##TITLE=1H_CA-9214-3
 CDCl3
 8 sc, 
 20.11.2023
##JCAMPDX= 6.0         $$ Bruker NMR JCAMP-DX V2.0
##DATA TYPE= NMR SPECTRUM
##DATA CLASS= NTUPLES
##ORIGIN= UXNMR, Bruker Analytische Messtechnik GmbH
##OWNER= root
$$ XWIN-NMR		Version 3.5
$$ Mon Nov 20 14:31:37 2023 Russian Standard Time (UT+4h)  she@DPX200
##.OBSERVE FREQUENCY= 200.1313
##.OBSERVE NUCLEUS= ^1H
##.ACQUISITION MODE= SIMULTANEOUS
##.ACQUISITION SCHEME= undefined
##.AVERAGES= 8
##.DIGITISER RES= 18
##SPECTROMETER/DATA SYSTEM= spect
##.PULSE SEQUENCE= zg30
##.SOLVENT NAME= D2O
##.SHIFT REFERENCE= (INTERNAL, D2O, 0, 15.3811)
##AUDIT TRAIL= $$ (NUMBER, WHEN, WHO, WHERE, WHAT)
$$ ##TITLE= Audit trail, XWIN-NMR		Version 3.5
$$ ##JCAMPDX= 5.01
$$ ##ORIGIN= Bruker BioSpin GmbH
$$ ##OWNER= she
$$ F:/spectra/data/she/nmr/H-F/1/pdata/1/auditp.txt
$$ ##AUDIT TRAIL=  $$ (NUMBER, WHEN, WHO, WHERE, WHAT)
(   1,<2023-11-20 14:29:50.51 +0400>,<she>,<DPX200>,
      <created by zg, POWCHK disabled, PULCHK disabled
       configuration hash MD5:
       00 E9 B6 7A A2 85 ED C7 34 08 36 98 17 FE 4E 26
       data hash MD5: 16K
       05 E5 E2 69 19 70 40 20 4B 3D 5F 44 DA CE F5 4D>)
(   2,<2023-11-20 14:29:53.10 +0400>,<she>,<DPX200>,
      <Start of raw data processing
       efp BC_mod = 2 LB = 0.24 FT_mod = 6 PKNL = 1 PHC0 = -23871.11 PHC1 = 13.45269 SI = 16K 
       data hash MD5: 16K
       89 1E 06 3B 11 D1 FF 61 AC BB 59 65 0C B3 62 9C>)
(   3,<2023-11-20 14:30:18.23 +0400>,<she>,<DPX200>,
      <pk PHC0 = 1.636906 PHC1 = -2.4 
       data hash MD5: 16K
       E1 62 42 BA BC 59 ED 0F AA 1B C3 4E D6 18 D4 C4>)
(   4,<2023-11-20 14:30:21.65 +0400>,<she>,<DPX200>,
      <abs ABSG = 5 
       data hash MD5: 16K
       21 8F 5E 8A FB 3A 66 A9 7C 3D AF FC 9E 1F BF 66>)
(   5,<2023-11-20 14:30:44.98 +0400>,<she>,<DPX200>,
      <pk PHC0 = 3.26614 PHC1 = -5.2 
       data hash MD5: 16K
       69 8D C4 05 09 F7 03 8E 8F E9 E0 D5 69 2D 80 51>)
(   6,<2023-11-20 14:30:48.96 +0400>,<she>,<DPX200>,
      <abs ABSG = 5 
       data hash MD5: 16K
       42 C6 83 39 88 00 E7 3C F5 EB B7 E6 98 FA A5 C6>)
$$ ##END=
$$ 
$$ hash MD5
$$ E5 AE BA B8 0A 5E 60 8D A5 36 95 D5 52 B7 38 2A
##$RELAX= 
##$RELAX= 
##$RELAX= 
##$RELAX= 
##$RELAX= 
##$RELAX= 
$$ Bruker specific parameters
$$ --------------------------
##$DU= <F:/spectra>
##$EXPNO= 1
##$NAME= <H-F>
##$PROCNO= 1
##$TYPE= <nmr>
##$USER= <she>
##$AMP= (0..31)
100 100 100 100 100 100 100 100 100 100 100 100 100 100 100 100 100 100 
100 100 100 100 100 100 100 100 100 100 100 100 100 100 
##$AQSEQ= 0
##$AQ_mod= 1
##$AUNM= <au_zg>
##$AUTOPOS= <>
##$BF1= 200.13
##$BF2= 200.13
##$BF3= 200.13
##$BF4= 200.13
##$BF5= 200.13
##$BF6= 200.13
##$BF7= 200.13
##$BF8= 200.13
##$BYTORDA= 1
##$CFDGTYP= 0
##$CFRGTYP= 5
##$CHEMSTR= <none>
##$CNST= (0..31)
1 1 145 1 1 1 1 1 1 1 1 1 1 1 1 1 1 1 1 1 1 1 1 1 1 1 1 1 1 1 1 1 
##$CPDPRG= <>
##$CPDPRG1= <>
##$CPDPRG2= <>
##$CPDPRG3= <>
##$CPDPRG4= <mlev>
##$CPDPRG5= <mlev>
##$CPDPRG6= <mlev>
##$CPDPRG7= <mlev>
##$CPDPRG8= <mlev>
$$ [...]
##$SUBNAM3= <"">
##$SUBNAM4= <"">
##$SUBNAM5= <"">
##$SUBNAM6= <"">
##$SUBNAM7= <"">
##$SUBNAM8= <"">
##$SUBNAM9= <"">
##$SW= 18.0517328524113
##$SWIBOX= (0..15)
0 0 2 0 0 0 0 0 0 0 0 0 0 0 0 0 
##$SW_h= 3612.71676300578
##$TD= 16384
##$TD0= 1
##$TE= 0
##$TE2= 300
##$TE3= 300
##$TEG= 300
##$TL= (0..7)
0 120 120 120 120 120 120 120 
##$TP= (0..7)
150 150 150 150 150 150 150 150 
##$TP07= 0
##$TPNAME0= <>
##$TPNAME1= <>
##$TPNAME2= <>
##$TPNAME3= <>
##$TPNAME4= <>
##$TPNAME5= <>
##$TPNAME6= <>
##$TPNAME7= <>
##$TPOAL= (0..7)
0.5 0.5 0.5 0.5 0.5 0.5 0.5 0.5 
##$TPOFFS= (0..7)
0 0 0 0 0 0 0 0 
##$TUNHIN= 0
##$TUNHOUT= 0
##$TUNXOUT= 0
##$USERA1= <user>
##$USERA2= <user>
##$USERA3= <user>
##$USERA4= <user>
##$USERA5= <user>
##$V9= 5
##$VALIST= <valist>
##$VCLIST= <CCCCCCCCCCCCCCC>
##$VD= 0
##$VDLIST= <DDDDDDDDDDDDDDD>
##$VPLIST= <PPPPPPPPPPPPPPP>
##$VTLIST= <TTTTTTTTTTTTTTT>
##$WBST= 1024
##$WBSW= 4
##$XGAIN= (0..3)
0 0 0 0 
##$XL= 0
##$YL= 0
##$YMAX_a= 754892
##$YMIN_a= -1027178
##$ZGOPTNS= <>
##$ZL1= 120
##$ZL2= 120
##$ZL3= 120
##$ZL4= 120
##$ABSF1= 15.43067
##$ABSF2= -2.62118
##$ABSG= 5
##$ABSL= 3
##$ALPHA= 0
##$AQORDER= 0
##$ASSFAC= 0
##$ASSFACI= 0
##$ASSFACX= 0
##$ASSWID= 0
##$AUNMP= <proc_1d>
##$AZFE= 0.1
##$AZFW= 0.1
##$BCFW= 0
##$BC_mod= 2
##$BYTORDP= 0
##$COROFFS= 0
##$CY= -3
##$DATMOD= 1
##$DC= 0
##$DFILT= <>
##$DTYPP= 0
##$F1P= 0
##$F2P= 0
##$FCOR= 1
##$FTSIZE= 16384
##$FT_mod= 6
##$GAMMA= 0
##$GB= 0
##$INTBC= 1
##$INTSCL= 3.70164e-10
##$ISEN= 128
##$LB= 0.24
##$LEV0= 0
##$LPBIN= 0
##$MAXI= 10000
##$MC2= 0
##$MEAN= 0
##$ME_mod= 0
##$MI= 1.114404
##$NCOEF= 0
##$NC_proc= -6
##$NLEV= 6
##$NOISF1= 3.799351
##$NOISF2= 2.8
##$NSP= 0
##$NTH_PI= 0
##$NZP= 0
##$OFFSET= 15.38109
##$PC= 1
##$PHC0= -23866.21
##$PHC1= 5.85269
##$PH_mod= 1
##$PKNL= yes
##$PPARMOD= 0
##$PSCAL= 0
##$PSIGN= 0
##$REVERSE= no
##$SF= 200.130028139801
##$SI= 16384
##$SIGF1= 3
##$SIGF2= 2
##$SINO= 5.538805
##$SIOLD= 16384
##$SREGLST= <1H.CDCl3>
##$SSB= 0
##$STSI= 16384
##$STSR= 0
##$SW_p= 3612.71676300578
##$SYMM= 0
##$S_DEV= 0
##$TDeff= 16384
##$TDoff= 0
##$TI= <>
##$TILT= no
##$TM1= 0
##$TM2= 0
##$TOPLEV= 0
##$USERP1= <user>
##$USERP2= <user>
##$USERP3= <user>
##$USERP4= <user>
##$USERP5= <user>
##$WDW= 1
##$XDIM= 16384
##$YMAX_p= 487039756
##$YMIN_p= -350118
$$ End of Bruker specific parameters
$$ ---------------------------------
##NTUPLES= NMR SPECTRUM
##VAR_NAME=  FREQUENCY,     SPECTRUM/REAL,   SPECTRUM/IMAG
##SYMBOL=    X,             R,               I
##VAR_TYPE=  INDEPENDENT,   DEPENDENT,       DEPENDENT
##VAR_FORM=  AFFN,          ASDF,            ASDF
##VAR_DIM=   16384,         16384,           16384
##UNITS=     HZ,            ARBITRARY UNITS, ARBITRARY UNITS
##FACTOR=    0.220516191357247, 1,           1
##FIRST=     3078.21800737907, 0,            0
##LAST=      -534.498755626706, 0,           0
##MIN=       -534.498755626706, -350118,     0
##MAX=       3078.21800737907, 487039756,    0
$$ Real data points
##PAGE= N=1
##DATA TABLE= (X++(R..R)), XYDATA
$$ [...]
7742c1352M1523k8367p3088N0453k1222l5765Q5276K6333j5809r488l9131Q1250
7730C0613P1924k6279k0753l1094k2675L0544n9933l253m4934N5217k9949N3555
7718B983l6546n9144J5131K4036R3446j29800P3188K852n458r6538r235J03715
7706b1370K7373p4177n3179M0463N7939K0237l6429j02613J9898P0810r754l146
7694f3948r066k6667K2434J8324K4177p3296Q804L6258N4014P6721p9803n8414
7682g0462l1048O7684j09583L8135l6366j07301J17510R4895J19159m5301n2128
7671a4806n0020o1448K5928j3440K5814p8080M8871m2220o131M947N858M7042
7659a07685m7186k215J02743K842n7041K8861K4237P9722m9192r8238N5400k6599
$$ plain form
7742 -31352 10171 -18196 -91284 -40831 -62053 -97818 -12542 13791 -2018 -11506 -50637 30613
7730 30613 102537 76258 55505 24411 1736 32280 -27653 -30906 -75840 -20623 -50572 2983
7718 2983 -33563 -92707 -77576 -53540 39906 -89894 -16706 -13854 -19312 -115850 -125085 -21370
7706 -21370 6003 -68174 -121353 -80890 -22951 -2714 -39143 -141756 -121858 -51048 -60802 -63948
7694 -63948 -73014 -99681 -77247 -58923 -34746 -108042 -99238 -62980 -8966 67755 -12048 -70462
7682 -70462 -101510 -33826 -143409 -105274 -141640 -248941 -131431 -36536 82623 37322 -14806
7671 -14806 -64826 -126274 -100346 -113786 -87972 -166052 -117181 -159401 -165532 -160585 -154727 -107685
7659 -107685 -154871 -157086 -54343 -51501 -108542 -79681 -55444 24278 -24914 -123152 -67752 -94351
7647i4351o5113K689J24956k0886k6477k4499O2679o2194l441k9732O9270l3913
7635a01012q2511j253M3777J06574o3303o73J06470j36433J7669R4698n498k8981
7623e0476r0747l3863J8258p2865o046N183J17673j186l7038r8213M1891J53602
7611e3827J2199l3120r8873p5958k8270J71910j3265L954q7343L6516j2604N2020
7599a26661K6101j2944p1809J10724k1236n9207K2886k755k651N3489K7724k0172
7587g6511P1197n278r8604J4005L8975M9361j09334K610j132M4234q0770K4069
7575a27178p0352K8997N1106j44479L7862R6317J8517j5533Q3484p387q203q7781
7563a44630Q9247m1950o778M8290j10767L019O6339l2294P6049P285l3197J5214
$$ plain form
7647 -94351 -159464 -156775 -31819 -52705 -79182 -103681 -41002 -103196 -106637 -136369 -67099 -101012
7635 -101012 -183523 -184776 -140999 -34425 -97728 -98401 8069 -128364 -110695 -15997 -21495 -50476
7623 -50476 -141223 -175086 -156828 -229693 -235739 -230556 -112883 -114069 -151107 -249320 -207429 -53827
7611 -53827 -41628 -74748 -173621 -249579 -277849 -105939 -119204 -115250 -202593 -166077 -178681 -126661
7599 -126661 -100560 -113504 -185313 -74589 -95825 -155032 -132146 -134901 -137552 -84063 -56339 -76511
7587 -76511 -5314 -10592 -109196 -95191 -56216 -6855 -116189 -113579 -114711 -70477 -151247 -127178
7575 -127178 -197530 -168533 -117427 -261906 -224044 -127727 -109210 -124743 -41259 -48646 -56849 -144630
7563 -144630 -55383 -97333 -104111 -55821 -166588 -163569 -97230 -129524 -53475 -46190 -79387 -64173
7551f4173j8918P861q9745K8264R1844l3013m6615J2215J624L9256p1613Q671
7539a34342J39946m5049o7562K4854k9239l8762l7492l773K4268J9969M9268m5719
7527a43633Q5205n1460r1006R7608n2429l9617P588j5199L5588l2210L7875k0787
7515a82477P7664l4904k7213n5843R4129K1988p6222o539J43228m756K689M0360
7503g896l7194l5957n7243O7932l7314L0259n4681l4356J27198O2953M3352J1461
7491G8514j7236j00227n2655K306k7762O8610M5133P39r1144K2610n8806M6212
7479h3706P4989J3478n5076J08224k8453p6850J676k6637M9124O49j6202q138
7467d6922P6417n4831Q0842L6276j09762j05428k9421J32014P6025k0265J3596
$$ plain form
7551 -64173 -83091 -75230 -164975 -136711 -44867 -77880 -124495 -112280 -110656 -71400 -143013 -134342
7539 -134342 5604 -39445 -107007 -82153 -111392 -150154 -187646 -191419 -167151 -147182 -97914 -143633
7527 -143633 -58428 -109888 -200894 -103286 -155715 -195332 -187744 -202943 -167355 -199565 -161690 -182477
7515 -182477 -104813 -139717 -166930 -222773 -128644 -106656 -182878 -189417 -46189 -50945 -48256 -7896
7503 -7896 -45090 -81047 -138290 -70358 -107672 -77413 -132094 -166450 -39252 23701 67053 78514
7491 78514 61278 -38949 -91604 -89298 -117060 -48450 -3317 -2578 -93722 -71112 -129918 -83706
7479 -83706 -8717 4761 -50315 57909 29456 -47394 -45718 -72355 -23231 -22582 -38784 -46922
7467 -46922 29495 -25336 55506 91782 -17980 -123408 -152829 -20815 55210 34945 48541
7456D8541n1684j09930L8331j9813j5004J7850p4649j0414J24160k0425R6067
7445B3030k0896q496o7855p4458q432J68676k3635l4387L4880k0359j2361r593
7433e3886k4349j37485J44776k5896m2166M426J0269Q7123j7977k0045J11399
7422C6189j8104o2486p2921M2821k9163M012J3227r3256N451l780N9598l8396
7410a56808o9302M5352J2634n1237m176J8853J1121O757p0327n366J30894n942
7398a37547R330P2559J7024j0944K5081k1349n5820Q879P7998n0240r6689M0324
7386a21394q5963N9606j9795M7106o6296R5119J6223R620L4764K1161k553l497
7374a5899n5002k4800l1012L9923L6407K7151j7442m3082j33555L5504J36683
$$ plain form
7456 48541 -3143 -113073 -74742 -94555 -109559 -91709 -166358 -176772 -52612 -73037 23030
7445 23030 2134 -6362 -74217 -148675 -157107 11569 -12066 -46453 -11573 -31932 -44293 -53886
7433 -53886 -78235 -215720 -70944 -96840 -139006 -134580 -124311 -37188 -55165 -75210 36189
7422 36189 18085 -44401 -117322 -74501 -103664 -99652 -86425 -179681 -174230 -178010 -118412 -156808
7410 -156808 -226110 -180758 -168124 -219361 -223537 -204684 -193563 -186806 -257133 -262499 -131605 -137547
7398 -137547 -128217 -55658 -38634 -49578 -24497 -45846 -101666 -92787 -14789 -65029 -161718 -121394
7386 -121394 -207357 -147751 -167546 -120440 -186736 -91617 -75394 -65774 -31010 -9849 -12402 -15899
7374 -15899 -70901 -95701 -126713 -86790 -50383 -23232 -40674 -83756 -217311 -181807 -45124
7363d5124k2976l8101Q3527K2828n6892j3202o6546J05200l0744q2753K2069R602
7351a13112n6549Q9646l3362k2286m2440j0808j3110j26300J48040P5257M221
7340a00803L0644r6457K1711n3964J7489j3493J07181n565p1737P2624l3104q3286
7328b08760l9166J15704O4476o1649N4066j02228P2386q8476Q367N9629m118q143
7316a37912o638K1651O4214R1529j37339q5648L8459R945J7188P9124N599n4595
7304i4423p7165R891J01977K391o9080l1209L6685p7811O7258o6125j9065Q8489
7292a28187Q7873q0260k0388O5810M1871N0310j0252P5125r9515K0077l8365o1096
7280i6997J02946O5909o5746l294k4607m8722O2597P884j02894Q5212k6619n1003
$$ plain form
7363 -45124 -68100 -106201 -22674 154 -56738 -69940 -136486 -31286 -62030 -144783 -122714 -113112
7351 -113112 -169661 -80015 -113377 -135663 -178103 -188911 -202021 -328321 -180281 -105024 -100803
7340 -100803 -70159 -166616 -144905 -198869 -181380 -194873 -87692 -93257 -164994 -92370 -125474 -208760
7328 -208760 -247926 -132222 -67746 -129395 -75329 -177557 -105171 -193647 -185280 -125651 -129769 -137912
7316 -137912 -144550 -122899 -58685 32844 -104495 -190143 -151684 -141739 -124551 -45427 -39828 -94423
7304 -94423 -171588 -161697 -59720 -57329 -126409 -157618 -120933 -198744 -131486 -197611 -216676 -128187
7292 -128187 -40314 -120574 -140962 -75152 -33281 17029 6777 81902 -17613 2464 -35901 -96997
7280 -96997 5949 71858 6112 2818 -21789 -70511 -7914 -30 -102924 -17712 -44331 -95334
7268i5334j6369K894o406n3451J05193l3088q6002N2470m0375J9928r576N1941
7256a08175n9532K1206J8891j6619o2864L3281q6303j689J08980L401N8558K1480
7244f9385r6715N3738N2698r4409J07386j5579M6239m7018j07851o4822M2689
7233a93029J32877m5560j6933J41059p0139n2190K1397k2069L0495l7099J4517
7222i6674p217K1135o9969j45972k0315R3407N0056k4514L6785l020N9124P9842
7210b7332k959p7342n5272n0186M9773N6274L7020N5838m3878o9643j504n6229
7198a85440l2897l576J00568J883k0796L6157k1039k6040L577p250l5149r127
7186a99129J04815m9460l4583j9617K2580J01213l4799l9158j42661O8976N0977
$$ plain form
7268 -95334 -111703 -108809 -115215 -168666 -63473 -96561 -182563 -130093 -170468 -150540 -160116 -108175
7256 -108175 -167707 -146501 -127610 -144229 -207093 -173812 -260115 -261804 -152824 -149423 -90865 -69385
7244 -69385 -166100 -112362 -59664 -154073 -46687 -62266 -16027 -63045 -170896 -235718 -193029
7233 -193029 -60152 -105712 -122645 18414 -51725 -103915 -82518 -104587 -74092 -111191 -96674
7222 -96674 -103891 -82756 -152725 -298697 -319012 -225605 -175549 -200063 -163278 -166298 -107174 -27332
7210 -27332 -30291 -107633 -162905 -213091 -163318 -107044 -70024 -14186 -58064 -127707 -129211 -185440
7198 -185440 -218337 -221913 -121345 -119462 -140258 -104101 -125140 -151180 -147603 -154853 -190002 -199129
7186 -199129 -94314 -143774 -178357 -197974 -175394 -74181 -108980 -148138 -290799 -221823 -170846
7175a70846p4081j1439K6733J26809O4185j71127n0881N5485L0644q526K36p2666
7163b55474J01377p947l2446O3267Q1446p0215K0635K9812M0557j603l8765j02560
7151a71916K148J22279J6679K1214j7503l4567j3707R1104j9220j07857o4511
7140a75857q6274L7595J16925r4541J7545l9332j8229L0855K7917L3271J06762
7129d3363L7492p6543j4533o571j02024n5100R1418k4470o4035q5639J5720J08349
7117b19299M2572K6245o8485l7822n0216L5944M4275P615L9252K9244k0101L0671
7105a40105o1Q7782j9945m4101J1652l1917r3948n0504J23980J13104r0545l792
7093a38400j9633N6043K377n8339J5606p9172O1512O4900r9819J0112K7079p3355
$$ plain form
7175 -170846 -244927 -256366 -229633 -102824 -38639 -209766 -260647 -205162 -174518 -183044 -182808 -255474
7163 -255474 -154097 -162044 -194490 -131223 -49777 -119992 -99357 -69545 -28988 -30591 -69356 -171916
7151 -171916 -169768 -47489 -30810 -9596 -27099 -61666 -75373 15731 -3489 -111346 -175857
7140 -175857 -262131 -224536 -107611 -202152 -184607 -223939 -242168 -211313 -183396 -150125 -43363
7129 -43363 -5871 -82414 -96947 -103518 -205542 -260642 -169224 -193694 -257729 -343368 -327648 -219299
7117 -219299 -176727 -150482 -218967 -256789 -307005 -271061 -226786 -219171 -179919 -150675 -170776 -140105
7105 -140105 -140166 -52384 -72329 -116430 -104778 -136695 -230643 -281147 -157167 -44063 -134608 -138400
7093 -138400 -158033 -101990 -99613 -157952 -142346 -221518 -160006 -95106 -194925 -184813 -157734 -231089
7081b31089Q8757K3602j08162K6277o444N9829P1199p138j5756p3365J46844o1307
7069h6753k6011J5992l6394j06858K100R5580k7458J1875k9265L5776O8802j01402
7057a84016j5787Q9957N837L1185m4431k5679l8634L1084L108n3858K8694P3441
7045i9099J2024m8059R1151n9069q578l5983p5381J01648r6138L7603J05675m2230
7033a16436Q8689l7330j09907O2897p267P313k8990n3397J38960N2528L5447J7554
7021E0061L2969j04682j6099j2949k1707K6409j46761K2938K7015N1235J18382
7010B6811o8166p5304o79K1529k9778j1995N6773j16603J12585J47682m8667j13100
6998i8912M6789k7035M852J10330k4351J0590p1222M6770J6065k6096j55019m7905
$$ plain form
7081 -231089 -142332 -118730 -226892 -200615 -207059 -147230 -76031 -83169 -98925 -172290 -25446 -86753
7069 -86753 -112764 -96772 -133166 -240024 -237924 -142344 -169802 -157927 -187192 -151416 -82614 -184016
7057 -184016 -199803 -109846 -104009 -72824 -117255 -142934 -181568 -150484 -147376 -201234 -172540 -99099
7045 -99099 -87075 -135134 -43983 -103052 -111630 -147613 -222994 -121346 -217484 -179881 -74206 -116436
7033 -116436 -27747 -65077 -174984 -112087 -119354 -112041 -141031 -194428 -55468 -2940 32507 50061
7021 50061 83030 -21652 -37751 -50700 -72407 -45998 -192759 -169821 -142806 -91571 26811
7010 26811 -41355 -116659 -117338 -95809 -125587 -137582 -80809 -197412 -84827 62855 14188 -98912
6998 -98912 -52123 -79158 -74306 36024 11673 22263 -48959 -2189 13876 -12220 -167239 -215144
6986b15144J44547Q168j895M7088L7913m4583q144L0869q0601p053r471j1409
6974a09715j28072n4515N2105Q5867P100l7181p33J10625M3383j12664P578P4406
6962f1816m1766k3886L0646n3843N198N9754O0933k2473j4516o8978J9769J2922
6950i8056M182k1443o5433k2987l4187O8996n8798K5778Q9061J14339J04371k70674
6938a64851j9565K258J3400l1654p9309L7550R3513l4168k7574P2716P2117J30855
6926F5288k5542j3789l3898r3305j7684Q865N4952K9993r4950l8529J2968r6777
6914b42408l7686J6966O2237r3953P2154J42017L971K1523q9038k5189J1880K3770
6902a33756p7165l5317O3211J50285n1475R288O7499K5243l9940K7887o0947j8574
$$ plain form
6986 -215144 -70597 -62429 -64324 -17236 20677 -23906 -32050 -1181 -81782 -88835 -98306 -109715
6974 -109715 -237787 -292302 -240197 -154330 -147230 -184411 -185144 -74519 -31136 -143800 -136222 -61816
6962 -61816 -103582 -127468 -96822 -150665 -145467 -85713 -24780 -47253 -61769 -130747 -110978 -98056
6950 -98056 -93874 -115317 -180750 -203737 -237924 -168928 -227726 -201948 -112887 1452 105823 -164851
6938 -164851 -184416 -182158 -168758 -200412 -279721 -242171 -148658 -182826 -210400 -137684 -65567 65288
6926 65288 39746 25957 -7941 -101246 -118930 -110065 -55113 -25120 -120070 -158599 -145631 -242408
6914 -242408 -280094 -263128 -200891 -294844 -222690 -80673 -76702 -55179 -144217 -169406 -157526 -133756
6902 -133756 -210921 -246238 -183027 -32742 -84217 -74929 -7430 17813 -22127 5760 -55187 -73761
6890g3761l3917p5041M6155l2800j1954N5761K8846m7931P5191o9563q2156J19230
6878a01940M5024j7899j0097k945n5968L9569K3480l3177k8824m5532O1253R5195
6866c1861l9832r5291k8480O6041R1075p4913o2116J64703N8841p9293p698l7629
6854g6453M213j497R6580p7078n2995K6180n785j09880J11246K3893k7552j3404
6842a02532P5208j31341j9373R9723J1860j1323n6003k7138o68n0563j2186Q7371
6830a36965Q3340N1393j39476J9498m2271J40713J9666J0002j29702j1595N517
6819a29880R3616n9373q0907P7715O6945j8712L0255K0628p096m1508m7456L6291
6807e9482N1853L0021j49527K1394J4235N7606K9198k2528p5935L0397Q1777n5440
$$ plain form
6890 -73761 -107678 -182719 -136564 -169364 -181318 -125557 -96711 -144642 -69451 -139014 -221170 -101940
6878 -101940 -56916 -74815 -84912 -87857 -143825 -104256 -80776 -113953 -142777 -188309 -127056 -31861
6866 -31861 -71693 -166984 -195464 -129423 -38348 -113261 -175377 -10674 48167 -31126 -38824 -76453
6854 -76453 -72240 -73737 22843 -54235 -107230 -81050 -86835 -196715 -85469 -61576 -89128 -102532
6842 -102532 -27324 -158665 -178038 -78315 -66455 -77778 -133781 -160919 -161587 -212150 -224336 -136965
6830 -136965 -53625 -2232 -141708 -122210 -164481 -23768 -4102 5900 -123802 -135397 -129880
6819 -129880 -36264 -95637 -176544 -98829 -31884 -50596 -20341 287 -6809 -48317 -95773 -59482
6807 -59482 -7629 22392 -127135 -105741 -91506 -33900 -4702 -27230 -103165 -72768 9009 -46431
6795d6431p0606K2812L6465r0848M7957L0592p6175J16902J9452o742j6258j02588
6783a35468m2630q2711O5645J1577n4117J1980R7100L8350m7743J06654k9487
6772f0850j5825M7598m1210M4006k8874j25346R6795o2991N3830J7139m0047n3615
6760a69390J41925Q6997m3911J178n6280k9834J3599Q722m2372M8030M2467j884
6748g53m2936L0396l400L7287m4449L3858l8112n7431L974L3567N1723K6093p37
6735B9080n7169k1294P1436J1123l4532m9949q882K1575Q5703j25529r6826P5399
6723i9865J0243M0581j5870P3747L1113J6776L656M3283m2342Q228o6529J15R9956
6710A03092j08398q0823O0951J26830m4987k5228k4517k6314j9026J50167L4221
$$ plain form
6795 -46431 -117037 -94225 -57760 -148608 -100651 -70059 -146234 -29332 -9880 -16622 -32880 -135468
6783 -135468 -178098 -260809 -195164 -183587 -237704 -225724 -128624 -90274 -138017 -31363 -60850
6772 -60850 -76675 -29077 -70287 -26281 -55155 -180501 -83706 -146697 -92867 -75728 -115775 -169390
6760 -169390 -27465 59532 15621 16799 -39481 -69315 -55716 -46994 -89366 -41336 1131 -753
6748 -753 -43689 -13293 -16693 20594 -23855 10003 -28109 -85540 -81566 -47999 3724 29817 29080
6735 29080 -28089 -49383 22053 33176 -1356 -51305 -60187 -38612 47091 -78438 -175264 -99865
6723 -99865 -89622 -49041 -64911 8836 39949 56725 60381 103664 61322 69550 3021 3136 103092
6710 103092 -5306 -86129 -25178 101652 56665 31437 6920 -19394 -38420 111747 145968
6699A45968K9363K490l3019o9389k0493n4402q5800J5461R7361J69282o3259p1562
6687F2001l1159p9132p7349Q3550M348N6002M622n8450M5859R2882K3028N5430
6675A81632p1501O6699l1225k9270r1638M189P7326J5037m6208K6264R6401l3456
6663A64250N6671o2457N1754k740j7420J1260P5735l3931r9972M3591p2437n6517
6651E7787J07301L1933N2805k0404k3363m520Q1710j8147n3040J1156p3427q2190
6639F7601M2771J6099L7365J05351o9496N3062k6489Q226N4605j15274M6238Q1256
6627C01315N1484K408R314M5866J8559m3695O7136M0890l1467O0351M2693j7402
6615E47452P8510n8239m9570J04990l2765l1215k5939K9675Q9227J3428p8389
$$ plain form
6699 145968 175331 177821 144802 75413 54920 518 -85282 -69821 27540 196822 133563 62001
6687 62001 30842 -48290 -125639 -42089 -37741 18261 22883 -35567 10292 103174 126202 181632
6675 181632 110131 176830 145605 116335 24697 28886 106212 121249 75041 101305 197706 164250
6663 164250 220921 158464 210218 207478 190058 201318 277053 243122 143150 186741 114304 57787
6651 57787 165088 197021 249826 229422 206059 201539 283249 265102 212062 223218 149791 67601
6639 67601 110372 126471 163836 269187 199691 252753 226264 234490 289095 173821 220059 301315
6627 301315 352799 355207 364521 410387 428946 385251 452387 493277 461810 522161 564854 547452
6615 547452 625962 567723 518153 623143 590378 559163 533224 562899 652126 665554 587165
6604E87165K4124M9064j4822M1100L0803K0634j16885L2214J03204o9212k8838
6593F58551m6357j04395k0794P2039p3018p418O1540R3910m7529L1707P4466p4436
6581F18266Q3294P4438P0054q1195M1894P3759o3723r10m2483n4596J686J83440
6569I03924l5563P1331j915j10451J7535J0684p377q8079N6156J9688j52905R956
6557F92984J16340L8416M2123l7991k7693j9632K7172J7529o0957J9451L2738
6546H40480M6173J47574Q3682o1388J18318J6098l6451l7790p255M6080j24987
6535A030534K1473N2656m3151J423j6770K5868K3451J12059n2235p9741L511K9568
6523A108646n3575j04794M553M889M0492l1635O2208n6263L6418j15665p1657
$$ plain form
6604 587165 611289 660353 645531 686631 717434 738068 621183 653397 756601 687389 658551
6593 658551 612194 507799 487005 559044 486026 478608 540148 634058 586529 618236 692702 618266
6581 618266 701560 775998 846052 764857 806751 880510 816787 815877 773394 718798 720484 903924
6569 903924 868361 939692 937777 827326 844861 855545 848168 760089 816245 835933 683028 692984
6557 692984 809324 847740 889863 851872 824179 804547 831719 849248 788291 807742 840480
6546 840480 886653 1034227 1117909 1056521 1174839 1190937 1154486 1116696 1109441 1155521 1030534
6535 1030534 1052007 1104663 1061512 1062935 1046165 1072033 1095484 1207543 1155308 1075567 1079078 1108646
6523 1108646 1055071 950277 954830 959719 1000211 968576 1030784 974521 1010939 895274 823617
6512H23617L8902k8665j03373Q3612M6714M0731M3247k159K5551n6545q6659q801
6500H16172J2448J4802Q2929j25917K9857O9541P8123m1502M507J5582M735Q4032
6488A045309M4498J0737j54579J3061N1418r5740O0541N3317M5113R5412J0343
6477A179430q3156m7890N1655M9072L3936j8300q794J793k8193k3820Q4813K9867
6465A220413o9615l2720J74603N8614j0008J18157j00077k1249L965P1180M7463
6454A460726k0031m4034K980m0900P0892K7443L3403O8546j4424J1505L9955k23
6442A595838O3415o096m0365r1206Q5336L6695J6388L2106J145k0763n2168J04402
6430A724727M2162L3409Q5029Q273q727k3284P0257L5160m5296J09715k3333K6669
$$ plain form
6512 823617 862519 833854 730481 814093 860807 901538 944785 942626 968177 911632 824973 816172
6500 816172 828620 843422 926351 800434 830291 899832 977955 936453 940960 956542 961277 1045309
6488 1045309 1089807 1100544 945965 959026 1010444 914704 975245 1028562 1073675 1169087 1179430
6477 1179430 1096274 1048384 1100039 1149111 1183047 1164747 1155953 1157746 1129553 1105733 1190546 1220413
6465 1220413 1150798 1118078 1292681 1351295 1341287 1459444 1359367 1338118 1342083 1413263 1460726
6454 1460726 1440695 1396661 1399641 1358741 1429633 1457076 1490479 1559025 1544601 1556106 1596061 1595838
6442 1595838 1659253 1653157 1612792 1521586 1606922 1643617 1660005 1692111 1693256 1672493 1620325 1724727
6430 1724727 1766889 1800298 1885327 1893600 1884873 1861589 1931846 1967006 1921710 2031425 2008092 2034761
6418B034761j59768Q0751M7894N1873O686J216j5904J21827J16270j185M5281
6407B329702K7291j4887N8490J01279J06450K6893J21012J52149l1191J8526J01204
6396B996918O3952N860P6529J66106J716J11910N0668Q1113J88921J51085P5555
6385C970333K3070J12094J01859K9532R1764J56324J56022J59523J94179k4292
6375D970408Q8239K15879M045M8127p9635Q6356J65233J8960k0408R5207Q2344
6364E674755K15260J45349k4808J54945J25315P3763J83446J21979J43084K05238
6354G018326M8806J24616J79711J30476K22497m232J01237O2265K40989K21589
6344H346280J57643J70709L00376K44055K26181L41287K45629L00513K59983L37170
$$ plain form
6418 2034761 1874993 1955744 2003638 2055511 2062197 2063413 2047509 2169336 2285606 2284421 2329702
6407 2329702 2356993 2342106 2400596 2501875 2608325 2635218 2756230 2908379 2877188 2895714 2996918
6396 2996918 3060870 3066730 3143259 3309365 3311081 3422991 3473659 3554772 3743693 3894778 3970333
6385 3970333 3993403 4105497 4207356 4236888 4328652 4484976 4640998 4800521 4994700 4970408
6375 4970408 5058647 5274526 5278571 5326698 5247063 5333419 5498652 5517612 5497204 5592411 5674755
6364 5674755 5890015 6035364 6010556 6165501 6290816 6364579 6548025 6670004 6813088 7018326
6354 7018326 7067132 7191748 7371459 7501935 7724432 7720200 7821437 7883702 8124691 8346280
6344 8346280 8503923 8674632 8975008 9219063 9445244 9786531 10032160 10332673 10592656 10929826
6334A0929826L11401M04360L71748L92145L93259M14529N65353M57339N26247
6325A4766207N33088O56506O64322Q69025Q82041R05906J009780J092262J308882
6316B2688019J539739J888612K079359K517474L132791L749436M653997N570695
6308D7820122O663064P460856O687422M055468P5171l754694n740350n686093
6300E7580966m330705k629775r45078N47432J884273L328299M847314N732227
6292F6014953N411310L095173j023633n208197p712140q103316p049679n377817
6284D0046654l933383l020609k363278j934806j617355j300300j042519q59278
6276B3975126p46628n19043m42252j62599j67405j91761M6692R0290L01901J21270
$$ plain form
6334 10929826 11241227 11645587 12017335 12409480 12802739 13217268 13782621 14239960 14766207
6325 14766207 15299295 15955801 16620123 17489148 18371189 19277095 20286875 21379137 22688019
6316 22688019 24227758 26116370 28195729 30713203 33845994 37595430 42249427 47820122
6308 47820122 54483186 61944042 68631464 72686932 72762103 69007409 63267059 57580966
6300 57580966 53250261 50620486 49675408 50222840 52107113 55435412 60282726 66014953
6292 66014953 71426263 74521436 73497803 68289606 60577466 52474150 45424471 40046654
6284 40046654 36113271 33092662 30729384 28794578 27177223 25876923 24834404 23975126
6276 23975126 23228498 22709455 22267203 22104604 21937199 21745438 21792130 21882420 22184321 22305591
6266B2305591J49610L15618L35256M13689M49489N10914N50933N90928N38861
6257B6160889O68372O54443P11178R00879R16772J007390J170581J400149J457915
6248C5048568J539061J770990K206257K650846L001303L613880M238639N103242
6240E9172786O256622P641221R444913J1537079J2859773J2592313Q888418K346883
6232A30740008m639025r457658j0529067q793445n957248l057946l07837K131737
6224I0129519M467720P026302R102047R330712O223110L56848o812353j2149652
6216A07674253j4053767j3001797j0595179q077673o295364m891362m024825l454594
6208D3279692l052413k443762k176470j778755j555041j466063j170514j101995
$$ plain form
6266 22305591 22455201 22770819 23106075 23519764 23969253 24480167 25031100 25622028 26160889
6257 26160889 26829261 27483704 28194882 29095761 30012533 31019923 32190504 33590653 35048568
6248 35048568 36587629 38358619 40564876 43215722 46217025 49830905 54069544 59172786
6240 59172786 65429408 73070629 82515542 94052621 106912394 119504707 128393125 130740008
6232 130740008 126100983 116643325 106114258 97320813 91363565 88305619 87997782 90129519
6224 90129519 94597239 101623541 110725588 120056300 126279410 126636258 119823905 107674253
6216 107674253 93620486 80618689 70023510 61945837 55650473 50759111 46734286 43279692
6208 43279692 40227279 37783517 35607047 33828292 32273251 30807188 29636674 28534679
6200B8534679j025997p71626q14496q53321n70899n81442o92239n53032n38879
6191B2132748m14772k80761l85829k69452k67372k54217j33640k19076j91098
6182A9716531k14992l62068j56920j03977j61508j52307n653j27449j91039k44565
6172A7996053j49213j54015j13774j41878j57047j34025k45066l56146j38070
6163A6406819k20127k55499j98611j37628k09734j34834j67617p2823J0079Q9839
6153A5109864o8390k0468J27522J58452j099O7709J48517N7004J16636J06841
6143A5802588Q8526L4357n1631K0363k9237J06873L9119R9668Q4784K86603K94764
6132A6776777J83351M99942L03979L48807N47497M12621M68821K98040K55714
$$ plain form
6200 28534679 27508682 26737056 25922560 25069239 24498340 23916898 23224659 22671627 22132748
6191 22132748 21717976 21437215 21051386 20781934 20514562 20260345 20126705 19907629 19716531
6182 19716531 19501539 19139471 18982551 18878574 18717066 18564759 18559106 18431657 18240618 17996053
6172 17996053 17846840 17692825 17579051 17437173 17280126 17146101 16901035 16544889 16406819
6163 16406819 16186692 15931193 15732582 15594954 15385220 15250386 15082769 15009946 15020025 15109864
6153 15109864 15041474 15021006 15148528 15306980 15305881 15373590 15522107 15579111 15695747 15802588
6143 15802588 15891114 15925471 15873840 15894203 15864966 15971839 16010958 16110626 16195410 16482013 16776777
6132 16776777 16960128 17460070 17764049 18112856 18660353 19072974 19541795 19839835 20095549
6123B0095549J94248J40819J2495j25381J16977P7820O4865K10869J45349J83816
6113B1117426J90889J46320J79843L51759K59252J79054K75513M42630M02541
6104B3545227M43795N56096N44785O74010P10169P22658Q51691J068348Q74397
6095B9991176R72108R98547R66941Q25321R36076J109402J145313J230670J216079
6086C9391633J319457J180492J148680J053002R26931J247430J620720J961726
6078D9850071K478248L004216L751088M656605N321087O285255P130842Q675598
6070I1153010J0277505J1602984J1653604Q744937K401694n111527j0653090j2059701
6062A08009416j0707329q190958n907159l878679k494387j305634n30323J55386
$$ plain form
6123 20095549 20289797 20430616 20443111 20317730 20434707 20512527 20577392 20788261 20933610 21117426
6113 21117426 21308315 21454635 21634478 21986237 22245489 22424543 22700056 23142686 23545227
6104 23545227 23989022 24545118 25089903 25763913 26474082 27196740 28048431 29116779 29991176
6095 29991176 30963284 31961831 32928772 33754093 34690169 35799571 36944884 38175554 39391633
6086 39391633 40711090 41891582 43040262 44093264 45020195 46267625 47888345 49850071
6078 49850071 52328319 55332535 59083623 63740228 69061315 75346570 82477412 91153010
6070 91153010 101430515 113033499 124687103 133432040 135833734 130722207 120069117 108009416
6062 108009416 97302087 89111129 83203970 79325291 76830904 75525270 74994947 75150333
6054G5150333J007600J726921K501623L380477M660361O436904Q533862J0690856
6046A14088937J1879588J0169204M409523l726160j0712827j4023291j3391173
6039I8693801j0902942q364195o310136m760890l938659l083663k625035k117724
6031E6590557j628071j270069j101266r42017q22706o88833l72631N268J87882
6022D9958114N77697P18665Q23168R66720J255711J426377J395743J642532J914995
6013F0679722J972824K096807K237987K605702L124958L203097L332156L239442
6005H2492695K685015J792592J334292J078501J581075K353360L675995N013426
5997A02006951N853488N218838K192076k101641n870104p244741o486769m788244
$$ plain form
6054 75150333 76157933 77884854 80386477 83766954 88427315 94864219 103398081 114088937
6046 114088937 125968525 136137729 140547252 136821092 126108265 112084974 98693801
6039 98693801 87790859 79426664 73116528 68355638 64416979 61333316 58708281 56590557
6031 56590557 54962486 53692417 52591151 51649134 50826428 50137595 49764964 49770232 49958114
6022 49958114 50535811 51254476 52077644 53044364 54300075 55726452 57122195 58764727 60679722
6013 60679722 62652546 64749353 66987340 69593042 72718000 75921097 79253253 82492695
6005 82492695 85177710 86970302 88304594 89383095 90964170 93317530 96993525 102006951
5997 102006951 107860439 113079277 115271353 113169712 107299608 100054867 93568098 88779854
5989H8779854l191093j643235n39256J94499P77223J408235J726342K239199K989987
5980I2741755L861710M707051N860894P068930Q043030Q646335P636949L779528
5972A42346182k112358p917610j1346329j1972669j0727395q958573p317994n836217
5964G6157037m723350l773079l026025k498155j959165j402459r88363n28574
5956E7257867j56787k99310j17418l13687o77566r65945j482208j938246k161982
5947D9144718k186340k081029j935144j611456j377332j123202r29027q46113
5939C7055075o22010o06538m63960o79641o13810p40310q08972o25583n89666
5930C1304585o07158m92735o62898o03578o55764r04304r85209r53496q84665
$$ plain form
5989 88779854 85588761 83945526 83406270 83600769 84377992 85786227 87512569 89751768 92741755
5980 92741755 96603465 101310516 107171410 114240340 122283370 130929705 138566654 142346182
5972 142346182 140233824 132316214 120969885 108997216 98269821 89311248 81993254 76157037
5964 76157037 71433687 67660608 64634583 62136428 60177263 58774804 57786441 57257867
5956 57257867 57101080 56801770 56684352 56370665 55693099 54727154 53244946 51306700 49144718
5947 49144718 46958378 44877349 42942205 41330749 39953417 38830215 37901188 37055075
5939 37055075 36433065 35826527 35362567 34682926 34069116 33328806 32519834 31894251 31304585
5930 31304585 30697427 30204692 29541794 28938216 28282452 27378148 26392939 25439443 24554778
5921B4554778p15233o66907n52184n24850n01128l26221j77642j56163K2830J02968
5911B1060248J63585J48293n051k68033m87778q83539j085395j093704j027937
5902A6520689q97696q26511o55202n92784m07643l18256l01094k73285j866o1374
5892A2184978M1603K8654O5706J66598J46357J29082L53969K79603J40920l314
5882A3534156L8038o7309J3095k92567m20578m14214m87835l17045l10390l70171
5872A0905180k16223k03436k59682k22508l42969k79511l46395l72023m93850
5863H168583m24358l89354l40800k73554l98314l47405k85410j37384k01058k10523
5853E160423k25450j02425j26637j52531m3634j06887o1819j35397j1067p4950
$$ plain form
5921 24554778 23839545 23172638 22620454 22095604 21594476 21268255 21090613 20934450 20957280 21060248
5911 21060248 21223833 21372126 21367075 21099042 20611264 19727725 18642330 17548626 16520689
5902 16520689 15622993 14796482 14141280 13548496 13140853 12822597 12521503 12248218 12246352 12184978
5892 12184978 12226581 12255235 12320941 12487539 12633896 12762978 13116947 13396550 13537470 13534156
5882 13534156 13572194 13504885 13517980 13225413 12804835 12390621 11902786 11585741 11275351 10905180
5872 10905180 10688957 10485521 10225839 10003331 9660362 9380851 9034456 8662433 8168583
5863 8168583 7744225 7354871 7014071 6740517 6342203 5994798 5709388 5572004 5370946 5160423
5853 5160423 4934973 4832548 4705911 4553380 4509746 4402859 4341040 4205643 4194576 4119626
5843D119626o0975q2170k10419j69988J2042Q308n5343j7108K311m7517j36026
5832C362741n5635j5882m9979n6227p762L4613k8508j8204j33048Q1196l6438
5821C076867p7808N510l1346M6241j48636l409R0407p4912p1805m2664J46413
5810B914858L5121j61294j2092K3116P5022J45739o9517J15829k7067L4811j38271
5799B936255j30471N2575j37893j1697j1900J751l1030R7586J19077J0525M3216
5788B937994o8979j04813j78826o6462q3405J909j06630N234O4384o1594m9625
5777B289187j31359l5070J5012K3025L6062O7735K1878O5722O8247o072p9814
5766B334553J142p102N2136j1949R8034J970M4405J17866M0921m4649K5897J56349
$$ plain form
5843 4119626 4058651 3976481 3766062 3596074 3608116 3616424 3561081 3543973 3546284 3498767 3362741
5832 3362741 3307106 3291224 3241245 3185018 3177256 3211869 3183361 3165157 3032109 3113305 3076867
5821 3076867 2999059 3004569 2973223 3019464 2870828 2867419 2957826 2882914 2811109 2768445 2914858
5810 2914858 2949979 2788685 2776593 2799709 2874731 3020470 2950953 3066782 3039715 3074526 2936255
5799 2936255 2805784 2858359 2720466 2708769 2696869 2698620 2667590 2765176 2884253 2894778 2937994
5788 2937994 2869015 2764202 2585376 2518914 2435509 2437418 2330788 2336022 2400406 2338812 2289187
5777 2289187 2157828 2122758 2137770 2160795 2196857 2264592 2286470 2352192 2420439 2414367 2334553
5766 2334553 2335695 2328593 2380729 2368780 2466814 2468784 2513189 2631055 2671976 2627327 2653224 2809573
5754B809573N5596J10903J0023J04354Q5631n9765j30907k02348K6521j48692
5744B660889p9536O8974L4193J64964J54476M7278K0721k3835j14342k0268p8225
5733B835289j06289p3309K958q6411q8740K6441q0575J4745j24280n8907K7056
5722B287978J0378L8095r8449m7955O9293L7737o4679l2573L6622M0183P2334
5711B348964j24168N756L0909M3059m0359p2152k9326m8186K2783J16251P8728
5700B332259o6865j29924m8414J13091O5097Q0913O2949K2352N514l0698j7504
5689B388770J34634O6499O4497R5876N4791K3101q4557R4736k3075k2276K06L2005
5677B825207r0795r8860L8351O8387P7127n3532O3178k5439j05881j2679J83457
$$ plain form
5754 2809573 2865169 2976072 2986095 3090449 3176080 3116315 2985408 2783060 2809581 2660889
5744 2660889 2581353 2650327 2684520 2849484 3003960 3051238 3071959 3048124 2933782 2913514 2835289
5733 2835289 2729000 2655691 2658649 2572238 2483498 2509939 2429364 2444109 2319829 2260922 2287978
5722 2287978 2298356 2336451 2238002 2190047 2259340 2297077 2232398 2199825 2236447 2276630 2348964
5711 2348964 2224796 2230552 2261461 2304520 2264161 2192009 2162683 2114497 2137280 2253531 2332259
5700 2332259 2265394 2135470 2087056 2200147 2265244 2346157 2409106 2431458 2436972 2406274 2388770
5689 2388770 2523404 2589903 2654400 2750276 2805067 2828168 2743611 2838347 2815272 2792996 2793202 2825207
5677 2825207 2734412 2635552 2673903 2742290 2819417 2765885 2829063 2803624 2697743 2685064 2868521
5666B868521k6881Q4532P2839m1771Q7253J29848J48048J3670o0629L7248Q0681
5655C393359J9947J19169L3274J69242J85089K26074K66660N9555J9288r8398
5645D393259k09227j42934j07294n4651j17778p0351j17521r078k2897q2426Q933
5634C468035p2224O9160m2246J4735L7189j1332J10502J93313J15049J80882J55815
5623D218878K19406L22176K50412K95328K30330J28000j74545l23914l56927k33716
5613D575428k9688j25329O6207n9549j456J74723R8494k0706J9771K8715J0828
5602D737438Q4015M8817J67979K41811K86150L97162K83481n0794m19346n46933
5592E229780n39869l58109k87362k24320o3181j37013m5479O645p9086O3448J99554
$$ plain form
5666 2868521 2841640 2926172 2999011 2957240 3044493 3174341 3322389 3336059 3275430 3312678 3393359
5655 3393359 3413306 3532475 3565749 3734991 3920080 4146154 4412814 4472369 4491657 4393259
5645 4393259 4184032 4041098 3933804 3879153 3761375 3691024 3573503 3564425 3541528 3459102 3468035
5634 3468035 3395811 3464971 3422725 3437460 3474649 3463317 3573819 3767132 3882181 4063063 4218878
5623 4218878 4438284 4760460 5010872 5306200 5536530 5664530 5489985 5166071 4809144 4575428
5613 4575428 4545740 4420411 4486618 4427069 4425613 4600336 4698830 4678124 4697895 4726610 4737438
5602 4737438 4821453 4870270 5038249 5280060 5566210 5963372 6246853 6196059 5776713 5229780
5592 5229780 4689911 4331802 4044440 3820120 3756939 3619926 3574447 3581092 3502006 3565454 3765008
5581C765008J45516J74396N1828L0690J42040j8692O5875o3469l882J52987P9993
5570D522290J12424j29078l37831k88970l32610l51074k16708j16522j25234j09548
5560B627139M0188j17433r9199j58768O723j677M7204l6541L7269n493m0351L1231
5548B330292o4551O5609O2544M7799j2626k6578P9590J07015r0697R1290k901
5537B586786r5631K5219Q2134N7405M0404j08090j5563L5382J91286J48793J10064
5526C058189J11728l071P0939J19648K252O5529P902M5837N5457J00269J17380
5515C752059r8568l8434j6887J6585j13755p8154K4518r8585j40855J736j40521
5504C069139r8327J17385n1600r8974o3864j8574L6435m3517p5885M739O3981
$$ plain form
5581 3765008 3910524 4084920 4136748 4167438 4309478 4290786 4356661 4293192 4289310 4442297 4522290
5570 4522290 4634714 4505636 4167805 3878835 3546225 3195151 2978443 2861921 2736687 2627139
5560 2627139 2667327 2549894 2450695 2291927 2298650 2296973 2344177 2307636 2344905 2339412 2299061 2330292
5548 2330292 2265741 2331350 2393894 2441693 2429067 2402489 2482079 2589094 2498397 2589687 2586786
5537 2586786 2491155 2516374 2598508 2655913 2696317 2588227 2572664 2608046 2799332 2948125 3058189
5526 3058189 3169917 3166846 3237785 3357433 3359685 3425214 3433116 3478953 3534410 3634679 3752059
5515 3752059 3653491 3615057 3598170 3614755 3501000 3422846 3447364 3348779 3207924 3209660 3069139
5504 3069139 2970812 3088197 3036597 2937623 2873759 2855185 2891620 2848103 2772218 2776957 2840938
5493B840938K093j2963j6503P8394k4245m1089L3224n5150j1379p6156L7787K8690
5481B783641L6635p656r0224O029M475j25593o7017j6187j1447N4089N6661q0724
5469B542682j0880j9662p8153J8920m3339J24406q1089o0020l8481R5295M426
5458B454105J6989p477J46817K9069L3715q679r2104j6470p8844j04482M2904
5447B415543R5612L96j02989N3339m4327J20903N5859J3433J36328O0996P0429
5436B875522R1468m5200j17290j40798j35467q9669M8474m2060M5394n9474o9729
5425B361171r5466M9446O1244n1185P5195m7556N3528J8631K4654N1657J8880
5414B520199J72761K51149K9692N4271J34197J66322j41283j8484L5274l1879
$$ plain form
5493 2840938 2843031 2830068 2813565 2891959 2867714 2826625 2859849 2804699 2793320 2717164 2754951 2783641
5481 2783641 2820276 2812620 2722396 2728425 2732900 2607307 2540290 2524103 2512656 2566745 2623406 2542682
5469 2542682 2531802 2512140 2433987 2452907 2409568 2533974 2452885 2392865 2354384 2449679 2454105
5458 2454105 2471094 2463617 2610434 2639503 2673218 2664539 2572435 2555965 2477121 2372639 2415543
5447 2415543 2511155 2511551 2408562 2461901 2417574 2538477 2594336 2607769 2744097 2805093 2875522
5436 2875522 2966990 2921790 2804500 2663702 2528235 2438566 2487040 2444980 2490374 2430900 2361171
5425 2361171 2265705 2315151 2376395 2325210 2400405 2352849 2406377 2425008 2449662 2501319 2520199
5414 2520199 2692960 2944109 2973801 3028072 3162269 3328591 3187308 3168824 3204098 3172219
5404C172219r9245J662j36922N4163j08915n633K9629J13767o937j0846N7212
5393C060154M1060K67N6418l345J09283J38352P9236Q0718R3870N0390O3730Q1656
5381C851789j7029j3462k2067j09520p6815M5184Q6809O7049K4336N6765L8591
5370C931630j9261J29400J37620N6065M9059n9858P4906J75736J14189K10877
5360D800363J18805K49766J53725J10804Q6554r4242p1817J5408N386M821j9141
5349E360432J00280J35609J02318P0238Q044J39145J56977J63688J01082M7145
5339F384958O717J45023J88876J78958J67766K75503J27106J66665N6878J20323
5329G818773Q1715J57128K98201O6600K29290L00301J87933J82719J36122K15201
$$ plain form
5404 3172219 3072974 3074636 2937714 2991877 2882962 2877329 2906958 3020725 3013788 3002942 3060154
5393 3060154 3101214 3101481 3157899 3154554 3263837 3402189 3481425 3562143 3656013 3706403 3770133 3851789
5381 3851789 3834760 3821298 3799231 3689711 3612896 3658080 3744889 3811938 3836274 3893039 3931630
5370 3931630 3912369 4041769 4179389 4235454 4284513 4224655 4299561 4475297 4589486 4800363
5360 4800363 4919168 5168934 5322659 5433463 5520017 5425775 5353958 5369366 5374752 5379573 5360432
5349 5360432 5460712 5596321 5698639 5768877 5776921 5916066 6073043 6236731 6337813 6384958
5339 6384958 6391675 6536698 6725574 6904532 7072298 7347801 7474907 7641572 7698450 7818773
5329 7818773 7900488 8057616 8355817 8422417 8651707 8952008 9139941 9322660 9458782 9673983
5319I673983J56980K25435J89979J75191K04933K52852K54323L01793J98071K25651
5309A1859191L61304L36497K44839L01424M05993L10832K93728L81129K62605
5300A4757542L05071M62102M68955N08830N54721M94629N00626N46357O12377
5291A9211210N76664O72717P86502Q51002Q64094R86134J232392J507254J693576
5282B8381545J968497K376561K757939L117009L569156L396349K218363O50904
5274D8436323o37642o88930R9787P73653J671096K640540L722240M828773N901573
5265F6747413O313101N412947L725755K091327P90237N09992P47534O71926J54718
5256H7164950L10096J269540J975254J814594J376266J633310J883431J439774
$$ plain form
5319 9673983 9830963 10056398 10246377 10421568 10626501 10879353 11133676 11435469 11633540 11859191
5309 11859191 12220495 12556992 12801831 13103255 13509248 13820080 14113808 14494937 14757542
5300 14757542 15062613 15524715 15993670 16502500 17057221 17551850 18052476 18598833 19211210
5291 19211210 19787874 20460591 21247093 22098095 22962189 23948323 25180715 26687969 28381545
5282 28381545 30350042 32726603 35484542 38601551 42170707 45567056 47785419 48436323
5274 48436323 47798681 47109751 47209538 47983191 49654287 52294827 56017067 60845840 66747413
5265 66747413 73060514 78473461 82199216 84290543 85080780 85590772 86338306 87010232 87164950
5256 87164950 87475046 88744586 90719840 92534434 93910700 95544010 97427441 98867215
5248I8867215J475280K392279K904950K446249J538227J08206j444981k749154
5240A05538271l661065l343204k469967j337874r06407j602432k244003j997581
5232H7975738j977297k418218k259775j136774n58306n67488o64308m64500q67726
5223G7061346k476186m519006n790276o517332o220222m858093l516468k292418
5215D0871345j358121o27640M4209O43710O63237j97852k009783l619640l932420
5206C0477045l339799k679935k196438j750545j353889j180364r81613q11242
5198A6183220q39045p47239n82561m98626p08149l60286m63042m60506l69718
5189A1154048l33603j76199k48485k71653k32720j42421l97329k48383j51288
$$ plain form
5248 98867215 100342495 102734774 105639724 108085973 109624200 109732406 108287425 105538271
5240 105538271 101877206 98534002 96064035 94726161 93819754 92217322 89973319 87975738
5232 87975738 85998441 83580223 81320448 80183674 79625368 79057880 78393572 77929072 77061346
5223 77061346 74585160 70066154 64275878 57758546 51538324 46680231 43163763 40871345
5215 40871345 39513224 38885584 38929793 39573503 40236740 40038888 38029105 34409465 30477045
5206 30477045 27137246 24457311 22260873 20510328 19156439 17976075 16994462 16183220
5198 16183220 15344175 14596936 14014375 13515749 12807600 12447314 11984272 11523766 11154048
5189 11154048 10820445 10644246 10395761 10124108 9891388 9748967 9351638 9103255 8951967
5180H951967j80810p8086o4845j28084j84166j85250k00536p6952k4904L3344
5170G861678j37927j78222j643J20480l0187q4239q9924j844r3151L2952o4550
5159G333423j2852O9756N4167O6182o606N54M4443j2243L7862P8423J80957J37200
5147G971266J05498R4377N8105L03876K28152K72490K54189N04288M81228N15184
5137A0788653P14937Q84576P14706M92167m1602m76750o99367o10299m16712k36112
5127A1114197p2350R1023L31643L09562K98384N68231O25429Q12977N98640J68282
5117A4846018l31090p02708r35546p35184n11169m29645l33379k06035r9956k08844
5107A0352462j02563j30116o8836j4524l5366K9244j18330K3045K00083J67885
$$ plain form
5180 8951967 8771157 8693071 8628226 8500142 8315976 8130726 7930190 7853238 7828334 7861678
5170 7861678 7723751 7545529 7543886 7664366 7634179 7549940 7460016 7458172 7365021 7397973 7333423
5159 7333423 7320571 7390327 7444494 7510676 7504070 7504624 7549067 7536824 7574686 7653109 7834066 7971266
5147 7971266 8076764 8171141 8229246 8533122 8761274 9033764 9287953 9792241 10273469 10788653
5137 10788653 11503590 12388166 13102872 13595039 13553437 13076687 12377320 11767021 11350309 11114197
5127 11114197 11041847 11132870 11464513 11774075 12072459 12640690 13266119 14079096 14677736 14846018
5117 14846018 14514928 13812220 12876674 12141490 11630321 11200676 10867297 10661262 10561306 10352462
5107 10352462 10249899 10119783 10050947 10036423 10001057 10030301 9911971 9935016 10135099 10302984
5097A0302984J46499K01533J72668K96951L85075K40821M05152M83184N92954
5088A3227821Q92773R15722R74272J196019J373678J411325Q54000P8374p32062
5079B0191922j096202j248529j094887o95359l28667r2853K20512K52600M97098
5070A6605635Q15977R83110J133726R14815L22942n41084j222991j619976j480242
5061A5911912j150236r53211p97825n60150m41221l69834l65755k15537k43756
5052A0814387j73892q9744m6480j47077j59188n7462j26534m6862O0329R340k9780
5041A0007037Q0408R0922j1554r0562n5963n3480O40Q3279N0544Q721Q2398L6942
5029A0229332O506L4552J29415J90954P4574R1109Q6851P3545K0250R0565K18903
$$ plain form
5097 10302984 10449483 10651016 10823684 11120635 11505710 11746531 12151683 12634867 13227821
5088 13227821 14120594 15036316 16010588 17206607 18580285 19991610 20845610 20923984 20191922
5079 20191922 19095720 17847191 16752304 16056945 15728278 15635425 15855937 16108537 16605635
5070 16605635 17421612 18404722 19538448 20453263 20776205 20235121 19012130 17392154 15911912
5061 15911912 14761676 13808465 13010640 12450490 12009269 11639435 11273680 11058143 10814387
5052 10814387 10640495 10550751 10504271 10357194 10198006 10140544 10014010 9967148 10027477 10036817 10007037
5041 10007037 10087445 10178367 10166813 10076251 10020288 9966808 9967448 10050727 10101271 10109992 10192390 10229332
5029 10229332 10235838 10270390 10399805 10590759 10665333 10756442 10843293 10916838 10937088 11027653 11246556
5018A1246556J45393J09748R6541J34732J18819J88450J08069Q9125Q7788J36484
5008A2461705J12626P637J55761J99939J17850K45150J92594L52342L15330L54531
4998A4515465K98789K25788J09977J9262J30802J04258J52637K22330K91774K80172
4988A6351254K86560L23571L50398M60090M38779O09922P34835P13178Q12508
4979B1081095Q30454P90028Q17405R13710J025147J203680J037045R43022N70573
4970B9212159j41438o54516r05455q42376n73984l78899j65633K6179J46760K69956
4960B5992753M10082N29778L96728M07802L60051K73503N16080P85824Q87442
4951C0560043R99545J199673J500956J726784J774471J390327Q07834M9501o69563
$$ plain form
5018 11246556 11391949 11501697 11598238 11732970 11851789 12040239 12148308 12237433 12325221 12461705
5008 12461705 12574331 12581968 12737729 12937668 13055518 13300668 13493262 13845604 14160934 14515465
4998 14515465 14814254 15040042 15150019 15169281 15300083 15404341 15556978 15779308 16071082 16351254
4988 16351254 16637814 16961385 17311783 17771873 18210652 18820574 19555409 20268587 21081095
4979 21081095 21911549 22701577 23518982 24432692 25457839 26661519 27698564 28641586 29212159
4970 29212159 29070721 28416205 27510750 26668374 26094390 25715491 25549858 25576037 25722797 25992753
4960 25992753 26402835 26932613 27329341 27737143 28097194 28370697 28886777 29672601 30560043
4951 30560043 31559588 32759261 34260217 35987001 37761472 39151799 39959633 40009134 39339571
4942C9339571q54545r21179n59485l60961m2176N550L26651M76102L23030N24722
4932C8257280N92247O18730O91338P42353O03381O59680P66601Q21910R26652
4923D4680172J083252J262710J291087J120269J085326Q02096M04924K41597L38821
4914E2310254M15027P97486R86490J080196J212835J136880J342050J435339J262684
4905F1979241J275028J265775J387898J664308J817164K030779K198674K344804
4897G5963671K520401K811346K908798L030586K858987K661950K414406K498416
4889I7668561L107739L762994M657086N632105O983870Q763073J0719757J3226890
4881A54522075J4805516J2820410N368731m340675r754511r552019o588541l532894
$$ plain form
4942 39339571 38485026 37563847 37004362 36643401 36601225 36606775 36933426 37409528 37732558 38257280
4932 38257280 38849527 39468257 40159595 40901948 41505329 42165009 42931610 43753520 44680172
4923 44680172 45763424 47026134 48317221 49437490 50522816 51324912 51729836 51971433 52310254
4914 52310254 52725281 53522767 54509257 55589453 56802288 57939168 59281218 60716557 61979241
4905 61979241 63254269 64520044 65907942 67572250 69389414 71420193 73618867 75963671
4897 75963671 78484072 81295418 84204216 87234802 90093789 92755739 95170145 97668561
4889 97668561 100776300 104539294 109196380 114828485 121812355 130575428 141295185 154522075
4881 154522075 169327591 182148001 187516732 183176057 173421546 163869527 157280986 153748092
4873A53748092j060177J227182L208311M777316O406206Q336045J0401329J3027324
4865B00071628J5939238J9352197K2116158K1680627J7024590J1686945Q754052
4858C16625435N534564j539130r504527j2667981j1284387q352165n856770l777140
4850B69177899j809342l79666Q96326J978523L202104M764190O944033R942334
4842B94716401J3266676J4587403J1350266L189222m526638o159281l252109J231152
4834C24403092N192958Q608167J1485329J3810419J5499127J6690363J6457417
4827D12146872J4910347J1454995O787417J417988l642219q048984j1520332j3695549
4819D09810535j4616900j4322578j3040782j0875574q299319n829272l658477
$$ plain form
4873 153748092 152687915 153915097 157123408 161900724 168306930 176642975 187044304 200071628
4865 200071628 216010866 235363063 257479221 279159848 296184438 307871383 316625435
4858 316625435 322159999 320620869 311116342 298448361 287163974 278811809 272955039 269177899
4850 269177899 267368557 266988891 267885217 269863740 273065844 277830034 284774067 294716401
4842 294716401 307983077 322570480 333920746 337109968 332583330 326424049 323171940 324403092
4834 324403092 329596050 338204217 349689546 363499965 378999092 395689455 412146872
4827 412146872 427057219 438512214 445299631 446717619 443075400 435026416 423506084 409810535
4819 409810535 395193635 380871057 367830275 356954701 348655382 342826110 339167633
4812C39167633j668199J4275J545815L257013N297849P365152R790346J2124620
4804C76894504J4482942J6277451J7306630J7352293J6182646J3517738R777655
4797D81791859N247897m60963o330958j1774508j6361617j8971975j9961121j9511598
4789C93667016j8219084j6618461j5088459j3793729j2344251j0892401r394709
4782B97315922p745915o256991m916146l693313k535994j758248j257306j222039
4774B67929970j570795k151908k665431l042055l794120m724435o000688p644064
4766B36336474r017600r889781j0252513j0141053r542121r010344q719226q183545
4758A61580291p720304p157235o660819o162237n490266m809545m472961m168606
$$ plain form
4812 339167633 337499434 337513709 339059524 342316537 347614386 354979538 364769884 376894504
4804 376894504 391377446 407654897 424961527 442313820 458496466 472014204 481791859
4797 481791859 487039756 486578793 480247835 468473327 452111710 433139735 413178614 393667016
4789 393667016 375447932 358829471 343741012 329947283 317603032 306710631 297315922
4782 297315922 289570007 283313016 278396870 274703557 272167563 270409315 269152009 267929970
4774 267929970 266359175 264207267 261541836 258499781 254705661 249981226 243980538 236336474
4766 236336474 227318874 217429093 207176580 197035527 187493406 178483062 169763836 161580291
4758 161580291 153859987 146702752 140041933 133879696 128389430 123579885 119106924 114938318
4750A14938318l853120l351564l026342k778050k364511j997221j821226j451034
4742I4295250j365540j227269j278593j236552j438550j492345j335195j531844
4734H3389362j403000j551866j435297j402931j471024j430290j654644j808582
4726G1231728j862657j846902j535213j459426j279019r76486p15079n58254k87388
4717F0711304j91266j43619l03042n19632n47096n32284o80365q30264r73616
4708E5990120j117636j085287j027286r58154p55787n13315n39424o40558n74781
4699D8777892q18824p50134p36543r05744p61660p29370p75254o71036n10497
4690D2118830n87250p04664n68570m57406l11070k61560j67399k17368m82632
$$ plain form
4750 114938318 111085198 107733634 104707292 101929242 99564731 97567510 95746284 94295250
4742 94295250 92929710 91702441 90423848 89187296 87748746 86256401 84921206 83389362
4734 83389362 81986362 80434496 78999199 77596268 76125244 74694954 73040310 71231728
4726 71231728 69369071 67522169 65986956 64527530 63248511 62272025 61556946 60998692 60711304
4717 60711304 60520038 60376419 60073377 59553745 59006649 58474365 57794000 56963736 55990120
4708 55990120 54872484 53787197 52759911 51801757 51045970 50532655 49993231 49352673 48777892
4699 48777892 47959068 47208934 46472391 45566647 44804987 44075617 43300363 42629327 42118830
4690 42118830 41531580 40826916 40258346 39800940 39489870 39228310 39060911 38843543 38360911
4681C8360911p79586r14215q07621p79736n00222j70077l1996R7467K12421J97134
4671C4884480K0387n0114j84468m03519l91200n56447o62520p04907n35190n42713
4661C0873789n13454l97894l39979l65376l58317l50198k54317n64432n87683
4652B7142139l94443k88463l52959k56895k34874j10224M2066m8296N121L3816
4642B5536988N637o2847J41041K7998J06459J2102Q2034M7858o6689P4623J51112
4631B6056316k8145R1630L18904L34113L19244N22671P00105P89155J086763J271075
4621C1461831J436691J641243J621184P16320l83081j081027j221576q53751l68847
4612C2968987m0404K24027K35086N00779Q31766R30541J018070J396306J643162
$$ plain form
4681 38360911 37581325 36667110 35859489 35079753 34579531 34409454 34377458 34474925 34687346 34884480
4671 34884480 34904867 34854753 34670285 34266766 33875566 33319119 32656599 31951692 31416502 30873789
4661 30873789 30360335 29962441 29622462 29257086 28898769 28548571 28294254 27729822 27142139
4652 27142139 26747696 26459233 26106274 25849379 25614505 25504281 25546347 25498051 25503172 25536988
4642 25536988 25542625 25479778 25620819 25648817 25755276 25767378 25849412 25897270 25830581 25905204 26056316
4631 26056316 26028171 26119801 26438705 26772818 27092062 27614733 28314838 29103993 30190756 31461831
4621 31461831 32898522 34539765 36160949 36877269 36494188 35413161 34191585 33337834 32968987
4612 32968987 32928583 33152610 33387696 33888475 34720241 35650782 36668852 38065158 39708320
4603C9708320K153011K538471K731949K834360K348806K131029J936731J550886
4595E7933563R33340O41434R38012J723446K909366M216433N740177P292860R439642
4586I1768273J2028107J4025928J3501411Q122536o50994p792593r687101p361524
4578A13954043l799663p93468J806105M466933P465684R828611R190743L512379
4570A45631367m641043j0412201j0870459p612757l401670Q31210M871270P649114
4562A22044831O874379J420543o067996j1048050j1398930q793485n367581k026601
4554H5637110R44228L697999O219442P523027N309130q58384q454496j3020238
4546H6997818j3156419j1052148q444669o390457m855292l752957k934835k443490
$$ plain form
4603 39708320 41861331 44399802 47131751 49966111 52314917 54445946 56382677 57933563
4595 57933563 58866903 59508337 60446349 62169795 65079161 69295594 75035771 82328631 91768273
4586 91768273 103796380 117822308 131323719 139446255 138795261 131002668 121315567 113954043
4578 113954043 110154380 109360912 111167017 115633950 123099634 132928245 142118988 145631367
4570 145631367 140990324 130578123 119707664 112094907 108693237 109524447 114395717 122044831
4562 122044831 128919210 130339753 124271757 113223707 101824777 93031292 87663711 85637110
4554 85637110 86581338 90279337 96498779 104021806 109330936 108472552 100018056 86997818
4546 86997818 73841399 62789251 54344582 47954125 43098833 39345876 36411041 33967551
4538C3967551k131572j881958j706062j324362j306833j124782r46774q57646
4530B2687562p78506o58774o84720n71399m91453m30066n01667m76817n28675
4521A7565485l41469k35220k72215k10011k60035k21080k31094j31155j58782
4512A5504424k00545j93383j46039j33773j29967k12222j47925j43906j55676
4503A4040988j61281j06780j46158k11173l11938j50149j01793k63916k70852
4494A2316948r0891j11663k33956j19914j43605l27443l8100n1566q6535q0703
4484A1032572j50195k6625o2440j3257l3087j97124j30355k14001r7003r8017
4474A0010468j55120j39780j67177j30877k20925j05751j89604j0527M504R95
$$ plain form
4538 33967551 31835979 29954021 28247959 26923597 25616764 24491982 23545208 22687562
4530 22687562 21909056 21250282 20565562 19994163 19502710 19072644 18570977 18094160 17565485
4521 17565485 17224016 16988796 16716581 16506570 16246535 16025455 15794361 15663206 15504424
4512 15504424 15303879 15110496 14964457 14830684 14700717 14488495 14340570 14196664 14040988
4503 14040988 13879707 13772927 13626769 13415596 13103658 12953509 12851716 12587800 12316948
4494 12316948 12226057 12114394 11880438 11760524 11616919 11289476 11251376 11199810 11113275 11032572
4484 11032572 10882377 10855752 10793312 10780055 10746968 10549844 10419489 10205488 10108485 10010468
4474 10010468 9855348 9715568 9548391 9417514 9196589 9090838 8901234 8890707 8895211 8896206
4464H896206L01N9015L6007K4309J68502Q2157Q7800K1781J0142j30184r5513
4453I160523q2702L9124K30993L29464M12276M27668P15446Q95035P75825K09882
4443A3113534n51284r92856r48429o82495n21276l64044k44323j66983k02975
4434H438869l45344l5073o4574q3495j91345k8482K9074r9037j04766j8772m028
4423G493027j04791n5428M8134r372J12308q2615k0899L5056R5124O0762p66J0206
4411G580746q3367Q5052N3763R1266J44801R5301j12818O0887J4460J1835K0741
4400G962667R2393P1205O3216m1126k0553J05703M0673J41170j19931J01725k011
4389H395131J20484J22389K8911J90395J19594N3621N8821P3634o3342K00705
$$ plain form
4464 8896206 8896507 8955522 8991529 9015838 9184340 9266497 9354297 9376078 9386220 9256036 9160523
4453 9160523 9077821 9116945 9347938 9677402 10089678 10517346 11232792 12127827 12903652 13113534
4443 13113534 12562250 11569394 10620965 9938470 9417194 9053150 8808827 8641844 8438869
4434 8438869 8093525 8058452 7993878 7910383 7719038 7690556 7719630 7620593 7515827 7497055 7493027
4423 7493027 7388236 7332808 7380942 7371570 7483878 7401263 7380364 7415420 7510544 7571306 7570540 7580746
4411 7580746 7497379 7582431 7636194 7727460 7872261 7967562 7854744 7915631 7930091 7941926 7962667
4400 7962667 8055060 8126265 8189481 8148355 8127802 8233505 8274178 8415348 8295417 8397142 8395131
4389 8395131 8515615 8638004 8666915 8857310 8976904 9030525 9089346 9162980 9099638 9300343
4379I300343Q6003O1340r496J75148J80455P0878l1314J86461J05412J64111J13194
4368A0402535J27819J60442J69440J41452R5270K30422K06396J19750J27935K40439
4358A2021900K75026K81709K02589J84159K65743L08828K26921L26006L11729
4349A4404610K74361M49210M99558M61845M11331M93921N66161N74633P18035
4340A8853665P48318P88930R88765J118100J136804J242507J512846J761998J937137
4331C0089070J779568J116359M8367p90884r40995o85192l73980n2534M11401
4322C0601180N38023Q63573R83458J058004M49201m75816j210734j381433j067869
4313C0357587p02832k36083Q5703N21872M69077J64414n57000j296689j627746
$$ plain form
4379 9300343 9386346 9447686 9438190 9613338 9793793 9864671 9833357 10019818 10125230 10289341 10402535
4368 10402535 10530354 10690796 10860236 11001688 11096958 11327380 11533776 11653526 11781461 12021900
4358 12021900 12296926 12578635 12781224 12965383 13231126 13539954 13766875 14092881 14404610
4349 14404610 14678971 15128181 15627739 16089584 16500915 16994836 17560997 18135630 18853665
4340 18853665 19601983 20390913 21379678 22497778 23634582 24877089 26389935 28151933 30089070
4331 30089070 31868638 32984997 33033364 32242480 31301485 30616293 30242313 30189779 30601180
4322 30601180 31139203 32002776 32986234 34044238 34493439 34017623 32806889 31425456 30357587
4313 30357587 29654755 29418672 29504375 30026247 30495324 30659738 30102738 28806049 27178303
4304B7178303j341286j030262p11786m24903j49372L43414M16605M34102K58922
4295B4973737m61734j170892j455254j463621j058595r46048o80866n59639m09618
4286A6767470l77508k87002k90197k34417k06177j12203l8216j00898j131n8631
4276A5061090j15462Q9952L3409N6006O4125k5102R7124k3546M8339K02921J56905
4265A5645761l214R6618J05589M2686J79324J75538J23283J92345J84969L12675
4255A7055574K93544J15445K74586K04877J15749J53808K80963K28788K63100
4246A8986434L57775K55624L34408L00092K63982L95930K11073K58753L97166
4237B1761237K20210L08107M32559M93954L82789M21341L70384N29328M44884
$$ plain form
4304 27178303 25837017 24806755 24094969 23670066 23520694 23864108 24280713 24714815 24973737
4295 24973737 24512003 23341111 21885857 20422236 19363641 18417593 17736727 17177088 16767470
4286 16767470 16389962 16102960 15812763 15578346 15372169 15259966 15221750 15120852 15119721 15061090
4276 15061090 14945628 15035580 15068989 15124995 15189120 15164018 15261142 15237596 15285935 15488856 15645761
4265 15645761 15642547 15739165 15844754 15887440 16066764 16242302 16365585 16557930 16742899 17055574
4255 17055574 17349118 17464563 17739149 17944026 18059775 18213583 18494546 18723334 18986434
4246 18986434 19344209 19599833 19934241 20234333 20498315 20894245 21105318 21364071 21761237
4237 21761237 21981447 22289554 22722113 23216067 23598856 24020197 24390581 24919909 25364793
4228B5364793N59069N88113M90163N41742N99187N76610O03334O68768O82862
4219C0674641P33129P10778Q32123Q97018Q21940J011161J068954J119789J055701
4210C8925234J359606J387558J366955J530095J764408J772330J789318J928485
4202E1823989K073131K106543K000920J848854J796575J781615J604796J618506
4194F6654929J690202J544276J513187J591268J700712J896624K247441K682036
4186H1520675L071473L322551L547789L520272L118837K646398K345488K241071
4178A05334554K049050K215720K381605K546296K338853K277986K216330K245127
4170A23605521K342993K439078K793874K840821K862795K921827K529538K492953
$$ plain form
4228 25364793 25923862 26511975 27002138 27543880 28143067 28719677 29323011 29991779 30674641
4219 30674641 31407770 32118548 32950671 33847689 34669629 35680790 36749744 37869533 38925234
4210 38925234 40284840 41672398 43039353 44569448 46333856 48106186 49895504 51823989
4202 51823989 53897120 56003663 58004583 59853437 61650012 63431627 65036423 66654929
4194 66654929 68345131 69889407 71402594 72993862 74694574 76591198 78838639 81520675
4186 81520675 84592148 87914699 91462488 94982760 98101597 100747995 103093483 105334554
4178 105334554 107383604 109599324 111980929 114527225 116866078 119144064 121360394 123605521
4170 123605521 125948514 128387592 131181466 134022287 136885082 139806909 142336447 144829400
4162A44829400K643428L282460M032944M981695N746499O132026N685727M552997
4154A81887176K965150J654948J219191J409713J833031K297876K532806K475757
4146A98275648K315144K013059J986532J872486J850530J821688J483628J237776
4138B12856491J000953J067997J231695J696654K317081L465081M464932N588754
4130B33689638O716622P298849P560984O936063N756234M759849M662090M809357
4122B82189686N163173M870970M081265K994374K259981K045383J794409J202462
4114C06601703M60886k05607l65813J22455O82919J327571K091014K861583L025974
4105C16602685L090910K855167K163015J545652Q05933L44420M9091l96297l18898
$$ plain form
4162 144829400 147472828 150755288 154788232 159769927 165516426 171648452 177334179 181887176
4154 181887176 184852326 186507274 187726465 189136178 190969209 193267085 195799891 198275648
4146 198275648 200590792 202603851 204590383 206462869 208313399 210135087 211618715 212856491
4138 212856491 213857444 214925441 216157136 217853790 220170871 223635952 228100884 233689638
4130 233689638 240406260 247705109 255266093 262202156 267958390 272718239 277380329 282189686
4122 282189686 287352859 292223829 296305094 299299468 301559449 303604832 305399241 306601703
4114 306601703 307062589 306856982 306491169 306613624 307296543 308624114 310715128 313576711 316602685
4105 316602685 319693595 322548762 324711777 326257429 327063362 327407782 327456873 327060576 326741678
4096C26741678K68698Q50652J268108J411690J143846N93626k86867j553568k383642
4087C28054221k517434k306573j977817j820168k371169l474495m309497m063481
4079C05213587l607065l394943m447037o134274p510540p782602p176672o158592
4071B59001862m832353l826819k743402k114651j921753j997598k331016k579294
4063B36654976k998850l378133l570485l676030l927984l915703l942184m037260
4055B07208347l692535l146766k385225j766129j347863j443445k374508l755898
4047A87295978n408457o162457o053629n259841m393183l569739l118047k940788
4039A50389837k777570l048216l350191l435929l531055l502533l116547k984667
$$ plain form
4096 326741678 327010376 327861028 329129136 330540826 331684672 332278298 331991431 330437863 328054221
4087 328054221 325536787 323230214 321252397 319432229 317061060 313586565 309277068 305213587
4079 305213587 301606522 298211579 293764542 287630268 280119728 272337126 265160454 259001862
4071 259001862 254169509 250342690 247599288 245484637 243562884 241565286 239234270 236654976
4063 236654976 233656126 230277993 226707508 223031478 219103494 215187791 211245607 207208347
4055 207208347 203515812 200369046 197983821 196217692 194869829 193426384 191051876 187295978
4047 187295978 181887521 175725064 169671435 164411594 160018411 156448672 153330625 150389837
4039 150389837 147612267 144564051 141213860 137777931 134246876 130744343 127627796 124643129
4031A24643129k792343k765139k533160k458377k362409k242488k146431k371107
4023A04971675k426045k750169l177785l462268l480251l362727l158806k864996
4015H0288628k469250k065610k083902j997212k028026k099937k062265k094862
4007F3387564k027169j828789j851922j885970j952595k042776k122956j905841
3999D7769546j940673k049473j712042j494377j527224j472860j399172j370213
3991C4803512j192203j180380j157460j115370r78710j036999r18869r53588q79325
3982B5390608p30083p50723p56484o61848o32046o46821o25401n17935m39582
3973A9629685n13122l49401m18264l55856m52240l64855m41032k28816k81456
$$ plain form
4031 124643129 121850786 119085647 116552487 114094110 111731701 109489213 107342782 104971675
4023 104971675 102545630 99795461 96617676 93155408 89675157 86312430 83153624 80288628
4015 80288628 77819378 75753768 73669866 71672654 69644628 67544691 65482426 63387564
4007 63387564 61360395 59531606 57679684 55793714 53841119 51798343 49675387 47769546
3999 47769546 45828873 43779400 42067358 40572981 39045757 37572897 36173725 34803512
3991 34803512 33611309 32430929 31273469 30158099 29179389 28142390 27223521 26269933 25390608
3982 25390608 24660525 23909802 23153318 22491470 21859424 21212603 20587202 20069267 19629685
3973 19629685 19116563 18767162 18348898 17993042 17540802 17175947 16734915 16506099 16224643
3964A6224643m24209l71160m12275k85041l62518l84403k51272j92687k52171
3955A3288907k75948j92499k38278l16305j74576j88811r0352k70458k09712o576
3945A1325392j08890j86715k04908r9867j46414j19454j23831p0947j15510j39303
3935A0009553p0266j57465j25801q6694j02693j39101p5176j62622q9779n7854
3925H942102j08322r9357p0866n8356j14007p0466j01708L0561o5096r8134j13531
3914H072820q1316J1885j41735J0993J53264L4278l5868p926p0471p8029l2837
3903G835058j308j42058L8468J06076P2903J10188o879n630P4372p1450j2916
3892G996824m8291j19180R7769j8973M4864P4481N4817J9350N0780l0179L6245
$$ plain form
3964 16224643 15800434 15429274 15016999 14731958 14369440 13985037 13733765 13541078 13288907
3955 13288907 13012959 12820460 12582182 12265877 12091301 11902490 11812138 11541680 11331968 11325392
3945 11325392 11216502 11029787 10824879 10725012 10578598 10459144 10335313 10264366 10148856 10009553
3935 10009553 9939287 9781822 9656021 9569327 9466634 9327533 9252357 9089735 8999956 8942102
3925 8942102 8833780 8734423 8663557 8605201 8491194 8420728 8319020 8349581 8284485 8186351 8072820
3914 8072820 7991504 8003389 7861654 7872647 8025911 8060189 8024321 8016395 7945924 7867895 7835058
3903 7835058 7833750 7691692 7730160 7836236 7909139 8019327 8012448 8006818 8081190 8009740 7996824
3892 7996824 7948533 7829353 7927122 7908149 7953013 8027494 8082311 8101661 8152441 8122262 8158507
3881H158507M7526L1407M7344R142J06802J01063P6734J27194O5508P9989J69521
3870I020737R7697N5567Q2687N8016k7878J1599N3368J3366J233P6832M7571K07666
3858I698461K9947j4373N1127J9331n7398l9187K1657n9849j0730K2576L1266
3847I692828k069L45q6178Q3681n2713n3121p2279m5239j19746l1662L440J05697
3835I422984n227j00486q778J1332p5385j90808r8181j94899r0646j85803j50701
3824H333402j34716j29339k08692j33206r111P426k9986j02192j46086j09695
3814G337805q6484p7613j00299j28001j95506j67415j59570j51086k35351o9608
3804E966872j11389j22033j79358j21678j1831j08577j27733j78990j73953j079
$$ plain form
3881 8158507 8206033 8237440 8284784 8293926 8400728 8501791 8578525 8705719 8771227 8851216 9020737
3870 9020737 9118434 9174001 9256688 9314704 9286826 9298425 9351793 9365159 9366392 9443224 9490795 9698461
3858 9698461 9728408 9714035 9765162 9784493 9727095 9687908 9709565 9649716 9638986 9661562 9692828
3847 9692828 9690759 9691104 9604926 9688607 9635894 9582773 9510494 9465255 9345509 9313847 9317287 9422984
3835 9422984 9417757 9317271 9308493 9319825 9244440 9053632 8955451 8760552 8669906 8484103 8333402
3824 8333402 8198686 8069347 7860655 7727449 7718338 7725764 7695778 7593586 7447500 7337805
3814 7337805 7251321 7173708 7073409 6945408 6749902 6582487 6422917 6271831 6036480 5966872
3804 5966872 5855483 5733450 5554092 5432414 5420583 5312006 5184273 5005283 4831330 4830251
3794D830251L3852o4562j26918r7215j8319j19899n5495k2631j02393j41039j5361
3783D100271p3261l6996j4909K1304p6602J6338r1273j3058p4874o3769L9616
3772C732787j16166j35583L7210l3857q2643P1571j14872k1421r895j9956j20190
3761C186985m8892K6886m7674o7788o4889M3354J4418N279j45790r244J20287
3750C012932l9582Q2k5816j11001Q0529o8203n5080j3756M0369k1990J1774p8167
3738B732091j0692L6923q2000N9299p9254p5303J2548K0079J01229o5835L0911
3727B679996N3555p7137k5361L6671P4375n1297k1914q0758N4957J18474L1976
3716B793537j71149R6369P8883J32542J37686L28181L59087K26906O0189n2589
$$ plain form
3794 4830251 4864103 4799541 4672623 4575408 4557089 4437190 4381695 4359064 4256671 4115632 4100271
3783 4100271 4027010 3990014 3975105 3996409 3919807 3936145 3844872 3831814 3756940 3693171 3732787
3772 3732787 3616621 3481038 3518248 3484391 3401748 3473319 3358447 3337026 3327131 3307175 3186985
3761 3186985 3138093 3164979 3117305 3049517 2984628 3027982 3042400 3047679 2901889 2892645 3012932
3750 3012932 2973350 2973432 2947616 2836615 2917144 2848941 2793861 2780105 2820474 2798484 2810258 2732091
3738 2732091 2721399 2758322 2676322 2735621 2656367 2581064 2593612 2613691 2714920 2649085 2679996
3727 2679996 2733551 2656414 2631053 2667724 2742099 2690802 2668888 2588130 2643087 2761561 2793537
3716 2793537 2622388 2718757 2797640 2930182 3067868 3396049 3755136 3982042 4042231 3989642
3706C989642l01342l13510l64046j78780M4991o3513o5920M1647l6885q5591j16805
3695B549888o1149J13816o5533o8024j11161r865n8489Q375p4358k6477n53J4760
3683B211230m896k1693L5374n4816J57170J25139r2940k260N2488j6776P2930
3672B460950J6748j8630N8450J11310L6772m8512P2458j7404l9482m6099L4931
3661B621492P2860k5040M4200J079Q6169L0432J8417K8250K9713k9024k3255J01944
3649B957237J01299J13123L4450L1590J45215O9766k1824M1787J79936R6981p641
3638C741919J94988p5729m7558k2022J1036Q1930L8636L9953N3703p8303M2442
3627C980995K20491J48344o3473O3755J98984L3953N2468J26346J1015J32119
$$ plain form
3706 3989642 3688300 3374790 3010744 2831964 2876955 2813442 2747522 2789169 2752284 2666693 2549888
3695 2549888 2488739 2602555 2537022 2468998 2357837 2347972 2289483 2297858 2223500 2197023 2196470 2211230
3683 2211230 2206334 2184641 2220015 2165199 2322369 2447508 2354568 2352308 2404796 2388020 2460950
3672 2460950 2477698 2459068 2517518 2628828 2665600 2617088 2689546 2672142 2632660 2586561 2621492
3661 2621492 2694352 2669312 2713512 2714591 2800760 2831192 2849609 2877859 2907572 2878548 2855293 2957237
3649 2957237 3058536 3171659 3206109 3237699 3382914 3452680 3430856 3472643 3652579 3749560 3741919
3638 3741919 3936907 3861178 3813620 3791598 3802634 3884564 3923200 3963153 4016856 3938553 3980995
3627 3980995 4201486 4349830 4286357 4350112 4549096 4583049 4635517 4761863 4772878 4904997
3617D904997P004P1674O9631P155L0414K02064m1430q7681P3178J35965J31243
3606E504214O202O2020M1704J06931L2709R9330o3728P869J14506J93836R4623
3595F200216J74278K23316N3674J43682J66913Q2912Q7228K49869K47233J38654
3585G767975K41592K12990L56637L13182L04244K19124K93598J54502L20403L70895
3575A0555142M09174M44929N96862O46139P55992P56332O00627P77770P37678
3566A6280645P14323O86564N87082M05082R9271k6734l26009q08658j042418j243307
3556A5325841j044218j066671r69139p00189n83869o74414n55669n23134m74042
3547H734496m42908l79572l50255l23065k87359j68932k59819k60200k43740k02508
$$ plain form
3617 4904997 4912001 4983675 5053306 5060461 5090875 5292939 5251509 5163828 5237006 5372971 5504214
3606 5504214 5510416 5572436 5614140 5721071 5753780 5853110 5789382 5797251 5911757 6105593 6200216
3595 6200216 6374494 6597810 6651484 6795166 6962079 7044991 7132219 7382088 7629321 7767975
3585 7767975 8009567 8222557 8579194 8892376 9196620 9415744 9709342 9863844 10184247 10555142
3575 10555142 10964316 11409245 12006107 12652246 13408238 14164570 14765197 15542967 16280645
3566 16280645 16994968 17681532 18268614 18673696 18772967 18746233 18420224 17611566 16569148 15325841
3556 15325841 14281623 13214952 12245813 11545624 10961755 10287341 9731672 9208538 8734496
3547 8734496 8291588 7912016 7561761 7238696 6951337 6782405 6522586 6262386 6018646 5816138
3537E816138k16936j06612k36077k10758o8302j78374r8209k09324j81446m3476
3527D266624j46984j28295l0987j33749r9470j13643j35804j70287m2870p8337
3517C186198j16068r3715K7735j55038p1040n473p6789j6062j771P598p5267p3590
3505B536718o2587n9507j22762o9210J4958Q734j65023j07819J8393M0073r4276
3494A937692r4687L4440Q297q2019j14137K6392m7477l5139k4628Q5798j38966
3483A555566k8360N0311n8672K811n0415p3825M8485o0047K2976n5974n8447P4177
3471A368586j6674j06362n386K3285n0818l274Q1622L3821j17044O6238l5634
3460A238360j687k4008O7129l3208o0280m1573j6100k3210N3071j8581L5538j5597
$$ plain form
3537 5816138 5599202 5492590 5256513 5045755 4977453 4799079 4700870 4491546 4310100 4266624
3527 4266624 4119640 3991345 3960358 3826609 3727139 3613496 3477692 3307405 3264535 3186198
3517 3186198 3070130 2976415 3004150 2849112 2778072 2772599 2695810 2679748 2677977 2685575 2610308 2536718
3505 2536718 2474131 2414624 2291862 2222652 2237610 2246344 2081321 1973502 1991895 2031968 1937692
3494 1937692 1843005 1877445 1885742 1803723 1689586 1715978 1668501 1633362 1608734 1694532 1555566
3483 1555566 1527206 1577517 1518845 1521656 1471241 1397416 1445901 1385854 1408830 1352856 1294409 1368586
3471 1368586 1351912 1245550 1240164 1263449 1212631 1209357 1290979 1324800 1207756 1273994 1238360
3460 1238360 1236673 1212665 1279794 1246586 1186306 1144733 1128633 1105423 1158494 1139913 1175451 1159854
3448A159854n4467j08632m4495J01491P5868m7337q9929J15759N2756K472l2939
3437A130401q645j64535M4030O5039n6667m6975J38298Q6594L5480j03868m4931
3426A074221L2668n0458m66M2209m1202l8612O46j14812O6802k3530J2701L3090
3414I93257R279O5727O566q1823N9182k6837j1030n1625o0616R0248L2973m0097
3402I85204J16472k1221o9689k0731j0965J2559J66366l205n6398r7143Q2012
3391A083261l4206o9211M8288P3177r1080k3374L7522o8550J59821r54n3540l4023
3379A027131O8519k7117J3174n6016j3621R9708p731o4869J9061J36456m261q8647
3367A101787l9835K8864J23274r4520K4235o3272N1121O4099J0105M240j0154
$$ plain form
3448 1159854 1105387 996755 952260 1053751 1129619 1082282 992353 1108112 1160868 1163340 1130401
3437 1130401 1121756 957221 1001251 1066290 1009623 962648 1100946 1187540 1223020 1119152 1074221
3426 1074221 1106889 1056431 1055965 1098174 1056972 1018360 1019006 904194 970996 947466 960167 993257
3414 993257 1002536 1068263 1074829 993006 1052188 1025351 1014321 962696 902080 992328 1025301 985204
3402 985204 1101676 1080455 1010766 990035 979070 991629 1157995 1154790 1098392 1001249 1083261
3391 1083261 1049055 979844 1028132 1101309 1010229 986855 1024377 955827 1115648 1114694 1061154 1027131
3379 1027131 1095650 1068533 1081707 1025691 1012070 1111778 1104047 1039178 1058239 1194695 1190434 1101787
3367 1101787 1061952 1090816 1214090 1119570 1143805 1080533 1131654 1195753 1205858 1210098 1199944
3356A199944k735Q862K17375M416p371J16491m28Q2370O0072L9966k462K34925
3344A951425J26966P5582N9536m4831m707L7335P2715m4070p0006m5373q4970
3333B029602j1174K8678J02355l1188N8355l4886l0927P6432o2897P9082P4873
3322B278305L9471K0556l2900L7761J04708N6203J79909k2410M8622O7473J48181
3311B925879J20165J87170R6249K73161J82325K29599J28043N334N0535j44798
3301D053662k11887j98041j75560j66571O5800j61203N2949L2102Q5702N1857
3291C428810O5717J32849K9972N205K8104n2796j7026L9928j16547k66329p6438
3280C201449J39914j6689n5992o6864m1481J07792J78186O1596J32328J59261
$$ plain form
3356 1199944 1197209 1206071 1423446 1427862 1420491 1536982 1536554 1618924 1678996 1718962 1716500 1951425
3344 1951425 2078391 2153973 2213509 2168678 2163971 2201306 2274021 2229951 2159945 2114572 2029602
3333 2029602 2018428 2047106 2149461 2118273 2176628 2141742 2110815 2187247 2124350 2203432 2278305
3322 2278305 2317776 2338332 2305432 2343193 2447901 2504104 2684013 2661603 2710225 2777698 2925879
3311 2925879 3046044 3233214 3329463 3602624 3784949 4014548 4142591 4147925 4198460 4053662
3301 4053662 3841775 3643734 3468174 3301603 3367403 3206200 3259149 3291251 3376953 3428810
3291 3428810 3494527 3627376 3657348 3662553 3690657 3637861 3620835 3660763 3544216 3277887 3201449
3280 3201449 3341363 3324674 3268682 3201818 3160337 3268129 3446315 3507911 3640239 3799500
3270C799500J34223R6303J4670k0958O756J0249M581k3891k2263O7194O4759J15097
3258D246220Q8734K01600K50508J60300K05954J52869J04353l3735N4114o2634
3248E368283q1542p5554k20545M3514j02805j52078N4629n9522r3123Q0290L4999
3237D796546k9616O1607J00848J07304O7468M2374Q6861J03282O3679R7602J25203
3226E623158K09325K94701L69686K39731M13989L07774J81432n7643l91038m75823
3216F715292n08947l75771l58914k81800j36384r9201m9673j35696j7147k8150
3206D723609j02618j3744j01593R7458L970n9295J03774m6411o7683J0041J38980
3195D686488N3996p0532l352j15315J3869L2775l9845k04820l13624k03910k17202
$$ plain form
3270 3799500 3933723 4030026 4044696 4023738 4030494 4040743 4045324 4021433 3999170 4066364 4131123 4246220
3258 4246220 4334954 4536554 4787062 4947362 5153316 5306185 5410538 5376803 5430917 5368283
3248 5368283 5286741 5211187 4990642 5034156 4931351 4779273 4833902 4774380 4681257 4761547 4796546
3237 4796546 4766930 4828537 4929385 5036689 5104157 5146531 5233392 5336674 5400353 5497955 5623158
3226 5623158 5832483 6127184 6496870 6736601 7150590 7458364 7639796 7582153 7191115 6715292
3216 6715292 6206345 5830574 5471660 5189860 5053476 4954275 4904602 4768906 4751759 4723609
3206 4723609 4620991 4607247 4505654 4603112 4607082 4547787 4651561 4605150 4537467 4547508 4686488
3195 4686488 4740484 4669952 4666600 4551285 4565154 4597929 4558084 4353264 4039640 3835730 3618528
3184C618528k529j35738k61681o6688j86183r5736L706n973j8575j24072j17014
3173B608045m7562j07287j17981l1891k3031m297j42553j4732P064k04341r2685
3162A828749j21450j46254l5676N1751j15385n2646l9474j47341p9077o0763m5562
3151A036872l9246n0241l8179K8336m4076L5758M0200q806j743o6753o9099j60647
3139F62376n4168j6722n832L9400J8082M8558k1829k9088k9345k2257L8965n5234
3127E72906j61323L25M406o9286O6249r624j1425P5780N2228o3423l6557q1747
3115C38509J3844k9061L8680p9076p5121N9960r3224M8318P1256n4373M5445n2209
3103B32948l3169K7201q423n6298N4269J01883p8197j0698K0268o799Q442r741
$$ plain form
3184 3618528 3615999 3480261 3218580 3151892 2965709 2869973 2873679 2867706 2849131 2725059 2608045
3173 2608045 2560483 2453196 2335215 2303324 2280293 2275996 2133443 2118711 2125775 1921434 1828749
3162 1828749 1707299 1561045 1525369 1577120 1461735 1409089 1369615 1222274 1143197 1082434 1036872
3151 1036872 997626 947385 909206 937542 893466 929224 969424 960618 958875 892122 823023 662376
3139 662376 608208 591486 585654 625054 643136 691694 669865 640777 611432 589175 628140 572906
3127 572906 411583 411908 416314 347028 413277 403653 392228 468008 520236 456813 420256 338509
3115 338509 352353 323292 361972 282896 207775 267735 174511 222829 294085 239712 285157 232948
3103 232948 199779 226980 218557 162259 216528 318411 240214 229516 249784 242985 251427 241686
3091B41686m9407p536j6971j8433Q0125j18242r5328R1384L1509k8193l5447J12859
3079A88006n2397J6254L8722M906o7318M2893p3152j41767k6445J40279O6708
3068A36689l6608j5817K0604l1884J23837m6875m1080L9723o0769M3157K0381
3057A51358K3775j05642K2877p8315J00939k8857j14540O5513K8394O8170k1418
3046A12254j5557p5320j3794P8833R866r3604o379n3500p1833K4991n70O3150
3034d1463P1203k6370n0915K3717Q1507j45346o393M0623O3850Q3772p1019J52097
3022A75263l671r4637J4319r3326L9271Q4132N2486J6937k1410n0608j26411M8377
3010D0722K2745J11640P0417m8232j3262n545Q020o1421R454P8568n7040J8992
$$ plain form
3091 241686 192279 184743 167772 149339 229464 111222 15894 107278 138787 110594 75147 188006
3079 188006 135609 151863 190585 195491 128173 171066 97914 -43853 -70298 69981 136689
3068 136689 100081 84264 104868 72984 196821 149946 108866 148589 87820 130977 151358
3057 151358 175133 69491 92368 14053 114992 86135 -28405 37108 65502 133672 112254
3046 112254 96697 21377 7583 86416 96282 2678 -3701 -57201 -129034 -104043 -104613 -41463
3034 -41463 29740 3370 -47545 -23828 57679 -87667 -94060 -53437 10413 94185 23166 175263
3022 175263 171592 76955 91274 -2052 37219 121351 173837 190774 169364 118756 -7655 40722
3010 40722 63467 175107 245524 197292 184030 178485 186505 125084 134538 213106 156066 175058
2998A75058n336j0227K5694N3769j2516J4140m1180J822K7744j9570J3696P0712
2986B93806O7333P1556j2854o508M7047j4660o0684J3529l09J22163J8884q0931
2974D58372N8906J6847Q585N0512L6218n5994Q7910K7731l6540p8427P5663j7752
2962F32031n1995K3408m6102J08427P7570l8611P0113L7482o1713n7122P054n705
2950F94837Q1914P117k2048J237M4477J46329K5713O239N1418J019Q981M1428
2938A088661J3843m7394k6988P7980L9674Q8934P3084N4553M5835n5204p063Q4784
2926A430699p0177j21118Q338j45751K7390n3335q9853r3598o9820n8645j09517
2915F54613k5971M7278J15347K6269Q6705o5571R369K8075L4109N3200J16144
$$ plain form
2998 175058 169722 159495 185189 238958 226442 240582 199402 201224 228968 209398 223094 293806
2986 293806 361139 432695 419841 413333 460380 445720 385036 398565 398256 520419 539303 458372
2974 458372 517278 534125 542710 593222 629440 573446 661356 689087 652547 574120 649783 632031
2962 632031 580036 603444 557342 665769 743339 704728 774841 812323 750610 693488 700542 694837
2950 694837 776751 783868 761820 763057 807534 953863 979576 985815 1037233 1038252 1047233 1088661
2938 1088661 1102504 1055110 1028122 1106102 1145776 1234710 1307794 1362347 1408182 1352978 1345915 1430699
2926 1430699 1360522 1239404 1247742 1101991 1129381 1076046 986193 892595 822775 764130 654613
2915 654613 628642 675920 791267 817536 904241 838670 848039 876114 910223 963423 1079567
2904A079567L7669J5440j459j05803n6354j1119o2532m9357n43O3020R6024O1321
2892A065874n7703m5371p7478r5692j7348k8261q2475o368m2530j33673r4154
2881C84821l1554m363j3815k2304j2788O8037N5601o9649K0613j2973k9745n2389
2869B79492J4404J1356R488K333o9377J25650j80159n9980N1409J15512j50139
2858A49989L0832P7357L4797M8543J9955j28150j36185L2333j22241K534M9450
2847E9214Q744n2727r0040M1156l2178j2107P9132n6436Q117j7456p4543j0472
2835a49596m6950K9892J6636L4248k0443J7053l3296M936K2529k9893L0342n8408
2823a82950k8831j9653P6360r79q400P8160J1715l8067k0158N1065N9865l4203
$$ plain form
2904 1079567 1117236 1132676 1131217 1025414 969060 957941 895409 846052 845509 908529 1004553 1065874
2892 1065874 1008171 962800 885322 789630 772282 744021 661546 655178 612648 478975 384821
2881 384821 353267 348904 335089 312785 299997 368034 423635 353986 374599 361626 331881 279492
2869 279492 293896 305252 314740 317073 247696 373346 193187 133207 184616 300128 149989
2858 149989 180821 258178 292975 341518 361473 233323 97138 129471 7230 9764 59214
2847 59214 67958 15231 -74809 -33653 -65831 -77938 1194 -55242 -47125 -64581 -139124 -149596
2835 -149596 -196546 -166654 -150018 -115770 -136213 -119160 -152456 -147520 -124991 -154884 -124542 -182950
2823 -182950 -211781 -231434 -155074 -156053 -164453 -86293 -74578 -112645 -132803 -81738 -21873 -56076
2811e6076K4425l026o6197l153N352p0543Q605j6385L8616o2886R6210o6467j5880
2798a87405r884O9101o4665R7819L0686j37983O9498J48305n822o4936L2635p1594
2786i4245n3718Q4384k9838j28549O5004n8551J545l787J42504j0255p6359J667
2774a60198J04523M9433k9966m8070o8715j37M7872j4820l8106q494j38508m4932
2762c50118J83536j1613l5052N2358K1867P5384M746p2748N438l8361p1001O3718
2750a71846P099l4187K6113J1438n835L229o8576m4988J9022J06221J7763k4511
2738a59058K6558O628r540j0978q3534j5887P2208J199Q9300n8204k9192O0899
2726a09601J7343L8387m1789L7361o3466k8832K2432j3257J5055K433m678l0974
$$ plain form
2811 -56076 -31651 -34677 -100874 -104027 -98675 -169218 -160613 -176998 -138382 -201268 -105058 -171525 -187405
2798 -187405 -197289 -128188 -192853 -95034 -64348 -202331 -132833 15472 9650 -55286 -22651 -94245
2786 -94245 -147963 -63579 -93417 -221966 -156962 -215513 -213968 -217755 -75251 -85506 -161865 -160198
2774 -160198 -55675 -6242 -36208 -84278 -152993 -153130 -105258 -120078 -158184 -166678 -305186 -350118
2762 -350118 -166582 -178195 -213247 -160889 -139022 -63638 -58892 -131640 -126202 -164563 -235564 -171846
2750 -171846 -164747 -198934 -172821 -161383 -167218 -163989 -232565 -277553 -258531 -152310 -134547 -159058
2738 -159058 -132500 -125872 -135412 -146390 -229924 -245811 -173603 -172404 -83104 -141308 -170500 -109601
2726 -109601 -92258 -53871 -95660 -58299 -121765 -150597 -128165 -141422 -126367 -123934 -128612 -159586
2714a59586j6495j3716N8803M4213J8080m7049R3401n9549o9301R6504j105j46614
2702b02414J0250R244J43338J06795o9376j660n5208p0174L07K8675l0427P474
2690a23176m3057L1096J3777j8257J39738k9390p0649O15p9274l727J08010m1684
2678a15978l8116K9396O8568K7806q6065L8854k3695Q8222l6389r9240k7666p196
2666a81499P2175o1599J06916N7671o9444J6571N2978k7198J6983o5412J6305
2655f5553m2386o595M4756j1591M9733j1660l6909m6070R7640n1608j06866j10643
2643b97752J23739J14638m5060k7544M1226k7474Q1023p2901J7028n988k2161
2632a21226J5013M6011k4423O005M7556k1933m6332j8242J14856m3937N8274n3064
$$ plain form
2714 -159586 -176081 -189797 -130994 -86781 -68701 -115750 -22349 -81898 -151199 -54695 -55800 -202414
2702 -202414 -192164 -182920 -39582 67213 -2163 -3823 -59031 -129205 -128898 -100223 -130650 -123176
2690 -123176 -166233 -135137 -121360 -139617 121 -29269 -99918 -99303 -178577 -182304 -74294 -115978
2678 -115978 -154094 -124698 -56130 -28324 -114389 -75535 -99230 -11008 -47397 -146637 -174303 -181499
2666 -181499 -109324 -170923 -64007 -6336 -75780 -59209 -6231 -33429 -16446 -81858 -65553
2655 -65553 -107939 -114534 -69778 -81369 -31636 -43296 -80205 -126275 -28635 -80243 -187109 -297752
2643 -297752 -174013 -59375 -104435 -131979 -90753 -118227 -37204 -110105 -93077 -99065 -121226
2632 -121226 -106213 -60202 -84625 -78620 -31064 -52997 -99329 -117571 -2715 -46652 11622 -41442
2620d1442j29484L2605l1277Q3851n5623r8577Q4139j0505O6615m9343M8355q425
2608a09111Q227J7927k3472k8472q3215N3867M7700J37806j02008j20407Q8486
2597a12672j5880m8565O3492M2830j14277k965O7033k0800J8784p170J10698Q0365
2585F0873r8034Q72p240M1540l2042l9061M1228M5098k3607q1447L5963L5071
2573b0786L0437K3745n0133j24180m5580K1563K8808P0933o7185O4239J13182
2562D5043q3246M0245O9288j5377j48876P470Q8669N9893N8179o2627L5561r9156
2550d934n7505o1630R9457J73714q3828m1846r398O14L3955j24309n3597J90054
2538F0747R1319k2664m5126M0824L1231r0679L9641L3918n48p9605j5831M9049
$$ plain form
2620 -41442 -170926 -138321 -169598 -85747 -141370 -239947 -155808 -166313 -99698 -149041 -100686 -109111
2608 -109111 -100884 -82957 -106429 -134901 -218116 -164249 -116549 21257 -80751 -201158 -112672
2597 -112672 -128552 -177117 -113625 -70795 -185072 -188037 -121004 -141804 -123020 -130190 -19492 60873
2585 60873 -37161 -36289 -43529 -1989 -34031 -73092 -31864 13234 -10373 -91820 -55857 -20786
2573 -20786 9651 33396 -16737 -140917 -186497 -164934 -136126 -65193 -132378 -68139 45043
2562 45043 -38203 2042 71330 55953 -92923 -85453 3216 63109 121288 58661 94222 -4934
2550 -4934 -62439 -124069 -24612 149102 65274 23428 14030 14644 48599 -75710 -129307 60747
2538 60747 152066 129402 84276 125100 156331 65652 105293 139211 138663 59058 43227 92276
2526I2276p033P021K126P4248J2879O7700m1351j24920J31717l2684j0207O92
2514A72464l002l9910P9612Q2944P661j2098M2508M2677r6101k3583O6175n5301
2502B64046J9387m407P5396N0193k7925J71780p968n3164m4591L9725J21546K4151
2490F28169j77762L6932M663N1695k1889l6434Q7583j3892r413k0281K3298O5273
2478F17942L411J06499l4604o7932K3618j7702n064O8075Q3389N3341L6049k442
2466H64580Q0975L7506r173J4615L5976k614Q6969P3702L8887K445J2907J53281
2454A390056J84282J26709P2974J13652O1445N9897R273N8974J33475J41511K66505
2443B618753J91620Q8143K10986K13604K15614K26240K03614J55598K46798L51737
$$ plain form
2526 92276 85243 92264 94390 168638 181517 249217 207866 82946 214663 181979 171772 172464
2514 172464 169462 129552 209164 292108 299769 287671 330179 372856 276755 253172 319347 264046
2502 264046 283433 279026 354422 404615 376690 548470 540502 487338 442747 482472 604018 628169
2490 628169 450407 487339 492002 543697 521808 485374 572957 559065 549652 529371 552669 617942
2478 617942 621353 727852 693248 625316 648934 631232 626168 694243 777632 830973 867022 864580
2466 864580 945555 983061 973888 988503 1024479 1021865 1108834 1182536 1221423 1223868 1236775 1390056
2454 1390056 1574338 1701047 1774021 1887673 1949118 2009015 2018288 2077262 2210737 2352248 2618753
2443 2618753 2810373 2898516 3109502 3323106 3538720 3764960 3968574 4124172 4370970 4722707
2433D722707N43372O69791Q57196J103677J329825J850566K367156L183828M310086
2424B0938204L632251j95423m361060m903353l505710k329356j667999j321259
2416F286295q73693q26939o19235m33141k92043k63073j59454l5082o5151l53503
2406B364981l91136l03900m7872n8216j40935o3393p5697k9753j15577j04702
2396A033800n6307o3201p8928j3777m389l8396O290n8491q6426r3532J1787j5658
2384E42772q9773O201K1143j30340q6846P0376N5319l0368n0553n1456l9822K8081
2372B44734m321L8874J6777n1642j43011k0159K9859R3412j9017n7078J9314r9569
2360D8173Q7610R462O83M7979J30809l8384j91079q5793o0956L4376n78p1864
$$ plain form
2433 4722707 5266079 5935870 6793066 7896743 9226568 11077134 13444290 16628118 20938204
2424 20938204 24570455 24375032 20013972 15110619 11604909 9275553 7607554 6286295
2416 6286295 5412602 4585663 3966428 3533287 3241244 2978171 2818717 2783635 2718484 2364981
2406 2364981 1973845 1669945 1622073 1563857 1422922 1359529 1283832 1254079 1138502 1033800
2396 1033800 977493 914292 835364 821587 817198 778802 785092 726601 640175 546643 558430 542772
2384 542772 452999 459200 480343 350003 263157 333533 388852 358484 307931 256475 216653 244734
2372 244734 240413 279287 296064 244422 101411 81252 111111 204523 185506 128428 147742 48173
2360 48173 135783 145245 145928 193907 324716 286332 95253 9460 -51496 -17120 -17698 -89562
2348h9562O8488P8675j27137j4636J78068l4710j09653J7350j1699J6236J7034
2337a1546J14263k1074j6486l0255j14910k1092N5555p490L4697O282m0882n5063
2325a08001l5640K3696O5051J0404j3719j8945Q1129n2863O8114o8791l9709J09921
2313B0647m6794j5441J2585n3284k5190j1634J2549J0515j7402L2580L4250J12568
2301F5949K7210o575r3416l6915k8261P5838M3651m7144o9060r11k5504M3167
2289e1971L2002J8870m4144m8546k4582n0147K4923J23537k0093J7686J3290P634
2277a541J8520Q590l1272k944o1137j4542j3715j6489q5625J17854K1823Q584
2265e1894P9151r9825J5027k6264Q4635K7938m7547j9667n2779K3652O9758l9279
$$ plain form
2348 -89562 -21074 57601 -69536 -84172 93896 59186 -50467 -33117 -44816 -28580 -11546
2337 -11546 102717 81643 65157 34902 -80008 -101100 -45545 -53035 -18338 -12056 -52938 -108001
2325 -108001 -143641 -119945 -54894 -44490 -58209 -77154 3975 -48888 19226 -49565 -89274 20647
2313 20647 -26147 -41588 -29003 -82287 -107477 -119111 -106562 -96047 -113449 -80869 -46619 65949
2301 65949 93159 86584 -6832 -43747 -72008 3830 47481 337 -68723 -69634 -95138 -51971
2289 -51971 -19969 -1099 -45243 -93789 -118371 -168518 -143595 -20058 -40151 -22465 -9175 -1541
2277 -1541 16979 25569 -5703 -8647 -69784 -84326 -98041 -114530 -200155 -82301 -60478 -51894
2265 -51894 27257 -72568 -57541 -83805 830 28768 -18779 -38446 -91225 -67573 2185 -37094
2253c7094j04876J01146M534k470J29146n6897k6726r0030M175k1533J17785O80
2241A7840r0515J1651n4022J308L5268K8328L8020K0395p1788m0143m4072Q8791
2229e8939J0478n6118J02828j5369l8823r1467M8580J5604o7663J48048O9467
2218F6626r8397Q4422k6172r3932n5184J1619o0984N9659Q8386r9677l0673M7059
2206a07248M2792l0845J7210P9959n5759K6674j1126j1535J5938N7534j18813
2195i5219q0556l0396L5350R2020K7076K3441p0615O3572m5988j18128M7916O1905
2183h9622L9758k0244j73081j9207M9079J1134O7703O8263L466k4620J07420p9569
2171e9520o2422O7312Q1075m2570j0044L6189j48421J6750J807R275K7457q7393
$$ plain form
2253 -37094 -141970 -40824 -36290 -38760 90386 33489 6763 -83267 -79092 -100625 17160 17840
2241 17840 -72675 -61024 -115046 -113738 -78470 -50142 -12122 8273 -63515 -103658 -147730 -58939
2229 -58939 -48461 -104579 -1751 -17120 -55943 -147410 -98830 -83226 -150889 -2841 66626
2218 66626 -31771 52651 26479 -67453 -122637 -111018 -172002 -112343 -23957 -123634 -154307 -107248
2206 -107248 -64456 -95301 -78091 1868 -53891 -27217 -38343 -49878 -33940 23594 -95219
2195 -95219 -175775 -206171 -170821 -78801 -51725 -28284 -98899 -35327 -81315 -199443 -151527 -89622
2183 -89622 -49864 -70108 -243189 -262396 -213317 -202183 -134480 -66217 -62751 -87371 20049 -59520
2171 -59520 -121942 -54630 26445 -16125 -26169 10020 -138401 -121651 -119844 -110569 -83112 -170505
2159a70505O9253J17631J480M8802q1820J29073k3889n0164j27923J7014J25214
2148E4166o2416L9453M3946o5563J1914K5314Q900l5570n221k2528j55523Q3318
2136g9810P9334J2031j7229k550K8765N7230J1667j40279m4780l6186P5242J6769
2124c9796p8287M0429J33557l6757r0904q881N2649N1367N9273r5903J2223o3672
2112f4702p096J08019j16231N7573J4773j2913j9406N3582l3899k4483n0264N6090
2100c8957P4974l5552J9166l4486O9951j6231m6616m471K5886o6842N9388M4807
2088E1017n9505n0081n6641R9646m8401l8563N41m245J34215O1386k2033j04722
2076c7386q2260J65916m8096J9511J1628l7227l4294r588R473R6775L0667K382
$$ plain form
2159 -170505 -101252 16379 17859 66661 -15159 113914 90025 39861 -88062 -71048 54166
2148 54166 -8250 31203 75149 9586 21500 46814 55714 20144 14923 -7605 -163128 -79810
2136 -79810 -476 11555 -5674 -8224 20541 77771 89438 -50841 -95621 -131807 -56565 -39796
2124 -39796 -118083 -77654 55903 19146 -71758 -80639 -27990 23377 82650 -13253 -1030 -64702
2112 -64702 -71798 36221 -80010 -22437 -7664 -20577 -39983 13599 -20300 -44783 -95047 -38957
2100 -38957 36017 465 19631 -14855 55096 38865 -7751 -12222 13664 -53178 6210 51017
2088 51017 -8488 -58569 -115210 -15564 -63965 -102528 -101987 -106232 27983 89369 67336 -37386
2076 -37386 -119646 46270 -1826 17685 29313 -7914 -42208 -51796 -42323 54452 85119 87501
2064H7501n457j37156p5919K1853K03449l2307r8003m4634o1195L3452J12628
2053D212L593j19619N8480R5619J1769p5804r13O9499o526O6582L1784j38821
2041a45Q05l1032o0579l973J6620J33705j4855p7170N0354L7977q1765l9511O9672
2028A03q283o2341O3226m4867P9998j7837j69749m4764O7212N4064j8302M1269
2016f0271O687k7187M9353R3084m9684k2025k104k4260L1158l6520j3618M0718
2004a4669K6560n361O2427p2550k0971p0734j2801M7763J8812l3229R38J9928
1992e3887O856M7912J939J06181m9270j7400J2056l2933m7170M7241k916m475
1980A4134O6266m1395j80453m9457J35840M4374p3771R2424L4023l0156r1390
$$ plain form
2064 87501 82044 -55112 -131031 -109178 94271 61964 -36039 -80673 -141868 -108416 4212
2053 4212 7805 -111814 -53334 42285 54054 -21750 -22663 46836 40310 106892 138676 -145
2041 -145 660 -30372 -90951 -94924 -78304 55401 40546 -36624 13730 51707 -30058 -69569 103
2028 103 -8180 -70521 -7295 -52162 27836 9999 -159750 -204514 -137302 -83238 -101540 -60271
2016 -60271 -53584 -80771 -31418 61666 11982 -10043 -12147 -36407 -5249 -41769 -55387 -14669
2004 -14669 11891 6530 68957 -3593 -24564 -95298 -108099 -60336 -41524 -74753 -73815 -53887
1992 -53887 -47031 881 2820 109001 59731 42331 54387 21454 -25716 21525 18609 14134
1980 14134 80400 39005 -141448 -190905 -55065 -10691 -84462 7962 41985 11829 -79561
1969g9561K1098j33163P5117J35814n1520Q968q8775M3068M1835m5156K1913O2302
1957A1940J0554k2187k4210J2501j2327j6796L880N2394J6272K2898l6899p2447
1945e4427N0706J4844J1955k1531O2336n5346n9235K7704o484L7930N581k7251
1933a3218L5830J2588r5911j09792N9821M313M1270R0496L3371m797q4614K4631
1921f012j10639O4507l042N9943L6178o7394M0537J4550l7928L3766m8736l6974
1909f1244J30685k1399J948j1902q3516N1165J23241l1533r6853O2116j7530j14739
1897f9561K897J28836n1723l2649k7645q2016L9576J03910j1553o0673J9830K9032
1885a1739j33788k0710P2381N2219K3153k7840l2694K5237J7772J7077m1410K7402
$$ plain form
1969 -79561 -58463 -191626 -116509 19305 -32215 -23247 -112022 -68954 -27119 -72275 -50362 11940
1957 11940 22494 307 -23903 -11402 -23729 -40525 -36645 15749 32021 54919 18020 -54427
1945 -54427 -3721 11123 23078 1547 63883 8537 -50698 -22994 -29478 8452 14033 -13218
1933 -13218 22612 35200 -60711 -170503 -110682 -106369 -65099 25397 58768 53971 -30643 -6012
1921 -6012 -116651 -52144 -55186 4757 40935 -26459 14078 28628 -9300 24466 -24270 -61244
1909 -61244 69441 48042 49990 38088 -45428 5737 128978 97445 592 62708 45178 -69561
1897 -69561 -66664 62172 10449 -22200 -49845 -131861 -92285 11625 72 -60601 -40771 -11739
1885 -11739 -145527 -166237 -93856 -41637 -18484 -46324 -79018 -53781 -36009 -18932 -60342 -32940
1873c2940J2447J7964j8987N3926j12427O4150m0814O2616N8631r5638r1856O9465
1861e3463o638m5790Q5914N820o6589J4246M707L2248k8924j09789R2820J03551
1849B8113m5130q5143R4916p1035J5179O5725Q3705j21196J09904j3703p3468
1838a2133r7063J53913m4961n6160M86N2343N8518M0259o2427l3832j26522P3906
1826e3673P5452p5833L6738l6857J28958j35288J562J20147K2856J8089p9867
1815B2284N3760K6764O8791j56087n7268N0832K061j1575M424j0916m1539m2519
$$ plain form
1873 -32940 -20493 -2529 -21516 32410 -80017 -15867 -56681 5935 64566 -31072 -122928 -53463
1861 -53463 -60101 -105891 -19977 -14157 -80746 -66500 -61793 -29545 -58469 -168258 -75438 28113
1849 28113 -17017 -102160 -7244 -78279 -63100 2625 86330 -34866 75038 61335 -12133
1838 -12133 -109196 44717 -244 -56404 -55918 -3575 54943 95202 32775 -1057 -127579 -53673
1826 -53673 21779 -54054 -17316 -54173 74785 -60503 -58941 61206 84062 102151 22284
1815 22284 76044 102808 171599 15512 -41756 9076 11137 -438 3986 -6930 -48469 -90988
$$ [...]
##END NTUPLES=NMR SPECTRUM
##END=
