##TITLE=1H_CA-9214-2
 CDCl3
 8 sc, 
 20.11.2023
##JCAMPDX= 6.0         $$ Bruker NMR JCAMP-DX V2.0
##DATA TYPE= NMR SPECTRUM
##DATA CLASS= NTUPLES
##ORIGIN= UXNMR, Bruker Analytische Messtechnik GmbH
##OWNER= root
$$ XWIN-NMR		Version 3.5
$$ Mon Nov 20 14:46:29 2023 Russian Standard Time (UT+4h)  she@DPX200
##.OBSERVE FREQUENCY= 200.1313
##.OBSERVE NUCLEUS= ^1H
##.ACQUISITION MODE= SIMULTANEOUS
##.ACQUISITION SCHEME= undefined
##.AVERAGES= 8
##.DIGITISER RES= 18
##SPECTROMETER/DATA SYSTEM= spect
##.PULSE SEQUENCE= zg30
##.SOLVENT NAME= D2O
##.SHIFT REFERENCE= (INTERNAL, D2O, 0, 15.3866)
##AUDIT TRAIL= $$ (NUMBER, WHEN, WHO, WHERE, WHAT)
$$ ##TITLE= Audit trail, XWIN-NMR		Version 3.5
$$ ##JCAMPDX= 5.01
$$ ##ORIGIN= Bruker BioSpin GmbH
$$ ##OWNER= she
$$ F:/spectra/data/she/nmr/H-F/1/pdata/1/auditp.txt
$$ ##AUDIT TRAIL=  $$ (NUMBER, WHEN, WHO, WHERE, WHAT)
(   1,<2023-11-20 14:44:44.04 +0400>,<she>,<DPX200>,
      <created by zg, POWCHK disabled, PULCHK disabled
       configuration hash MD5:
       00 E9 B6 7A A2 85 ED C7 34 08 36 98 17 FE 4E 26
       data hash MD5: 16K
       92 BF E2 A6 2E 48 04 27 68 27 EA F2 BE 8F 94 C1>)
(   2,<2023-11-20 14:44:47.82 +0400>,<she>,<DPX200>,
      <Start of raw data processing
       efp BC_mod = 2 LB = 0.24 FT_mod = 6 PKNL = 1 PHC0 = -23870.69 PHC1 = 12.05269 SI = 16K 
       data hash MD5: 16K
       79 92 DB C5 59 7B A9 DF 20 14 E6 44 72 B0 CE CF>)
(   3,<2023-11-20 14:45:09.21 +0400>,<she>,<DPX200>,
      <pk PHC0 = 3.177315 PHC1 = -3.8 
       data hash MD5: 16K
       4B BC 94 7C 9A 78 AC 27 B7 79 BA 6F 83 BD 2D 09>)
(   4,<2023-11-20 14:45:13.39 +0400>,<she>,<DPX200>,
      <abs ABSG = 5 
       data hash MD5: 16K
       85 30 3A 23 18 B6 02 61 BE B5 C8 D0 78 E5 F2 60>)
$$ ##END=
$$ 
$$ hash MD5
$$ 3B 11 1F A4 9E F7 CE D2 D0 D0 1C 1E 3C 34 BE 0D
##$RELAX= 
##$RELAX= 
##$RELAX= 
##$RELAX= 
##$RELAX= 
##$RELAX= 
$$ Bruker specific parameters
$$ --------------------------
##$DU= <F:/spectra>
##$EXPNO= 1
##$NAME= <H-F>
##$PROCNO= 1
##$TYPE= <nmr>
##$USER= <she>
##$AMP= (0..31)
100 100 100 100 100 100 100 100 100 100 100 100 100 100 100 100 100 100 
100 100 100 100 100 100 100 100 100 100 100 100 100 100 
##$AQSEQ= 0
##$AQ_mod= 1
##$AUNM= <au_zg>
##$AUTOPOS= <>
##$BF1= 200.13
##$BF2= 200.13
##$BF3= 200.13
##$BF4= 200.13
##$BF5= 200.13
##$BF6= 200.13
##$BF7= 200.13
##$BF8= 200.13
##$BYTORDA= 1
##$CFDGTYP= 0
##$CFRGTYP= 5
##$CHEMSTR= <none>
##$CNST= (0..31)
1 1 145 1 1 1 1 1 1 1 1 1 1 1 1 1 1 1 1 1 1 1 1 1 1 1 1 1 1 1 1 1 
##$CPDPRG= <>
##$CPDPRG1= <>
##$CPDPRG2= <>
##$CPDPRG3= <>
##$CPDPRG4= <mlev>
##$CPDPRG5= <mlev>
##$CPDPRG6= <mlev>
##$CPDPRG7= <mlev>
##$CPDPRG8= <mlev>
##$CPDPRGB= <>
##$CPDPRGT= <>
##$D= (0..31)
0 1.2 0 0 0 0 0 0 0 0.06 0 0.03 0 0 0 0 0.0002 0 0 0 0 0 0 0 0 0 0 0 0 
0 0 0 
##$DATE= 1700477083
##$DBL= (0..7)
120 120 120 120 120 120 120 120 
##$DBP= (0..7)
150 150 150 150 150 150 150 150 
##$DBP07= 0
##$DBPNAM0= <>
##$DBPNAM1= <>
##$DBPNAM2= <>
##$DBPNAM3= <>
##$DBPNAM4= <>
##$DBPNAM5= <>
$$ [...]
##$SUBNAM3= <"">
##$SUBNAM4= <"">
##$SUBNAM5= <"">
##$SUBNAM6= <"">
##$SUBNAM7= <"">
##$SUBNAM8= <"">
##$SUBNAM9= <"">
##$SW= 18.0517328524113
##$SWIBOX= (0..15)
0 0 2 0 0 0 0 0 0 0 0 0 0 0 0 0 
##$SW_h= 3612.71676300578
##$TD= 16384
##$TD0= 1
##$TE= 0
##$TE2= 300
##$TE3= 300
##$TEG= 300
##$TL= (0..7)
0 120 120 120 120 120 120 120 
##$TP= (0..7)
150 150 150 150 150 150 150 150 
##$TP07= 0
##$TPNAME0= <>
##$TPNAME1= <>
##$TPNAME2= <>
##$TPNAME3= <>
##$TPNAME4= <>
##$TPNAME5= <>
##$TPNAME6= <>
##$TPNAME7= <>
##$TPOAL= (0..7)
0.5 0.5 0.5 0.5 0.5 0.5 0.5 0.5 
##$TPOFFS= (0..7)
0 0 0 0 0 0 0 0 
##$TUNHIN= 0
##$TUNHOUT= 0
##$TUNXOUT= 0
##$USERA1= <user>
##$USERA2= <user>
##$USERA3= <user>
##$USERA4= <user>
##$USERA5= <user>
##$V9= 5
##$VALIST= <valist>
##$VCLIST= <CCCCCCCCCCCCCCC>
##$VD= 0
##$VDLIST= <DDDDDDDDDDDDDDD>
##$VPLIST= <PPPPPPPPPPPPPPP>
##$VTLIST= <TTTTTTTTTTTTTTT>
##$WBST= 1024
##$WBSW= 4
##$XGAIN= (0..3)
0 0 0 0 
##$XL= 0
##$YL= 0
##$YMAX_a= 716156
##$YMIN_a= -975379
##$ZGOPTNS= <>
##$ZL1= 120
##$ZL2= 120
##$ZL3= 120
##$ZL4= 120
##$ABSF1= 15.46704
##$ABSF2= -2.584809
##$ABSG= 5
##$ABSL= 3
##$ALPHA= 0
##$AQORDER= 0
##$ASSFAC= 0
##$ASSFACI= 0
##$ASSFACX= 0
##$ASSWID= 0
##$AUNMP= <proc_1d>
##$AZFE= 0.1
##$AZFW= 0.1
##$BCFW= 0
##$BC_mod= 2
##$BYTORDP= 0
##$COROFFS= 0
##$CY= -3
##$DATMOD= 1
##$DC= 0
##$DFILT= <>
##$DTYPP= 0
##$F1P= 0
##$F2P= 0
##$FCOR= 1
##$FTSIZE= 16384
##$FT_mod= 6
##$GAMMA= 0
##$GB= 0
##$INTBC= 1
##$INTSCL= 3.70164e-10
##$ISEN= 128
##$LB= 0.24
##$LEV0= 0
##$LPBIN= 0
##$MAXI= 10000
##$MC2= 0
##$MEAN= 0
##$ME_mod= 0
##$MI= 1.114404
##$NCOEF= 0
##$NC_proc= -6
##$NLEV= 6
##$NOISF1= 3.799351
##$NOISF2= 2.8
##$NSP= 0
##$NTH_PI= 0
##$NZP= 0
##$OFFSET= 15.3866
##$PC= 1
##$PHC0= -23867.51
##$PHC1= 8.252689
##$PH_mod= 1
##$PKNL= yes
##$PPARMOD= 0
##$PSCAL= 0
##$PSIGN= 0
##$REVERSE= no
##$SF= 200.130027038698
##$SI= 16384
##$SIGF1= 3
##$SIGF2= 2
##$SINO= 5.538805
##$SIOLD= 16384
##$SREGLST= <1H.CDCl3>
##$SSB= 0
##$STSI= 16384
##$STSR= 0
##$SW_p= 3612.71676300578
##$SYMM= 0
##$S_DEV= 0
##$TDeff= 16384
##$TDoff= 0
##$TI= <>
##$TILT= no
##$TM1= 0
##$TM2= 0
##$TOPLEV= 0
##$USERP1= <user>
##$USERP2= <user>
##$USERP3= <user>
##$USERP4= <user>
##$USERP5= <user>
##$WDW= 1
##$XDIM= 16384
##$YMAX_p= 482610124
##$YMIN_p= -348729
$$ End of Bruker specific parameters
$$ ---------------------------------
##NTUPLES= NMR SPECTRUM
##VAR_NAME=  FREQUENCY,     SPECTRUM/REAL,   SPECTRUM/IMAG
##SYMBOL=    X,             R,               I
##VAR_TYPE=  INDEPENDENT,   DEPENDENT,       DEPENDENT
##VAR_FORM=  AFFN,          ASDF,            ASDF
##VAR_DIM=   16384,         16384,           16384
##UNITS=     HZ,            ARBITRARY UNITS, ARBITRARY UNITS
##FACTOR=    0.220516191357247, 1,           1
##FIRST=     3079.320582116, 0,              0
##LAST=      -533.39618088978, 0,            0
##MIN=       -533.39618088978, -348729,      0
##MAX=       3079.320582116, 482610124,      0
$$ Real data points
##PAGE= N=1
##DATA TABLE= (X++(R..R)), XYDATA
$$ [...]
7777f8969N6769M3598n9367m1893O0268L1083K0947l9160k2443m7422k5919J50222
7765E7714o9553p4200J45041j05002k369o6727J3162Q8557j742r6352K3494k5653
7753a13630l0415Q1965M0698Q1891l7019O1393P8506k0912l2109J6044j65452
7742c9040n3699N2380J10961k0532J0698j5829j27144k9733L581n7397R7680L7838
7730c0236Q9918j5339j18380K6083l1118L1529Q7419k9191r8262M1526J4232P3592
7718D1773R2041j08125n5473n963k8663q0390N1823q0935n510L5839q8177J0614
7706b21146R5555J05731K5766M7912L7918p519m6627j01350r1188N0775R6000
7695h173K8116q7646o4870J02973o8374q4171J36241q4232j02912N9485R384O8097
$$ y = [-68969, -12200, 31398, -27969, -69862, -9594, 21489, 42436, 3276, -19167, -66589, -92508, 57714, -11839, -86039, 59002, -46000, -48369, -115096, -101934, -13377, -15119, -111471, -87977, -113630, -144045, -62080, -21382, 60509, 23490, 84883, 163389, 142477, 110368, 126412, -39040, -92739, -40359, 70602, 50070, 60768, 44939, -82205, -111938, -108357, -165754, -68074, -30236, 59682, 44343, -74037, -47954, -79072, -47543, 39876, 10685, -87577, -46051, -31819, 41773, 133814, 25689, -29784, -35747, -64410, -144800, -92977, -173912, -179422, -143583, -231760, -221146, -125591, -19860, 5906, 53818, 91736, 84217, 37590, -63760, -154948, -104173, -8173, 19943, -67703, -132573, -29600, -97974, -182145, -45904, -130136, -233048, -173563, -164179, -96082]
7683i6082Q3619k8359r2336M1811O3877l3979n2335k4011P619Q0308J01901m9520
7671B513j1562o7635m0581K5030k9184q7279p578R0458r461r7894j4011N4387
7659a92797M1417n0944O2395m6058J08785l5995n0007j0305M9833R5064J4933
7648a3679q8501J10351J8041o9966j2807n7408m474K0590o0996P2792J0902n5761
7636a30916l1864K5591k669r20N9756N4747k9860m0775o4940O1969m13j11714
7624b12008Q8111j3360N6937L237j29240J1675R3446j6482L7993k8405m8620L9364
7612a17352L5347P564j0266n7619n9284J776J42095K71m2428m0463J00076j503
7600d1786j02034l3952Q6517m3790k8190L4584Q9621o1487N3208j773r2658j18107
$$ y = [-96082, -12463, -40822, -133158, -91347, -27470, -61449, -113784, -137795, -130176, -49868, 52033, 2513, -9049, -76684, -117265, -92235, -121419, -208698, -216276, -125818, -135279, -233173, -247184, -192797, -151380, -202324, -139929, -185987, -77202, -113197, -163204, -173509, -123676, -28612, -13679, -102180, 8171, 26212, -43754, -56561, -113969, -118443, -97853, -158849, -86057, -75155, -130916, -162780, -137189, -139858, -140778, -81022, -26275, -56135, -96910, -161850, -99881, -100294, -212008, -123897, -137257, -80320, -77083, -206323, -194648, -101202, -117684, -79691, -108096, -156716, -117352, -82005, -74441, -84707, -142326, -201610, -199834, -57739, -57468, -99896, -140359, -40283, -41786, -143820, -177772, -91255, -135045, -163235, -128651, -39030, -100517, -47309, -49082, -141740, -259847]
7588b59847K6665R5367Q7441L104o6592L0690P0529j4200m5243R864l3250j27444
7576b22916L3545N1336L7144l3920K5079j1414q3164J3302P4011j3485J3013J225
7564a16244O2754j14628k2516J14032J6527K1864O349M0985l8901P319o571j14127
7552a43157K1683m182n2318K3917p7024j09669J00253J13427p4798L8979O8723
7541i4166o6020m3677J27727k0764j21919J01673j4835Q1034N2284p9807n8496
7530a36966k9619J99685r7883j18070k3999O9980o9037K9358K1189q56m5129J34524
7518f6823j9500p7681N2060N1369k8072j9244J448j6313r8239J04562J49195M2739
7506G5501j42342P1972Q799M2662q296L808k0575N3013q576M170l6536k7159M6378
$$ y = [-259847, -233182, -137815, -50374, -47270, -113862, -83172, -12643, -26843, -72086, -62222, -95472, -222916, -189371, -138035, -100891, -134811, -109732, -121146, -204310, -191008, -116997, -130482, -117469, -116244, -53490, -168118, -190634, -76602, -60075, -38211, -31862, 9123, -29778, -22459, -29030, -143157, -121474, -125656, -177974, -154057, -231081, -340750, -240497, -127070, -201868, -162889, -94166, -160186, -203863, -76136, -96900, -218819, -117146, -131981, -50947, 1337, -78470, -136966, -166585, 33100, -64783, -182853, -206852, -136872, -205909, -176551, -155362, -156218, -201347, -66823, -86323, -164004, -111944, -60575, -88647, -107891, -106443, -122756, -220995, -116433, 32762, 75501, -66841, 5131, 13930, 56592, 48296, 52104, 31529, 84542, 75966, 80136, 43600, 16441, 62819]
7493F2819j20904L8618l5938J7410J0663r6881k6386r477l0111M0189J4156J03645
7481c2197O223K1227J8080J4182k8998k889j2205L6352r8983n2770M8243L9606
7469d4129l2494l1114O8878O2936L0864K154J0030j8465l5301l6494j25218L0812
7457a17541J0162M894Q773j9136m9091J10160p293j8727Q1000P033n5065p132
7445e1963j493k9178J11089j47605K2731l9166J2703P5568j4790q5765N547J20837
7433b1485l1509o9650k3660J18265J03428j3988L1309j6179m0300j5924k7367
7422g060k5855q31k5963q3324N634J18354l5161j37389q0086P4379N8566N918
7410a32818L7540n8334P3486j1851J21154n5107k3078N7948n2122j08367n435
$$ y = [62819, -58085, -19467, -55405, -37995, -27332, -124213, -150599, -160076, -190187, -149998, -135842, -32197, -25974, -4747, 13333, 27515, -1483, -4372, -16577, 19775, -79208, -131978, -83735, -44129, -76623, -107737, -38859, 24077, 54941, 57095, 67125, 48660, 13359, -23135, -148353, -117541, -107379, -102485, -93712, -112848, -161939, -51779, -59072, -77799, 3201, 10234, -44831, -51963, -53456, -82634, 28455, -119150, -96419, -135585, -122882, -47314, -62104, -147869, -142322, -21485, -52994, -122644, -146304, -28039, 75389, 61401, 92710, 76531, 36231, 20307, -7060, -32915, -33746, -59709, -143033, -137399, -19045, -54206, -191595, -271681, -197302, -138736, -132818, -95278, -153612, -80126, -91977, 29177, -25930, -49008, 8940, -43182, -151549, -156984]
7399a56984n689Q9437n9574r6144Q7928J6191n8298N144N5435m096q0392L0602
7387a76440M7908R8807m5449m9974p558n6739N5323o5620J4578k9642K0996P0745
7375a23065K3104o1979J5352K749j4017P7436P2712r8557j51867N8597P7388P7672
7363d4475r8619L3027L7819j0143r4470r321O7347m9065K3573k9439m7227J6551
7351b04442O0745k1254P3695k1135L5592q1136o900J7180p511J3844l3489l2416
7339b07227N7127J1490k9359j1363k1130J2475L300k8141k0669J93289M2754j08839
7327a06293q9479j20973j2772J99668K4127M5193q2382l8719l5497K3222R7410
7316i6495n1146k3728M630n3458l1719M8657Q4239l4606N3157q1357j0689P1184
$$ y = [-156984, -162673, -73236, -132810, -228954, -141026, -124835, -183133, -177989, -122554, -126650, -207042, -176440, -128532, -29725, -75174, -125148, -132706, -189445, -134122, -199742, -185164, -214806, -193810, -123065, -99961, -161940, -146588, -143839, -157856, -80420, -7708, -106265, -258132, -199535, -122147, -44475, -143094, -110067, -72248, -82391, -176861, -186182, -118835, -167900, -144327, -173766, -220993, -204442, -143697, -164951, -91256, -112391, -76799, -157935, -164835, -147655, -155166, -141322, -174811, -207227, -150100, -138610, -167969, -179332, -200462, -187987, -184687, -212828, -233497, -40208, 2546, -106293, -195772, -316745, -329517, -129849, -105722, -60529, -142911, -181630, -217127, -193905, -96495, -147641, -171369, -166739, -220197, -251916, -203259, -119020, -153626, -100469, -181826, -192515, -121331]
7304a21331m3078r5449R8823J11444q7650J03273j37203k2134j5355J9391N4352
7293a34917Q3875j762p745l6411R4306m7450K3696l6590m5364J01965M7238K5979
7281F6820k9914j09831q3738J7158j21142j2670K45748L4872k0895O4046P6947
7270A27401j31533j26290k0546Q2019j7669K6047m6137J02224L2038l0546K4610
7259B1618j04797m0911q954N8828n6259K905J17491j5977j01952l1840m4441k507
7247b06796o834l0948Q3665N659q9876J42593L1812m2059l2497M4101P0514j6017
7235d6683n913n0055L033j9111P94l7703m0198M5685R0668k9674l5667j7603q4848
7222b27275O84j3681N6523J16819J30804j53165n359n4964k0611Q0500j15787
$$ y = [-121331, -164409, -259858, -161035, -49591, -137241, -33968, -171171, -193305, -208660, -189269, -134917, -51042, -52804, -60549, -96960, -2654, -50104, -26408, -62998, -108362, -6397, 40841, 66820, 36906, -72925, -156663, -139505, -260647, -273317, -27569, 7303, -13592, 50454, 127401, -4132, -130422, -150968, -68949, -86618, -60571, -106708, -4484, 27554, -2992, 21618, -83179, -124090, -133044, -74216, -130475, -127570, -10079, -26056, -128008, -159848, -204289, -206796, -213630, -244578, -160913, -155254, -245130, -102537, -70725, -112784, -145281, -101180, -30666, -46683, -52596, -102651, -99618, -118729, -117935, -155638, -195836, -150151, -59483, -89157, -124824, -142427, -227275, -226591, -240272, -183749, -66930, 63874, -89291, -94650, -149614, -170225, -89725, -205512]
7211b05512k6782O4336J5828P0950P2539N8475j35095K2091K320q8994J03884
7200d5960N4847j66089M4278L4619j0339j01680J706O7415J2146o398Q3924M819
7188b6712m1235L3223O656n9173j24697K8351J1400r2064O7551L8740j7711L6487
7176a39184N3474n876J3878r4996L6350N693m9369P9029K0966q9823j16503O0844
7164b25517M4639j3592Q398L876j3093J30192J0269j5743j81636m7195J22122
7153a77280J28404n9543p0975l6403p5689m9683K0396J62701J39197j02710l0785
7142a52370J35290q5354n2460K9330P6109o8255k8299J5087J6712L9124l1841
7131a06927k3145p2147j1312j3240J09803m4559m9843J24467q2360L8259j2139
$$ y = [-205512, -232294, -167958, -152130, -81180, -8641, 49834, -85261, -63170, -60850, -149844, -45960, 8887, -157202, -112924, -78305, -88644, -190324, -188618, -121203, -109057, -115455, -31531, -26712, -67947, -34724, -28068, -87241, -211938, -183587, -172187, -264251, -196700, -157960, -175671, -139184, -85710, -91586, -77708, -172704, -136354, -130661, -180030, -101001, -80035, -169858, -286361, -225517, -180878, -194470, -186072, -182196, -195289, -65097, -54828, -70571, -252207, -299402, -177280, -48876, -108419, -179394, -215797, -291486, -341169, -320773, -158072, -18875, -121585, -152370, -17080, -102434, -154894, -125564, -49455, -117710, -146009, -130922, -114210, -75086, -106927, -130072, -202219, -213531, -226771, -116968, -161527, -211370, -86903, -169263, -131004, -143143]
7120a43143j04985r7871J05000J04381j57005L9879r4985P0816J60830L9634M3823
7109c3626j59905p1513J18011L95k0326q1270j8026k7335K4241j684Q835J03324
7097a58879o6366n859P9679O742j9745q4649Q8761n2993J8926O5536L2684O7172
7085b8991n1116p4576R8855n0567L3842k0992o0881R253Q0611P6863p4186j15462
7073a77347L4093M2772r2807M1248O6301j945p8118l0975k5078J7172J16580J0168
7061g7936n2310o47p0392O5752n3629M8414M4605k2825N9575r5138n2334J4436
7049a92429M0471n7610J1971r622O8810L6241J2877K89n5285N8468P4470q6060
7037i7409l8051Q0611p3647n687q9929M9230J05028O1862N7929K3237j6294q8869
$$ y = [-143143, -248128, -345999, -240999, -136618, -293623, -253744, -348729, -277913, -117083, -77449, -33626, -193531, -265044, -147033, -146638, -166964, -248234, -266260, -293595, -269354, -271038, -262203, -158879, -225245, -231104, -151425, -144683, -164428, -249077, -160316, -213309, -194383, -128847, -96163, -28991, -80107, -154683, -55828, -106395, -72553, -93545, -154426, -145173, -64562, 12301, -61885, -177347, -143254, -100482, -193289, -152041, -85740, -87685, -165803, -196778, -221856, -204684, -88104, -77936, -130246, -130893, -201285, -135533, -189162, -140748, -96143, -118968, -59393, -154531, -206865, -192429, -151958, -209568, -197597, -207219, -138409, -102168, -89291, -89002, -144287, -85819, -11349, -97409, -135460, -54849, -128496, -134183, -224112, -174882, -69854, -7992, 49937, 73174, 56880, -31989]
7025c1989q6337l4701k8010Q2461j4674J12215R0872j07982k13844j5518r88K01217
7013d7278Q3788j15731j35920J3344R8731l8077j0274K9126q2565P6338N444k3612
7001a46686L6164N9322l6798j31892J4189J0995O5476j0123n6944j9940R7000
6990a19237N8021J9315l6500O2999r33j40868o1917J4502K1145J3378l5980l5762
6978b41837j260R3846k0153m4345K0280j25388R6902O9204r8601J18064K4786
6967a08502r5886L2660O0299L4023o4564J4350l4743l5648m37M004O8827j2758
6955a38375J5402n471M5591p5938r396N0626p5213O0152L1971r7951O4822J34245
6943D65n0203o8076q440P1598J7090j36585j0305O9198L9589l6400K9740n0461
$$ y = [-31989, -118326, -153027, -181037, -98576, -113250, -1035, 89837, -18145, -231989, -247507, -248495, -47278, 36510, -79221, -215141, -201797, -103066, -141143, -151417, -122291, -204856, -128518, -123074, -146686, -110522, -51200, -87998, -219890, -205701, -194706, -129230, -139353, -196297, -216237, -119237, -61216, -41901, -78401, -15402, -16335, -157203, -219120, -204618, -183473, -170095, -206075, -241837, -243097, -149251, -169404, -213749, -193469, -318857, -221955, -152751, -251352, -133288, -108502, -204388, -171728, -111429, -77406, -141970, -127620, -162363, -198011, -198448, -194444, -125617, -138375, -122973, -128444, -82853, -158791, -168187, -117561, -192774, -132622, -100651, -198602, -133780, 465, -49738, -117814, -126254, -54656, -37566, -174151, -184456, -115258, -75669, -112069, -82329, -132790]
6931a32790K2760k4641m8655N6401j445O6372k5864n4161j8475j4352k3518J1402
6919a86966N0804M9742L287M9169J4889j06540N9497l9646n2838L2855L2610J0247
6907h2890l4199j6336m3885n1096k681L8766J04212j10668j06904J36365P6829
6896i2487j16323L3263O138M7046N2382p6345k9119R3372J4109q4564j9308k8753
6884b00589r367K1341k5905m4193L7803N0019M9079m0383R543k8627l6735n5229
6872b73243N5628R2525n1386o2380J08968N5213J40021p0349j14638n5157m5511
6861b20309L077J18013o8194r8196P6849m4640K3897P2071L4297q186M2656k3811
6849i2476N6889j21685j9318r2560N8801n0947L73R2372q212O3990j3457r6724
$$ y = [-132790, -110030, -134671, -183326, -126925, -128370, -61998, -87862, -142023, -160498, -174850, -198368, -186966, -136162, -86420, -83133, -33964, -19075, -125615, -66118, -105764, -158602, -125747, -93137, -82890, -117089, -133425, -177310, -228406, -231087, -192321, -88109, -198777, -305681, -169316, -92487, -208810, -175547, -169409, -122363, -69981, -146326, -175445, -82073, -67964, -152528, -171836, -200589, -209956, -188615, -214520, -258713, -220910, -170891, -121812, -162195, -152652, -181279, -218014, -273243, -217615, -125090, -176476, -238856, -129888, -74675, 65346, -5003, -119641, -174798, -220309, -217232, -99219, -167413, -265609, -188760, -233400, -209503, -137432, -103135, -111321, -68665, -92476, -35587, -157272, -176590, -269150, -210349, -261296, -260923, -168551, -176763, -112773, -126230, -222954]
6837b22954l0306N5373P076J00090q4947l178O2765k6727q6830n3795J31522m0682
6825a92593K878N4352N808j2858N9498J29520M856l3159J0090j06315n7544M9654
6813h5813L08K5992k5569J2263j6550j75467P1288J72840k7678R9406l8655l6893
6801b4528l09Q3568k4714o4176N7491n407k2044p7558j22202J6497j3085j04230
6789c00697j8209J45502j1694N9737J3049m0125K7720q2587J19066M2135l797
6778d9900j50224k2067P4819O426J10229m187k2003j37240P5590j2410K7767R7668
6766e532K431m4059r8735P6565O6959n3035l5097l7073O7304r7285L9283J25010
6754F736k9235j03602O3022P7050o0836j6393p7405k2509L1054Q3781o2676n416
$$ y = [-222954, -253260, -197887, -190811, -90721, -175668, -178846, -116081, -142808, -229638, -283433, -151911, -192593, -189715, -135363, -129555, -142413, -82915, 46605, 51461, 18302, 28392, -77923, -135467, -85813, -85505, -59513, -85082, -72819, -89369, -264836, -193548, -20708, -48386, 51020, 12365, -24528, -24837, 58731, 34017, -30159, 27332, 21925, -119, -77677, -199879, -183382, -196467, -300697, -318906, -173404, -185098, -125361, -112312, -152437, -124717, -207304, -88238, -46103, -49900, -200124, -222191, -147372, -140946, -30717, -34904, -56907, -194147, -118557, -130967, -103200, -5532, -3101, -47160, -145895, -69330, -2371, -55406, -90503, -127576, -60272, -157557, -118274, 6736, -22499, -126101, -63079, 13971, -46865, -63258, -140663, -163172, -132118, -48337, -111013, -116429]
6742a16429r122o911k55L2438K3256L917J1681p843Q615l1641L5520p0857J9908
6729a07723L6091l5182J01719k9340m3821r144o1194M592J18150K8767j03798
6718a00883P6038J83323n7288j59485j927k4535N2052L6483j06355j2802L4061
6707h1318m452J9249j01829J7537P9571k0423l3412J8731N699p7959J32339m9034
6695i5301J7054M3243L9502r7173o3418P4165O1290j7506N1848q3828j10955M7313
6683a33766L1771P4155K4927k6133k0737p9516P2730o8239J1103J25407m9863
6672c8161J0859k3782p3789O7626P9215o487o574K6018l5113n955K2979k8349
6660a1513o3055Q5084L8148m7735J06184k9281j9284K7070o8088J87517j3181
$$ y = [-116429, -125551, -132462, -132717, -100279, -77023, -73106, -61425, -69268, -60653, -92294, -56774, -127631, -107723, -71632, -106814, -5095, -34435, -78256, -87400, -148594, -144002, -25852, 2915, -100883, -24845, 158478, 101190, -58295, -60222, -84757, -32705, 3778, -102577, -115379, -81318, -85770, -66521, -168350, -150813, -71242, -91665, -125077, -106346, -100647, -178606, -46267, -95301, -78247, -35004, 4498, -92675, -156093, -81928, -20638, -38144, 13704, -70124, -181079, -133766, -101995, -27840, -2913, -29046, -49783, -129299, -56569, -124808, -113705, 11702, -38161, -27302, -51084, -124873, -57247, 21968, 15481, 8907, 34925, -188, -6143, 16836, -11513, -74568, 10516, 48664, 929, 107113, 77832, 58548, 85618, 17530, 205047, 191866]
6649A91866j56000J6391M3356j417p3190J71467l2354o7901m6766j1196J90391
6638B24647K2366m2672k2536l9910K7541o044k2137k6553P4172M748p3421J13769
6626B33970L804J2824J538o672Q4258M9190P3067j03679q1971M1561j5640j311
6614B90939n5459K2383K361N7213K7761j09675J93219L7046o0531K053P1998p614
6602D71694l00l5357j28661j06903R2952O3156l0437l0241j93P1410M9581q7988
6590C28713m9223O9504q0148n6865R4841k6741L2236m8557Q1743o6211K3741m5781
6578B57252n5053N015j01003R7897R8773L1267j4149n1476L6626K170l7550j8193
6566B51576k5465J31600p0436j5743R9326k6895J39382J13039p6751r9304p1967
$$ y = [191866, 35866, 52257, 95613, 94196, 21006, 192473, 160119, 92218, 45452, 34256, 224647, 247013, 204341, 181805, 141895, 169436, 163392, 141255, 114702, 188874, 193622, 120201, 233970, 237774, 250598, 252136, 245464, 329722, 378912, 451979, 348300, 266329, 307890, 292250, 290939, 235480, 257863, 260224, 317437, 345198, 235523, 428742, 465788, 405257, 407310, 479308, 471694, 471394, 436037, 307376, 200473, 293425, 356581, 326144, 295903, 295710, 367120, 416701, 328713, 279490, 348994, 268846, 211981, 306822, 280081, 312317, 263760, 345503, 279292, 303033, 257252, 202199, 207214, 106211, 204108, 302881, 334148, 319999, 268523, 305149, 307319, 269769, 251576, 226111, 357711, 287275, 271532, 370858, 343963, 483345, 596384, 519633, 420329, 348362]
6555C48362m2375R483J31471R2131Q9303Q4413l5081K6019R4044K7029m8816j1659
6543G64324n060l8624n5120j9676J5829J3138K1172K1782Q4227o388L4314n6956
6531G72962P856k1594k6016q5865L0059o6228m7682l4240J2110p9036M8436J66762
6519F77524k01174r0248K5336R642j9730K260N0865O6580m9427p9268K0601m0911
6507C72050K4236q8004M4692L8570O8862m4506q4964M4959P2429l5779k3799L7010
6495D25756N7765O175j03685M5244R91m6396N2709N9281j6018N2113r2414k0395
6483D21126J86643M5167l9202L8824K8362l4201j15883P3461j8627K4J3807j02741
6471D96760K336N4333P3046n5454k2305j0697J95420O9694j11945L5205L4033
$$ y = [348362, 305987, 315470, 446941, 539072, 628375, 712788, 677707, 703726, 797770, 824799, 775983, 764324, 759264, 720640, 665520, 645844, 661673, 674811, 695983, 717765, 801992, 795604, 829918, 772962, 780818, 759224, 733208, 647343, 677402, 611174, 563492, 529252, 541362, 462326, 510762, 677524, 476350, 386102, 411438, 421080, 401350, 403610, 454475, 521055, 471628, 392360, 412961, 372050, 396286, 308282, 352974, 391544, 460406, 415900, 330936, 375895, 448324, 412545, 388746, 425756, 483521, 489696, 386011, 431255, 432246, 385850, 438559, 497840, 481822, 533935, 441521, 421126, 607769, 652936, 613734, 652558, 680920, 646719, 530836, 604297, 585670, 585694, 599501, 496760, 499096, 553429, 626475, 571021, 548716, 538019, 733439, 803133, 691188, 726393, 760426]
6460G60426q852l1757N4870Q9089j4052L2563L0332m7530q9240O4173R0142J3713
6448I43877j9970r218M8405o9603p9208L1142Q5451k2884j6587j6944N9578l1478
6436I02561N6126m0911n1411L560K6148J23095Q3326L5291l5689K6526P0673k091
6424A197204k7664K2150O628o7942P0911j4234O8282J56690L85k8037o531L7369
6412A415211k4054l3447J92823q057P9461Q8220J82957J3453r7485J48874R4517
6401B052473P0332q7405r91N714N0309J76424j7227M7736J31048K4507J15732
6390B568652J53973M1331L4243J13098J02367J06176J69664J55839Q6248P0901
6380C602492o655N7199J8553P5168P5028o0732M1714O4994J23519J19576L5896
$$ y = [760426, 751574, 719817, 774687, 863776, 849724, 882287, 912619, 865089, 775849, 840022, 930164, 943877, 923907, 914689, 963094, 893491, 814283, 845425, 930876, 907992, 891405, 874461, 934039, 902561, 958687, 917776, 866365, 869925, 896073, 1019168, 1102494, 1137785, 1102096, 1128622, 1199295, 1197204, 1169540, 1191690, 1198318, 1130376, 1201287, 1187053, 1255335, 1412025, 1412410, 1384373, 1377842, 1415211, 1391157, 1357710, 1550533, 1542476, 1621937, 1710157, 1893114, 1906567, 1809082, 1957956, 2052473, 2122805, 2035400, 2034409, 2040123, 2090432, 2266856, 2249629, 2297365, 2428413, 2452920, 2568652, 2722625, 2763956, 2798199, 2911297, 3013664, 3119840, 3289504, 3445343, 3531591, 3602492, 3595837, 3653036, 3671589, 3746757, 3821785, 3761053, 3802767, 3867761, 3991280, 4110856, 4146752]
6369D146752J10016R5908O7607K01496J10425R4078J50274J30738J86602K2639
6359E316535J26083J33855K80456O9453M5970J34593J51506J17473O5579J55719
6349F597222J68465K06318L13313J90336R4866J93020L12601K94985L93636L08248
6339I073010K85693K61428L59769L54954L38001M40857M23966M51861L73661N15332
6329A2878532N75959N95003O69870P91822Q64756J085435J116299J249394J490237
6320B1317307J823269J976574K401074K862142L290110M089108M854128N885918
6312D8499630P032650P688960O870359M114543K17457l512181n582795n660879
6304E9667744m290765k706024r98961N10426K024286L465522M970013O026483
$$ y = [4146752, 4256768, 4352676, 4420283, 4621779, 4732204, 4826282, 4976556, 5107294, 5293896, 5316535, 5442618, 5576473, 5856929, 5926382, 5972352, 6106945, 6258451, 6375924, 6441503, 6597222, 6765687, 6972005, 7285318, 7475654, 7570520, 7763540, 8076141, 8371126, 8764762, 9073010, 9358703, 9620131, 9979900, 10334854, 10672855, 11113712, 11537678, 11989539, 12363200, 12878532, 13454491, 14049494, 14719364, 15511186, 16375942, 17461377, 18577676, 19827070, 21317307, 23140576, 25117150, 27518224, 30380366, 33670476, 37759584, 42613712, 48499630, 55532280, 63221240, 70091599, 74206142, 74423599, 70911418, 65328623, 59667744, 55376979, 52670955, 51671994, 52182420, 54206706, 57672228, 62642241, 68668724]
6296F8668724N563891L142479r71860n100773p768244q164842p338670n845343
6288D2185362m603667l530097k687929k088289j690722j510890j206607q60207
6280B4006954o17937n92861l45635k52426k89575k27138q8121M7089p7277P3623
6270B1636696J44015J82284K89318K88404K61398K15329L66502L93721N38830
6261B4316497N27431N57302O60582Q40821R79936R73834J236440J388014J482233
6252C2963090J694331K089726K539055L020917L357205L956075M616211N342221
6244E9578831O604461Q147997J0034838J2138420J3550794J3002966R081811K352749
6236A34492867m515713r034141j0321294q923473o042079l224805n31424K142436
$$ y = [68668724, 74232615, 77375094, 76403234, 71302461, 63534217, 55369375, 48030705, 42185362, 37581695, 34051598, 31363669, 29275380, 27584658, 26073768, 24867161, 24006954, 23389017, 22796156, 22450521, 22198095, 21908520, 21681382, 21593261, 21640350, 21563073, 21636696, 21780711, 21962995, 22252313, 22540717, 22802115, 23017444, 23383946, 23777667, 24316497, 24843928, 25401230, 26061812, 26902633, 27882569, 28856403, 30092843, 31480857, 32963090, 34657421, 36747147, 39286202, 42307119, 45664324, 49620399, 54236610, 59578831, 66183292, 74331289, 84366127, 96504547, 110055341, 123058307, 132140118, 134492867, 129977154, 120943013, 110621719, 101698246, 95656167, 92431362, 91899938, 94042374]
6228I4042374M901796P493634R431017R582784O450649L08856o785795j2191219
6220A13234096j4188958j3504382j1477918r201832p167684n792518m863805l951894
6212D3085105l369655k711702k231977j792820j711082j497460j111184j149909
6204B7509316j042419r95363r94305q79656q27459o57576o02824o24867n96553
6195B0288294o03874m13250m84125m41578l68934l30180l38595k30470j94928
6186A6882360k30530k79548k65604k86441k87689k99151k42355k20276k50857
6177A4519909j19166j66037j43515L836j01253j34851j03026p0347q8831j89710
6167A3407009j35588k29533j55032j67180j44009j39478j77750k03969j87065
$$ y = [94042374, 98944170, 106437804, 115868821, 125451605, 131902254, 132211110, 125425315, 113234096, 99045138, 85540756, 74062838, 64861006, 57693322, 51900804, 47036999, 43085105, 39715450, 37003748, 34771771, 32978951, 31267869, 29770409, 28659225, 27509316, 26466897, 25471534, 24477229, 23597573, 22770114, 22112538, 21509714, 20884847, 20288294, 19684420, 19271170, 18787045, 18345467, 17976533, 17646353, 17307758, 17077288, 16882360, 16651830, 16372282, 16106678, 15820237, 15532548, 15233397, 14991042, 14770766, 14519909, 14400743, 14234706, 14091191, 14095027, 13993774, 13858923, 13755897, 13685550, 13596719, 13407009, 13271421, 13041888, 12886856, 12719676, 12575667, 12436189, 12258439, 12054470, 11867405]
6158A1867405j26735k17200k1293O305j34117J31997Q3845J12142K19701J6207
6148A1938257N0011J08822J7407J40373l8227R6838P3982l6203J09777P5457Q5527
6137A2622021J58887K78215J66674J91695K56661L97087M64933M30498N51778
6128A5518449L70649N00842L41662K06508J42456J08627K7343M1905J09592L3790
6118A7401823J41684J02918J42101K63296J97718K30405K92123K36501L08529
6109A9317098L39282L34877L49404M80365O60304O81188O06476O51174O30707
6100B4050875Q42030Q92486P44704R22877R38304Q86185J027324R96604J108497
6091C2409886J152853J310479J457201J495918J599002J660563J788887J963293
$$ y = [11867405, 11740670, 11523470, 11502177, 11508482, 11374365, 11506362, 11590207, 11702349, 11922050, 11938257, 11988268, 12097090, 12114497, 12254870, 12216643, 12313481, 12387463, 12351260, 12461037, 12536494, 12622021, 12780908, 13059123, 13225797, 13417492, 13674153, 14071240, 14536173, 14966671, 15518449, 15889098, 16389940, 16731602, 16938110, 17080566, 17189193, 17216536, 17258441, 17368033, 17401823, 17543507, 17646425, 17788526, 18051822, 18249540, 18479945, 18772068, 19008569, 19317098, 19656380, 19991257, 20340661, 20821026, 21481330, 22162518, 22768994, 23420168, 24050875, 24892905, 25785391, 26530095, 27452972, 28391276, 29277461, 30304785, 31301389, 32409886, 33562739, 34873218, 36330419, 37826337, 39425339, 41085902, 42874789, 44838082]
6083D4838082K280548K696443L180710L830857M597878N382065O275436P581795
6075H0663814Q935085J0904346J2422022J2051402Q277048J276921o198473j1057374
6067A17274791j2361474j0891570q511307o010325m070683k510608j192576o7914
6059G1658334Q87266J846366K789415L736541M718074N942328P647499R523179
6051A08749002J1401034J1895674R129110K698031n430801j1996444j4501580
6044A11944026j3835191j1560754r176122p092170n666419m429880l536505k795436
6036E3851549k187765j632002j047850r20254p99416p20994n00492m59736n12568
6027D5070472m51020j74966j23526J04365N06090O88111P83448J045619J304548
$$ y = [44838082, 47118630, 49815073, 52995783, 56826640, 61424518, 66806583, 73082019, 80663814, 89598899, 100503245, 112925267, 124976669, 133253717, 134530638, 128332165, 117274791, 104913317, 94021747, 85510440, 79500115, 75429432, 72918824, 71726248, 71658334, 72545600, 74391966, 77181381, 80917922, 85635996, 91578324, 99225823, 108749002, 120150036, 132045710, 141174820, 143872851, 138442050, 126445606, 111944026, 98108835, 86548081, 77371959, 70279789, 64613370, 60183490, 56646985, 53851549, 51663784, 50031782, 48983932, 48063678, 47264262, 46543268, 46042776, 45583040, 45070472, 44619452, 44444486, 44320960, 44425325, 44931415, 45619526, 46402974, 47448593, 48753141]
6018D8753141J366935J738609J757544J794604K279645K376594K268475K399792
6010F4735339K019200J721306J538302J622917K015008K912558L927080N371301
6002H5863011O471689P022369N676170K002052k606080o112474p555027o855118
5994H3906592n447043l855214k285816r57523k11763Q02916J741003K253617K911478
5985G8858247L463241M115634M782084N628427O478826P287972P344488N899200
5977A23858119J970082l300700q111298j0540677j0722937r463306p889151o461218
5969F9338914n078961m134003l511359k711210k060255j490144j189070q26972
5961D8336940n88324m82990k32549k71900l90670p53945j125507j187903j504255
$$ y = [48753141, 50120076, 51858685, 53616229, 55410833, 57690478, 60067072, 62335547, 64735339, 66754539, 68475845, 70014147, 71637064, 73652072, 76564630, 80491710, 85863011, 92334700, 99357069, 105033239, 107035291, 104429211, 98316737, 90761710, 83906592, 78459549, 74604335, 72318519, 71360996, 71149233, 71952149, 73693152, 75946769, 78858247, 82321488, 86437122, 91219206, 96847633, 103326459, 110614431, 117958919, 123858119, 125828201, 122527501, 114416203, 103875526, 93152589, 83689283, 75800132, 69338914, 64259953, 60125950, 56614591, 53903381, 51843126, 50352982, 49163912, 48336940, 47748616, 47265626, 47033077, 46761177, 46370507, 45616562, 44491055, 43303152, 41798897]
5952D1798897j837194j683822j607451j434145j154705r83637p94481o09834m16040
5943C1277588l12784q1824k80806q4532j87530j89637j84489k60534l47451l21716
5933B9026285l92655m20704k94148l50901l82419m82610m02293p95229q70950
5924B4634376q20434q83926p32578p12546p06801l90738j35149n1035p9665j98516
5914A9922988L2489k02461l51789m60046p38523p98533q38995r32885p55849o65577
5904A4210819n49748n82878n12286m31503l76968k15429j12089r8977k97645L4081
5894A1067377o3551N6651J33928L8219K1686j28226o1276j11865q6022k2135K0547
5883A0865333J34764P1397J49713J11350r6446k16716k82187k51878k75906k50128
$$ y = [41798897, 39961703, 38277881, 36670430, 35236285, 34081580, 33097943, 32303462, 31693628, 31277588, 30964804, 30882980, 30602174, 30517642, 30330112, 30140475, 29955986, 29695452, 29348001, 29026285, 28633630, 28212926, 27918778, 27567877, 27185458, 26702848, 26300555, 25505326, 24634376, 23813942, 22930016, 22197438, 21484892, 20778091, 20387353, 20252204, 20201169, 20121504, 19922988, 19955477, 19753016, 19401227, 18941181, 18202658, 17404125, 16565130, 15632245, 14876396, 14210819, 13661071, 13078193, 12565907, 12134404, 11757436, 11542007, 11429918, 11330941, 11033296, 11067377, 11003826, 11060477, 11194405, 11232624, 11254310, 11126084, 11064808, 10952943, 10866921, 10844786, 10865333, 11000097, 11071494, 11221207, 11332557, 11236111, 11019395, 10737208, 10485330, 10209424, 9959296]
5873I959296l06783k14634j37762k19714o4009q7646k10439l97696m69050m45223
5863G406340m25624l84172m35318l07629j62468k64002j40517j31576j85597j78067
5853D791370j17332j59571r0244k25533p7448r6142j64325n1493j50778k8106
5843C630398o5443k9163r6692M448p4737r7816k076j02196n9906l1186L2870r6346
5831C012155j04862n8121Q1537m130m3225q6360P5621l1684p9461j08120j16190
5820B537160o355q9111P9379J0964j3868k8850J04472j49201r8636L7390p2256
5809B311088M0375l7859M4153n5506Q7185J7026j88519L3341Q105k8863j12523
5798B118003m6556Q0598N993j02937L028O072n3292o2750o5858N7673m7086o9300
$$ y = [9959296, 9652513, 9437879, 9300117, 9080403, 9016394, 8928748, 8718309, 8320613, 7851563, 7406340, 6980716, 6596544, 6161226, 5853597, 5691129, 5427127, 5286610, 5155034, 4969437, 4791370, 4674038, 4514467, 4424223, 4198690, 4121242, 4025100, 3860775, 3809282, 3658504, 3630398, 3564955, 3535792, 3439100, 3443548, 3368811, 3270995, 3268919, 3166723, 3106817, 3075631, 3108501, 3012155, 2907293, 2849172, 2930709, 2926579, 2883354, 2796994, 2872615, 2840931, 2761470, 2653350, 2537160, 2530805, 2441694, 2521073, 2532037, 2518169, 2489319, 2593791, 2444590, 2345954, 2383344, 2311088, 2351463, 2313604, 2357757, 2302251, 2389436, 2406462, 2217943, 2251284, 2259389, 2230526, 2118003, 2071447, 2152045, 2158038, 2055101, 2058129, 2064201, 2010909, 1948159, 1882301, 1939974, 1892888, 1823588]
5786A823588R2393m3504o4333o3531j642N8489J1260k8578o7138J7912M9395Q1578
5774A865889m7738p3965L7709r8740Q0460M5251K3088p7984K0787O0264K8072
5763A863093K3967J45605P5805R9424j2234r0177L2927Q5679j35109j07939L4524
5752B015565q6585n7194o149m053l9488k8260p1061L4708P0629J65670O9103P931
5740B070816m4541K4631O8555N0792r7034N9886q9018l9784p6781J2070q1844
5729A857748o3594j8651j68641J21595J8086J8004j3490k2561n3730q3590N9755
5718A650931K2416j5631j6913N8658q630N2890P7783K1320p0547p8937r6614J6888
5706A613614q011m4373n0426Q4957N7763P564N3758P8486J9316J7007k088j19974
$$ y = [1823588, 1915981, 1872477, 1808144, 1744613, 1742971, 1801460, 1812720, 1784142, 1717004, 1734916, 1784311, 1865889, 1818151, 1744186, 1781895, 1683155, 1763615, 1808866, 1831954, 1753970, 1774757, 1835021, 1863093, 1887060, 2032665, 2108470, 2207894, 2195660, 2105483, 2138410, 2224089, 2088980, 1981041, 2015565, 1928980, 1871786, 1865637, 1861584, 1822096, 1793836, 1722775, 1757483, 1828112, 1993782, 2062885, 2070816, 2026275, 2050906, 2119461, 2170253, 2073219, 2133105, 2044087, 2004303, 1927522, 1939592, 1857748, 1794154, 1775503, 1606862, 1728457, 1746543, 1764547, 1751057, 1728496, 1674766, 1591176, 1650931, 1673347, 1657716, 1640803, 1699461, 1690831, 1743721, 1821504, 1842824, 1772277, 1693340, 1596726, 1613614, 1605603, 1561230, 1510804, 1595761, 1653524, 1661088, 1714846, 1793332, 1812648, 1829655, 1827567, 1707593]
5694A707593l4545J14640J14162p5471N8371J04462Q0721J25592L2241L1906N9562
5683B319234j69478n2714j71037K37133K7644j23305K6517k8641l2886P5012P9824
5672B187303K8615j81229N0681N6940O2506J57594P3353Q8514r1040O5770r0634
5661B408373m4701M4346j4482L8449M0798J33192Q4717R2377K17818R2963J93721
5650C287571L4755K4734K283k05428k0876o8357n8848k3425j26519l9969l9598
5639B766323j14545M5986L2364N7785k5373M0667O8832J34860Q2774O4684J01674
5628C256031J02568J31629P7873J68702J70189K11948K23077K39933J13240j13548
5618D581642k65735k73328j75834o9206k01751m0777P1038Q3354K3891J13091
$$ y = [1707593, 1673048, 1787688, 1901850, 1826379, 1884750, 1989212, 2069933, 2195525, 2227766, 2259672, 2319234, 2149756, 2097042, 1926005, 2163138, 2190782, 2067477, 2093994, 2065353, 2032467, 2107479, 2187303, 2215918, 2034689, 2085370, 2142310, 2204816, 2362410, 2435763, 2524277, 2433237, 2499007, 2408373, 2363672, 2408018, 2393536, 2431985, 2472783, 2605975, 2690692, 2783069, 3000887, 3093850, 3287571, 3322326, 3347060, 3349343, 3143915, 3123039, 3054682, 2995834, 2972409, 2845890, 2805921, 2766323, 2651778, 2697764, 2730128, 2787913, 2762540, 2803207, 2872039, 3006899, 3089673, 3154357, 3256031, 3358599, 3490228, 3568101, 3736803, 3906992, 4118940, 4342017, 4581950, 4695190, 4581642, 4315907, 4042579, 3866745, 3797539, 3595788, 3555011, 3626049, 3709403, 3733294, 3846385]
5608C846385M1454J7142J3619J13980R6936Q1575P8007L15558L11685J80777M6231
5597E143349j47335m52017n54575n54147j88911j9434j29008j00408j46032P902
5587B859384j6639J35820K857J21257J86314P5801J62400J3177J37665L6210M8745
5576C762991J35072J2609q0212j29182k23187k78741k68178l34573l11785j40163
5566B144651n0666k4421j84996j74228n0974Q7414p531r2888K0897j03872J7800
5555A581186L2756o9196p4344n6931J28937P928p6445J57034J1052L800k9251
5544A616526L7852k6498l8171Q8978k9480o3367j5574N3259J01581J56223N1145
5533A932474o0004J50775M6714L9820M4749o6158j40855J19061J36999O5196J16290
$$ y = [3846385, 3887839, 3904981, 3918600, 4032580, 4129516, 4211091, 4289098, 4604656, 4916341, 5097118, 5143349, 4996014, 4543997, 3989422, 3435275, 3246364, 3226930, 3097922, 2997514, 2851482, 2859384, 2842745, 2978565, 2981422, 3102679, 3288993, 3364794, 3527194, 3540371, 3678036, 3714246, 3762991, 3898063, 3910672, 3830460, 3701278, 3478091, 3199350, 2931172, 2596599, 2284814, 2144651, 2093985, 2069564, 1884568, 1710340, 1659366, 1746780, 1739249, 1646361, 1667258, 1563386, 1581186, 1613942, 1544746, 1470402, 1413471, 1542408, 1550336, 1473891, 1630925, 1641977, 1645777, 1616526, 1654378, 1627880, 1589709, 1678687, 1649207, 1585840, 1570266, 1623525, 1725106, 1881329, 1932474, 1872470, 2023245, 2069959, 2109779, 2154528, 2088370, 1947515, 2066576, 2203575, 2268771, 2385061]
5522B385061J01118P3498N8466P0758j7959q0409j0107j34771r9300j4795K7798
5511B359358P486r5812l3274j6454k11338Q723M9142o7322q194J3365j05148m4605
5499A855927j364j33721J12267J14373m9466n5862r8848K9949J47692L9760j3204
5488A947503j1218j07803k8855p314P3886J4714o2462j8326j44909k0801j0833
5477A623582j7163j3407M2738L8078q0577J8245l7613n0592J307r2844J10063
5466A541817r5147L7612l0659K9110J9368P1797m709q3516K3599L1223O009o6326
5454A480178j36588m0813N1533j13159l0451k7085J23531j17903l1453L301O0455
5443A221546M8402p5860j53031m1138M1062J5150J07052j3389k3155K6330k4564
$$ y = [2385061, 2486179, 2559677, 2618143, 2688901, 2670942, 2590533, 2580426, 2445655, 2346355, 2331560, 2359358, 2366844, 2271032, 2237758, 2221304, 2009966, 2018689, 2067831, 2000509, 1992315, 2005680, 1900532, 1855927, 1854563, 1720842, 1833109, 1947482, 1898016, 1842154, 1743306, 1773255, 1920947, 1960707, 1947503, 1936285, 1828482, 1799627, 1792313, 1866199, 1880913, 1818451, 1800125, 1655216, 1634415, 1623582, 1606419, 1593012, 1635750, 1673828, 1593251, 1611496, 1573883, 1523291, 1524598, 1431754, 1541817, 1446670, 1484282, 1453623, 1482733, 1502101, 1573898, 1569189, 1485673, 1509272, 1540495, 1546504, 1480178, 1343590, 1302777, 1354310, 1241151, 1210700, 1183615, 1307146, 1189243, 1157790, 1161091, 1221546, 1269948, 1194088, 1041057, 999919, 1040981, 1056131, 1163183, 1149794, 1126639, 1152969, 1128405]
5432A128405K0981L6939q2530J49708m9087m5205k35k9555N7066P264O90P1876
5420A266317J02707l9739M0551o0508K1498J40083j9867p7088L3247q7091L7370
5409A357480L8552L8599J10473R2789q8546r0445N6087k7203L5780J16204o6985
5398A572785J5268J07913M7047p0791K9362J36248m3982J88241m7162L5653l9089
5387A931493Q9060j7011r1735N8698O0608m910K9091N3273N5235J19077N1135
5376B334014J0016R782n9962N8030L48J1355J39818J03399J11561O2767N2429
5365B833557N6205O0370m30M6184Q1687J23277j8067M9745J4032N4466J60188
5354C461214M5679Q4455J20885M6750j8478R9101P8784N1040J77368J62028J04131
$$ y = [1128405, 1149386, 1186325, 1103795, 1253503, 1204416, 1159211, 1158976, 1129421, 1186487, 1193751, 1194441, 1266317, 1369024, 1329285, 1369836, 1309328, 1330826, 1470909, 1451042, 1373954, 1407201, 1320110, 1357480, 1396032, 1434631, 1545104, 1637893, 1549347, 1458902, 1514989, 1487786, 1523566, 1639770, 1572785, 1588053, 1695966, 1743013, 1672222, 1701584, 1837832, 1793850, 1982091, 1934929, 1970582, 1931493, 2020553, 2003542, 1911807, 1970505, 2031113, 2026203, 2055294, 2108567, 2163802, 2282879, 2334014, 2344030, 2353812, 2293850, 2351880, 2352228, 2363583, 2503401, 2606800, 2718361, 2781128, 2833557, 2889762, 2950132, 2949702, 2995886, 3077573, 3200850, 3182783, 3232528, 3246560, 3301026, 3461214, 3506893, 3591348, 3712233, 3758983, 3740505, 3839606, 3918390, 3969430, 4146798, 4308826, 4412957]
5343D412957J25544J11118N0292J81709K02119J85984J57836R8647J99624O0126
5333E785956P2709N4374K52190J86593J02830J79286K11939K44803K34686J92861
5323G518227J55314K65467J65929J07207K84591K07517J91647K68930O8589K87617
5313I521035M04837L51893M13745L55607K76270L26718K15286L29074L83433M25960
5303A3003858M40644L93487M09237M42813O02223N70388O47188P77047O51485
5294A7938370P22427Q44181R12715J020599J160552J170822J493241J732898K077703
5285B9073508K357782K876443L284493L771926L642788K416037O16423m01172
5277D7638228n27110J38697J106760J917545K899990L945574N229169O225005
$$ y = [4412957, 4538501, 4649619, 4699911, 4881620, 5083739, 5269723, 5427559, 5526206, 5725830, 5785956, 5858665, 5913039, 6165229, 6351822, 6454652, 6633938, 6845877, 7090680, 7325366, 7518227, 7673541, 7939008, 8104937, 8212144, 8496735, 8704252, 8895899, 9164829, 9233418, 9521035, 9925872, 10277765, 10691510, 11047117, 11323387, 11650105, 11865391, 12194465, 12577898, 13003858, 13444502, 13837989, 14247226, 14690039, 15292262, 15862650, 16509838, 17286885, 17938370, 18660797, 19504978, 20417693, 21438292, 22598844, 23769666, 25262907, 26995805, 29073508, 31431290, 34307733, 37592226, 41364152, 45006940, 47422977, 48039400, 47638228, 47111118, 47249815, 48356575, 50274120, 53174110, 57119684, 62348853, 68573858]
5269F8573858O403659N699660M100343K411902J114449Q05431R39725P56837L39065
5260I1144929N28121J592568K048606J690893J654114K098558K029837J789297
5252A04576923K020538K731540L054192K774146J498686J89707j385331k759324
5244A12701077l438501l342397k421454j266131j107764j838439k163219j920009
5236I5203163k100178k445109k211927j233538m54498n77896o28921n54780j149800
5227H3846516k677057m550206o242344o704568o252411n075362l743452k649994
5219D5951122j617569p49652k4449O05821P29330m72162k294057l573841l896459
5210C4658084l483154k945808k458031k042950j672137j387500j263129q85233
$$ y = [68573858, 74977517, 80677177, 84777520, 87189422, 88303871, 89109302, 90049027, 90805864, 91144929, 91673050, 93265618, 95314224, 97005117, 98659231, 100757789, 102787626, 104576923, 106597461, 109329001, 112383193, 115157339, 116656025, 116845732, 115460401, 112701077, 109262576, 105920179, 103498725, 102232594, 101124830, 99286391, 97123172, 95203163, 93102985, 90657876, 88445949, 87212411, 86757913, 86180017, 85551096, 84996316, 83846516, 81169459, 76619253, 70376909, 63672341, 57419930, 52344568, 48601116, 45951122, 44333553, 43583901, 43559452, 44165273, 44894603, 44422441, 42128384, 38554543, 34658084, 31174930, 28229122, 25771091, 23728141, 22056004, 20668504, 19405375, 18520142]
5202A8520142r08046q02932o66548o21906n80349n25551n19716m45946m94013
5193A2955135m03819l73570k96140l85664l61016l43554k87006k22623k92554
5184I989189j18327l11786j67022j82828j36035j16903k16989j17298k25925k01356
5174H194720j62742j23356j35505j37308j19901j51011q4360j05239j50954J0079
5164G034423k0962p2119j9110K657m7630n1576J3456M7381M0075r3241j71846
5153F661508m55j964J05452P2721J19691R1264M5045J84615K30728J97087K49500
5142G955192L14867L27885N14254N50882N77295P35747O05905L20582j09950n87034
5132A1205625n18997m99115l47629k95677m3525N3955N8991L64754M80706M87541
$$ y = [18520142, 17612096, 16809164, 16142616, 15520710, 14940361, 14414810, 13895094, 13449148, 12955135, 12551316, 12177746, 11881606, 11495942, 11134926, 10791372, 10504366, 10281743, 9989189, 9870862, 9559076, 9392054, 9209226, 9073191, 8956288, 8739299, 8622001, 8396076, 8194720, 8031978, 7908622, 7773117, 7635809, 7515908, 7364897, 7280537, 7175298, 7024344, 7034423, 7013461, 6941342, 6922232, 6924889, 6877259, 6825683, 6839139, 6886520, 6926595, 6833354, 6661508, 6661053, 6659089, 6764541, 6837262, 6956953, 7048217, 7093262, 7277877, 7508605, 7705692, 7955192, 8270059, 8597944, 9112198, 9663080, 10240375, 10976122, 11582027, 11902609, 11792659, 11205625, 10686628, 10187513, 9839884, 9544207, 9500682, 9554637, 9613628, 9978382, 10459088, 10946629]
5122A0946629P67661O53320M26002K2988m62372o86015p63210n70178m60887m07493
5112I466445k65217j56817k67510r4279n7235q0113q4250j87610q582J5151o9999
5101H209984n8484N2302J05738Q3827K60395K48907K29861L22419L57431M16682
5091A0229062M73933O30286O96062Q50295Q59168J101266J240428J234329O24363
5082A7939192l8028q05949j048446j061946p88131m87032m15734m145J89749J80666
5072A3660196N03814P78608R80117Q87505P02895n3566q86795j243155j411045
5063A3918574j271146j037301q73601p13394m77765m14687l43678k74486j87461
5054H325055j93874j94613j26018j33821j39301Q778k04074j10781p9818j9302
$$ y = [10946629, 11714290, 12367610, 12793612, 12816600, 12354228, 11668213, 10905003, 10334825, 9873938, 9466445, 9201228, 9044411, 8776901, 8682622, 8625387, 8545274, 8461024, 8273414, 8264832, 8279983, 8209984, 8151500, 8203802, 8309540, 8393367, 8653762, 8902669, 9132530, 9454949, 9812380, 10229062, 10702995, 11333281, 12029343, 12879638, 13738806, 14840072, 16080500, 17314829, 17939192, 17901164, 17095215, 16046769, 14984823, 14196692, 13709660, 13293926, 13289781, 13479530, 13660196, 14164010, 14942618, 15922735, 16810240, 17513135, 17459569, 16572774, 15329619, 13918574, 12647428, 11610127, 10736526, 10023132, 9545367, 9130680, 8787002, 8512516, 8325055, 8131181, 7936568, 7810550, 7676729, 7537428, 7546206, 7342132, 7231351, 7151533, 7132231]
5044G132231k71138q0273K0583q1441L5914r8649o2815j7451Q5455J3031m5625
5033F629822N3668O1689L2699k2215P1142m633O2521m7469k1984Q9115O3957k0506
5021F947806P7136J72970P2013R1669J23882N6840J31188J47257P4730M2619J8300
5010G956410L5165J96693J51153P0856N4439J79511J91362K72312J39330J37990
5000I385221J95367Q6694K0714J1208J29286J30405Q8671M2115K41254J70060
4990A0500995L05479K72768K84934N06258M52005M62204N10919N30745N53859
4981A4380166N33930N91529N21381M27586N84411P51041P91307J096748J096995
4972B0775094Q30161N59065j37627o29983p06415o91091m89678l04515M4636O3176
$$ y = [7132231, 6861093, 6780820, 6801403, 6719962, 6755876, 6657227, 6594412, 6576961, 6662416, 6675447, 6629822, 6683490, 6745179, 6777878, 6755663, 6826805, 6822172, 6884693, 6837224, 6815240, 6904355, 6968312, 6947806, 7024942, 7197912, 7269925, 7361594, 7485476, 7542316, 7673504, 7820761, 7895491, 7938110, 7956410, 7991575, 8188268, 8339421, 8410277, 8464716, 8644227, 8835589, 9107901, 9247231, 9385221, 9580588, 9667282, 9687996, 9699204, 9828490, 9958895, 10047566, 10089681, 10330935, 10500995, 10806474, 11079242, 11364176, 11870434, 12322439, 12784643, 13295562, 13826307, 14380166, 14914096, 15505625, 16027006, 16454592, 17039003, 17790044, 18581351, 19678099, 20775094, 21605255, 22164320, 22026693, 21396710, 20690295, 19999204, 19509526, 19205011, 19249647, 19312823]
4962A9312823J1099J09155N3121P1501P7757K72887M19710M84847M45371P83379
4952B2041650Q54174Q92147J211055J467373J513224J461925J060207N87334o278
4943C1082811o05556q73591p40651n27223l20479j08658R9086K32564K27584L22072
4933B8787959M23220N24929L85984M94593N90281P43095P63410Q62199R44930
4924C4520600J002059J012609J307746J024193J105548Q86200N56084M82598L55147
4915D2252784M02048L89192O32666R35373Q59531R38247J129106J142350J413073
4906E0094370J510854J521448J574648J591641J721801K014452K136846K424362
4898F4590422K619665K973133L350677L614319L837705L912256L876768M008335
$$ y = [19312823, 19323922, 19433077, 19486198, 19557699, 19635456, 19908343, 20328053, 20812900, 21258271, 22041650, 22895824, 23787971, 24999026, 26466399, 27979623, 29441548, 30501755, 31089089, 31082811, 30477255, 29603664, 28863013, 28335790, 28015311, 27906653, 28005739, 28238303, 28465887, 28787959, 29211179, 29736108, 30122092, 30616685, 31206966, 31950061, 32713471, 33575670, 34520600, 35522659, 36535268, 37843014, 38867207, 39972755, 40858955, 41415039, 41897637, 42252784, 42654832, 43044024, 43676690, 44612063, 45471594, 46409841, 47538947, 48681297, 50094370, 51605224, 53126672, 54701320, 56292961, 58014762, 60029214, 62166060, 64590422, 67210087, 70183220, 73533897, 77148216, 80985921, 84898177, 88774945, 92783280]
4890I2783280M458010N564797P162813R079058J1294953J3536464J4482752J1046177
4882A69408304K670931n999040j0114914r326963o388435l479271r33270J027168
4874A36864510K922506M707728O570951Q645663J0915670J3709232J6953801K0334019
4866B21624080K2427769K0872289J5583696J0696985P650188L095671m481120
4859B97469558j0478457j1852620r061039n444270k842059j144126L8414R47116
4851B57632517K049882L279805M638479O117497P760348J0060537J2144154J2082466
4843C15765685O480032k361846q858439r798227o668247k237798J747269N286259
4835B99354688Q026755J0339183J2423455J4461231J6319828J7674699J8068462
$$ y = [92783280, 97241290, 102806087, 109968900, 119047958, 130342911, 143879375, 158362127, 169408304, 172079235, 166080195, 155965281, 146638318, 140249883, 136770612, 135837342, 136864510, 139787016, 144494744, 151065695, 159711358, 170627028, 184336260, 201290061, 221624080, 244051849, 264924138, 280507834, 291204819, 298855007, 301950678, 297469558, 286991101, 275138481, 266077442, 260633172, 257791113, 256646987, 256685401, 257632517, 259682399, 262962204, 267600683, 273718180, 281478528, 291539065, 303683219, 315765685, 322245717, 319883871, 311025432, 301227205, 294558958, 292321160, 294068429, 299354688, 307381443, 317720626, 330144081, 344605312, 360925140, 378599839, 396668301]
4828C96668301J6923690J4277865J0250661N602977N16525m147307q285804j1516130
4820D20290778j4118648j5652403j5647020j4111641j1722905q967664n936443
4813C34134054l485970j260333N52812K096510L724479N496871P294426R486269
4805C58039118J2042822J4399172J6557807J8044778J8073424J6677108J3964746
4798D67798975R755729N055420j89430n465166j0430232j4956995j8383861k0423914
4790D12760526k0703594j9630394j7882497j5990114j4322920j2826348j1251621
4783C00153038r533269p746799o224555m596561l174112k049236j070574n71224
4775B65186708l88558p07876j445901k221956k827188l512143m184216n297622
$$ y = [396668301, 413591991, 427869856, 438120517, 443723494, 444240019, 440092712, 431806908, 420290778, 406172130, 390519727, 374872707, 360761066, 349038161, 340070497, 334134054, 330648084, 329387751, 329940563, 332037073, 335761552, 341258423, 348552849, 358039118, 370081940, 384481112, 401038919, 419083697, 437157121, 453834229, 467798975, 477554704, 482610124, 482420694, 476955528, 466525296, 451568301, 433184440, 412760526, 392056932, 372426538, 354544041, 338553927, 324231007, 311404659, 300153038, 290619769, 282872970, 276648415, 272051854, 268877742, 266828506, 265757932, 265186708, 264798150, 264090274, 262644373, 260422417, 257595229, 254083086, 249898870, 244601248]
4767B44601248o802122q534179r962201j0704544j0738716j0367158r784530r012656
4759A68695142q537447p947613p322114o770575o237866n651058n151809m639954
4751A16436706m222855l659157l187346k985690k677844k512600k230175k027516
4743I2933523j815128j766640j791024j532959j459434j514426j432986j398160
4735H0222766j397734j422512j375593j425813j314473j297543j568695j558453
4727F8861950j578071j559335j438651j288201j180952r99392q73393q23718n51588
4718E8568649l22516l74425l80989m56887n26541n44828n54072o80387p75750
4709E3952254r31889r60671r26751r49674n81386l95390l77680n04369o05091
$$ y = [244601248, 237799126, 229264947, 219302746, 208598202, 197859486, 187492328, 177707798, 168695142, 160157695, 152210082, 144887968, 138117393, 131879527, 126228469, 121076660, 116436706, 112213851, 108554694, 105367348, 102381658, 99703814, 97191214, 94961039, 92933523, 91118395, 89351755, 87560731, 86027772, 84568338, 83053912, 81620926, 80222766, 78825032, 77402520, 76026927, 74601114, 73286641, 71989098, 70420403, 68861950, 67283879, 65724544, 64285893, 62997692, 61816740, 60817348, 59943955, 59120237, 58568649, 58246133, 57871708, 57490719, 57033832, 56507291, 55962463, 55408391, 54728004, 53952254, 53020365, 52059694, 51132943, 50183269, 49601883, 49206493, 48828813, 48324444, 47719353]
4700D7719353p18585p26441p60264p96059q03452q00146p68853q67618o84665
4691D0793270n81467o14112n22334m26269l52329k48596k16053j47260m51531
4682C7233319p99539q47216p60883p32990n38311k88878j00070r1059m8714J36397
4672C3162056p5825k49606k31450l63487m21365n87685n81633m24537m52639n21927
4662B9251902n52461l58329l05509k56194k34191k45248l38745l71999n94398
4653B5994828m70220l83316l82422j55871k29251k44564L7054l5330n3713o5395
4643B4011800K066j1190m2436J59637k5919j739N7019J03118K12015J03187K17251
4632B4784809J78345K42851M37004L73860L18206N37282O61703P95869R59537
$$ y = [47719353, 47000768, 46274327, 45514063, 44718004, 43914552, 43114406, 42345553, 41477935, 40793270, 40211803, 39597691, 39075357, 38649088, 38296759, 38048163, 37832110, 37684850, 37233319, 36433780, 35586564, 34825681, 34092691, 33554380, 33265502, 33165432, 33074373, 33025659, 33162056, 33086231, 32836625, 32605175, 32241688, 31820323, 31232638, 30651005, 30226468, 29773829, 29251902, 28699441, 28341112, 28035603, 27779409, 27545218, 27299970, 26961225, 26589226, 25994828, 25524608, 25141292, 24758870, 24602999, 24373748, 24129184, 24166238, 24130908, 24077195, 24011800, 24013866, 24002676, 23960240, 24119877, 24093958, 24092219, 24149238, 24252356, 24464371, 24567558, 24784809, 24963154, 25206005, 25643009, 26016869, 26335075, 26872357, 27534060, 28329929, 29289466]
4623B9289466J144972J529312J600448J351855M68354l06080p57422r48867o97574
4614C2674464l85532j35603K39760M07455N93421P60508R80645J292761J453050
4605C7880929J680516K167871K386148K559376K642571K630358K472088K416516
4597E6836373K110308J718481J542148J882206K878728M111096N858614P701127
4589H4639081R966312J2583829J4579358J4067627Q971831M81198o858899r580586
4581A28849751p896982m303875q55346K122547M999869P895192R894145R540943
4573A50246244M274062l578882r355899j0742979q082821l730989P37724M644333
4565A24410793P332055O922950K025537n091071j0215071j1326931r095166n756189
$$ y = [29289466, 30434438, 31963750, 33564198, 34916053, 35384407, 35078327, 34320905, 33372038, 32674464, 32288932, 32153329, 32393089, 32800544, 33393965, 34154473, 35135118, 36427879, 37880929, 39561445, 41729316, 44115464, 46674840, 49317411, 51947769, 54419857, 56836373, 58946681, 60665162, 62207310, 64089516, 66968244, 71079340, 76937954, 84639081, 94605393, 107189222, 121768580, 135836207, 144808038, 145289236, 138430337, 128849751, 120952769, 116648894, 115793548, 117916095, 122915964, 130811156, 140705301, 150246244, 154520306, 150941424, 141585525, 130842546, 122759725, 119028736, 119766460, 124410793, 131742848, 138665798, 140691335, 135600264, 125385193, 114058262, 104963096, 99206907]
4557I9206907k557374M12596L304616N785698P347460N590283l88672p881252
4549A10820262j2635510j3386729j1513587r194371p415049n790369m680327l725278
4541D2479042k890278k354430j960895j688612j316828j213840j181813j057865
4533B8814481j051296r91405j001419q82525p65808o95960o11069n64048n57920
4524B1693031o85162n40146n56388n80882m67397m22401k34697k58841k65701
4515A7681416k23921j87885k71574j91669k71092k99970j77924j43232m8834k97520
4505A5567795j67813j06312j65169k56327k66095k42937j66515m20579k99254
4496A3476794k54661k44707k28548l33067j75850j79609k02631j40496j96658
$$ y = [99206907, 96649533, 97062129, 100366745, 106152443, 113499903, 119090186, 118701514, 110820262, 98184752, 84798023, 73284436, 64090065, 56675016, 50884647, 46204320, 42479042, 39588764, 37234334, 35273439, 33584827, 32267999, 31054159, 29872346, 28814481, 27763185, 26771780, 25770361, 24887836, 24122028, 23426068, 22814999, 22250951, 21693031, 21007869, 20467723, 19911335, 19330453, 18863056, 18440655, 18205958, 17947117, 17681416, 17457495, 17269610, 16998036, 16806367, 16535275, 16235305, 16057381, 15914149, 15865315, 15567795, 15399982, 15293670, 15128501, 14872174, 14606079, 14363142, 14196627, 13776048, 13476794, 13222133, 12977426, 12748878, 12415811, 12239961, 12060352, 11857721, 11717225, 11520567]
4487A1520567j50841j41139j70537r3119o8810m2891m0003j95229j58217j73879
4477A0285902j80983k09602l23409j81842k48958j06806k27858q8855K8113j82573
4467H563129j2216j792r6711j24437J8028k0372n1461j60026j70385k1475j74299
4456G747983p8674o2205j33673j85174j01706n0712Q1892l7634M6028J11131R6833
4445G434089P3766J58073K46074N9464k14805k93944l18254k96931j44726n6534
4435F646272K9443j53850p0541p3581j60221K160N5116l0045j26195o8733k5923
4424F023902l657j01944j03259L0367N8849j06444q6525m3117P8664m1566O7865
4413E773135K5107k9154L7663Q6874L3002j0779n6115m9793J74188L2410j16195
$$ y = [11520567, 11369726, 11228587, 11058050, 10964931, 10896121, 10853230, 10813227, 10617998, 10459781, 10285902, 10104919, 9895317, 9571908, 9390066, 9141108, 9034302, 8806444, 8717589, 8745702, 8563129, 8550913, 8549121, 8452410, 8327973, 8346001, 8325629, 8274168, 8114142, 7943757, 7922282, 7747983, 7669309, 7607104, 7473431, 7288257, 7186551, 7135839, 7217731, 7180097, 7226125, 7337256, 7434089, 7507855, 7665928, 7912002, 7971466, 7756661, 7462717, 7144463, 6847532, 6702806, 6646272, 6675715, 6521865, 6451324, 6377743, 6217522, 6219682, 6274798, 6244753, 6118558, 6049825, 6023902, 6020245, 5918301, 5815042, 5845409, 5904258, 5797814, 5711289, 5668172, 5746836, 5705270, 5773135, 5798242, 5769088, 5806751, 5893625, 5926627, 5915848, 5859733, 5809940, 5984128, 6016538, 5900343]
4402E900343N4132Q6530q0763m9364Q0369L1962l6710j32663L0422M5513J6044
4391E945815q355o5516m7032M0504M0223M2103L6519L8173O2384J6611K18524
4380F319953O5933J7204Q6581j06564m0618J94265q0949K5234J08329J24167r0959
4369F622576M6350J07541J31132L370p2155J03386O7290N7886P4575J92115M3247
4358G377313P1052J18494N1202J37695J86555Q0812N7758J44715K45081J89041
4348H659718J94915J69623J72238K15150K19690L75625L85504M00755N84585O07090
4338A1984893P28304Q01555Q50608J129303J418005J579608J674219J270729L44349
4329B1781573j30387m53709m87759j27104K10604N17305Q15486J017722J179268
$$ y = [5900343, 5954475, 6041005, 5960242, 5910878, 5991247, 6023209, 5986499, 5853836, 5884258, 5929771, 5945815, 5937460, 5871944, 5824912, 5865416, 5905639, 5947742, 5984261, 6022434, 6084818, 6101429, 6319953, 6385886, 6403090, 6489671, 6383107, 6342489, 6536754, 6455805, 6481039, 6589368, 6713535, 6622576, 6668926, 6776467, 6907599, 6910969, 6838814, 6942200, 7009490, 7067376, 7141951, 7334066, 7377313, 7448365, 7566859, 7618061, 7755756, 7942311, 8023123, 8080881, 8225596, 8470677, 8659718, 8854633, 9024256, 9196494, 9411644, 9631334, 10006959, 10392463, 10793218, 11377803, 11984893, 12713197, 13514752, 14365360, 15494663, 16912668, 18492276, 20166495, 21437224, 21781573, 21651186, 21197477, 20709718, 20582614, 20793218, 21310523, 22126009, 23143731, 24322999]
4320B4322999J285987J018894Q7254o87970j191335r91102n99396j86932J63986
4311B3222385O06481Q26020P25258Q1353m88915q90623q86384o75076p17553m18865
4301B1384081k24295o4218p16K86425J97083l51615j021831j410008j571845j287506
4291A5935555j084180r48761p11868n41610n34001m61702l25537k68920k43743
4282A0815233j86123q6233j35768j04738j27156j20686l7605K3001k437r7771
4272I939717l0894R9205k9194L6038q526p655J9818K6049K0335j965J16893J96379
4260A0376200R0443K0339J76143J36003J58003J96931O2796J07919K73137J03058
4250A1700972J02204J32664P8885K58288J35348J24417K53820J58689J90779K48292
$$ y = [24322999, 25608986, 26627880, 26715134, 26027164, 24835829, 23844727, 23245331, 23058399, 23222385, 23828866, 24654886, 25380144, 25461497, 24972582, 24081959, 23195575, 22520499, 21802946, 21384081, 21159786, 21095568, 21094852, 21381277, 21578360, 21226745, 20204914, 18794906, 17223061, 15935555, 14851375, 13902614, 13190746, 12649136, 12115135, 11653433, 11327896, 11058976, 10815233, 10629110, 10542877, 10407109, 10302371, 10175215, 10054529, 10016924, 10039925, 10037488, 9939717, 9908823, 10008028, 9978834, 10014872, 10006346, 9998691, 10018509, 10044558, 10064893, 10062928, 10179821, 10376200, 10466643, 10486982, 10663125, 10799128, 10957131, 11154062, 11216858, 11324777, 11597914, 11700972, 11803176, 11935840, 12014725, 12273013, 12408361, 12532778, 12786598, 12945287, 13136066, 13384358]
4240A3384358L43577J20811K46629L09906L87194K99185L05475M56847L67694
4231A6221676L51079M43703M38268L69783J84338M51223M28631M58294N51505
4222A9898500M67866M59687N10781N51930N54180O42736P02842P26119R48203
4213B5462844P26447Q00886J159707J036618J042097J106955J416732J466036
4205C4218322J491822J709681J897629J937414K002244K010126K075823J982664
4197D9325725J881619J741688J631197J552621J469421J398848J474019J451387
4189F1926525J546260J828641J920139K383515K698368L034373L441238L576572
4181H2355631L453965L115695K811409K378641K293523K162795K150765K167662
$$ y = [13384358, 13727935, 13848746, 14095375, 14405281, 14792475, 15091660, 15397135, 15853982, 16221676, 16572755, 17016458, 17454726, 17824509, 18008847, 18460070, 18888701, 19346995, 19898500, 20366366, 20826053, 21336834, 21888764, 22442944, 23085680, 23788522, 24514641, 25462844, 26189291, 26990177, 28149884, 29186502, 30228599, 31335554, 32752286, 34218322, 35710144, 37419825, 39317454, 41254868, 43257112, 45267238, 47343061, 49325725, 51207344, 52949032, 54580229, 56132850, 57602271, 59001119, 60475138, 61926525, 63472785, 65301426, 67221565, 69605080, 72303448, 75337821, 78779059, 82355631, 85809596, 88925291, 91736700, 94115341, 96408864, 98571659, 100722424, 102890086]
4173A02890086K174321K068369K112655K093799K261614K173915K618623K961340
4165A21354722K831312K887483K663022K466766K369917K817319L452822M486823
4157A45330186N185717N878266O376524N724616M298542K595302J508820J192639
4149A78090612J494548J936203K164691K316419K330206K067272J826088J790838
4141A94016877J722745J588075J446333J312825J005601Q86030R13108R54906
4133B03846500J712833K513184L525065M737105O028313P027430P727186P650989
4125B44768605O841197N646347M867332M900758N141775N303845M796631L832555
4117B86099045K796300K202359J818867J597673R99454M7462n21762n23505r3927
$$ y = [102890086, 105064407, 107132776, 109245431, 111339230, 113600844, 115774759, 118393382, 121354722, 124186034, 127073517, 129736539, 132203305, 134573222, 137390541, 140843363, 145330186, 150515903, 156394169, 162770693, 168495309, 172793851, 175389153, 176897973, 178090612, 179585160, 181521363, 183686054, 186002473, 188332679, 190399951, 192226039, 194016877, 195739622, 197327697, 198774030, 200086855, 201092456, 201978486, 202891594, 203846500, 205559333, 208072517, 211597582, 216334687, 222363000, 229390430, 237117616, 244768605, 251609802, 257256149, 262123481, 267024239, 272166014, 277469859, 282266490, 286099045, 288895345, 291097704, 292916571, 294514244, 295513698, 295561160, 295039398, 294515893, 294421966]
4108B94421966O76240J373717K124746K787615L227849L084683K620291K042800
4100C12359907J324309N08880r1067n97049q63154l88171J42813Q45228J490429
4091C14732125J677957J443204R20554J33283j043725j892697k261553k152501
4083C11556647j741640j778854k327669l380986l996129l902255l342354l310148
4075B87776612m623638o328907p611666p892838p334439o223162m995229l625362
4067B39141371k584908j689858j120198j192749j471836j943602k274395k454553
4059B24409272k682593k874285l255848l515545l632163l666823l382921k898527
4051A98500567k158904j281146r65487j277512k240638l794529n417298o201528
$$ y = [294421966, 295098206, 296471923, 298596669, 301384284, 304612133, 307696816, 310317107, 312359907, 313684216, 314193096, 314102029, 313504980, 312641826, 312253655, 312396468, 313241696, 314732125, 316410082, 317853286, 318773840, 318907123, 317863398, 315970701, 313709148, 311556647, 309815007, 308036153, 305708484, 302327498, 298331369, 294429114, 291086760, 287776612, 283152974, 276824067, 269212401, 261319563, 253985124, 247761962, 242766733, 239141371, 236556463, 234866605, 233746407, 232553658, 231081822, 229138220, 226863825, 224409272, 221726679, 218852394, 215596546, 212081001, 208448838, 204782015, 201399094, 198500567, 196341663, 195060517, 194095030, 192817518, 190576880, 186782351, 181365053, 175163525]
4043A75163525o159934n352853m429643l542988l020903k808835k761589k923159
4035A44163621l100479l338856l344911l212206l083695k941924k423349k568591
4027A20149610k317563k276308k189351k242790k163161k190522k529161k684493
4019A01556261l145538l416815l604620l436819l177150k754560k460057k357703
4011G7202999k048902j794995j998204k041080j960017j936027j797720j857189
4003F1768865j817400j861791j930706k070706k150955k027648k041411j922664
3995D5945584j698483j634946j539251j425368j410282j306465j246938j176321
3987C4507530j117663j079396r83363j026289r66427q47168r28080p70416q73106
$$ y = [175163525, 169003591, 163650738, 159221095, 155678107, 152657204, 149848369, 147086780, 144163621, 141063142, 137724286, 134379375, 131167169, 128083474, 125141550, 122718201, 120149610, 117832047, 115555739, 113366388, 111123598, 108960437, 106769915, 104240754, 101556261, 98410723, 94993908, 91389288, 87952469, 84775319, 82020759, 79560702, 77202999, 75154097, 73359102, 71360898, 69319818, 67359801, 65423774, 63626054, 61768865, 59951465, 58089674, 56158968, 54088262, 51937307, 49909659, 47868248, 45945584, 44247101, 42612155, 41072904, 39647536, 38237254, 36930789, 35683851, 34507530, 33389867, 32310471, 31327108, 30300819, 29334392, 28487224, 27559144, 26788728, 25915622]
3978B5915622p46238n40475n71993n84287n89069n28959n43870n25328m80449
3969B0804954m87581m30221m44502m89458m63267l41226m53332m19543k97986
3960A6977838l53146k78214l33876l09168l76867l67246k14795k42339k84230
3951A4217957k04788l21383k68394j37275k53158j17406k44354l11417j91836
3942A2167946j11526j39124k78276j37427k01420o2328j85381k41187j81320o9228
3932A0560729j38197r8177l8166k09066j42158j54863r5035j31141r7552j34672
3922I321702j0442k20728j21631L5357j41286r5368n8594J9600j53746j18551
3912H456313j1573m5623j69723l1546l8645q3932M7158k0245k5411L9277k7863
$$ y = [25915622, 25169384, 24628909, 24056916, 23472629, 22883560, 22354601, 21810731, 21285403, 20804954, 20317373, 19887152, 19442650, 18953192, 18489925, 18148699, 17695367, 17275824, 16977838, 16624692, 16346478, 16012602, 15703434, 15326567, 14959321, 14744526, 14502187, 14217957, 14013169, 13691786, 13423392, 13286117, 13032959, 12915553, 12671199, 12359782, 12167946, 12056420, 11917296, 11639020, 11501593, 11300173, 11237845, 11052464, 10811277, 10629957, 10560729, 10422532, 10324355, 10286189, 10077123, 9934965, 9780102, 9685067, 9553926, 9456374, 9321702, 9311260, 9090532, 8968901, 9004258, 8862972, 8767604, 8709010, 8728610, 8574864, 8456313, 8444740, 8399117, 8229394, 8197848, 8159203, 8075271, 8122429, 8102184, 8076773, 8116050, 8088187]
3901H088187l933j3584l0582o883l4116j7132m1457Q1628n9999j00923J3293O2063
3889G936562o9785O828K0562J0540J09001Q7102L2579p7302k1288M6974K84923
3878H366696J26464O9331J78126M1011R3209K78909J11347J57471J85047J70188
3868I777799L00256K48091K86830L04107L51086K70332K76333L72932M38265N79803
3858A3205834N48450N09393O01708N64794M92129M10051M20617K85668o6387j50806
3848A6821451l29047m51118m51352o53547n84770n94495o39934n40206n85544
3839A1991438m41920l38486l02741l77636k75937j89450j43340j51827j31777
3830I638324r5220n303j56514k57695k63343k74085j01796k30462k01395k97651
$$ y = [8088187, 8084254, 8070670, 8040088, 8033205, 7999089, 7981957, 7940500, 8022128, 7962129, 7861206, 7874499, 7936562, 7866777, 7873605, 7894167, 7904707, 8013708, 8100810, 8133389, 8056087, 8034799, 8081773, 8366696, 8493160, 8562491, 8740617, 8781628, 8874837, 9153746, 9265093, 9422564, 9607611, 9777799, 10078055, 10326146, 10612976, 10917083, 11268169, 11538501, 11814834, 12187766, 12626031, 13205834, 13754284, 14263677, 14865385, 15430179, 15922308, 16332359, 16752976, 17038644, 16972257, 16821451, 16492404, 16041286, 15589934, 14936387, 14351617, 13757122, 13117188, 12576982, 11991438, 11549518, 11211032, 10908291, 10530655, 10254718, 10065268, 9921928, 9770101, 9638324, 9543104, 9537801, 9381287, 9123592, 8860249, 8586164, 8484368, 8253906, 8052511, 7754860]
3820G754860j68377n2790j10436j77518n2204l7102k9981q9982j27670O7820o1624
3809F914996n1412j9725n7999k54586k69510j56890k26236j49927j92554j15299
3799E420858j90806k4919q4522j21846j83952p5503j31991o0848j89139r0859
3789D266473N6046P139j08135j97120r777n872k9286r2904j49977L807j1946n5034
3777C673414l8396j57412Q1471k9753j0697j0967M5474m0862r0182j33730n3493
3766C234867m884l7437n7380Q1950n9328r5304q3020k5571j0327j07068Q14p0321
3754B766991m9486n9664M5690N7650m59l7851r6190n0023K3294N9445r7850k6855
3742B534692K0788o1955o6791p1498m1268N827j61541n2485n9918R414P018m5934
$$ y = [7754860, 7586483, 7533693, 7423257, 7245739, 7193535, 7156433, 7126452, 7036470, 6908800, 6976620, 6914996, 6863584, 6843859, 6785860, 6531274, 6261764, 6104874, 5878638, 5728711, 5536157, 5420858, 5230052, 5205133, 5120611, 4998765, 4814813, 4739310, 4607319, 4546471, 4357332, 4266473, 4322519, 4329658, 4221523, 4024403, 4014626, 4008754, 3979468, 3886564, 3736587, 3740394, 3728448, 3673414, 3635018, 3477606, 3559077, 3529324, 3518627, 3507660, 3553134, 3512272, 3422090, 3288360, 3234867, 3229983, 3192546, 3135166, 3217116, 3157788, 3062484, 2979464, 2953893, 2943566, 2836498, 2837312, 2766991, 2717505, 2657841, 2703531, 2761181, 2760722, 2722871, 2626681, 2576658, 2599952, 2659397, 2561547, 2534692, 2555480, 2493525, 2426734, 2355236, 2313968, 2319795, 2158254, 2105769, 2045851, 2055265, 2062283, 2016349]
3730B016349n646m5113q9939N268K9298j7661n1128J54654o6657j47134P2447
3719A854738r4055J2339k9212l412K2460M1920J0147j5153j7687n5513k2264J57989
3707A862297R158L9394J30191P6747n5872j46729j79420j22333K4006j5074j01637
3696A520728O6028O168p8559k7515l4063l1899Q4496j4948j82818l145m0851n3022
3684A210600O8318k6948n78J05708p7724r4251o8219K5987K0188n4147J17558
3673A226492O5125r8861j6005o277p2594L0571Q798j5066J05106J7886l3019Q5204
3661A297360m0164L161J1448L6771Q009l7773O328j16630M1331Q1741p784j4045
3649A269753l89l9128m679P7650m5015k9086L5810N8628M8280M1759M2037j50224
$$ y = [2016349, 2010703, 1965590, 1875651, 1880919, 1910217, 1892556, 1841428, 1996082, 1929425, 1782291, 1854738, 1760683, 1773022, 1743810, 1740398, 1762858, 1804778, 1814925, 1799772, 1782085, 1726572, 1704308, 1862297, 1871455, 1910849, 2041040, 2117787, 2061915, 1915186, 1735766, 1613433, 1637439, 1622365, 1520728, 1586756, 1592924, 1514365, 1486850, 1452787, 1420888, 1505384, 1490436, 1307618, 1304473, 1263622, 1210600, 1278918, 1251970, 1251392, 1357100, 1279376, 1185125, 1116906, 1142893, 1163081, 1108934, 1226492, 1291617, 1192756, 1176751, 1170474, 1097880, 1128451, 1137249, 1122183, 1227289, 1245175, 1212156, 1297360, 1257196, 1260357, 1271805, 1308576, 1316585, 1278812, 1285140, 1168510, 1209841, 1291582, 1283798, 1269753, 1269364, 1230236, 1225557, 1303207, 1258192, 1229106, 1264916, 1323544, 1371824, 1413583, 1455620, 1305396]
3637A305396M0833K7884p6597J02588J4238k9848J37325q8061k7390k377k9467
3626A374524n203l732P0781m3618L6699L1420R746N4697J16593N5365n1510L7832
3614A683594O3941j38341J4824Q1011N0766k8771O8661q626P044Q3601N0392j0903
3602A917193m5278O1793Q8378P7690m5702K2827L2838K5395k2902J10367O8767
3591B291366K9816R5900l5610J9978r708M9637J21042M8682L9716O7264K1201
3580B739284J02264N5808P4971J59913J97890O0694J60761J38936Q5850P158J46944
3569C930473J64542K91078K26324J17879L89047K97987R0616J96124K20186J23599
3559F047855J63673J10055M3895q4952k44523l07567j83939l37365m05005l80858
$$ y = [1305396, 1346229, 1374113, 1297516, 1400104, 1414342, 1384494, 1521819, 1433758, 1406368, 1403991, 1374524, 1369321, 1365589, 1436370, 1392752, 1429451, 1460871, 1470617, 1525314, 1641907, 1697272, 1645762, 1683594, 1747535, 1609194, 1624018, 1705029, 1755795, 1727024, 1795685, 1787059, 1794103, 1877704, 1928096, 1917193, 1871915, 1933708, 2022086, 2099776, 2054074, 2076901, 2109739, 2135134, 2112232, 2222599, 2291366, 2321182, 2417082, 2381472, 2401450, 2391742, 2441379, 2562421, 2611103, 2650819, 2718083, 2739284, 2841548, 2897356, 2972327, 3132240, 3330130, 3390824, 3551585, 3690521, 3776371, 3783529, 3930473, 4095015, 4386093, 4612417, 4730296, 5119343, 5417330, 5507946, 5704070, 5924256, 6047855, 6211528, 6321583, 6365478, 6280526, 6036003, 5728436, 5544497, 5207132, 4802127, 4421269]
3549D421269j50303j82224m05076k09210p5051k57208n4996j34163m9877j45846
3539B757315j28903j8643j12683j20018r8653j11170o3112j33209m6328m1344
3529A883252j29966L6956R0308o2561k12736L2031L0084n5022j8287j39249n7320
3518A397490j9135o5712K1778j29755n8579O5216n1842l7207K038l643J1414j5999
3506A116064j14377O1877l9795j4753Q799o6720R543m1714p9372J22451n771q0174
3494H76058j00135K2775K9833q0231N7602L2532l1957O9480J9916l5169j40658
3483G20046j02392O8391j1329N9777j4861k2897n8157j5020k9187Q6598p4095
3472F06874r8170l4344o8175m4663J66749M3110q5466M3236o5699l0562O2397
$$ y = [4421269, 4270966, 4088742, 3683666, 3474456, 3399405, 3142197, 3087201, 2953038, 2903161, 2757315, 2628412, 2609769, 2497086, 2377068, 2278415, 2167245, 2104133, 1970924, 1924596, 1883252, 1753286, 1790242, 1880550, 1817989, 1605253, 1637284, 1667368, 1612346, 1594059, 1454810, 1397490, 1378355, 1312643, 1334421, 1204666, 1146087, 1211303, 1159461, 1122254, 1124292, 1120649, 1132063, 1116064, 1001687, 1063564, 1023769, 1009016, 1017815, 951095, 960638, 918924, 839552, 962003, 956232, 876058, 775923, 798698, 828531, 748300, 805902, 838434, 806477, 875957, 895873, 860704, 720046, 617654, 686045, 674716, 734493, 719632, 696735, 638578, 623558, 594371, 680969, 606874, 508704, 474360, 406185, 361522, 528271, 571381, 485915, 529151, 463452, 432890, 495287]
3461D95287k2295j7490m410J8171J3092p872J2500O0066j16550j11620O6197K4408
3449D09484r6097Q2648M0896K9403n6131N3173j476k5374m6038O8028K7536j5096
3437D70956m7584o1921O3487j36303J17980N6360q043k0484J2132k378j305K9633
3425D72530j9851l7172r7595j28713J25207J9567m794m9590l7253L6030k4207
3414B54159L3618J01968j09729L3509J5718J8303K5131l6614J29078P6291m0478
3403E00954n0731J8423n8755q606r3874p7582j45N3880O2067N2427K6454m0217
3391C84295j32289R026j9011R7206K286n14M2791q3225k0847O5769l6694p2868
3379B35925L935P6158K3510L548L8505j9607n1782J0919K9453j3029k6335p8682
$$ y = [495287, 472992, 455502, 451092, 469263, 482355, 474483, 486983, 547049, 430499, 318879, 385076, 409484, 313387, 396035, 436931, 466334, 410203, 463376, 461900, 436526, 390488, 458516, 486052, 470956, 423372, 361451, 424938, 288635, 406615, 462975, 454932, 434448, 446580, 444202, 442897, 472530, 452679, 415507, 317912, 189199, 314406, 333973, 329179, 279589, 242336, 278366, 254159, 287777, 389745, 280016, 313525, 329243, 347546, 372677, 336063, 465141, 541432, 500954, 450223, 468646, 409891, 401285, 307411, 229829, 229684, 283564, 345631, 398058, 424512, 384295, 252006, 261032, 242021, 339227, 341513, 340999, 383790, 300565, 279718, 345487, 308793, 235925, 239860, 316018, 339528, 343076, 381581, 361974, 310192, 321111, 350564, 337535, 311200, 232518]
3367B32518N9557L1510j7005J6628N9329m7867M3697J25410n4872n9853r787N899
3355C85164K1424k7013p2913K472R4148Q7185m0939p8571j9974J05849N0666j27827
3343C79671j1855P9479N7633O9600K4557L4479k7464r5650J8675O8215k803n1864
3331E42673K6690j5645k4730l2221P7456J1509k0949Q6672K4461o176N9536L6640
3319G65916r1367m4169N3790o2243J15447N4911j3420n4835j8527K8030K2247
3308G55780J0270j9277R6330j2968o967N9090k5647R4336J35474R2407K2299r8487
3296A102640p5949N868o511r1396r603L8297j68903N831N9085K9903Q8474L9953
3284A017689m2215j6570R9913P7676n8762k3716k2809j20095J48730p4745j30961
$$ y = [232518, 292075, 323585, 306580, 323208, 382537, 334670, 378367, 503777, 448905, 389052, 379265, 385164, 406588, 379575, 306662, 309134, 403282, 490467, 449528, 370957, 350983, 456832, 507498, 379671, 367816, 447295, 504928, 574528, 599085, 633564, 606100, 510450, 529125, 597340, 594537, 542673, 569363, 553718, 528988, 496767, 574223, 585732, 564783, 651455, 675916, 669740, 729276, 765916, 674549, 630380, 684170, 621927, 737374, 792285, 778865, 724030, 705503, 733533, 755780, 766050, 746773, 843103, 830135, 823168, 882258, 856611, 950947, 1086421, 1178828, 1201127, 1102640, 1026691, 1032559, 1026048, 934652, 925049, 963346, 794443, 800274, 859359, 889262, 977736, 1017689, 975474, 958904, 1058817, 1136493, 1077731, 1054015, 1031206, 911111, 1059841, 985096, 854135]
3273H54135M6674k0752q5705Q7645J10954M5360J3810o4604Q6475L9534k281q252
3261A102993L9115P3641L0269J436k0096p931O7216k1679R3673J35406M4902R6152
3249A635097R685l4815n565Q2636J17131p9732j48754M4870J37232K275j15702
3238A644358P817o1534J6568l2312L721q661k754P1404k3666M1896M2596o3282
3226A636151J15576J21516Q6686M2037J00202O9438R8321J98547J13193J17871
3216B699538J75863m7050j34979j88805k10148k05007j05951j03091j22277j7011
3206A741082l4235L1649l6554J05408j19621j29901j4981M781n0822j0714l0750
3195A455342k0137L8014L8201J60990j61552L4825q1409N8940Q6472k2640k2687
$$ y = [854135, 900809, 880057, 794352, 881997, 992951, 1038311, 1052121, 987517, 1073992, 1113526, 1111245, 1102993, 1142108, 1215749, 1246018, 1247454, 1227358, 1219427, 1286643, 1264964, 1358637, 1494043, 1538945, 1635097, 1644782, 1609967, 1604402, 1687038, 1804169, 1724437, 1575683, 1620553, 1757785, 1760060, 1644358, 1652175, 1590641, 1607209, 1574897, 1578618, 1569957, 1567203, 1638607, 1614941, 1656837, 1699433, 1636151, 1751727, 1873243, 1959929, 2001966, 2102168, 2171606, 2269927, 2468474, 2581667, 2699538, 2875401, 2828351, 2693372, 2504567, 2294419, 2089412, 1983461, 1880370, 1758093, 1741082, 1706847, 1738496, 1701942, 1807350, 1687729, 1557828, 1542847, 1547628, 1496806, 1486092, 1455342, 1435205, 1473219, 1511420, 1672410, 1510858, 1545683, 1464274, 1523214, 1609686, 1587046, 1564359]
3184A564359q7894R517P1623j81782j25476n0145q1094r7095n2895L8392K1362
3173A028872r6938p0734K4628J2262p4492n4295O6081r5040n7258J873n2722M002
3161F36239l2314r5113k0025n7870O6709j3354j5272m6852P3801r134j79662L5307
3149C42460L8758K1351k2240q8990o2506n6837J10558k601l18k6258O608l2039
3137B27946j8737O095R311r5967O0475l4906P912L9002P7744l2116j24835n2712
3125F9212J30830l5343P1969M671q6326M3032j05383R1579M4077k3708n3810p4063
3113G6737J20514L1028q6686n7063M156O5477k9516n248n6832N1814N8821m5604
3101A27598l7504q116j9112L3026P5059j42334P5184k8583l539R179j05041N5273
$$ y = [1564359, 1476465, 1485982, 1557605, 1375823, 1250347, 1200202, 1119108, 1022013, 969118, 1007510, 1028872, 931934, 861200, 885828, 898090, 823598, 769303, 835384, 740344, 683086, 684959, 632237, 636239, 603925, 508812, 488787, 430917, 497626, 484272, 469000, 422148, 495949, 486815, 307153, 342460, 381218, 402569, 380329, 291339, 228833, 171996, 282554, 279953, 279635, 253377, 259985, 227946, 209209, 215304, 224615, 128648, 189123, 154217, 162129, 201131, 278875, 246759, 121924, 69212, 200042, 164699, 236668, 241339, 155013, 198045, 92662, 184241, 228318, 204610, 150800, 76737, 197251, 228279, 141593, 84530, 88686, 154163, 124647, 119399, 62567, 114381, 173202, 127598, 90094, 81978, 62866, 95892, 170951, 28617, 103801, 75218, 71679, 80858, -24183, 31090]
3089C1090m6002M8740O560J9442j5312L7377P3761o1310q5049o117l8889r4732
3077a30441N4859J33560o0416K5876K2227o729n734K6414l1658k7144M2705O7003
3065A10522N67k6984p8021p5921M0798l5837k332J1920K6675j7245n7336J61964
3053E8770l8313l1744p915o8845J6750N148l5598m9417m8039R7488O1965J8161
3041b1589p1845p441L8907J34235j0895q2948N0017r5679m8933P2133P6934l9285
3029f389l5065Q105p720R038p1987J33067P4311n8996o08q6265M2247K6389k8761
3016b634O9179o4958O8750j4560m2055P0228k1766o2006m6896L3470M0733J14099
3004A41584j03832M353o6468N0911m0916L8964L8376j8546J1429l1327j02171
$$ y = [31090, -14912, 33828, 40388, 59830, 44518, 81895, 155656, 94346, 9297, 3180, -35709, -130441, -75582, 57978, -2438, 23438, 45665, 38936, 33202, 59616, 27958, 814, 43519, 110522, 111089, 84105, 6084, -69837, -29039, -64876, -67208, -55288, -28613, -45858, -103194, 58770, 20457, -11287, -19202, -88047, -71297, -66149, -101747, -151164, -199203, -101715, -39750, -21589, -93434, -100875, -61968, 72267, 61372, -21576, 28441, -67238, -116171, -44038, 32896, -6389, -41454, -33349, -41069, -32031, -104018, 29049, 103360, 44364, 43756, -42509, -262, 26127, -2634, 66545, 1587, 70337, 55777, 13722, 83950, 62184, 178, -46718, -13248, 27485, 141584, 37752, 42105, -24363, 26548, -14368, 24596, 62972, 44426, 55855, 24528, -77643]
2993g7643j4978O5834M1496O4007j11773l8332O9759R4981Q1548J9427j22696
2982G1630m6200o0838O1289J42731j10572o1899j4670j0533N1960J9920j6133
2971B6685n0014j038J08543l6694J8196K633k3688j5588Q4421k1358j14676J14020
2959I1442L5939o2632p089J65117o4730J1922m5082J13917j19045P82J00825o0186
2947A61180k0375j02895n2620Q6110L3035l2869N7225L4573j0912L9965J0968
2936B03385J367L6179m8130R111j1002N6697J2334L3631n2513L8983Q6763k3466
2924C43339o4763l460J350J3325r8582j3495J7169o7484L8686O4370l1994l6859
2912A61602N8826J7844l3070J0234L8376q1763n5556K1388L9531l372J8380j2948
$$ y = [-77643, -92621, -26787, 14709, 78716, -33057, -71389, -1630, 93351, 174899, 194326, 71630, 25430, -35408, 25881, 168612, 58040, -3859, -18529, -29062, 22898, 42818, 26685, -23329, -24367, 84176, 47482, 65678, 68311, 44623, 29035, 113456, 92098, -22578, 91442, 127381, 64749, 57660, 222777, 158047, 169969, 124887, 238804, 119759, 120541, 221366, 161180, 140805, 37910, -14710, 71400, 104435, 71566, 128791, 163364, 152452, 192417, 203385, 204752, 240931, 192801, 201912, 190910, 247607, 259941, 293572, 241059, 280042, 366805, 343339, 278576, 275116, 276466, 289791, 191209, 177714, 194883, 127399, 166085, 230455, 198461, 161602, 220428, 238272, 205202, 215436, 253812, 172049, 116493, 137881, 177412, 174040, 192420, 179472]
2900A79472q4479J10553J5803p8015L9146O8351m361o1353L1249Q1616m4659K4282
2888B77605k1322j00851n696M2070p791J1212p1790P1495K4140j8760m7033Q653
2876A61932n4114o5660J2613o0946k0566L7668N3321m7100o0388J4280K1630N0885
2864D3555R8889n0105p4103L2852N0875N9507m7987k9698p1723M6394j8954o534
2852C2968j1999l0549k2345l1336J10294P9273q3830n0333K0031n4822k0884R0014
2840B6482p620j01632J625n174O7755p9200N7059J4272k1143j9257j01631j0581
2828a79045J63912Q1326N977r8574j34153M7498o7446l749K1572K9445L6605k4354
2816a20986O5432r105J39068j19817J1682K4835L0489r5172m2835o408P2075J10268
$$ y = [179472, 94993, 205546, 221349, 143334, 182480, 250831, 246470, 185117, 216366, 297982, 253323, 277605, 256283, 155432, 149736, 191806, 184015, 195227, 123437, 194932, 219072, 200312, 153279, 161932, 107818, 42158, 54771, -6175, -26741, 10927, 64248, 17148, -43240, -28960, -7330, 43555, 142444, 92339, 18236, 51088, 101963, 161470, 113483, 83785, 12062, 58456, 39502, 32968, 20969, -9580, -31925, -63261, 47033, 126306, 42476, -7857, 12174, -42648, -63532, 26482, 18862, -82770, -81145, -86319, -18564, -97764, -40705, -26433, -47576, -66833, -168464, -179045, -15133, 66193, 72170, -26404, -160557, -113059, -180505, -184254, -162682, -133237, -96632, -120986, -55554, -64659, 74409, -45408, -33726, -8891, 21598, -73574, -116409, -122817, -50742, 59526]
2804E9526q9002k350k437q763L4671m0363k0905M9652Q0519j39675o8577J71771
2792B4067m1692o5374M2533M7882q4347j8642q900J3122n0914j0943J51053p7726
2780g9881j36458J65673P629r0750J2574k5806J4075O9808n8116Q2830J12357
2769G3935j02527L8696J1952j672p1468k5159N7443K7054j5792p1889j08243K3557
2757a64113l4677J26422O7734j12701N1895O6284r2829l3635M0517l0450R9172
2746a6381l1777p1400L6844N4315K4391M1348m8110k5679J03643O0542m6765l4821
2734D6150M913k4517j02612K532J6451N167N0041q9625l1208k9857N2988M4125
2722e5452M7798J794k14883O9975Q9531n8624q230R7341l916k8564k0201n282
$$ y = [59526, -29476, -31826, -34263, -43026, -8355, -48718, -69623, -19971, 60548, -79127, -147704, 24067, -17625, -82999, -40466, 7416, -76931, -95573, -104473, -91351, -142265, -153208, -2155, -79881, -216339, -50666, -43037, -133787, -121213, -147019, -132944, -63136, -121252, -38422, 73935, -28592, 10104, 22056, 20384, -51084, -76243, -18800, 8254, -7538, -79427, -187670, -164113, -198790, -72368, -4634, -117335, -65440, 844, -91985, -125620, -85103, -115553, -16381, -48158, -119558, -82714, -28399, -4008, 37340, -10770, -36449, 67194, 127736, 80971, 46150, 51063, 26546, -76066, -73534, -57083, -51916, -1875, -91500, -122708, -152565, -99577, -55452, -7654, -5860, -220743, -150768, -61237, -119861, -128091, -30750, -34666, -63230, -83431, -88713]
2710h8713J6680K6035n9406J6103K4659N0675k2873j5876j4612Q691J171J411
2698e6055J4051k125l4891L8728k5810N2260j43193k315J44679J99049J05792
2687B90170r5525m1887o5714j5073o5334j2495j3465N0522m0182j490o1224L2500
2675c9197j01487j9868J29981n2437N9794m3834j2904l066O8724p6639L3163q6397
2663a44167J4908P5947K8062O887K9943O1671j33949J8923m0078r385M646j7724
2651a04316J8045j698Q4687N6550j19503N1824P7459j45800m2156Q3888o5146
2640a06166J69770O1572j30534J2664l9199j08503j9098J7507P7103n887j209
2629g1980O325M0872j2166P4936K815j24004Q8359q642K7074O9229k2899k223
$$ y = [-88713, -72033, -45998, -105404, -89301, -64642, -13967, -36840, -52716, -67328, -58637, -57466, -56055, -42004, -44129, -79020, -40292, -66102, -13842, -157035, -159350, -14671, 184378, 290170, 194645, 152758, 87044, 71971, 6637, -5858, -19323, 31199, -8983, -10473, -71697, -39197, -140684, -160552, -30571, -83008, -23214, -67048, -79952, -83018, -14294, -90933, -57770, -144167, -129259, -53312, -25250, -18363, 11580, 73251, -60698, -41775, -81853, -91238, -86592, -104316, -86271, -87969, -3282, 53268, -66235, -14411, 63048, -82752, -124908, -41020, -106166, 63604, 125176, -5358, 7306, -31893, -140396, -159494, -141987, -64884, -70771, -71980, -65655, -24783, -36949, 37987, 40802, -83202, 5157, -3485, 23589, 92818, 69919, 67696]
2617F7696j13988N8940j06045Q3505O3327j02835L8001n1569m9939Q9000J2737
2606a1170n0798J312l920K7717J3750k5018l677M6198M709M914M2716o7479j0975
2593c1721o3433P350j0416O0080M3582j8920K5578J3369N0372L9139o0326J498
2581E6152p7202J21518l5540O487k3237k4408K6070L8286l4642l8787q803K1604
2569B7498J01352j05679J2709K6049M6082p2049m3224l5380R0522O0717j3414
2558I5183j59625O2637L9086K1186n2450L8916n3233k2893N1068k4268M3261K8261
2546F7129N8878o0668j03379L4459p4378J11174Q3006n9380o2642J30850j158
2535A23891j21980j2267J11923K8379m6897Q4667K8768r8932j20242M3382l9738
$$ y = [67696, -46292, 12648, -93397, -9892, 53435, -49400, -11399, -62968, -112907, -23907, -11170, -61968, -60656, -64576, -36859, -23109, -48127, -51804, -5606, -897, 4017, 46733, -20746, -31721, -95154, -87804, -98220, -38140, 5442, -13478, 12100, 25469, 75841, 114980, 54654, 56152, -21050, 100468, 64928, 71415, 48178, 23770, 49840, 88126, 53484, 14697, 5894, 27498, 128850, 23171, 35880, 61929, 108011, 35962, -7262, -42642, 47880, 108597, 95183, -64442, -1805, 37281, 58467, 6017, 44933, -8300, -31193, 19875, -4393, 38868, 67129, 126007, 65339, -38040, -3581, -77959, 33215, 116221, 56841, -5801, 125049, 123891, 1911, -10356, 101567, 129946, 83049, 167716, 196484, 97552, -22690, 20692, -19046]
2524a9046P4077L9720M727q414j0812L8296N383Q5984j7744r6916j351J07990
2512B01894p6564m1475M3148N8266J4655o0851P2277R7831N1286q4146m5878j5975
2500B14468M9262M5426R2622n657m4823Q6461o0978n1336J9445O5662j0353p848
2488C92351J316l7773O9195L3250Q5608L7150j26918N0363R6559q306L8738k9865
2476F01668j12147m7389p184K02379M2811k9240O3910L1923J1545L1874L1001
2465H21151Q1084N8590l1273K0078K4802O5579O1816N8523N5602K6322N9202O4977
2453A366453j6491J65247J08399p1354M7342j5220J79197J02278N8929J44403
2443B069183j2920K01820J37936L8650K43866J88165K33599L71339L80518K96037
$$ y = [-19046, 55031, 94751, 99478, 91064, 80252, 118548, 123931, 209915, 192171, 95255, 93904, 201894, 125330, 83855, 127003, 185269, 199924, 139073, 211350, 309181, 360467, 276321, 230443, 214468, 263730, 309156, 401778, 396121, 351298, 437759, 376781, 325445, 344890, 410552, 400199, 392351, 393667, 355894, 425089, 458339, 543947, 581097, 454179, 504542, 601101, 592795, 631533, 601668, 489521, 442132, 434948, 637327, 680138, 650898, 714808, 746731, 758276, 790150, 821151, 902235, 960825, 929552, 949630, 974432, 1040011, 1101827, 1160350, 1215952, 1242274, 1301476, 1366453, 1349962, 1515209, 1623608, 1552254, 1599596, 1584376, 1763573, 1865851, 1924780, 2069183, 2056263, 2258083, 2396019, 2434669, 2678535, 2866700, 3100299, 3471638, 3852156, 4148193]
2433D148193J73310J39813L20630N49443M73095P19242P84429J102314J334794
2424I745263J771699K127841L104676L898807N130371K974977j530343m702088
2416B2521203n260047l709657k653207j809690j538290j088850q90960o89214
2408D881288m40129l65501k27822j90971m6319k00216l03432j30279k20117k10007
2398B546495k91207j44628j31975l7944j62862o3256j48670n5708p0166O5267
2388A505346j19338j14753j08746j3198J488j1241M1947j58881M6637q041j82967
2377H78253o8711P7316j05603j08623j5859O1379K0685M8203n2556n9067j86516
2366D88901L4175K5469L685M721o0626q0508m2887n4888O8358M0726p2307O2022
$$ y = [4148193, 4321503, 4461316, 4781946, 5331389, 5804484, 6523726, 7308155, 8410469, 9745263, 11516962, 13644803, 16749479, 20648286, 25778657, 28753634, 27223291, 22521203, 17261156, 13551499, 10898292, 9088602, 7550312, 6461462, 5570502, 4881288, 4441159, 4075658, 3847836, 3656865, 3610546, 3410330, 3106898, 2976619, 2756502, 2546495, 2255288, 2110660, 1978685, 1940741, 1777879, 1714623, 1565953, 1510245, 1440079, 1505346, 1386008, 1271255, 1162509, 1149311, 1150799, 1139558, 1181505, 1022624, 1069261, 1061220, 878253, 809542, 886858, 781255, 672632, 656773, 718152, 738837, 787040, 734484, 675417, 488901, 523076, 548545, 552230, 556951, 496325, 415817, 372930, 318042, 386400, 427126, 354819, 416841]
2354D16841j24595O4441O4426l8784m7111r39n0327l9678j09366q411m53Q5073
2342B11117P713j712N7903K8666l2687J5771r4478Q9333L9240j67023o4527m148
2330H5168O4450n9310O2453o4961N9844L4855m2823r715j0199o2874l7120K4325
2318D4093O1122P7788m4927j31156N3719O4646j2110P6272j04940l1415o9191
2307a6099J1418O1270O6937k8317p947k440r733o8773l7365M5464P3782j8667
2295F9530j42522R6184M6914K1559k6000M560m831r142L645J53753L9773j83741
2283F9682p8110q0811K1744K42551N1232j07072j71250M9311O1946j7016O1820
2272A04027n5831j23992J13318o5544J7711K5457M141m1241m3662k5632J19684
$$ y = [416841, 292246, 356687, 421113, 382329, 335218, 334279, 283952, 244274, 134908, 126497, 126044, 211117, 218830, 217118, 275021, 303687, 271000, 286771, 192293, 281626, 320866, 153843, 89316, 85168, 149618, 90308, 152761, 87800, 147644, 182499, 139676, 129961, 119762, 56888, 19768, 44093, 105215, 183003, 138076, 6920, 60639, 125285, 113175, 189447, 84507, 53092, -16099, -4681, 56589, 123526, 95209, 87262, 84822, 75089, 6316, -31049, 14415, 88197, 69530, -72992, 23192, 70106, 91665, 65665, 70225, 65394, 56252, 59897, 213650, 253423, 69682, -8428, -89239, -67495, 175056, 226288, 119216, -52034, -2723, 59223, 42207, 104027, 48196, -75796, 37522, -28022, -10311, 15146, 19287, -21954, -65616, -91248, 28436]
2261B8436L3075j05929l2355j4147J30001K8220q7673Q4464p4614p747O6088m8809
2249i90K1467k6617q067m8353J50870j0460p3901L0918l7139k7070M6277J2210
2237B9145P671p5902N9253O3359j23782m9085N586o6174N1325Q2176j6456J5943
2225a6941o0052K4547Q5387M3330p9424j3445J15796m3626k6494m4495M5672j0056
2213B0199J8304J1369l684r3788r513K6278R9826l3956O595j56314N5372J30409
2201G1097m6321p6330l923K4144M0634K5953L6458r4411O3887o14l4160J4476
2189B0890q7168K3321J11597O4299j68342j55242N6020M7782l4357J42627J0302
2178C1729k8264m2947N2036M1044R370p9404K1574l6203Q7827Q6616j01157p7337
$$ y = [28436, 61511, -44418, -76773, -90920, 39081, 67301, -20372, 64092, -10522, -18269, 47819, -990, 20477, -6140, -14207, -62560, 88310, 77850, 3949, 34867, -2272, -29342, 16935, 29145, 36816, -39086, 20167, 83526, -40256, -89341, -83755, -149929, -98604, -16428, -32884, -16941, -76993, -52446, 32941, 76271, -3153, -16598, 99198, 55572, 29078, -15417, 30255, 20199, 38503, 49872, 46188, -47600, -57113, -30835, 68991, 35035, 41630, -114684, -59312, 71097, 24776, -51554, -55477, -31333, 9301, 35254, 71712, -22699, 41188, 40574, 6414, 20890, -66278, -42957, 68640, 132939, -35403, -190645, -134625, -86843, -121200, 21427, 31729, 3465, -39482, 12554, 53598, 62968, -16436, 5138, -31065, 56762, 143378, 42221, -35116]
2166c5116P486K2192j0309j27465Q494J10845J07371k6625j5614j45513M228n9931
2154a59957M7432J98276n6978R592l4436J5179J6186j42933P7858o8408k5211
2143a23400P6065k098L2571j3943J13793q7696k9996n3630L94J31235k1547o4060
2131d2312L2349n753P3793k531q0606J0934L8772J046p0544R0710q5154J9778
2119a9518J56427j03291k0294P2837n6586r5616j790l6538R9863J19546m3819
2108G1221j05468Q714Q6964p1699n3880N6827m4651j30231N0573J0038N2487q873
2096g7978p558N0412l1581p4389J15342o6309q0178O1943M4561M828k396n4307
2084a17610m4784L585N1516M6912r7291O8095j1543O3860P9266m179K4781q4535
$$ y = [-35116, -27630, -5438, -15747, -143212, -134718, -23873, 83498, 56873, 41259, -104254, -100026, -159957, -112525, 85751, 28773, 38365, 3929, 19108, 35294, -107639, -29781, -98189, -123400, -47335, -49433, -16862, -30805, 82988, -4708, -34704, -88334, -87940, 43295, 21748, -42312, -9963, -15716, 58077, 55546, -25060, -14126, 24646, 25692, -44852, 45858, -39296, -19518, 136909, 33618, 13324, 86161, 29575, -66041, -67831, -104369, -4506, 115040, 71221, -34247, -25533, 61431, -10268, -64148, -7321, -51972, -182203, -131630, -121592, -69105, -77978, -85536, -35124, -66705, -141094, -25752, -92061, -172239, -110296, -65735, -60907, -63303, -117610, -162394, -158809, -107293, -60381, -157672, -89577, -101120, -37260, 42006, 37827, 62608, -21927]
2072b1927k5036n6082m1808J06685L5392M878n0607r1103q9912K8677R2477Q0002
2060b8364m3876l7454q1529O2661J07333j2007j4162O4197P582Q2618o1821r2338
2048d7160O6060K448j02250m0572M3790J4790L5522j7296M0503m2894p6241J18725
2036d575k4380j14376L304R2334r536J16809O7779o5248Q0927j47171n2050K2485
2024c3698J4635p7573l0611R3158M5918j92661J68732J35200q8814j23433Q8781
2013c66J18184j07767Q258l2483M5397R4339m3875j54518M641k3562K1748l9834
2001a09838R82K6843M3088N728L243j8709K4731p7010q704J38997n5811j8229
1989d4689M9887p7244k4634l8296J17076J9347Q849L7512K4590n2219n2521O8629
$$ y = [-21927, -46963, -103045, -144853, -38168, -2776, 2102, -48505, -139608, -229520, -200843, -108366, -28364, -72240, -109694, -191223, -128562, -21229, -33236, -47398, 16799, 24381, 106999, 45178, -47160, 18900, 21348, -80902, -121474, -77684, -62894, -27372, -44668, -4165, -47059, -123300, -4575, -28955, -143331, -140027, -47693, -57229, 59580, 127359, 62111, 143038, -4133, -56183, -33698, -19063, -96636, -127247, -34089, 11829, -180832, -12100, 123100, 34286, -89147, -366, 117818, 10051, 18309, -14174, 31223, 125562, 81687, -72831, -68190, -91752, -70004, -109838, -108856, -82013, -38925, -33197, -29954, -48663, -23932, -100942, -109646, 29351, -26460, -44689, 5198, -72046, -96680, -134976, -17900, 1447, 10296, 47808, 72398, 20179, -32342, 36287]
1977C6287P3288j69947p5923K6974k021l1150Q3428j388L8835J19606r4563R7931
1965A01357o8528P34n8110r4026R8569m970l6896Q4897j9112n7508P3494j7025
1953B876k27590O037J28098J06339q99j9070J585p5830k9013R9617N0572n1615
1941h893l7133L1059l9818J37721k6592q9181N4223j28891n0278Q1843q2779J140
1929a57579M4506l7840L1552M3881K1269L9232L1022k5795J08306n6064j14220
1918g1730l6799K0617m729j5954N9910P4547J4050p6021J04557j35595k6046K4026
1906f9167k2768R2512O6771j00392o7340N0650L7490N1105n6652m2123o031L7687
1894b8258j4983l8593j1424J1898j2260K6891N6146o4650l6725L8742o4901M1409
$$ y = [36287, 109575, -60372, -136295, -109321, -111342, -142492, -59064, -60452, -21617, 97989, 3426, 101357, 32829, 33563, -24547, -118573, -20004, -24974, -61870, 23027, 3915, -53593, 19901, 2876, -224714, -218677, -90579, 15760, 14861, -4209, -2624, -78454, -107467, -7850, 42722, -8893, -46026, -14967, -54785, 82936, 56344, -32837, 21386, -107505, -157783, -75940, -158719, -157579, -113073, -150913, -119361, -75480, -54211, -14979, 16043, -9752, 98554, 42490, -71730, -108529, -87912, -92641, -108595, -48685, 25862, 39912, -36109, 68448, -67147, -93193, -69167, -91935, 577, 67348, -33044, -100384, -49734, -12244, 38861, -17791, -59914, -65945, -28258, -43241, -81834, -93258, -81360, -93620, -66729, -10583, -75233, -111958, -73216, -138117, -96708]
1882i6708O9465j2514J9645q1374J714K2380O271O5701N175n6786k0386j8475
1870i5892J9299J24521j1693q2423r0379K4286J25336K0786N016q5668O4532m2434
1858b4713L1410j2802q3338L2096J9504K8449m5715J15667r3814j3289Q1587J3430
1846D8472K56l6087L464K7749k8872m2416k4572K5299P3652p7127p074R7772J1751
1833G2267n2291o598P2781j32990R074n1079Q1755N7779j57559k7285K3336O5188
1821d5622K8666m2277l879o315l8263N662k019P1465m0681m6187O8002k3844j4924
1808i0216R9146N3030j8160N0110l2798l5341R306o3957M0670q5964m565K9327
1796d9412P4037n1194Q244M5205j03348L1431P40R062N7420L1658j152m4852j19374
$$ y = [-96708, -27243, -39757, -20112, -101486, -99772, -77392, -71121, -5420, -245, -57031, -77417, -95892, -76593, 47928, 36235, -46188, -136567, -112281, 13055, 33841, 38857, -46811, 17721, -24713, 6697, -6105, -89443, -57347, -37843, -9394, -55109, 60558, -33256, -46545, 35042, 48472, 48728, 12641, 16105, 43854, 14982, -27434, -52006, -26707, 46945, -30182, -37256, 60516, 72267, 19976, 13378, 86159, -46831, -37757, -88836, -7081, 50698, -106861, -134146, -110810, -45622, -16956, -59233, -63112, -69427, -107690, -102028, -104047, -32582, -73263, -119450, -51448, -75292, -90216, 8930, 61960, 43800, 93910, 61112, 25771, 35077, -28880, 11790, -74174, -78739, -49412, 24625, -26569, -18325, 26880, -76468, -45037, -44297, -35235, 22185, 53843, 52691, 7839, -111535]
1783a11535k3390Q7572R5166J1842k8255m0913j2937K7554M8995n6815q114p8416
$$ y = [-111535, -134925, -47353, 47813, 59655, 31400, -9513, -22450, 5104, 54099, -2716, -10830, -89246]
$$ [...]
##END NTUPLES=NMR SPECTRUM
##END=
