##TITLE=1H_CA-9213-2
 CDCl3
 8 sc, 
 1.12.2023
##JCAMPDX= 6.0         $$ Bruker NMR JCAMP-DX V2.0
##DATA TYPE= NMR SPECTRUM
##DATA CLASS= NTUPLES
##ORIGIN= UXNMR, Bruker Analytische Messtechnik GmbH
##OWNER= root
$$ XWIN-NMR		Version 3.5
$$ Fri Dec  1 14:08:08 2023 Russian Standard Time (UT+4h)  she@DPX200
##.OBSERVE FREQUENCY= 200.1313
##.OBSERVE NUCLEUS= ^1H
##.ACQUISITION MODE= SIMULTANEOUS
##.ACQUISITION SCHEME= undefined
##.AVERAGES= 8
##.DIGITISER RES= 18
##SPECTROMETER/DATA SYSTEM= spect
##.PULSE SEQUENCE= zg30
##.SOLVENT NAME= CDCl3
##.SHIFT REFERENCE= (INTERNAL, CDCl3, 0, 15.4637)
##AUDIT TRAIL= $$ (NUMBER, WHEN, WHO, WHERE, WHAT)
$$ ##TITLE= Audit trail, XWIN-NMR		Version 3.5
$$ ##JCAMPDX= 5.01
$$ ##ORIGIN= Bruker BioSpin GmbH
$$ ##OWNER= she
$$ F:/spectra/data/she/nmr/H-F/1/pdata/1/auditp.txt
$$ ##AUDIT TRAIL=  $$ (NUMBER, WHEN, WHO, WHERE, WHAT)
(   1,<2023-12-01 14:06:45.06 +0400>,<she>,<DPX200>,
      <created by zg, POWCHK disabled, PULCHK disabled
       configuration hash MD5:
       00 E9 B6 7A A2 85 ED C7 34 08 36 98 17 FE 4E 26
       data hash MD5: 16K
       CE FD C6 47 AD CC 72 BA D6 18 83 56 7A 5A FC 95>)
(   2,<2023-12-01 14:06:47.34 +0400>,<she>,<DPX200>,
      <Start of raw data processing
       efp BC_mod = 2 LB = 0.24 FT_mod = 6 PKNL = 1 PHC0 = -24500.44 PHC1 = 9.65271 SI = 16K 
       data hash MD5: 16K
       57 FC AE CA 82 3A 39 2C EB 97 F0 4B E2 6A 31 0E>)
(   3,<2023-12-01 14:07:04.03 +0400>,<she>,<DPX200>,
      <pk PHC0 = -89.1777 PHC1 = 0 
       data hash MD5: 16K
       75 27 3D 09 54 5A FF 2C F3 5B 53 B4 8D 07 A7 B0>)
(   4,<2023-12-01 14:07:20.85 +0400>,<she>,<DPX200>,
      <pk PHC0 = 1.467657 PHC1 = -2.4 
       data hash MD5: 16K
       61 BD 14 8C 80 63 93 85 CE ED 2D C6 0D 9A 60 04>)
(   5,<2023-12-01 14:07:24.26 +0400>,<she>,<DPX200>,
      <abs ABSG = 5 
       data hash MD5: 16K
       C6 B6 67 D9 B4 95 96 ED 8B 27 7B D0 FF 96 F9 FD>)
$$ ##END=
$$ 
$$ hash MD5
$$ B5 41 16 17 7F 99 41 56 98 34 87 9A EB 42 96 91
##$RELAX= 
##$RELAX= 
##$RELAX= 
##$RELAX= 
##$RELAX= 
##$RELAX= 
$$ Bruker specific parameters
$$ --------------------------
##$DU= <F:/spectra>
##$EXPNO= 1
##$NAME= <H-F>
##$PROCNO= 1
##$TYPE= <nmr>
##$USER= <she>
##$AMP= (0..31)
100 100 100 100 100 100 100 100 100 100 100 100 100 100 100 100 100 100 
100 100 100 100 100 100 100 100 100 100 100 100 100 100 
##$AQSEQ= 0
##$AQ_mod= 1
##$AUNM= <au_zg>
##$AUTOPOS= <>
##$BF1= 200.13
##$BF2= 200.13
##$BF3= 200.13
##$BF4= 200.13
##$BF5= 200.13
##$BF6= 200.13
##$BF7= 200.13
##$BF8= 200.13
##$BYTORDA= 1
##$CFDGTYP= 0
##$CFRGTYP= 5
##$CHEMSTR= <none>
##$CNST= (0..31)
1 1 145 1 1 1 1 1 1 1 1 1 1 1 1 1 1 1 1 1 1 1 1 1 1 1 1 1 1 1 1 1 
##$CPDPRG= <>
##$CPDPRG1= <>
##$CPDPRG2= <>
##$CPDPRG3= <>
##$CPDPRG4= <mlev>
##$CPDPRG5= <mlev>
##$CPDPRG6= <mlev>
##$CPDPRG7= <mlev>
##$CPDPRG8= <mlev>
##$CPDPRGB= <>
##$CPDPRGT= <>
##$D= (0..31)
0 1.2 0 0 0 0 0 0 0 0.06 0 0.03 0 0 0 0 0.0002 0 0 0 0 0 0 0 0 0 0 0 0 
0 0 0 
##$DATE= 1701425204
##$DBL= (0..7)
$$ [...]
##$SUBNAM3= <"">
##$SUBNAM4= <"">
##$SUBNAM5= <"">
##$SUBNAM6= <"">
##$SUBNAM7= <"">
##$SUBNAM8= <"">
##$SUBNAM9= <"">
##$SW= 18.0517328524113
##$SWIBOX= (0..15)
0 0 2 0 0 0 0 0 0 0 0 0 0 0 0 0 
##$SW_h= 3612.71676300578
##$TD= 16384
##$TD0= 1
##$TE= 0
##$TE2= 300
##$TE3= 300
##$TEG= 300
##$TL= (0..7)
0 120 120 120 120 120 120 120 
##$TP= (0..7)
150 150 150 150 150 150 150 150 
##$TP07= 0
##$TPNAME0= <>
##$TPNAME1= <>
##$TPNAME2= <>
##$TPNAME3= <>
##$TPNAME4= <>
##$TPNAME5= <>
##$TPNAME6= <>
##$TPNAME7= <>
##$TPOAL= (0..7)
0.5 0.5 0.5 0.5 0.5 0.5 0.5 0.5 
##$TPOFFS= (0..7)
0 0 0 0 0 0 0 0 
##$TUNHIN= 0
##$TUNHOUT= 0
##$TUNXOUT= 0
##$USERA1= <user>
##$USERA2= <user>
##$USERA3= <user>
##$USERA4= <user>
##$USERA5= <user>
##$V9= 5
##$VALIST= <valist>
##$VCLIST= <CCCCCCCCCCCCCCC>
##$VD= 0
##$VDLIST= <DDDDDDDDDDDDDDD>
##$VPLIST= <PPPPPPPPPPPPPPP>
##$VTLIST= <TTTTTTTTTTTTTTT>
##$WBST= 1024
##$WBSW= 4
##$XGAIN= (0..3)
0 0 0 0 
##$XL= 0
##$YL= 0
##$YMAX_a= 447139
##$YMIN_a= -529670
##$ZGOPTNS= <>
##$ZL1= 120
##$ZL2= 120
##$ZL3= 120
##$ZL4= 120
##$ABSF1= 15.78105
##$ABSF2= -2.270805
##$ABSG= 5
##$ABSL= 3
##$ALPHA= 0
##$AQORDER= 0
##$ASSFAC= 0
##$ASSFACI= 0
##$ASSFACX= 0
##$ASSWID= 0
##$AUNMP= <proc_1d>
##$AZFE= 0.1
##$AZFW= 0.1
##$BCFW= 0
##$BC_mod= 2
##$BYTORDP= 0
##$COROFFS= 0
##$CY= -3
##$DATMOD= 1
##$DC= 0
##$DFILT= <>
##$DTYPP= 0
##$F1P= 0
##$F2P= 0
##$FCOR= 1
##$FTSIZE= 16384
##$FT_mod= 6
##$GAMMA= 0
##$GB= 0
##$INTBC= 1
##$INTSCL= 3.70164e-10
##$ISEN= 128
##$LB= 0.24
##$LEV0= 0
##$LPBIN= 0
##$MAXI= 10000
##$MC2= 0
##$MEAN= 0
##$ME_mod= 0
##$MI= 1.114404
##$NCOEF= 0
##$NC_proc= -7
##$NLEV= 6
##$NOISF1= 3.799351
##$NOISF2= 2.8
##$NSP= 0
##$NTH_PI= 0
##$NZP= 0
##$OFFSET= 15.46373
##$PC= 1
##$PHC0= -24588.15
##$PHC1= 7.25271
##$PH_mod= 1
##$PKNL= yes
##$PPARMOD= 0
##$PSCAL= 0
##$PSIGN= 0
##$REVERSE= no
##$SF= 200.130011602574
##$SI= 16384
##$SIGF1= 3
##$SIGF2= 2
##$SINO= 5.538805
##$SIOLD= 16384
##$SREGLST= <1H.CDCl3>
##$SSB= 0
##$STSI= 16384
##$STSR= 0
##$SW_p= 3612.71676300578
##$SYMM= 0
##$S_DEV= 0
##$TDeff= 16384
##$TDoff= 0
##$TI= <>
##$TILT= no
##$TM1= 0
##$TM2= 0
##$TOPLEV= 0
##$USERP1= <user>
##$USERP2= <user>
##$USERP3= <user>
##$USERP4= <user>
##$USERP5= <user>
##$WDW= 1
##$XDIM= 16384
##$YMAX_p= 465940197
##$YMIN_p= -776878
$$ End of Bruker specific parameters
$$ ---------------------------------
##NTUPLES= NMR SPECTRUM
##VAR_NAME=  FREQUENCY,     SPECTRUM/REAL,   SPECTRUM/IMAG
##SYMBOL=    X,             R,               I
##VAR_TYPE=  INDEPENDENT,   DEPENDENT,       DEPENDENT
##VAR_FORM=  AFFN,          ASDF,            ASDF
##VAR_DIM=   16384,         16384,           16384
##UNITS=     HZ,            ARBITRARY UNITS, ARBITRARY UNITS
##FACTOR=    0.220516191357247, 1,           1
##FIRST=     3094.75643598035, 0,            0
##LAST=      -517.960327025431, 0,           0
##MIN=       -517.960327025431, -776878,     0
##MAX=       3094.75643598035, 465940197,    0
$$ Real data points
##PAGE= N=1
##DATA TABLE= (X++(R..R)), XYDATA
$$ [...]
6397C506524K5291N4510J44342j11779L4869O6288j4584k7418K8084l7163J07821
6386C776785J319r2868L6109J86508M0703k2460J40381k49315J1903O9333R0036
6375C988434n9267k24342K15255m5957n8702j66605O2134J37367O6467M1547j50833
6364C805498j45538Q9648J32176j813k96473p2838o0575R3838j2515J61061J40306
6353C832775J18179k56092J99647J42412k2131K9442j34373J44910q9161j87082
6343C778526q3818L22737J37880p1626o379k7404q7602j09058K49173K0866j00629
6332D022666j9810p6441K01063j27167M4352L9968j6056q1800r071J38874j78259
6321C938319M5183J48824J17339j44913j1354P2661q2083k53152q3927K28991
$$ plain form
6397 3506524 3531815 3586325 3730667 3618888 3653757 3720045 3705461 3678043 3706127 3668964 3776785
6386 3776785 3778104 3685236 3721345 3907853 3948556 3926096 4066477 3817162 3829065 3898398 3988434
6375 3988434 3929167 3704825 3920080 3874123 3815421 3648816 3710950 3848317 3914784 3956331 3805498
6364 3805498 3659960 3749608 3881784 3879971 3583498 3510660 3450085 3543923 3531408 3692469 3832775
6353 3832775 3950954 3694862 3894509 4036921 4014790 4044232 3909859 4054769 3965608 3778526
6343 3778526 3694708 4017445 4155325 4083699 4077320 4049916 3962314 3853256 4102429 4123295 4022666
6332 4022666 4002856 3926415 4127478 4000311 4044663 4084631 4068575 3986775 3977704 4116578 3938319
6321 3938319 3983502 4132326 4249665 4104752 4093398 4166059 4083976 3830824 3746897 3975888
6311C975888J44011j08313o9784J04464K36409N8795k05381j2556j60804q3458
6301C879271L50963J77268l50986m7688K42901m7338o5203k3815N7695P0793k5894
6290D217967J69334K8446j29784j33199R2247j8235J06237J62924L2638M9225
6280D577800O6841j25399p0293j05152J37167L00547Q8060n5511J38558K2160
6270D974778j03863j38296p0555K45120l1129l1730J9772m1482K28206O8091j8924
6259E099988k5505j33639n5796M6848P7567n5988k8171O0186j14830J37759j037
6248E007382L7558R5274K04956m9769j78388O7190P2036K7089j5211P6545L8946
6237E383608j7872l5597k20909m6174J5122j27673M02421j8551j80158o1277q3961
$$ plain form
6311 3975888 4119899 4011586 3941802 4046266 4282675 4341470 4136089 4123533 3962729 3879271
6301 3879271 4230234 4407502 4056516 4008828 4251729 4204391 4139188 4115373 4173068 4243861 4217967
6290 4217967 4387301 4415747 4285963 4152764 4245011 4226776 4333013 4495937 4528575 4577800
6280 4577800 4644641 4519242 4448949 4343797 4480964 4781511 4869571 4814060 4952618 4974778
6270 4974778 4870915 4732619 4662064 4907184 4876055 4844325 4864097 4822615 5050821 5118912 5099988
6259 5099988 5074483 4940844 4885048 4931896 5009463 4953475 4925304 4985490 4870660 5008419 5007382
6248 5007382 5044940 5140214 5345170 5295401 5117013 5184203 5256239 5283328 5268117 5344662 5383608
6237 5383608 5365736 5330139 5109230 5063056 5078178 4950505 5352926 5334375 5154217 5092940 5008979
6226E008979m173J09594O8499j69845l7514k3177o8981N2196M5912j83064k7959
6215D770467K09560l8657k040l3387q2770j32219J04020L3191N3387Q8712J1023
6204D981287j24617M7142K9484O4291L2465p0237l776J20604K1240j74375j28404
6193D795104M9477R0366J27458j1113K41672o8335j03121P5114o5998k2840m5473
6182E062311M5141O0104j7158k2802l0914j82987J41220J1261J5128J77274O573
6171E265151o3434K518l7271P3553k390L3450J52620L1527K9872j74888J25280
6160E435988J00501P3047j60192l8672m2880j93803J17395J24136J56627j11441
6150E460706K2591j14632j81541l1659L02568J98529J86938n9027k82434j4822
$$ plain form
6226 5008979 5004806 5114400 5182899 5013054 4975540 4952363 4883382 4935578 4981490 4798426 4770467
6215 4770467 4980027 4941370 4939330 4905943 4823173 4690954 4794974 4828165 4881552 4970264 4981287
6204 4981287 4856670 4903812 4933296 4997587 5030052 4959815 4956039 5076643 5097883 4923508 4795104
6193 4795104 4844581 4934947 5062405 5051292 5292964 5224629 5121508 5196622 5130624 5107784 5062311
6182 5062311 5107452 5167556 5150398 5127596 5096682 4913695 5054915 5066176 5081304 5258578 5265151
6171 5265151 5201717 5204235 5166964 5240517 5238127 5271577 5424197 5455724 5485596 5310708 5435988
6160 5435988 5536489 5609536 5449344 5410672 5367792 5173989 5291384 5415520 5572147 5460706
6150 5460706 5483297 5368665 5187124 5155465 5458033 5656562 5843500 5784473 5502039 5487217
6140E487217O3146N9268J07093k48982J26165j1076J39733o1924k14551m1459
6130E404630J9857J46857l0100Q3610L10078r3982O9355J31442J06493M697j78183
6119E974754k07612J72127J85161N2707n2091j3970J38075R6737L2669J60298
6109F538855N0980k70481l2431K07796J10335J7292J42760j29242k8399o3391
6099F544074L12895J15364N0997k83933J37256J20410J94789k6035J26055K71451
6089G563323r0797P3672k69755J71857J90114J20542J26856P5136J82743M363
6079H148054Q253p9853O878J34002r1912O136K63561K42232R0110R8741O9858
6068H896060m616J44293J11631K04031K3737j1614J39194P3744K42041J46088
$$ plain form
6140 5487217 5550363 5609631 5716724 5467742 5593907 5582831 5722564 5660640 5446089 5404630
6130 5404630 5424487 5571344 5541244 5624854 5934932 5840950 5910305 6041747 6148240 6152937 5974754
6119 5974754 5767142 5939269 6124430 6177137 6125046 6111076 6249151 6345888 6378557 6538855
6109 6538855 6589835 6319354 6286923 6494719 6605054 6622346 6765106 6635864 6607465 6544074
6099 6544074 6856969 6972333 7023330 6739397 6876653 6997063 7191852 7165817 7291872 7563323
6089 7563323 7472526 7546198 7276443 7448300 7638414 7758956 7885812 7960948 8143691 8148054
6079 8148054 8156307 8076454 8083332 8217334 8125422 8131558 8395119 8637351 8727461 8826202 8896060
6068 8896060 8891444 9035737 9147368 9351399 9375136 9363522 9502716 9576460 9818501 9964589
6058I964589J12722J56819J91532M20130j2894M7908J45215R0886K17006K51195
6048A1585108o1433J60503K18650M20497K74276L68555N06941K16664L59585N90438
6038A4639784L72372M23108M43397M13070L53331J0399J09438j2266q7997J68857
6028A6833493Q282j96601P4704J04265K20747L30277K80138J15204K9242L01052
6018A8100803L26604L04286K50977M08818M36899K98287N74797L63140N09521
6009B1574132N35331O81941O62998Q48296P08977P41082Q49251R68740Q04800
6000B8375548O86025N31055K39072M36677M84150K46033K93258L30388N59437
5991C2181643N76807M27661Q22946Q62181R39378R45192J212361J288818J598651
$$ plain form
6058 9964589 10077311 10234130 10425662 10845792 10832898 10880806 11026021 11116907 11333913 11585108
6048 11585108 11523675 11684178 11902828 12323325 12597601 12966156 13473097 13689761 14049346 14639784
6038 14639784 15012156 15435264 15878661 16291731 16645062 16655461 16764899 16752633 16664636 16833493
6028 16833493 16841775 16645174 16719878 16824143 17044890 17375167 17655305 17770509 17799751 18100803
6018 18100803 18427407 18731693 18982670 19391488 19828387 20126674 20701471 21064611 21574132
6009 21574132 22109463 22791404 23454402 24302698 25011675 25752757 26602008 27570748 28375548
6000 28375548 29061573 29592628 29831700 30268377 30752527 30998560 31291818 31622206 32181643
5991 32181643 32758450 33186111 34009057 34871238 35810616 36755808 37968169 39256987 40855638
5982D0855638J796379J792413J948521K354459K740285K790123L401614L770857
5974F1450289M121126M226153M830914M950106M473833L862885K355841Q24784
5966I1095931k99017j219308r81058q47210k27131N44040J247153J966588K633948
5957I3913936L470783L784698L805842L637575K822004J186055j9324o81663r64545
5948A10955361o55989J37050J128008K112453L302256M559010N630964O792248
5940A33961361Q487898R478541J0337278J0344747R392787P131916L374969j314910
5932A91194587o276887j0260465j2942361j4167128j4154824j2838295j1606872
5925A08947755r762601q400479p074305n892536n131335m574887l913606l169677
$$ plain form
5982 40855638 42652017 44444430 46392951 48747410 51487695 54277818 57679432 61450289
5974 61450289 65571415 69797568 74628482 79578588 84052421 87915306 90271147 91095931
5966 91095931 90796914 89577606 88596548 87749338 87522207 88066247 89313400 91279988 93913936
5957 93913936 97384719 101169417 104975259 108612834 111434838 112620893 112601569 111919906 110955361
5948 110955361 110299372 110436422 111564430 113676883 116979139 121538149 127169113 133961361
5940 133961361 142449259 151927800 162265078 172609825 182002612 189134528 192509497 191194587
5932 191194587 184917700 174657235 161714874 147547746 133392922 120554627 108947755
5925 108947755 99185154 90784675 83710370 77817834 72686499 68111612 64198006 61028329
5917F1028329k744206k598559k086198j816746j520220j192730j078659j047518
5909D6943493p32767o69298p22967j17213R2681L65427K79582L87724O28442Q71497
5899D7326601N63653K98753K13756k70406r8591R684j62594l44760K21276K57774
5889D8015146N14756Q79261Q20307Q50438O84386N70407L11439j24350P0155l06324
5879E2285621m71904p30777r47886j044232r34735q02264n36315k10458J94817
5870D6801867L16834O14178Q61563J011551J298012J320954J181505J076433O40453
5861E5123350K540j96800p73932j044138j054237j231391j270689q73349m11948
5852D8269406j61264k53455R8729M39371K07918J09922M77079M5405j46885J5107
$$ plain form
5917 61028329 58284123 55685564 53599366 51782620 50262400 49069670 47991011 46943493
5909 46943493 46210726 45541428 44818461 44701248 44793929 45159356 45438938 45826662 46455104 47326601
5899 47326601 47890254 48189007 48402763 48132357 48033766 48043450 47880856 47536096 47757372 48015146
5889 48015146 48529902 49409163 50229470 51079908 51764294 52334701 52646140 52521790 52591945 52285621
5879 52285621 51813717 51082940 50135054 49090822 48156087 47353823 46817508 46607050 46801867
5870 46801867 47118701 47732879 48594442 49605993 50904005 52224959 53406464 54482897 55123350
5861 55123350 55125890 54929090 54155158 53111020 52056783 50825392 49554703 48681354 48269406
5852 48269406 48108142 47854687 47953416 48392787 48600705 48710627 49187706 49233111 49086226 49101333
5842D9101333k5401m16763n01341p56749j053799j001519j063173j263348r33507
5833D2085733q26063o70199k65621q3632N873k8022k11417k28406k26100l42320
5823C9209826q85647r65412j021000j079196j430554j402001j131244q68500n85968
5814B9840304o01729m27941n13674m72133m80058n60069o44614p12519p43642
5805B4683925o61298j025323j082218p94875o56675q50508q10147m14245o26053
5796A7762583l60295r6486m32915m68425j27561j78371k02235m62569n42971n43806
5786A4346949n80526p48645o26258m88842m30170o09432m29654n79308l80661
5777I473453j12011l43517l23437j99794j69729j99842j94269l04531p6096k08609
$$ plain form
5842 49101333 49075932 48659169 48157828 47401079 46347280 45345761 44282588 43019240 42085733
5833 42085733 41259670 40589471 40323850 40240218 40246091 40218069 40006652 39778246 39552146 39209826
5823 39209826 38324179 37358767 36337767 35258571 33828017 32426016 31294772 30426272 29840304
5814 29840304 29238575 28810634 28296960 27824827 27344769 26784700 26140086 25427567 24683925
5805 24683925 24022627 22997304 21915086 21120211 20463536 19613028 18802881 18388636 17762583
5796 17762583 17402288 17305802 16872887 16404462 16276901 16098530 15896295 15433726 14890755 14346949
5786 14346949 13766423 13017778 12391520 11902678 11472508 10863076 10433422 9854114 9473453
5777 9473453 9361442 9017925 8694488 8494694 8324965 8125123 7930854 7626323 7550227 7341618
5767G341618m03228j02488J4301l24369J95400L7414l19711l18843m5576j18366
5757E956152Q4129j16381q564j17453j52224j52975L0080j20729P038j86997m7453
5746E174623O6546J02498j05729j64973m0265K0963j04845l8315o0691r019r2096
5735D748697j4058R56k26216p117Q3464j02525r3481N1540J8347j20570j67137
5724D171900J94797n2929m5065m2855l7067k54027j8967j75600K25954K6834o6842
5713C926133O013J22855k2265O5595k02986O7878J02971j38550p3546J40214M7090
5702D041402j57895j12820j28349k13655O1570K34364k06144j56801J46291J27089
5692C635052J79984j84586k51944K54449l8682l00776J36812P1467k3219n1217
$$ plain form
5767 7341618 6938390 6835902 6850203 6525834 6721234 6758648 6438937 6120094 6074518 5956152
5757 5956152 6040281 5923900 5915336 5797883 5645659 5492684 5522764 5402035 5409073 5222076 5174623
5746 5174623 5241169 5343667 5237938 5072965 5032700 5053663 4948818 4910503 4849812 4840793 4748697
5735 4748697 4734639 4735595 4509379 4502262 4585726 4483201 4389720 4441260 4459607 4339037 4171900
5724 4171900 4366697 4313768 4268703 4225848 4188781 3934754 3915787 3740187 3966141 3992975 3926133
5713 3926133 3932146 4055001 4032736 4098331 3895345 3963223 4066194 3927644 3854098 3994312 4041402
5702 4041402 3883507 3770687 3642338 3428683 3490253 3724617 3518473 3361672 3507963 3635052
5692 3635052 3815036 3630450 3378506 3632955 3594273 3293497 3430309 3501776 3478557 3427340
5682C427340r1696n5956K0570J1149J890j60936n5265J18120m2686o9068j8602
5671C084860K11403L0417j18981j04706O7901r1849L10177N6022M7045J30906
5661C623195j70815r2539M4579l3228K9655j09389N2754J97638J29545j26052
5651C545343J03232J8956j05686r5510O2527n8699M8772l1003L1106k83562M154
5640C239630M7002K2165r2677L6724P6129j42143J1253j10966j1150l0997K90697
5629C335667r4200Q7477R2668n0834l9005l7196J00737J2519l4146r0812q7358
5618C195517M8592j31073L1768K1237J21352j58M9329k55001j47100L8181K4488
5607B997132n8689q8275l6645k9878L2651j12056M2266K0297M4902J02498n9446
$$ plain form
5682 3427340 3335644 3279688 3300258 3311407 3313297 3152361 3097096 3215216 3172530 3103462 3084860
5671 3084860 3296263 3326680 3207699 3102993 3170894 3079045 3389222 3445244 3492289 3623195
5661 3623195 3452380 3359841 3404420 3371192 3400847 3291458 3344212 3541850 3671395 3545343
5651 3545343 3648575 3667531 3561845 3466335 3528862 3470163 3518935 3487932 3519038 3235476 3239630
5640 3239630 3286632 3308797 3216120 3252844 3328973 3186830 3198083 3087117 3075967 3044970 3335667
5629 3335667 3241467 3328944 3421612 3370778 3331773 3294577 3395314 3407833 3373687 3282875 3195517
5618 3195517 3244109 3113036 3144804 3166041 3287393 3287235 3336564 3081563 2934463 2972644 2997132
5607 2997132 2938443 2850168 2813523 2783645 2816296 2704240 2746506 2766803 2811705 2914203 2854757
5596B854757r0414j65969J08324j25994k1573Q8682K08791r3411o5700k4458j824
5585B671211J25993n9001p2670j30401j9863J70769P1393j87282J23997J43566
5575B837712r60k16506j93403J77637K71463l23792j75983J51978J45154L4658
5565B707958J8572O229j7278j02924J16352l8074k23093M1121K26453Q3163N9618
5554B878097m869l16036m2785J28989m158j33139J28116P0457j53795J3634J79167
5543B743678r4199J4622J3102r400j20362J16165J13782k30557N1900j53778p315
5532B437638J63434K4656n9773o745q7162l882J81880o4562O0102p1539j05476
5521B468571J15697L3797J62440N8673l69541p5906N7107J59683j69024j38172
$$ plain form
5596 2854757 2764343 2598374 2706698 2580704 2559131 2647813 2856604 2763193 2697493 2673035 2671211
5585 2671211 2797204 2738203 2665533 2535132 2515269 2686038 2757431 2570149 2694146 2837712
5575 2837712 2836752 2620246 2426843 2604480 2875943 2552151 2376168 2528146 2673300 2707958
5565 2707958 2726530 2732759 2715481 2612557 2728909 2690835 2467742 2508863 2735316 2818479 2878097
5554 2878097 2873228 2557192 2514407 2643396 2639238 2506099 2634215 2704672 2550877 2564511 2743678
5543 2743678 2649479 2664101 2677203 2667803 2547441 2663606 2777388 2546831 2598731 2444953 2437638
5532 2437638 2601072 2625728 2565955 2559210 2472048 2468166 2650046 2585484 2645586 2574047 2468571
5521 2468571 2584268 2618065 2780505 2839178 2469637 2393731 2450838 2610521 2441497 2303325
5511B303325K0371R0274k4502j07314P0714q1652p846J14734K86925k01683j75629
5500B287717J2202m8005J37765O735l40882K45754L0856j6670J90221j45683j34818
5489B225192r678n6672R3546N8990J37626j07408o1873L5597L9473O839J69167
5478B530799j88958O528j8862k4322L202M5348l6240q4566L7855N2043K7773P4634
5466B425234j26465j71932J10079J69995n3654j53110J06527p2702Q6728j3497
5456B307203o1415j26565L9230J22055p8694L3137K9873L4970j24916j38687m8686
5445A987505J38026J64156j80278q0369K59738m3296k49025M3305K2677Q3734
5435B146173j52486J50080q2172O5080p3082K45992q0074j73125P1251k8320j4767
$$ plain form
5511 2303325 2323696 2413970 2389468 2282154 2352868 2271216 2263370 2378104 2665029 2463346 2287717
5500 2287717 2299919 2251914 2389679 2396414 2055532 2301286 2332142 2315472 2505693 2360010 2225192
5489 2225192 2215514 2158842 2252388 2311378 2449004 2341596 2279723 2315320 2354793 2361632 2530799
5478 2530799 2341841 2348369 2329507 2305185 2308387 2353735 2317495 2232929 2270784 2322827 2350600 2425234
5466 2425234 2298769 2126837 2236916 2406911 2353257 2200147 2306674 2233972 2320700 2307203
5456 2307203 2245788 2119223 2158453 2280508 2201814 2234951 2264824 2299794 2174878 2036191 1987505
5445 1987505 2125531 2289687 2109409 2029040 2288778 2245482 1996457 2039762 2062439 2146173
5435 2146173 1993687 2143767 2061595 2126675 2053593 2299585 2219511 2046386 2117637 2089317 2074550
5424B074550j1837j25738O6384K16165J20045k4583k01332m8622r1553J17380
5414B090859N0110o5026j36520j64409J43567J31634J56301k04590K6708n2790
5404A975844P2065N8577j91227P3833N8280O5526o3881k00287M4273L20976K58960
5393B472939l28266k05535N9632R1092j49669q9215K02298j99494q811J48126
5383A993097P6086j50143j2547r6090K876L4417J06978q0519k00765L05736J35328
5372B114454p599j14621k9973m6216O7158k5125l3130q6479o7283J74931J29259
5361B075376J19627j42027j1731j88398N9133l6850L4166K1766r0290J43310q1857
5350A902225j73842N3746K37298L692J8124k4030j00866j47778J0060J81002l9100
$$ plain form
5424 2074550 2062713 1936975 2003359 2219524 2339569 2314986 2113654 2065032 1973479 2090859
5414 2090859 2140969 2075943 1939423 1775014 1918581 2050215 2206516 2001926 2028634 1975844
5404 1975844 2047909 2106486 1915259 1989092 2047372 2112898 2049017 1848730 1893003 2213979 2472939
5393 2472939 2144673 1939138 1998770 2089862 1940193 1850978 2053276 1853782 1844971 1993097
5383 1993097 2069183 1919040 1906493 1810403 1813279 1847696 1954674 1874155 1673390 1979126 2114454
5372 2114454 2106855 1992234 1962261 1916045 1983203 1958078 1924948 1838469 1771186 1946117 2075376
5361 2075376 2195003 2052976 2041245 1852847 1911980 1875130 1909296 1931062 1840772 1984082 1902225
5350 1902225 1728383 1782129 2019427 2023119 2041243 2017213 1916347 1768569 1778629 1959631 1920531
5339A920531j04864J57749j30262j60344J38887j10700J38627j58816k3675J72154
5329A839287o3164l8309L3143K709k7048j00890M2902l6361K19248o6163J55415
5318A960769J5804j43163j4664L9233o2479K02098J70480k4433j59875J02722
5308B086492J20869k73478j49488M3075J73600J20743n3559j78033J7737j01527
5298A806431K52984J53723n0781j4176j02642L570M1592L9147j18213m0169J71415
5287B142881M9429K8008k24336q1787P625J19444J0097k8311R0154J26527K8283
5276B268014j30379k18485J25753P6223k73840J29187R1167j19159M0277J50322
5266B139080n3574J43419P506o3149J52882O7990o1778j32614p2698O1964j3382
$$ plain form
5339 1920531 1815667 1973416 1843154 1682810 1821697 1710997 1849624 1690808 1667133 1839287
5329 1839287 1776123 1737814 1770957 1773666 1746618 1645728 1688630 1652269 1871517 1805354 1960769
5318 1960769 1976573 1833410 1818746 1857979 1795500 1997598 2168078 2143645 1983770 2086492
5308 2086492 2207361 1933883 1784395 1827470 2001070 2121813 2068254 1890221 1907958 1806431
5298 1806431 2059415 2213138 2162357 2148181 2045539 2049109 2090701 2129848 2011635 1971466 2142881
5287 2142881 2192310 2220318 1995982 1914195 1921820 2041264 2051361 2023050 2113204 2239731 2268014
5276 2268014 2137635 1919150 2044903 2121126 1847286 1976473 2067640 1948481 1988758 2139080
5266 2139080 2085506 2228925 2236431 2173282 2326164 2394154 2332376 2199762 2127064 2189028 2175646
5255B175646j39622l1855Q0361L07903l1793j83722n0489J8298q1339K20493j6555
5244B267326k80843N8332n6712K17165J17918j23136L09626j96821q922J54341
5234B458274p6793j10900j7375J66762k18074l6405k2538p1571J44037r394k2718
5223B183305J01259O026r8707J36847J88502j84316L2130J78552j48127j20648
5213B274823j51969J76479m3863J8019J2834M3655P1669J27832o9004p1818Q4304
5202B472961M4936q7329r5118J024q9647M726O0918m1624j8493K71463j17037
5191B406780r7363J46630J24134j12995J10487P7266l55278J71709j10938j32713
5181B227719L54459Q3223p6464k17579j07843K17193k9284J89166n2103j35887
$$ plain form
5255 2175646 2036024 2004169 2084530 2392433 2360640 2176918 2126429 2144727 2063388 2283881 2267326
5244 2267326 1986483 2044815 1988103 2205268 2323186 2200050 2509676 2312855 2303933 2458274
5234 2458274 2381481 2270581 2253206 2419968 2201894 2165489 2142951 2071380 2215417 2206023 2183305
5223 2183305 2284564 2290590 2191883 2328730 2517232 2332916 2365046 2543598 2395471 2274823
5213 2274823 2122854 2299333 2255470 2273489 2286323 2329978 2401647 2529479 2460475 2388657 2472961
5202 2472961 2517897 2430568 2335450 2336474 2246827 2251553 2312471 2270847 2252354 2523817 2406780
5191 2406780 2309417 2456047 2580181 2467186 2577673 2654939 2299661 2471370 2360432 2227719
5181 2227719 2582178 2665401 2588937 2371358 2263515 2480708 2451424 2640590 2588487 2452600
5171B452600J6171O4334m8411p4198K06976r1506J48521q9307k3689M7366O6877
5160B675734J8767K554o9767J98909j07628j02493j27663Q851J89435q6138K07411
5149B807972k1040K37260J5603j34532L8999J406Q6935k16448j4176p423P7272
5138B871828m5192q763J46900m9021J4969j09890K048n912K5913J15228J37923
5127C096031J13107J762J1538J42486J957l36206N958J40642J21145j91698M8447
5116C155169J99515N0739k0053j59902r4780q0307O228K24430K02618p849q6228
5105C389580M8061J86983J35998J96480j48473l48353J42404K4394p502m0113
5095C579459M0402M278O0946K8883O3238J62485o4311J77716r6418j07254Q4446
$$ plain form
5171 2452600 2468771 2533105 2484694 2410496 2617472 2525966 2674487 2585180 2561491 2608857 2675734
5160 2675734 2694501 2697055 2627288 2826197 2718569 2616076 2488413 2497264 2686699 2600561 2807972
5149 2807972 2786932 3024192 3039795 2905263 2944262 2945668 3032603 2816155 2801979 2794556 2871828
5138 2871828 2826636 2817873 2964773 2915752 2930721 2820831 2822879 2816967 2842880 2958108 3096031
5127 3096031 3209138 3210900 3222438 3364924 3366881 3030675 3036633 3177275 3298420 3106722 3155169
5116 3155169 3354684 3405423 3385370 3225468 3130688 3050381 3056609 3281039 3483657 3475808 3389580
5105 3389580 3437641 3624624 3760622 3957102 3808629 3460276 3602680 3627074 3619572 3579459
5095 3579459 3619861 3624139 3685085 3713968 3777206 3939691 3875380 4053096 3956678 3849424 3933870
5084C933870K4520J00133j220J01806j9557j01519P9609J8009K12500J1057j48297
5073D210911j6441J74836M3301l12727q0876K6648K64869K3976K18520R8953n523
5062D646447P4009p879J37686l74318j13037J48279J21646J08455j4093o586J84183
5051D904792J01962O5366J654J23813O558K5616k7891j31847J53930J77716j59689
5040E241980K22R9262m388n2818J08339r7366K02303l9570j96206p2718J13267
5029E302307J70227j4937j1207M9222j7088m5929J82350n2720l19294K2867K10732
5018E476530j29564m7094J9724K21645R3939L3577J54431J30669j29698J38807
5008E962966J12543j98591K7601K95046J05571N6924j6245j05181L89q4776J52818
$$ plain form
5084 3933870 3958390 4058523 4057303 4159109 4139552 4038033 4117642 4135651 4348151 4359208 4210911
5073 4210911 4194470 4369306 4412607 4099880 4019004 4045652 4310521 4334497 4553017 4651970 4646447
5062 4646447 4720456 4712577 4850263 4475945 4362908 4511187 4632833 4741288 4727195 4720609 4904792
5051 4904792 5006754 5072120 5073774 5197587 5204145 5229761 5201870 5070023 5223953 5401669 5241980
5040 5241980 5242202 5341464 5337076 5284258 5392597 5295231 5497534 5457964 5261758 5189040 5302307
5029 5302307 5472534 5457597 5446390 5495612 5478524 5432595 5614945 5562225 5242931 5265798 5476530
5018 5476530 5346966 5299872 5319596 5541241 5635180 5668757 5823188 5953857 5824159 5962966
5008 5962966 6075509 5876918 5904519 6199565 6305136 6362060 6345815 6240634 6241023 6156247 6309065
4997F309065l5551n4029J80335J0897Q2342K8696P4714K12129R3774j26555L0913
4986F806730K98409K4984m5563J75654K13362J14255o6407N545J35362K24444
4976G886775L903J17540L83788J28972o9948r2116J42138K9918L10517J49328
4966H990815K48706L49680K19665K75254R3141K5369L99335K27982K5811K78928
4956A1134686K39659M73425L02813K42557K91629L34812M07275O04258L36201
4947A4367315K00795N76240L96252M40676L78289K08966L61349M13108L57691
4938A7700681j01863J85896J75023M66812J35444r4345K62301K40980L30852M05866
4928A9707647M62059L24855M84071M25653O46142N82293M46592M49789M63278
$$ plain form
4997 6309065 6273514 6219485 6399820 6410717 6493059 6521755 6596469 6808598 6902372 6775817 6806730
4986 6806730 7105139 7130123 7084560 7260214 7473576 7587831 7521424 7526969 7662331 7886775
4976 7886775 7890678 8008218 8392006 8520978 8451030 8358914 8501052 8530970 8841487 8990815
4966 8990815 9239521 9589201 9808866 10084120 10177261 10202630 10601965 10829947 10855758 11134686
4956 11134686 11374345 11847770 12150583 12393140 12684769 13019581 13426856 14031114 14367315
4947 14367315 14568110 15144350 15540602 15981278 16359567 16568533 16929882 17342990 17700681
4938 17700681 17598818 17784714 17959737 18426549 18561993 18467648 18729949 18970929 19301781 19707647
4928 19707647 20169706 20494561 20978632 21404285 22050427 22632720 23079312 23529101 23992379
4919B3992379K58640N35646N20032K71399K961j78983j88949o890M3624k14479
4909B5035380k72561j34281n9101o4262J08204m6701L10151L71730R1191J65150
4899B5504900K73601N19523N51736L35817N97053M51823L72716O12096O13830
4890B9833095N78999N89152L94174Q06878P20258O42209O60442P61353Q32467
4881C5819027R99086J143566J129032R55758R14406J171079J726519J340267R04717
4872D6103457J350274J150536J197365R00188O42726P93091M85107N43285N78602
4863E3744631Q6983N94141M64059N82612Q22747Q91712Q97494J112892J314016
4854F0511287J274101J792525K074256J865609J742965J912849K185277K041203
$$ plain form
4919 23992379 24251019 24786665 25306697 25578096 25581057 25402074 25213125 25206235 25249859 25035380
4909 25035380 24762819 24628538 24569437 24505175 24613379 24566678 24876829 25248559 25339750 25504900
4899 25504900 25778501 26298024 26849760 27185577 27782630 28234453 28607169 29219265 29833095
4890 29833095 30412094 31001246 31395420 32202298 32922556 33564765 34225207 34986560 35819027
4881 35819027 36818113 37961679 39090711 40046469 40960875 42131954 43858473 45198740 46103457
4872 46103457 47453731 48604267 49801632 50701820 51344546 52137637 52622744 53166029 53744631
4863 53744631 53831614 54425755 54889814 55472426 56295173 57186885 58084379 59197271 60511287
4854 60511287 61785388 63577913 65652169 67517778 69260743 71173592 73358869 75400072
4846G5400072J958060J975111J699855J232688Q12861N20885L91285Q3505j39965
4837H3934357m67564j45294j2148m44617j45297J61328M99973K23341O51715R38849
4827H5194643J101595J142407J505248J492955J344866J588925J573145J707303
4819I6651087J433185J271322J399045J172605J242614J222844J067812J397916
4811A06858430J564969K081582K318572K605938K804131K892786L123360L097572
4803A27347340K640011J983181J393695Q54444L51936M19364J12028J75709M39180
4794A35716888O28964Q20543J071412J590447J677008J436859J448378J222604
4786A45613103O50487n3250k26968m68142n54152k12598j96549J49643J79859
$$ plain form
4846 75400072 77358132 79333243 81033098 82265786 83078647 83599532 83990817 84074322 83934357
4837 83934357 83466793 83321499 83309351 82864734 82719437 82880765 83380738 83604079 84255794 85194643
4827 85194643 86296238 87438645 88943893 90436848 91781714 93370639 94943784 96651087
4819 96651087 98084272 99355594 100754639 101927244 103169858 104392702 105460514 106858430
4811 106858430 108423399 110504981 112823553 115429491 118233622 121126408 124249768 127347340
4803 127347340 129987351 131970532 133364227 134218671 134570607 134989971 135101999 135277708 135716888
4794 135716888 136345852 137166395 138237807 139828254 141505262 142942121 144390499 145613103
4786 145613103 146263590 146210340 145983372 145515230 144961078 144748480 144551931 144701574 144881433
4777A44881433L0080J46293l4628j62064k04746l86259k04908r3193M4541R8192
4767A44114741L74995R80485J646057J767415K635270L369780L703991M419860
4759A63012594M897959N514530N821497N892872N794874N620455N151251M323627
4751B06029659L054317R73821o34894k433367m335680n215982n878090o024168
4743A85535616n561389m890458m198866l527219k278246j512791r65167r23666
4735A61677814p17404r34221j860322k706542l271333m086680m464580m219966
4727A39416766m410124m296726m900246n156862n235347n505048n739683n808021
4719I8364709n642655n276056m930183m824706m413143l916944l647735l232417
$$ plain form
4777 144881433 144911513 145057806 145023178 144861114 144656368 144270109 144065201 143972008 144016549 144114741
4767 144114741 144489736 145470221 147116278 148883693 151518963 154888743 158592734 163012594
4759 163012594 167910553 173425083 179246580 185139452 190934326 196554781 201706032 206029659
4751 206029659 209083976 210057797 209422903 206989536 202653856 197437874 191559784 185535616
4743 185535616 179974227 175083769 170884903 167357684 165079438 163566647 162601480 161677814
4735 161677814 160960410 160026189 158165867 155459325 152187992 148101312 143636732 139416766
4727 139416766 135006642 130709916 125809670 120652808 115417461 109912413 104172730 98364709
4719 98364709 92722054 87445998 82515815 77691109 73277966 69361022 65713287 62480870
4711F2480870l194290k718625k391528k310527j915594j502289j767660j354575
4703D5325782j192936j270620j024171j238115j187047j125221r30930q91848
4695C6464894p32647r13394j297346o86055q65898r83218j050442q84203q73240
4686B8178451r01417o56153p86874m98049l70988n18269o44115m68389m47500
4677B2886697l80719k76834l41591m04834l7128l31280k63258j21102l26281j79149
4667B0224521j81357k43661J32248k71513j51100j98176K38947J51413j3765J13103
4657A9800660P381r9806k1770N0202J37245K97879j99774J50786K35370J43000
4647B0501173K46308K55108L19525J33109K64570O25267L00372K03660O30374
$$ plain form
4711 62480870 59286580 56567955 54176427 51865900 49950306 48448017 46680357 45325782
4703 45325782 44132846 42862226 41838055 40599940 39412893 38287672 37356742 36464894
4695 36464894 35732247 34818853 33521507 32835452 31969554 30986336 29935894 29051691 28178451
4686 28178451 27277034 26620881 25834007 25335958 24964970 24446701 23802586 23334197 22886697
4677 22886697 22505978 22229144 21887553 21482719 21445591 21114311 20851053 20729951 20403670 20224521
4667 20224521 20043164 19799503 19931751 19660238 19509138 19310962 19549909 19701322 19687557 19800660
4657 19800660 19808041 19708235 19686465 19736667 19873912 20171791 19972017 20122803 20358173 20501173
4647 20501173 20747481 21002589 21322114 21455223 21719793 22345060 22645432 22849092 23479466
4638B3479466O27957M72358Q35670O67311R08246J363993J472531J327773J536512
4629C2691817J855457J953816K216622K654217K707102K970447L014861K566825
4621E2631164J979879J375001K12q16667j895045k760362k833393l074543k428969
4612D2177277k334293k025086j738828j278916j234204j158929q70400o29325
4604C0907296o75896l57965R1940r025m935O7894J60364N88786L67115O22837
4594C1758411R22952R49587J050213J275082J356445J616280J994135K157948
4586D3081053K668326K689111K652146K617671J686566J210473M00935j015151
4578E5991130j476338j910006k172047k014133j423111j000718o69048l40414
$$ plain form
4638 23479466 24107423 24579781 25415451 26082762 26991008 28355001 29827532 31155305 32691817
4629 32691817 34547274 36501090 38717712 41371929 44079031 47049478 50064339 52631164
4621 52631164 54611043 55986044 55986256 55169589 53274544 50514182 47680789 44606246 42177277
4612 42177277 39842984 37817898 36079070 34800154 33565950 32407021 31536621 30907296
4604 30907296 30231400 29873435 29965375 29956350 29951415 30019309 30179673 30768459 31135574 31758411
4594 31758411 32681363 33630950 34681163 35956245 37312690 38928970 40923105 43081053
4586 43081053 45749379 48438490 51090636 53708307 55394873 56605346 57006281 55991130
4578 55991130 54514792 52604786 50432739 48418606 46995495 45994777 45325729 44985315
4570D4985315M4646J50397K46617r1899l98895j251191j679230j913849k414934
4561C7676977k198949k273654k006005j768669j506083j351862j291851q85467
4553B4394437n64001p50167r48555l80384m04201k52481k38703l48235k09464
4544B0298246j0709m3314m9281K78173M15171M99304N80532O27185O55339J134658
4534B4385304J168948J150131J333794J319533J670274R48266K97587k36087r98775
4525C1038975j473228j810454j950174j950965j707834j694763j374598j392243
4517A7684716j099314q02064p97081p04466o55751m80553l74217n54060m25298
4508A1791912n90126n38039j25399k65667k82482k97555l07346j60843k1258k07148
$$ plain form
4570 44985315 45029961 45180358 45426975 45335076 44936181 43684990 42005760 40091911 37676977
4561 37676977 35478028 33204374 31198369 29429700 27923617 26571755 25279904 24394437
4553 24394437 23830436 23080269 22131714 21751330 21347129 21094648 20855945 20507710 20298246
4544 20298246 20287537 20244223 20194942 20473115 20888286 21387590 21968122 22595307 23250646 24385304
4534 24385304 25554252 26704383 28038177 29357710 31027984 31976250 32273837 32037750 31038975
4525 31038975 29565747 27755293 25805119 23854154 22146320 20451557 19076959 17684716
4517 17684716 16585402 15783338 14986257 14281791 13626040 13145487 12771270 12217210 11791912
4508 11791912 11201786 10663747 10538348 10272681 9990199 9692644 9385298 9224455 9203197 8996049
4498H996049j79060j6899L657l13543M6570J3099k27336k30233k6231j39521r3686
4487G832866j39053Q0214N0775o0243j14283j27924m4212j23068L9773o93K0091
4476G414243n3592l9819j19157j06156Q852J36926O7338M1188p0924n8399k19820
4465G000680P3163O6161j57735l8581J83842n1821r2137l0533q3202l0724Q9916
4454F929029j5816N3144P3682M2175q7234o454N9776J09274M4785k20196J45507
4443G127672p4474R5226j42405q3433R4948j76796k17000r1508J83185J74810
4433F890225l6983q4252k19922L2897J09435j63724j29639j33446j35525p8267
4423F050799K27931j11935p660M4690l3875j58426j06496K7728J37851r2338K137
$$ plain form
4498 8996049 8816989 8800090 8803747 8490204 8536774 8549873 8322537 8092304 8066073 7926552 7832866
4487 7832866 7693813 7774027 7824802 7764559 7650276 7522352 7478140 7355072 7394845 7394152 7414243
4476 7414243 7360651 7320832 7201675 7095519 7104371 7241297 7308635 7349823 7278899 7220500 7000680
4465 7000680 7073843 7140004 6982269 6943688 7127530 7075709 6983572 6953039 6869837 6839113 6929029
4454 6929029 6913213 6966357 7040039 7082214 6994980 6988526 7048302 7157576 7202361 6982165 7127672
4443 7127672 7053198 7148424 7006019 6922586 7017534 6840738 6623738 6532230 6715415 6890225
4433 6890225 6853242 6768990 6549068 6581965 6691400 6527676 6398037 6264591 6129066 6050799
4423 6050799 6278730 6166795 6159135 6203825 6169950 6011524 5905028 5932756 6070607 5978269 5980406
4412E980406J22528k03637L5864k46M3206q1837k1048r8431j100K93306o8040
4401F000971N25r1943J84260j66573j26006M6901k5161j15873j8537j25877J23229
4390E685916N4905n0829P9244J20431K800j64711r3475p83P4604j67408O7090
4379E607784K48437J11857J7973L8228k6108r0642M4882q9875j323p303r539J09015
4367E953386J02878n4856j89896j35800L08608J37478J58160o5889j62415K54654
4357F306308O5725J65161j33969j17686L2218Q5251J17551J84352o257J49492
4347F848146l93803J07263N7528J22578j16298R2050M751J9074L4899p7748J44568
4336F843008N6432R7932j30630j4358K48399l878j53245j405J90374K15290L29971
$$ plain form
4412 5980406 6102934 5899297 5935161 5934915 5978121 5896284 5875236 5776805 5775705 6069011 6000971
4401 6000971 6001496 5909553 6093813 5927240 5801234 5848135 5822974 5707101 5688564 5562687 5685916
4390 5685916 5740821 5689992 5769236 5889667 5892467 5727756 5634281 5633498 5708102 5540694 5607784
4379 5607784 5856221 5968078 5986051 6024279 5998171 5907529 5952411 5862536 5861213 5853910 5844371 5953386
4367 5953386 6056264 6001408 5811512 5675712 5984320 6121798 6279958 6214069 6051654 6306308
4357 6306308 6372033 6537194 6403225 6285539 6317757 6403008 6520559 6704911 6698654 6848146
4347 6848146 6454343 6561606 6619134 6741712 6625414 6717464 6722215 6741289 6776188 6698440 6843008
4336 6843008 6899440 6997372 6866742 6852384 7100783 7096905 6943660 6942255 7132629 7347919 7677890
4325G677890J34330P1427l41238l4840J31205r8110Q3076J36391Q4626L03J62458
4314H007518J29900K5915j07567r1270J12934J63156l2808K35812K40547k32164
4304H451973j26744O3276K1571K65087N7969J11672K6249n4538j00818J59341
4294H875038J75603K06380q9934r0656L34462J47044J49626k16162K57730L89429
4284A0138560K466K03348k79132q3828O4787L65213P4844J74477P7569Q8314J02019
4273A0928637L3145K06892J124J26302J98920j6883J84465L09378L7702j23779
4263A1885903R7473M24015J06926L9948N9697K9205K24123N1766K8656L69456
4253A3317168K18855K36698K19070N3563K69416K56464K23288K07715J58839L75362
$$ plain form
4325 7677890 7812220 7883647 7542409 7507569 7638774 7540664 7623740 7760131 7844757 7845060 8007518
4314 8007518 8137418 8163333 8055766 7964496 8077430 8240586 8207778 8443590 8684137 8451973
4304 8451973 8325229 8388505 8410076 8675163 8733132 8844804 8871053 8816515 8715697 8875038
4294 8875038 9050641 9257021 9167087 9076431 9410893 9557937 9707563 9491401 9749131 10138560
4284 10138560 10141026 10344374 10065242 9981414 10046201 10411414 10486258 10660735 10738304 10826618 10928637
4273 10928637 10961782 11168674 11169798 11296100 11495020 11478137 11662602 11971980 12009682 11885903
4263 11885903 11983376 12407391 12514317 12554265 12613962 12643167 12867290 12919056 12947712 13317168
4253 13317168 13536023 13772721 13991791 14045354 14314770 14571234 14794522 15002237 15161076 15536438
4243A5536438J58383J67474L20299K2520J60315N12302N12628L02109K66200K48155
4233A8206823K51329K24391N15329M77471K30917M06060M26695L77212M28470
4224B1544697L23558M35444M95538K55265M08179M44693M67646N51249M36901
4215B5363170N55506L59267M73074P34589N88435O92155P33207N46569P58683
4206C0804655P16041O82956R94327Q69018O96485Q92665J064647O89531J088828
4197C8499153J122083J087903Q93060J256689J438017J180159J165704J421465
4189D8064233J753029J767566J525003J793441J854051K080427K346030K106486
4181F3290266K389309K306415K659729K654072L056801K913319L171774L352025
$$ plain form
4243 15536438 15694821 15862295 16182594 16205114 16365429 16877731 17390359 17692468 17958668 18206823
4233 18206823 18458152 18682543 19197872 19675343 19906260 20312320 20739015 21116227 21544697
4224 21544697 21868255 22303699 22799237 23054502 23462681 23907374 24375020 24926269 25363170
4215 25363170 25918676 26277943 26751017 27485606 28074041 28766196 29499403 30045972 30804655
4206 30804655 31520696 32203652 33197979 34066997 34763482 35656147 36720794 37410325 38499153
4197 38499153 39621236 40709139 41602199 42858888 44296905 45477064 46642768 48064233
4189 48064233 49817262 51584828 53109831 54903272 56757323 58837750 61183780 63290266
4181 63290266 65679575 67985990 70645719 73299791 76356592 79269911 82441685 85793710
4173H5793710L537345L719785L956392L874558M168838M400247M300711M631776
4165A18383362M479384M574575M869994M969028M862704M796908N260375N493141
4157A57689471N287889N284489N389704N485630N038437M939356N063508M770293
4149A98948777M266447M257683L878807L863102L562363L425344L297515K831632
4141B28331670K692780K228838J639736J070709L88704j33766l00566p84264j238563
4132B33895278j221457j310862j461638j582164j899828k062174k341779k628722
4124B19386654k854170l146159l458213l641185l674585m074487l986798m188456
4116A90362601m089661l672325l460945l497697l457326l180080l118305l074678
$$ plain form
4173 85793710 89331055 93050840 97007232 100881790 105050628 109450875 113751586 118383362
4165 118383362 122862746 127437321 132307315 137276343 142139047 146935955 152196330 157689471
4157 157689471 162977360 168261849 173651553 179137183 184175620 189114976 194178484 198948777
4149 198948777 203215224 207472907 211351714 215214816 218777179 222202523 225500038 228331670
4141 228331670 231024450 233253288 234893024 235963733 236352437 236218671 235918105 235133841 233895278
4132 233895278 232673821 231362959 229901321 228319157 226419329 224357155 222015376 219386654
4124 219386654 216532484 213386325 209928112 206286927 202612342 198537855 194551057 190362601
4116 190362601 186272940 182600615 179139670 175641973 172184647 169004567 165886262 162811584
4108A62811584k869749k445074k261918k190600k047823j609869j567391j431857
4100A46387303j400368j376753j551465j609142j362658j382345j110446j130840
4092A35463286j014860o54580n97701q40292k82061m37564n21112R3879p1127
4083A31137868j14815K04973K71060P77475J069471J097926J612482K145788J939226
4074A40141454K220269K227790K007557J707053J449598J270542J238971Q70075
4066A53133309Q70328L88882M34991M01161K00680p9592m1299k8552m71293l09701
4056A54498914l13162j18102n21389q9972l8734J46423j52435j68673k13094p45255
4046A52284521r56704q72565p62106o99233q55696o43399n14839r3401j35200
$$ plain form
4108 162811584 159941835 157496761 155234843 153044243 150996420 149386551 147819160 146387303
4100 146387303 144986935 143610182 142058717 140449575 139086917 137704572 136594126 135463286
4092 135463286 134448426 133793846 133196145 132355853 132073792 131636228 131115116 131208995 131137868
4083 131137868 131023053 131228026 131499086 132276561 133346032 134443958 136056440 138202228 140141454
4074 140141454 142361723 144589513 146597070 148304123 149753721 151024263 152263234 153133309
4066 153133309 154003637 154392519 154827510 155228671 155429351 155349759 155308460 155279908 154808615 154498914
4056 154498914 154185752 154067650 153546261 153456289 153417555 153563978 153411543 153242870 153029776 152284521
4046 152284521 151327817 150455252 149693146 148993913 148138217 147494818 146979979 146886578 146751378
4037A46751378j26758M9022l20835o27398p69792j275067j551228k188086k306689
4028A37634547k229974k267482k358011k314048k539100k613993k856784l022492
4020A17432663k970314k620385k415974j934088j611847j502099j163274j272062
4012A01942620j141785q25511r53444r48800r53756j117962j189547j329402j249973
4003I2232440j379476j180327r98233p70651o63138p32092o65330j069196j844620
3994H2929377j859129j897491k438497k022033j859731k008714j805590j681430
3986F7356762j475335j610118j535184j580154j274789j271848r00109j092616
3978E6616609j203371q50598o42049o97606j040370q02329o68266j054414r73905
$$ plain form
4037 146751378 146624620 146673642 146352807 145725409 144955617 143680550 142129322 139941236 137634547
4028 137634547 135404573 133137091 130779080 128465032 125925932 123311939 120455155 117432663
4020 117432663 114462349 111841964 109425990 107491902 105880055 104377956 103214682 101942620
4012 101942620 100800835 99975324 99021880 98073080 97119324 96001362 94811815 93482413 92232440
4003 92232440 90852964 89672637 88674404 87903753 87240615 86508523 85843193 84773997 82929377
3994 82929377 81070248 79172757 76734260 74712227 72852496 70843782 69038192 67356762
3986 67356762 65881427 64271309 62736125 61155971 59881182 58609334 57709225 56616609
3978 56616609 55413238 54562640 53920591 53222985 52182615 51380286 50712020 49657606 48683701
3969D8683701j236340j248684j040546j062426j208840j119083j101415j120121
3961C9546246j120254q42611o63421o39894p55707n49847m61627m90092o05634
3952C3417159n55220m03941o83357l17505m49989o77324l72210m97379m43705
3943B9016529p63446o87262j30191l37039k87535m42401j34490N8640m67044N0321
3933B5876082L9126k40951j34565j58082j06951N1284J29834j80447O2485L4317
3923B5372132m337K2035p5431J31553O7596r0161l34248j29303L01963J98486
3913B5460285n1986J48034j564j03770N0101k9480J52440L01553J43647N8344
3903B6127604J97880M31802L27276j36827R0766N33371N15068K24615M28678M09001
$$ plain form
3969 48683701 47447361 46198677 45158131 44095705 42886865 41767782 40666367 39546246
3961 39546246 38425992 37583381 36919960 36280066 35524359 34974512 34512885 34022793 33417159
3952 33417159 32861939 32457998 31774641 31457136 31007147 30329823 29957613 29460234 29016529
3943 29016529 28253083 27565821 27435630 27098591 26811056 26368655 26234165 26292805 25825761 25876082
3933 25876082 25915208 25674257 25539692 25381610 25274659 25325943 25455777 25275330 25337815 25372132
3923 25372132 25367795 25389830 25314399 25445952 25513548 25423387 25089139 24959836 25261799 25460285
3913 25460285 25408299 25556333 25554769 25450999 25501100 25471620 25624060 25925613 26069260 26127604
3903 26127604 26325484 26757286 27084562 26947735 27038501 27571872 28086940 28311555 28740233 29149234
3893B9149234K00842J57752N90546O40952N31452P16251P56507M44238O75814
3884C3863588N38241J016700P24610M25229R90911J072288R80830J116432J425317
3875D2154146J103103J371845J582973J398066J508905J904928J680415J954621
3867E4659002J982038K024807K426962K462628K447531K505309K345095K373099
3859G3226471K667318K600708K274129K155409K172467K124340K086863K069180
3851I1376885J827800J694515J662652J407370J385361J022432Q89717M61961
3843A01728693K99234L63138j20951k72798m24364p19002o84242q15021p67954
3834I8586733n88389q51034o76591p18230o74724n25103m50894l14333l41516
$$ plain form
3893 29149234 29350076 29507828 30098374 30739326 31270778 31987029 32743536 33187774 33863588
3884 33863588 34401829 35418529 36143139 36568368 37559279 38631567 39612397 40728829 42154146
3875 42154146 43257249 44629094 46212067 47610133 49119038 51023966 52704381 54659002
3867 54659002 56641040 58665847 61092809 63555437 66002968 68508277 70853372 73226471
3859 73226471 75893789 78494497 80768626 82924035 85096502 87220842 89307705 91376885
3851 91376885 93204685 94899200 96561852 97969222 99354583 100377015 101266732 101728693
3843 101728693 102027927 102391065 102270114 101997316 101572952 100853950 100169708 99354687 98586733
3834 98586733 97998344 97147310 96470719 95752489 95077765 94552662 94101768 93787435 93445919
3825I3445919j44777M2169K35593O42980P98785Q81770J531530J746513K153723
3816A01334205K612777K888123K902198L927174M253663M342735M521139M985744
3808A31767758N327332N325854N479160N348785N398106N429685N524265N059014
3800A74659959M991909M914275M759370M372281L971865L543579L440013L017971
3792B07671222K168022J586845J047388M62794k34760r99244j401500k352209
3784B07948558k560811l086678l401156l698770m150970m215195m363435m416903
3776A78054640m651125m621982m767169m453979m796813m621667m263519m177743
3768A41700643l821120l685688l302953l161357k479286k019277j792039j434948
$$ plain form
3825 93445919 93301142 93343311 93578904 94221884 95020669 95902439 97433969 99180482 101334205
3816 101334205 103946982 106835105 109737303 113664477 117918140 122260875 126782014 131767758
3808 131767758 137095090 142420944 147900104 153248889 158646995 164076680 169600945 174659959
3800 174659959 179651868 184566143 189325513 193697794 197669659 201213238 204653251 207671222
3792 207671222 209839244 211426089 212473477 212936271 212701511 211702267 210300767 207948558
3784 207948558 205387747 202301069 198899913 195201143 191050173 186834978 182471543 178054640
3776 178054640 173403515 168781533 164014364 159560385 154763572 150141905 145878386 141700643
3768 141700643 137879523 134193835 130890882 127729525 125250239 123230962 121438923 120003975
3760A20003975q15891o93852N2553N41918Q00536J116356J639836K542868K916591
3751A28104890L205655L615804L914423M306554M485060M853023N068085N105812
3743A62659306N426134N289279N121277M978938M881483M666063M717100M344296
3735B02083876M403278M216821L816731L772746L406131K881036K654098J792410
3727B29027127J240052P74795k34575m87362j064653j876211k120906k528650
3719B22729617k978595l149875l422799l440126l754466l569984l542415l927388
3711A94943969l590401l455160l818217l666224l718676l942920l739682l569180
3703A65443509l265086k958434k599210k369639j473211j080314j077827k39701
$$ plain form
3760 120003975 119188084 118494232 118546785 119088703 119889239 121005595 122645431 125188299 128104890
3751 128104890 131310545 134926349 138840772 143147326 147632386 152485409 157553494 162659306
3743 162659306 168085440 173374719 178495996 183474934 188356417 193022480 197739580 202083876
3735 202083876 206487154 210703975 214520706 218293452 221699583 224580619 227234717 229027127
3727 229027127 230267179 231041974 230807399 230320037 229255384 227379173 225258267 222729617
3719 222729617 219751022 216601147 213178348 209738222 205983756 202413772 198871357 194943969
3711 194943969 191353568 187898408 184080191 180413967 176695291 172752371 169012689 165443509
3703 165443509 162178423 159219989 156620779 154251140 152777929 151697615 150619788 150380087
3695A50380087K6879M34434R55182R61014J287329J436366J788408J678991J864607
3686A60813297J999816J976408K084657K424137K634081K544599K718220L214354
3678A80409569L676066L703002M073531M134841M135166M470969M320632M212361
3670B13136137M537819M732777N168556N449525N573355N978529O524990P480600
3662B58582288P821576Q474849Q903639R332686R938487J0344426J1072196J1268359
3654C35738506J1551141J1928972J1584030J1564469J1297926J1213625J0851988
3647D15730657J0242855R539912Q440072P247465O020637M282825K985407J450367
3639D65940197l11172k068378m166310n474198p229674q525040r991648j1414103
$$ plain form
3695 150380087 150406966 150841400 151796582 152757596 154044925 155481291 157269699 158948690 160813297
3686 160813297 162813113 164789521 166874178 169298315 171932396 174476995 177195215 180409569
3678 180409569 184085635 187788637 191862168 195997009 200132175 204603144 208923776 213136137
3670 213136137 217673956 222406733 227575289 233024814 238598169 244576698 251101688 258582288
3662 258582288 266403864 274878713 283782352 293115038 303053525 313397951 324470147 335738506
3654 335738506 347289647 359218619 370802649 382367118 393665044 404878669 415730657
3647 415730657 425973512 435513424 443953496 451200961 457221598 461504423 464489830 465940197
3639 465940197 465629025 463560647 459394337 453920139 446690465 438165425 428173777 416759674
3631D16759674j2414966j3267939j3941433j4572200j5362609j5181966j5044562
3624C16973999j5287645j5274564j4754869j4588879j4443675j3735653j3262613
3617B15626101j2688349j2192718j1377591j0761738r877695r103722q682267
3610A40942021q062113p447545o571596o123453n421757m742845m644248l989855
3602I3938609l246518l223917k790859k297163k052265j828757j562871j670266
3594G5265993j326528j194592r40242o78244q95846o71773p42589q30005q32312
3585F7153862p46916p14780q17513o86835o70713r15318r28464j137984q99444
3576E9635895j024450j088196r65321j153230r78046j252112j191733j265406
$$ plain form
3631 416759674 404344708 391076769 377135336 362563136 347200527 332018561 316973999
3624 316973999 301686354 286411790 271656921 257068042 242624367 228888714 215626101
3617 215626101 202937752 190745034 179367443 168605705 158728010 149624288 140942021
3610 140942021 132879908 125432363 118860767 112737314 107315557 102572712 97928464 93938609
3602 93938609 90692091 87468174 84677315 82380152 80327887 78499130 76936259 75265993
3594 75265993 73939465 72744873 71804631 71126387 70230541 69558768 68816179 67986174 67153862
3585 67153862 66406946 65692166 64874653 64187818 63517105 62601787 61673323 60535339 59635895
3576 59635895 58611445 57523249 56557928 55404698 54426652 53174540 51982807 50717401
3568E0717401j319329j252981j180215j435393j489539j427916j485753j265063
3560C9861212j328247j293987j420600j180536r36902r95565q33463r52115r40990
3551B9978807n64013q02623o90857n26297r02020l70163k90178k94883m41228
3542B5096545n20570l68919m00797k43264j77035k75295j45526m94626k22005
3533B2248508j55583j59274j72663k57734r1782j51179j65066j82670r4191o5284
3523B0753082M262k63242J03353k31015J55996K91800j31021k25295r0843l2699
3513B0334378L9476K10207k27127L945L38441L76534K45811L67216K23031K14770
3503B2126682M24864K00153Q8527K71629q1831j13544J48177j62916j63241m13875
$$ plain form
3568 50717401 49398072 48145091 46964876 45529483 44039944 42612028 41126275 39861212
3560 39861212 38532965 37238978 35818378 34637842 33700940 32705375 31871912 30919797 29978807
3551 29978807 29414794 28612171 27921314 27395017 26492997 26122834 25832656 25537773 25096545
3542 25096545 24575975 24207056 23806259 23562995 23385960 23110665 22965139 22470513 22248508
3533 22248508 22092925 21933651 21760988 21503254 21411472 21260293 21095227 20912557 20818366 20753082
3523 20753082 20757344 20494102 20597455 20366440 20522436 20814236 20683215 20457920 20367077 20334378
3513 20334378 20373854 20584061 20356934 20360879 20699320 21075854 21321665 21688881 21911912 22126682
3503 22126682 22551546 22751699 22840226 23111855 23030024 22916480 23064657 22901741 22738500 22324625
3493B2324625m34166n00285l19188l72954m13057l11801o45970n44421n0930k30254
3483A8501599m41808l31957j96463m82681k08561l42931k48504l12407k51302
3474A5684985k24222j96234k99544j72734j880M5034j98290k19192J18992j64127
3464A4372788j50629l8291K9238J22270J73397k15890K01177N5290j17653O9295
3454A4500992O1806J43104J18117J29966M40447K69496K70632M71508L73582N59971
3444A7339621P94508P66430P58848J265474J500790J925156K293667K565527K295386
3435C1505407Q27762j018187k433410k865686k642935k382069j499065j136599
3427A8355218j029965m54874k54332j02622j96287l40737k53141J79698R9255
$$ plain form
3493 22324625 21890459 21390174 21070986 20698032 20284975 19973174 19327204 18782783 18731853 18501599
3483 18501599 18059791 17727834 17531371 17048690 16840129 16497198 16248694 15936287 15684985
3474 15684985 15460763 15264529 14964985 14792251 14790371 14835405 14637115 14417923 14536915 14372788
3464 14372788 14222159 14183868 14213106 14335376 14508773 14292883 14494060 14549350 14431697 14500992
3454 14500992 14562798 14705902 14824019 14953985 15394432 15663928 15934560 16406068 16779650 17339621
3444 17339621 18134129 18900559 19659407 20924881 22425671 24350827 26644494 29210021 31505407
3435 31505407 32333169 31314982 28881572 26015886 23372951 20990882 19491817 18355218
3427 18355218 17325253 16870379 16616047 16513425 16317138 15976401 15723260 15902958 16002213
3418A6002213L90107L61748L08430Q76603P49228R38372J573095J810325J979362
3409B4989483K239619K323280L63553j657303k896474k914343k490596k205556
3401A7751663j661811j034110r47839o94924m14636n62053m00142l97368l87402
3392A1251378l44011j78777j05258j7205j26585k09778j01188j56030j02667j26835
3382I783044k93585j37811j53487j77087M3004k5599n9428J7270j7283j83679
3372H795359K9907J67423n0993J1236J12771k27931j13001J83053r7086Q0111
3362H890849L8978n8889r2979L664J596r7579n995J76529k14847M988n2357q9294
3350H504664l7483j88620J56429K24186j42857q6584j50910p900R201k21364m0172
$$ plain form
3418 16002213 16392320 16754068 17062498 17939101 18688329 19626701 21199796 23010121 24989483
3409 24989483 27229102 29552382 29915935 28258632 25362158 22447815 19957219 17751663
3401 17751663 16089852 15055742 14107903 13412979 12998343 12436290 12036148 11638780 11251378
3392 11251378 10907367 10728590 10623332 10606127 10479542 10269764 10168576 10012546 9909879 9783044
3382 9783044 9489459 9351648 9198161 9021074 9064078 9038479 8979051 8996321 8979038 8795359
3372 8795359 8825266 8992689 8941696 8952932 9065703 8837772 8724771 8907824 8810738 8890849
3362 8890849 8929827 8870938 8777959 8781623 8783219 8685640 8679645 8856174 8641327 8646315 8593958 8504664
3350 8504664 8467181 8278561 8434990 8659176 8516319 8429735 8278825 8270925 8280126 8058762 8018590
3339H018590k66481o3234j45842j6880q604j71387l1845O8195j41198n9357k01269
3328F980688J724o4167q9559j57127m4760J33649j42704k23795j42843j3550r4646
3317F142910K0586n6624m4666k272p043K3591j5267J17593o7290j50507j49102
3306E811909N1015q442K6636O7489N4411l7095q5567p5871k78130J45641J38983
3295E810979J0353M6910j31368J65044O1844J0442j70908j62037J64955p1993
3285E734221p3460j57689J67947j26228N286J07288r1268J17409K810j14831p5267
3274E496218p2792j68474r6982K8819K5539J65690P6899r3879M430j4367J1724
3263E362825q7020k43168P5839J38128q032n6276o1863m7707J41530j20640O8956
$$ plain form
3339 8018590 7752109 7688875 7543033 7526153 7517549 7346162 7314317 7382512 7241314 7181957 6980688
3328 6980688 6982412 6918245 6828686 6671559 6626799 6760448 6617744 6393949 6251106 6237556 6142910
3317 6142910 6163496 6106872 6062206 6059934 6052891 6076482 6061215 6178808 6111518 5961011 5811909
3306 5811909 5862924 5854482 5881118 5948607 6003018 5965923 5880356 5804485 5526355 5671996 5810979
3295 5810979 5821332 5868242 5736874 5901918 5963762 5974204 5803296 5641259 5806214 5734221
3285 5734221 5660761 5503072 5671019 5544791 5550077 5657365 5566097 5683506 5686316 5571485 5496218
3274 5496218 5423426 5254952 5157970 5186789 5212328 5378018 5454917 5361038 5365468 5351101 5362825
3263 5362825 5275805 5032637 5108476 5246604 5238572 5182296 5120433 5072726 5214256 5093616 5162572
3252E162572n2970K00114R3119o3603o2880Q0921Q238l0902j77813J20190K03601
3241E480587k4588j17312j63410J24008J31184j36710O8055R0774O6494p3617
3231E445465M378j31650L2607o8188k18103J1661n0000Q3493M0434K21527j15042
3220E256582m5669j36428K6608l2683J86301j06414j9310J91718M080q6619K57092
3209E495258J7650k43044R6955m4056K53554L2223n3543L7951o9922R7269N5920
3198E676215K17526n8909L58035r843j91240p5838J36814J47257K06054J25882
3188F531953k0258J3255L17804K30852K08804J04116J00950L3480p7580J88890
3178G632266L05797r427j01561j00960J99821m94p3279P4823k05736O985j98412
$$ plain form
3252 5162572 5109602 5309716 5402835 5339232 5276352 5357273 5365511 5334609 5156796 5276986 5480587
3241 5480587 5455999 5338687 5175277 5299285 5430469 5293759 5361814 5452588 5519082 5445465
3231 5445465 5449843 5318193 5350800 5282612 5064509 5076170 5026170 5109663 5150097 5371624 5256582
3220 5256582 5210913 5074485 5101093 5068410 5254711 5148297 5128987 5320705 5324785 5238166 5495258
3209 5495258 5512908 5269864 5366819 5322763 5576317 5608540 5554997 5592948 5523026 5620295 5676215
3198 5676215 5893741 5834832 6192867 6183024 5991784 5915946 6052760 6200017 6406071 6531953
3188 6531953 6511695 6524950 6842754 7073606 7282410 7386526 7487476 7520956 7443376 7632266
3178 7632266 7938063 7928636 7827075 7726115 7925936 7925442 7852163 7926986 7721250 7728235 7529823
3167G529823K04421J14932m9348r311L3429j48193K03294L42671l22J93648K29036
3156H644080L64425K72148K36723N18081N6602M51169J79923K17183m65826m84869
3146I989639m09083n59859l35443m71840l39355m26818k10744j08234M0369j07259
3136G061373Q8434l64709k30546J20281N6464j60807o0236j24743j11749L07523
3126F581285N317k20711J28286J38439M1018j22396o0402J3939n1702j52084j51854
3115F149135j66634k67859j13052k18019j62453k32628j18977n439k82732n9831
3105D521511J79020j82651j72371N503J43447Q310k96080j72413r5779J59466
3095D097963J1602l40821j08289j8085R5659R6791j30974j0981r1917o7890P6844
$$ plain form
3167 7529823 7734244 7849176 7799828 7790517 7823946 7675753 7879047 8221718 8221396 8415044 8644080
3156 8644080 9008505 9280653 9517376 10035457 10092059 10543228 10723151 10940334 10474508 9989639
3146 9989639 9580556 9020697 8685254 8213414 7874059 7447241 7236497 7128263 7168632 7061373
3136 7061373 7149807 6785098 6554552 6674833 6731297 6570490 6510254 6385511 6273762 6581285
3126 6581285 6586602 6365891 6494177 6632616 6673634 6551238 6490836 6504775 6453073 6300989 6149135
3115 6149135 5982501 5714642 5601590 5383571 5221118 4988490 4869513 4864074 4581342 4521511
3105 4521511 4700531 4517880 4345509 4351012 4494459 4502769 4206689 4034276 3938497 4097963
3095 4097963 4109565 3768744 3660455 3642370 3738029 3834820 3703846 3692865 3600948 3533058 3609902
3084C609902l20j9159m9532o1479j19611J4325Q0625j38233k37123r1441O9139
3073C057093K17998j06895O1018J3802j7074J87104q6336l5395P6950j16896o47
3062C250722l6853O4747j18468P3682M3039j86116j5062J7125N6612L7733J65263
3051C352424j23005k01983M2318R7755j44372k08735Q058P8046j40714j51136
3041B608656N236J32677O1573o8954j97823J96458J60356j44162J33950j2949
3031B875018r8456k12611J0645J39313M1764k8191k0983j21755q6462J00314K08190
3020B806786k69599M4787l7258o5557J21067J9936j49254N2179P9933j31800j12995
3009B358225j12884L46037r1238q2211m5950J54541M2084p9336N1395o0089j61977
$$ plain form
3084 3609902 3609582 3590423 3540891 3479412 3359801 3374126 3454751 3316518 3079395 2987954 3057093
3073 3057093 3275091 3168196 3229214 3243016 3225942 3413046 3326710 3291315 3368265 3251369 3250722
3062 3250722 3213869 3278616 3160148 3233830 3276869 3090753 3075691 3092816 3149428 3187161 3352424
3051 3352424 3229419 3027436 3069754 3167509 3023137 2814402 2822460 2900506 2759792 2608656
3041 2608656 2613892 2746569 2808142 2739188 2541365 2737823 2898179 2754017 2887967 2875018
3031 2875018 2776562 2563951 2574596 2713909 2755673 2727482 2706499 2584744 2498282 2598596 2806786
3020 2806786 2537187 2581974 2544716 2479159 2600226 2620162 2470908 2523087 2603020 2471220 2358225
3009 2358225 2245341 2591378 2500140 2417929 2371979 2526520 2568604 2489268 2540663 2480574 2318597
2998B318597P7382l9745j15833R6460m5239O6097R9636o3316L5116o4789j9714
2987B344652j73761L5800J03282j11215j48857r239q8887J58762J7905J27448
2977B255890r6279q0845o4982J01362K96371j14474k99164O359K6048P9762j54709
2966A955339p5316J33196j02349k2689n1266P4452m4447k0520o8999K10534o3777
2955A924158P2189O2379N7105k85906p198k00663P6783L17881j47288n3459J63606
2944A979587p1895j14490J02714o0681k06333J78287K46257j46693r9817p1675
2934A735261J07195m3596N4555r4982J73585J07216k22648q1231O98J29298R4946
2923A960297q8389k28265j58842Q6184l5178P702O3114J92056K9284l22167J46735
$$ plain form
2998 2318597 2395979 2356234 2240401 2336861 2291622 2357719 2457355 2394039 2429155 2364366 2344652
2987 2344652 2170891 2206691 2309973 2198758 2049901 2040662 1951775 2110537 2128442 2255890
2977 2255890 2159611 2078766 2013784 2115146 2411517 2297043 1997879 2004238 2030286 2110048 1955339
2966 1955339 1880023 2013219 1910870 1888181 1836915 1911367 1866920 1846400 1777401 1987935 1924158
2955 1924158 1996347 2058726 2115831 1829925 1822727 1622064 1698847 2016728 1869440 1815981 1979587
2944 1979587 1907692 1793202 1895916 1835235 1628902 1807189 2053446 1906753 1806936 1735261
2934 1735261 1842456 1798860 1853415 1758433 1932018 2039234 1816586 1735355 1736053 1865351 1960297
2923 1960297 1871908 1643643 1484801 1570985 1535807 1543509 1606623 1798679 1827963 1505796 1652531
2912A652531K10111Q0810k32192k31225j16440J42700J8755O6886K25619k62473
2902A555082n8004L3233r6572K18068K9876m4950J23542L694R588j98369o2461
2891A512727j62204p5856O0038K61398Q9654n7897k60135k33475K34218N2980
2881A421448j01607k1634j9596q542p6264k19654K16022J85279j6211N0500R073
2870A418814J82192k43436m8716J08294J20444j18433o6539J28801j04102j315
2860A376004J30034j96152r3758Q5738M8520j73364K590J55922j67215m8987L3151
2849A152483J82728K2763r7376j26148J06996l2992K36588q0178j11107j54151
2839A099606K31733J66296j33888j23257j05564J27879m8286j17863r6069P2657
$$ plain form
2912 1652531 1862642 1943452 1711260 1480035 1363595 1506295 1525050 1591936 1817555 1555082
2902 1555082 1497078 1530311 1433739 1651807 1681683 1636733 1760275 1763969 1773557 1575188 1512727
2891 1512727 1350523 1274667 1334705 1596103 1685757 1627860 1367725 1134250 1368468 1421448
2881 1421448 1319841 1298207 1278611 1270069 1193805 974151 1190173 1375452 1359241 1409741 1418814
2870 1418814 1601006 1357570 1308854 1417148 1537592 1419159 1352620 1481421 1377319 1376004
2860 1376004 1506038 1309886 1216128 1301866 1350386 1177022 1179612 1335534 1168319 1119332 1152483
2849 1152483 1335211 1357974 1260598 1134450 1241446 1208454 1445042 1364864 1253757 1099606
2839 1099606 1331339 1497635 1363747 1240490 1134926 1262805 1214519 1096656 1000587 1073244
2829A073244O0896n5604K2285j8993l4601J60652K5592j47140q6061J0806n0929
2818I60147J29699j15378n1499L33653q5810K3980J61425J49279j26743q5649
2808A293104k81420n0014J31939J69695L8184m1386M7354k21594J0154m6100M2202
2797A092118M3069L2448j87452N78R0011L602m0119q7807j833r6520O5637P541
2785I21273R3211N2861j50609O4194p9194q0553N1416J85778j27351k6751r5054
2774H09221R8785P1396N3062n4249j64389N6705N4958K5132r1707j79343O4736
2763G44307K91313m10n7253q3755R7400J07640l16758J44020q1615p6232J34065
2752I02722P3318m6804k4779n7861n9892o8455k01805J99296J22509k02000j62963
$$ plain form
2829 1073244 1134140 1078536 1100821 1081828 1047227 1207879 1233471 1086331 1000270 1011076 960147
2818 960147 1089846 974468 922969 1256622 1170812 1194792 1356217 1505496 1378753 1293104
2808 1293104 1011684 961670 1093609 1263304 1301488 1260102 1307456 1085862 1096016 1049916 1092118
2797 1092118 1135187 1167635 980183 980761 1070772 1074374 1034255 946448 944615 848095 913732 921273
2785 921273 1014484 1067345 916736 980930 901736 821183 872599 1058377 931026 904275 809221
2774 809221 908006 979402 1032464 978215 813826 870531 925489 950621 858914 679571 744307
2763 744307 1035620 1035210 977957 894202 991602 1099242 782484 926504 844889 768657 902722
2752 902722 976040 929236 904457 846596 786704 718249 516444 715740 838249 636249 473286
2741D73286J40795K15052P7341n1341m0008p3994j94981N928P3177m3269K67843
2730H49829M2100K249q2789o1854j46092Q5950R7959j1875J08511J22189p2883
2719I33294j79027n1729J02111o5068R7983q2020r4092M3646J41757J2876k2080
2708H37651l8466L2285j45435m2479Q844o5011J25730K33837j58298Q2394m1391
2697H29661k24190K39421j08852j01821K3481p1978J38981K33095k53300j34299
2687E70199k1548K23069k41663M9468o8361p5791L8543L5830J00902M1879j96579
2676D55948P4855J43252j85313J77619o4397o2122j2660O8785J8817r3314J00208
2665F21678j72538J2280R3052j40845P8647Q7327j4465J27202K9123j01276l7635
$$ plain form
2741 473286 614081 829133 906474 855133 815125 741131 546150 552078 625255 581986 849829
2730 849829 891929 894178 811389 749535 603443 689393 787352 775477 883988 1006177 933294
2719 933294 754267 702538 804649 739581 837564 755544 661452 705098 846855 859731 837651
2708 837651 799185 831470 686035 643556 652400 587389 713119 946956 788658 871052 829661
2697 829661 605471 844892 736040 634219 657700 585722 724703 957798 704498 570199
2687 570199 548651 771720 530057 579525 511164 435373 473916 509746 610648 652527 455948
2676 455948 530803 674055 488742 666361 601964 539842 527182 595967 614784 521470 621678
2665 621678 449140 461420 554472 413627 492274 579601 565136 692338 721461 620185 582550
2654E82550J05632j45758m0366l1908R0604K3753j84152l5268R4393m566j7297
2643D37617K37366J63405j8632k65072o7481j56336L5671J41317K65180j34774
2633F38261j37509R1982m1785r3918Q0858J50141j95489m2219k56589J21265R958
2622C24956J7822J36442j0916O6796N3890R2983K55893l5365j6265l1120j45826
2611G09290j26311j72350j86980J57687R1436N3963n3696M6544K37967j85465
2601E72085p4154O3424q2450j52068J987O7994J7991P7294P7788j92178m5958
2590C31755J2265L23998M3291j96122j35117o7303l2593K11321M2463J0565O1754
2579F06277k840j49749K0152j25504p1622J97573J28862m6670P7176n5939p2734
$$ plain form
2654 582550 688182 542424 502058 470150 560754 584507 400355 365087 459480 454914 437617
2643 437617 674983 838388 819756 554684 487203 330867 366538 507855 773035 638261
2633 638261 500752 592734 550949 457031 537889 688030 492541 450322 193733 314998 324956
2622 324956 342778 479220 468304 535100 588990 681973 937866 902501 886236 855116 709290
2611 709290 582979 410629 223649 381336 472772 526735 473039 519583 757550 572085
2601 572085 497931 561355 478905 326837 328824 396818 414809 492103 569891 377713 331755
2590 331755 344020 668018 711309 515187 380070 312767 280174 491495 533958 544523 606277
2579 606277 603437 453688 473840 348336 276714 474287 603149 556479 633655 577716 504982
2568E04982j85113p6533O6767J74584J10546K2911j30279m7657J24298o8112n9634
2557D36760J32530j6977l2747l224k3742k5425J50643Q9542r2639J5394j20524
2546E09591r347r6505Q9610r357k16830J49508j7043m9763J41225l1516n1999
2535D07574J11869r3597N38J1383j9444N8935m9427n9607L8740k482k70020M15655
2523E50117K48102k53219o3963q183n6408m1616J32690J59477k26992M5068o762
2512D78311L6835o4932j18712K74179K68159R135m7537j97686j07799N76Q9549
2501F20078K9567J5973k27036p114N7259K18397j34939J641K801j3030j21731
2490D41866n4176L19210J28057j64504j03899j6081L05572r1451j24589J7619
$$ plain form
2568 504982 319869 243336 310103 484687 595233 618144 487865 440208 564506 496394 436760
2557 436760 569290 552313 519566 516342 492600 467175 617818 707360 614721 630115 509591
2546 509591 500244 403739 493349 483992 267162 416670 399627 349864 491089 459573 407574
2535 407574 519443 425846 426384 437767 418323 477258 427831 368224 406964 404482 134462 550117
2523 550117 798219 545000 481037 472854 416446 374830 507520 666997 440005 485073 478311
2512 478311 515146 450214 331502 605681 873840 882975 835438 637752 529953 530529 620078
2501 620078 649645 665618 438582 431468 488727 707124 572185 573826 576627 563597 441866
2490 441866 387690 706900 834957 670453 566554 550473 856045 764594 640005 657624
2480F57624k55281L9509K96102o0620j76359J11712M619N6466j32886k8535n1221
2469D61130p1003J88475J75644j12429j43071L44114j0886j13570K64256n6166
2459I26494n1390j47503M7313O7570M5035j19927l2063J17263L34579k0276M082
2448A171177k21833Q385j5130N2463j26915O6646J37359j01157l2991K11376j8258
2437A131122L1104N1501j17632J44835k0863Q2396J8324q5408J86158j01632q1846
2426A238059J36341J43111J08056j0421J8860J39898K07043j85009r1522k9649
2416A674767J48385Q0840J19447O2803n261M4999J675J33601L6476J7435j26158
2405B189009K27523l2000j04688J81336J04018l7189q907J48359J32996J93794
$$ plain form
2480 657624 402343 441852 737954 677334 500975 612687 617306 673772 540886 512351 461130
2469 461130 390127 578602 754246 641817 498746 842860 831974 718404 982660 926494
2459 926494 875104 727601 774914 842484 887519 767592 735529 852792 1187371 1167095 1171177
2448 1171177 949344 957729 942599 995062 868147 934793 1072152 970995 938004 1149380 1131122
2437 1131122 1162226 1213727 1096095 1240930 1220067 1302463 1320787 1235379 1421537 1319905 1238059
2426 1238059 1374400 1517511 1625567 1615146 1634006 1773904 1980947 1795938 1704416 1674767
2416 1674767 1823152 1903992 2023439 2086242 2080981 2125980 2127655 2261256 2297732 2315167 2189009
2405 2189009 2416532 2384532 2279844 2461180 2565198 2528009 2519102 2667461 2800457 2994251
2395B994251l8326P0414J23074J84888O2506L47571J09722j21372K78861K56414
2385D268003P2846K05943K09689L16611N5139q345K19903K62668P7681R4894L97628
2374F172660N7904K23503N17571L45626K26586L34237O30955L80751P01925Q09594
2364A0401312N66071N60266Q32879Q71976Q88810J429000J666228J995110K538942
2355B1750594K948126L841635M832096N667947O698652O500152K534621l023479
2347E1750344o358108p791023o975660n611446m246898l272478k415523j614656
2339A3464552j322519r98288j016383m86163n31739m91326m94847p46393n32298
2330F844596n40245m75618m69678j98455k83125m62703l56955j92424J7133l81385
$$ plain form
2395 2994251 2955925 3026339 3149413 3334301 3396807 3744378 3854100 3732728 4011589 4268003
2385 4268003 4340849 4546792 4756481 5073092 5128231 5119886 5339789 5602457 5680138 5775032 6172660
2374 6172660 6230564 6454067 6971638 7317264 7543850 7878087 8509042 8889793 9591718 10401312
2364 10401312 10967383 11527649 12360528 13232504 14121314 15550314 17216542 19211652 21750594
2355 21750594 24698720 28540355 33372451 39040398 45739050 52239202 54773823 51750344
2347 51750344 45392236 37601213 30625553 25014107 20767209 17494731 15079208 13464552
2339 13464552 12142033 11143745 10127362 9641199 9109460 8618134 8123287 7376894 6844596
2330 6844596 6304351 5828733 5359055 5160600 4877475 4414772 4057817 3865393 3882526 3501141
2320C501141j71369l77114l25960J91997L8699j86609j13669k60154k18834p2495
2310B005633p5302K6516J30420j29110j40576o5868l7465M83j16605O8577q8971
2299A577732j90584l23295J14365r146j51699m4298j69498q4194L7810K16817
2289I74010M2789j58317k1389o97Q0316l1305q4154O4760n3844j83133o6118n2116
2277E10802r4137Q9478J94790J00970M7286n5443j19898k45251j23446J04815
2267D09966J12847k7232Q872k01818P290J19580j05443j0588r304j31321K82777
2256D55626j44831R823J68569J14682o6971k40858r9327P4863K6724K6565J41161
2245D66026Q5434n3685N7472Q4892k01157j16849O8220o9682O678M9049J3208
$$ plain form
2320 3501141 3329772 2952658 2626698 2818695 2857394 2670785 2557116 2296962 2078128 2005633
2310 2005633 1930331 1956847 2087267 1958157 1817581 1751713 1714248 1714731 1598126 1666703 1577732
2299 1577732 1387148 1063853 1178218 1169072 1017373 973075 803577 719383 757193 974010
2289 974010 1016799 858482 837093 836396 916712 885407 801253 866013 812169 629036 562918 510802
2277 510802 416665 506143 700933 801903 849189 793746 673848 428597 305151 409966
2267 409966 522813 495581 504453 302635 309925 429505 324062 313474 304170 172849 455626
2256 455626 310795 320618 489187 603869 536898 296040 196713 271576 298300 324865 466026
2245 466026 551460 497775 555247 640139 438982 322133 390353 320671 327349 376398 389606
2234C89606k9786k41827l5391j12866L4265K51830J78804r3624n9995P1455n6222
2223B96249q1890l4622R7584L7859p8678L8338o9337j67273k08407K42377m5829
2212B6371n3397l7959O8840l8527p4803J28387J79441K6690k3252r9012m8290
2201E4489k01323J41684K12626P6793q6595j76164O5851J24769m4900j41238L7090
2190F3082j15908P2129O2720j07402J28857n9065K4342M1282p5633K25070j32655
2179A26819l6201J57790J16204r8696k99658Q9134q8520j68630Q2477K90961M2720
2168B14400J04933j76775O6165m4772M761j45944n3444o5467K7378K4542r5590
2157a39813J55291p731R5251R1972n7053k15291P9890O2004K796J4764M994j21154
$$ plain form
2234 389606 359820 117993 82602 -30264 4001 255831 434635 341011 281016 352471 296249
2223 296249 214359 179737 277321 315180 236502 274840 205503 38230 -170177 72200 26371
2212 26371 -27026 -64985 3855 -34672 -109475 18912 198353 225043 201791 102779 54489
2201 54489 -146834 -5150 207476 284269 197674 21510 87361 212130 167230 25992 63082
2190 63082 -52826 19303 82023 -25379 103478 44413 68755 110037 34404 259474 126819
2179 126819 90618 248408 364612 265916 -33742 55392 -33128 -201758 -119281 171680 214400
2168 214400 319333 142558 208723 163951 168712 22768 -30676 -96143 -68765 -44223 -139813
2157 -139813 15478 7747 102998 194970 137917 -77374 2516 64520 67316 82080 87074 -34080
2145c4080l6280j41549J31934l623J32469J13151n8203q8225Q496j09674J1017
2134g4567J0309L7190J79460j25496j58732J57088j23767L0373o3378l4763J30211
2123c6072J29011P0411j18881p8819j123J35714j08862J61735j54545j23085P5282
2112d9234N2851L0657p8787p9355P8113J49227q8931q8110j25409N4171m336J51150
2100B007r2949j21206K81071l4911j49999K71358q7457j29090O9629L35986M4341
2089C88780l24767R6510n6183j01559n555M2885R7715J07796k5280j37477J06706
2078A89571j3770M8829k73506R1907J77040N2175o2792j75124j41632J34321n9162
2067c2143n763r0768j16680q3359J17026M748J7450J14537L018Q2182m2054N749
$$ plain form
2145 -34080 -70360 -211909 -79975 -83598 48871 162022 103819 15594 24090 -85584 -74567
2134 -74567 -64258 -27068 152392 26896 -131836 25252 -98515 -68142 -131520 -166283 -36072
2123 -36072 92939 163350 44469 -34350 -35473 100241 -8621 153114 -1431 -124516 -49234
2112 -49234 3617 34274 -44513 -123868 -45755 103472 14541 -73569 -198978 -144807 -149143 2007
2100 2007 -90942 -212148 68923 34012 -115987 155371 67914 -61176 8453 344439 388780
2089 388780 64013 160523 104340 2781 -2774 40111 137826 245622 220342 82865 189571
2078 189571 175801 224630 -48876 43031 220071 272246 209454 34330 -107302 27019 -32143
2067 -32143 -37906 -128674 -245354 -328713 -211687 -206939 -189489 -74952 -71934 10248 -31806 -26057
2055b6057K0712j29613j03092M1187K3718r3584K1090J81710m1759P9059j00205
2044a26834m7050J80474J27497j59401M7078k50974j71677J11326K2698J41707
2034a25156K10768p7168p7410Q8748J1805j44017Q2239l33331P1829K7023J05880
2023a58790J53396N1641L450j00443J3160O126r6564J1274j42854p2275R5463
2012b36416J02022K59988j25672k39817L48336R7179j3212j23866r9510k4090
2002e5058J7241J40752J5794K00613k31808j25629l5033N7150j14038M5541J88545
1991A04070j58334l6609j19711L7837k51743J98518J24786q7451J1691J47691
1981b9255r2263j05626j3063k2635J23565K1525j26666m5664r3800O4275R2336
$$ plain form
2055 -26057 -5345 -134958 -238050 -196863 -173145 -266729 -245639 -63929 -105688 -26629 -126834
2044 -126834 -173884 6590 134087 -25314 21764 -229210 -400887 -289561 -266863 -125156
2034 -125156 85612 8444 -68966 19782 31587 -112430 -30191 -363522 -291693 -264670 -158790
2023 -158790 -5394 46247 49697 -50746 -37586 -31460 -128024 -116750 -259604 -331879 -236416
2012 -236416 -134394 125594 -78 -239895 108441 205620 192408 68542 -30968 -55058
2002 -55058 -37817 102935 118729 319342 87534 -38095 -73128 -15978 -130016 -84475 104070
1991 104070 -54264 -90873 -210584 -172747 -424490 -225972 -101186 -188637 -176946 -29255
1981 -29255 -121518 -227144 -240207 -262842 -139277 -117752 -244418 -290082 -383882 -319607 -227271
1970b27271P5840M9358J04334K02178j43348N29p1773j21700j00092K9748J56799
1959d5398L8693r0687p0582P3077M7196j10097j4821M5469O8074J0047j4261m4562
1947a07852J13506K1022o7925j50536J83188M3416j53657Q5931K28123j46066
1937D9150k40175O7628O5509j97658J6925K14805n4197M3506J33629j87574N048
1926h3404J22090j59219j54580m516k0830L7022Q2482J16222R233j4542k62174
1915c32216J2469K29820L3584k76816L90323m0198j87631J35640J17164p7001
1905E138j51649O6711k9003M5904l3213k4725o5511L2448Q4832P3039J62478q1037
1893H5412j81346n5659j18826J5061N6815o8082J44958O1923J8894m0606j37043
$$ plain form
1970 -227271 -151431 -102073 2261 204439 61091 61620 -10153 -131853 -231945 -202197 -45398
1959 -45398 -6705 -97392 -167974 -94897 -47701 -157798 -172619 -127150 -59076 -49029 -63290 -107852
1947 -107852 5654 26676 -41249 -191785 -8597 34819 -118838 -32907 195216 49150
1937 49150 -191025 -123397 -57888 -255546 -238621 -23816 -78013 -34507 99122 -88452 -83404
1926 -83404 38686 -120533 -275113 -279629 -300459 -263437 -180955 -64733 -55500 -70042 -332216
1915 -332216 -319747 -89927 -56343 -333159 57164 16966 -170665 -35025 82139 5138
1905 5138 -146511 -79800 -108803 -62899 -96112 -120837 -186348 -153900 -69068 3971 166449 85412
1893 85412 -95934 -151593 -270419 -255358 -198543 -266625 -121667 -59744 -40850 -81456 -218499
1882b18499J15920J42019j17650j8232j25647m1577j58390j6457K30018j6622
1872b25117J08094J11604O8778m4665J02043O4628k05302K865j01554j44970J49232
1861a14364J24929J39329q0683l30979J34226K60553J0191R6531k53454K2218
1851H497j13334n1917r9080J62036K6985q428R3155q4581o5228J72807R6227j80641
1839d3502j11832o5389Q8982J25182p8957m9288o6987J67711J35478j41128J51681
1828A11951N1596l03344J01742L7593m5206j69231O5626J93909o719q2841k00707
1817b45631J91850J59841O8312q1422k2362j49969R7954q9508j1635q9475K20799
1806D8754j5853l52708K44814Q9794L9639o5549O0640n3954J19109j54203j93207
$$ plain form
1882 -218499 -102579 39440 -78210 -96442 -222089 -263666 -422056 -438513 -208495 -225117
1872 -225117 -117023 -5419 63359 18694 120737 185365 -19937 -17072 -118626 -263596 -114364
1861 -114364 10565 149894 69211 -261768 -127542 133011 143202 239733 -13721 8497
1851 8497 -104837 -156754 -255834 -93798 -66813 -75241 17914 -66667 -131895 40912 137139 -43502
1839 -43502 -155334 -220723 -131741 -6559 -85516 -134804 -201791 -34080 101398 -39730 111951
1828 111951 163547 -139797 -38055 -462 -45668 -214899 -149273 44636 37917 -44924 -245631
1817 -245631 -53781 106060 174372 92950 70588 -79381 18573 -70935 -82570 -172045 48754
1806 48754 32901 -319807 -74993 14801 54440 -11109 49531 -4423 114686 -39517 -232724
1795b32724J28901J04032p1657j09960J4499m003j08583M045L6348J53507J57805
1784G2210j99955k7478K17969j50162K35626j43268m5667J2717M3507R5778K343
1773A13620n7398o6232o2570J04461n9999o6052J23351m4449j09591n9224K13363
1762B9280n8270l6994j95721K5517n2066l3552N7975L0750k8303j02035J57137
1751b06282p6506L87715o5874j95571K54036j30902r6040r555k0935j57674K4565
1740b93023o8188J84121l1023R1606N8451P3829j48581q2000n9645O2803n8611
1729b70261L09865o1856k53460r7134J84100J85318l9093J07557j17565p6504
1719a29033l0709J65187J483k95946p4266Q0878P8901m7159M6920k03370J9501
$$ plain form
1795 -232724 -103823 209 -71448 -181408 -166909 -170912 -279495 -275450 -239102 -85595 72210
1784 72210 -127745 -155223 62746 -87416 148210 4942 -40725 -28008 15499 111277 113620
1773 113620 56222 -10010 -72580 31881 -28118 -94170 29181 -15268 -124859 -184083 29280
1762 29280 -28990 -65984 -261705 -236188 -288254 -321806 -263831 -233081 -261384 -363419 -206282
1751 -206282 -282788 104927 39053 -156518 97518 -33384 -129424 -138979 -159914 -317588 -293023
1740 -293023 -361211 -177090 -208113 -116507 -58056 15773 -132808 -214808 -274453 -211650 -270261
1729 -270261 39604 -22252 -275712 -372846 -188746 -3428 -42521 65036 -52529 -129033
1719 -129033 -159742 5445 6928 -289018 -363284 -282406 -203505 -250664 -203744 -407114 -387613
1708c87613K21295J16941J91729J2127k4155j62669j80637N2375L8101l2711M0708
1697a14509J2239j72231J98481N2732k05057j059N1469R6611J5971P7825j15268
1686a02796r2196p4355L14643p979J68426j24135j21220Q7939J73922l2801n3764
1675A35684q1489L1579K4139j96631L0060n1974n9212n4774M2643r534K9831J4570
1663a45108p8067p6732m3998J53553J31331p533j12944k02612R1905M9338p6280
1652c17147K14920J46390q3410j63418R928j07065l3448P0109J66103j09603k7245
1641b33886R5461j07447J92006m1820R69L5383j45799q631P5438J12229j9370
1630d5467M3417J05163o1894j61567j09297J32406j97758K9235L1973j04778J56008
$$ plain form
1708 -387613 -166318 -49377 142352 154479 130324 -32345 -212982 -160607 -122506 -155217 -114509
1697 -114509 -102270 -274501 -76020 -23288 -228345 -229404 -177935 -81324 -65353 12472 -102796
1686 -102796 -194992 -269347 45296 37317 205743 81608 -39612 48327 222249 189448 135684
1675 135684 54195 85774 109913 -86718 -56658 -108632 -167844 -222618 -179975 -189509 -159678 -145108
1663 -145108 -223175 -299907 -343905 -190352 -59021 -66554 -179498 -382110 -290205 -240867 -317147
1652 -317147 -102227 44163 -39247 -202665 -192737 -299802 -333250 -263141 -97038 -206641 -233886
1641 -233886 -138425 -245872 -53866 -95686 -94717 -59334 -205133 -213764 -138326 -26097 -45467
1630 -45467 -2050 103113 41219 -120348 -229645 -97239 -294997 -265762 -233789 -338567 -182559
1619a82559J12863j55282P199J50660R8783J9966M5550P8294j10698j61311Q130
1608h8405j29071J40502J8320k03408k1282J13802L06612j91390O0547N2963j27463
1597f8273k1435l5378P5995r1130K3034m9722j12459K67695m5145j7805O5889
1586h734m1672k5980l2622J27201j85088O1699J29328o3995j04742q0013J81701
1575d2917K58866q1575k87778K3681q3834O5159l1797J75089R229q1679J70644
1564I3088j0757O6504q5602L3726o9607K4690Q2289n0469j33495j5226O2113p4876
1552g7622r0030J61862j05353j04819L9794m9094r5910M1892L3937l1305j8522
1541b95170j4485J95181J38501q3744r4778L5658j42524M8406j54894R4430L3419
$$ plain form
1619 -182559 -69696 -224978 -217779 -67119 31664 51630 97180 175474 64776 -96535 -88405
1608 -88405 -217476 -76974 -58654 -262062 -283344 -169542 137070 -54320 6227 59190 -68273
1597 -68273 -89708 -125086 -49091 -140221 -117187 -166909 -279368 -11673 -56818 -74623 -8734
1586 -8734 -50406 -76386 -109008 18193 -166895 -105196 24132 -39863 -144605 -224618 -42917
1575 -42917 215949 134374 -153404 -129723 -213557 -148398 -180195 -5106 4123 -77556 93088
1564 93088 82331 148835 63233 96959 27352 52042 134331 83862 -49633 -64859 -2746 -77622
1552 -77622 -167652 -5790 -111143 -215962 -176168 -225262 -321172 -279280 -245343 -276648 -295170
1541 -295170 -309655 -114474 24027 -59717 -154495 -118837 -261361 -212955 -367849 -273419 -240000
1530b40000K37639p0873M9311L675k18549J67291r1284O1368N7257p4492J40775
1519B2118l2021k22228k0715K1265r7309K2373J10562R6726L8304j12104J8877
1508a54152j85560N0005L67699j75864k75462J6245J33161K40294o9481N995N2242
1497E122L3892K9632M9669j04888k13244k7343N7743K06371K40259k13432k09268
1486a45487r8109J4999J32056p345j3920r3595J13150k8943K3503j20985L8355
1475a86321n6199P9286J44446k963K03205n9284l82077R6206R0588r0012P6799
1464h6326J39678o0192J9631l4584q0505m754r8360O1829n614J6557J13368J20537
1452A01265k14631Q6942M0549J2553O9820J1396k00623m3996J5655J42911p2489
$$ plain form
1530 -240000 -2361 -73234 -23923 -20248 -238797 -71506 -162790 -101422 -44165 -118657 22118
1519 22118 -9903 -232131 -252846 -231581 -328890 -306517 -195955 -99229 -60925 -173029 -154152
1508 -154152 -339712 -289707 77992 -97872 -373334 -357089 -223928 16366 -53115 -47120 5122
1497 5122 39014 68646 118315 13427 -199817 -227160 -169417 36954 277213 63781 -145487
1486 -145487 -243596 -228597 -96541 -103886 -117806 -211401 -98251 -127194 -103691 -224676 -186321
1475 -186321 -242520 -163234 -18788 -21751 181454 122170 -259907 -163701 -73113 -163125 -86326
1464 -86326 53352 -6840 12791 -21793 -102298 -107052 -205412 -143583 -149197 -132640 -19272 101265
1452 101265 -113366 -26424 14125 26678 96498 107894 -92729 -136725 -121070 21841 -50648
1441e0648l5605J65613n0109q8741L05683o0522k01135k8038o1553l3927O3696
1430g5286K37878k9953j87999k7208k43636O1604p9712r0198K41876N9535m0536
1419a73635L4425j67266O1968P0511P5696Q2568l7875m2562k8493J6686m9601
1408a57578J79937R6350j77172N4614J41556k92274Q5959J17004j12585J07288
1398D3099j3284K1061J35317j96217J46863o1771n5432j0148j38646q2468L5867
1387a75759J44546l3696K06161j7326l86376p5421J13721j180P5961K6652N4112
1376f8605j26881M3026O7296J52992J50043n7795p0119m5843P1284p2730N673
1365D8341p986L5352j59819O9606j09133L5832j40498q0540K72725K57057k1995
$$ plain form
1441 -50648 -86253 79360 29251 -59490 246193 185671 -15464 -43502 -105055 -138982 -75286
1430 -75286 162592 132639 -55360 -82568 -326204 -264600 -344312 -434510 -192634 -133099 -173635
1419 -173635 -139210 -306476 -244508 -173997 -98301 -15733 -53608 -96170 -124663 -107977 -157578
1408 -157578 22359 118709 -58463 -3849 137707 -154567 -68608 48396 -64189 43099
1398 43099 29815 50876 186193 -10024 136839 75068 19636 9488 -129158 -211626 -175759
1387 -175759 -31213 -64909 141252 123926 -262450 -337871 -224150 -225330 -149369 -122717 -68605
1376 -68605 -195486 -152460 -85164 67828 217871 160076 89957 44114 115398 42668 48341
1365 48341 40355 75707 -84112 -14506 -123639 -87807 -228305 -308845 -36120 220937 198942
1354A98942n3577O326q9435q3263P1067l3925l1034k29130J02729J37898j33506
1343a36908p9917J69651J84181k19095J72627L3610j84667j4491M6429J58961
1333A30381j46571J46702n3639j75273j30593o2336J6287K66842J29196L6989
1323A57985j58825O9367M1091j40684J78724j46713M5141J18521q5369l31469
1313b52231l8510Q5394K4847j73082L6944K26816K36798j00262k1529j43190k71502
1302c89507K37084J50630j65624K69720P3840j24664j17675k19456O3106K44342
1292B1796p3960l1814M9791j42387L11054M958m2555J18491j09913n1347o4031
1281i917J52307m8629Q0395l9533j60485N1997J36268q9708k12129n7786K47752
$$ plain form
1354 198942 145365 151691 62256 -21007 50060 16135 -14899 -244029 -141300 -3402 -136908
1343 -136908 -216825 -47174 137007 -82088 90539 124149 -60518 -75009 -28580 130381
1333 130381 -16190 130512 76873 -98400 -228993 -291329 -275042 -8200 120996 157985
1323 157985 -840 68527 109618 -31066 147658 945 46086 164607 79238 -252231
1313 -252231 -290741 -205347 -180500 -353582 -316638 -89822 146976 46714 25185 -118005 -389507
1302 -389507 -152423 -1793 -167417 102303 176143 51479 -66196 -285652 -222546 21796
1292 21796 -52164 -83978 -34187 -176574 134480 139438 96883 215374 105461 54114 -9917
1281 -9917 142390 93761 174156 134623 -25862 26135 162403 72695 -139434 -197220 50532
1270E0532j22216r8447q5141N8767O1802N302j35316P9258J34790Q1298K42524
1259B73153j49619k8851m3088k66997K14659m7305L7618P9176o4132q5375j08291
1248a89052J03848J73692j8757M7578Q8400k77136N5373m1177J61388J956J02557
1237B08670j28155k04122L6064Q710j90960R8685N1190Q3556j32944K41744J80606
1226B53044k25863R7098q3790j60664J53182j18006k8434P68o821J56577q2905
1215d5814j47890o2891J16405M2765l6698J78003J06088j76711j71996l1633J45401
1204h4971J8020M3783J0488m8144Q5010j06718J13089P8864k04465j7971k79113
1193c92128R9170p7644J74449J1985l1687J56039m2572J1847k1985j53859J17499
$$ plain form
1270 50532 -71684 -170131 -255272 -196505 -134703 -129401 -264717 -185459 -50669 30629 273153
1259 273153 123534 94683 51595 -215402 -743 -48048 -10430 68746 4614 -80761 -189052
1248 -189052 -85204 88488 69731 117309 205709 -71427 -16054 -57231 104157 106113 208670
1237 208670 80515 -123607 -87543 -78833 -269793 -171108 -119918 -36362 -169306 72438 253044
1226 253044 27181 124279 40489 -120175 33007 -84999 -113433 -112665 -119486 37091 -45814
1215 -45814 -193704 -256595 -140190 -97425 -134123 43880 149968 -26743 -198739 -230372 -84971
1204 -84971 -66951 -23168 -12680 -60824 24186 -82532 30557 109421 -95044 -113015 -392128
1193 -392128 -292958 -370602 -196153 -184168 -215855 -59816 -102388 -90541 -112526 -266385 -148886
1182a48886K36827j07382j47144J18987J1063p1902J94708Q8771R7969p5722k43417
1171d6128j98036j48568Q7888q083J35576P8845R8797K20601j88328M6738J56126
1160B35428j17992J13486j20899o8098o1932l6857K00469o6735R4499j51460l1538
1149a1629r939O5373n7348l5285J07035r1019j29156j5468J44934L3039o3605
1138f3068j17793m9339m1379K18048L9252M2817O1795j07586O2972p7647O2472
1127C0544o7191K2273M0225l4521j73832R1819J21334N3891k50568K8094J02106
1116c5826n672J22703j01399q4429J60620p2593k60580L9994l2018J26864l5405
1105a77741K00434J70400k3494M171J03978L7136j46004j08042j88173r519K6121
$$ plain form
1182 -148886 87941 -19441 -166585 -47598 -36535 -108437 86271 175042 273011 197289 -46128
1171 -46128 -244164 -392732 -304844 -312927 -177351 -98506 291 220892 32564 79302 235428
1160 235428 117436 230922 110023 41925 -20007 -56864 143605 76870 171369 19909 -11629
1149 -11629 -21568 43805 -13543 -48828 58207 -32812 -161968 -177436 -32502 537 -63068
1138 -63068 -180861 -230200 -271579 -53531 -14279 28538 90333 -17253 45719 -31928 30544
1127 30544 -36647 -14374 25851 -8670 -182502 -90683 30651 84542 -166026 -137932 -35826
1116 -35826 -41498 81205 -20194 -104623 55997 -16596 -277176 -237182 -269200 -142336 -177741
1105 -177741 22693 193093 169599 173770 277748 314884 168880 60838 -127335 -136854 -110733
1094a10733K0951n0792J37773J06879J0463j87033q6355n2601m9082L32734K4808
1083I7012p8975J7068J0201O523O0084j41296J9185P3948n4238p3041J47148O4980
1071A48599j92115r8717L079P5861K8304M4743m6628Q4858K0647L4252L7900l5859
1059A04924l1996o3263j48861r0343j4298O2166J20880q0506K46100J33733p798
1048B30738j48263L8481j83971o7831J58541Q955j14703J23138Q859l75045j34902
1037d56003M22990N01Q9339Q1178l21801J11483q5969P4474J58433n5837m458
1026A4330O4779n4153j54007r5176L26197j27369r4674o0770k2152R7K02148K18357
1014B17607j67432k99094K3824J85649r4821P3981J93236j0400p0595k19471j70009
$$ plain form
1094 -110733 -89782 -140574 -2801 104078 114541 -72492 -158847 -211448 -260530 72204 97012
1083 97012 18037 35105 45306 51829 111913 -29383 -10198 63750 9512 -63529 83619 148599
1071 148599 -43516 -142233 -139154 -63293 -34989 9754 -36874 47984 68631 102883 140783 104924
1059 104924 72928 9665 -139196 -229539 -243837 -181671 -60791 -141297 104803 238536 230738
1048 230738 82475 120956 -63015 -130846 27695 36650 -78053 45085 53944 -321101 -456003
1037 -456003 -33013 -32512 56827 138005 -183796 -72313 -158282 -83808 74625 18788 14330
1026 14330 79109 24956 -129051 -224227 101970 -25399 -120073 -180843 -202995 -202898 -750 217607
1014 217607 50175 -248919 -225095 -39446 -134267 -60286 132950 122550 51955 -167516 -337525
1003c37525J14401J64117J03255k03186R1370K12206j52j82481k19429j69355
993d26779K69731m4026n4993K53300N9625j32251k41726O8881p8165K26110J82474
982H2181o7555L29M6641r467N269m4074o9691q6784J18172J26617q5416q6145
970f9923O9662j75428o2328J66266J50270j09490j8193J41398k25368j18007q5359
959c36500K80009Q2287J43586P9859o5813j64050Q1875Q6258n3019k34810r5174
948a95492K90196Q2844k60813o9161m1068J0211Q1188K4614p897k2425q80J20564
936A1881n167k52299Q1838L8953p9648J23959M0249M2511k22552K9099J81827
925i349j12756O5676J33239j9893k59140J18000p408r8244o4631J33666J38194
$$ plain form
1003 -337525 -223124 -59007 44248 -158938 -67568 144638 144486 -37995 -257424 -426779
993 -426779 -157048 -201074 -256067 -2767 56858 -75393 -317119 -248238 -326403 -100293 82181
982 82181 14626 14955 61596 52129 57398 13324 -56367 -143151 -24979 101638 16222 -69923
970 -69923 -261 -175689 -238017 -71751 78519 -30971 -49164 92234 -133134 -251141 -336500
959 -336500 -56491 25796 169382 249241 183428 19378 101253 187511 134492 -100318 -195492
948 -195492 94704 177548 -83265 -152426 -193494 -183283 -102095 -77481 -85378 -107803 -108683 11881
936 11881 6714 -245585 -163747 -124794 -204442 -80483 -40234 2277 -220275 -191176 -9349
925 -9349 -122105 -56429 76810 56917 -202223 -84223 -91631 -189875 -254506 -120840 17354
914A7354J81002p6061j70372J25242J38944N973k04214L6677r7894o3935J9177
903h8107J94730J3766k52123r7109o9240J31452L0542K74633J5127n426p9028
892F9217j29230J27981J20830j38938J20781o1489k01769J27645N0636P692m6203
881D7153K11053j00352p7279Q091r7523J01471j9649o3843n7487J40119N6846
870A48600P886j29124r2178J58495j53307J28255J08090J59067k02977O9327J49865
859C51999k39025k54355L2557O5491j01555j34059Q5365J51454J27316J0416j58508
848f2904J42490N7181n9741J73990r4311p6152P4405n5000k5909k3040K66950
837C17959k42303O7548n1465Q8889M8799L4532j6960j42954q0159o8186P9445
$$ plain form
914 17354 198356 122295 -48077 77165 216109 222082 17868 54545 -43349 -107284 -88107
903 -88107 106623 120389 -131734 -228843 -298083 -166631 -136089 138544 153671 148245 69217
892 69217 -60013 67968 188798 49860 170641 109152 -92617 35028 85664 93356 47153
881 47153 258206 157854 80575 88666 -8857 92614 72965 9122 -48365 91754 148600
870 148600 156486 27362 -64816 93679 -59628 68627 176717 335784 132807 202134 351999
859 351999 112974 -141381 -108824 -43333 -144888 -278947 -193582 -42128 85188 95604 -62904
848 -62904 79586 136767 77026 251016 156705 80553 154958 99958 74049 51009 317959
837 317959 75656 143204 91739 180628 229427 263959 246999 104045 23886 -44300 35145
826C5145J28236N5380j24424r4347J79608j28191k123J40205j48112j17233J21088
815D5232l4716M0704n5639P650K28840j33899L3069L1089q9154j26615j67137
804b20576K24643J98829q2888j86546q1970J14023N7090m2470J05831l1029q0637
793b5700P4069j41775M6691J13224J80001k31487j24784k1859j24662K59413K26937
782B30068j01417j1890J57620m5039o6763O8817j10110O1881r5111k6582J48495
771B09969j25781P1785K36626m9411k27336k29396K48660q1002j07371K74836
761B21579P3515k27942o6732r7173J66744Q7659r2716j79908O7683J10348Q2162
750A45219m9917J13536m2842q1866M1070m3980P1351j91546P1430p9396J76834
$$ plain form
826 35145 163381 218761 94337 -10 179598 51407 49284 189489 41377 -75856 45232
815 45232 10516 51220 -4419 3231 232071 98172 131241 162330 73176 -53439 -220576
804 -220576 4067 202896 120008 -66538 -148508 -34485 22605 -19865 85966 54937 -25700
793 -25700 48369 -93406 -46715 66509 246510 15023 -109761 -131620 -256282 3131 230068
782 230068 128651 116761 274381 229342 162579 231396 121286 183167 88056 61474 209969
771 209969 84188 155973 392599 343188 115852 -113544 135116 54114 -53257 221579
761 221579 295094 67152 420 -96753 69991 157650 64934 -114974 -47291 63057 145219
750 145219 95302 208838 165996 84130 125200 81220 152571 -38975 32455 -46941 129893
739A29893L2569p2538K89902j98504j28754K38405K7489j49416o6778j01914J86826
728A87180J4477j89926M65r4839J8412J49660l8811J04218p9078J31931n2694
717A50995j58268j06085j18959J56182k2606o2019p532J50651l6191L80073j57439
706A68802k05745L3087l2412M1005m9838K6418m4605J737J64446q6143j3305M4924
694D8371k31860M3432q6071K60107K20471k25069J2543M5498N3878j10440q1423
683e0563J83194k00484N3180j22016r712L58611k02937K5360N405J66227p1266
672A34999n8769n0390M7385P8999l9215q3199J57395K38773m194l70540n2632
661a388L8235M726n4357L6934j21483r2254J91485K12102k37141q5791k9294m9993
$$ plain form
739 129893 162462 89924 379826 181322 52568 290973 318462 169046 102268 354 187180
728 187180 201657 11731 12196 -82643 -64231 85429 46618 150836 71758 203689 150995
717 150995 -7273 -113358 -232317 -76135 -98741 -160760 -168292 -17641 -53832 326241 168802
706 168802 -36943 -3856 -36268 4737 -45101 -18683 -63288 -61551 102895 16752 3447 48371
694 48371 -183489 -140057 -226128 33979 254450 29381 41924 87422 141300 30860 -50563
683 -50563 132631 -67853 -14673 -136689 -146401 212210 9273 34633 40038 206265 134999
672 134999 76230 25840 73225 152224 113009 29810 187205 425978 421784 51244 -1388
661 -1388 36847 41573 -12784 24150 -97333 -189587 1898 214000 -23141 -108932 -138226 -188219
649a88219J6099J70321N9168J1241M9288p306J6871J15779K7081j95871N5941
638A30393L8178J62964r8855J80134K79420j99179k38523J68542j64196j10712
628A48166m3587j48783J40690R2299l9839j11458O5192J67027l6959j19392n4731
617E8625j11004J04440q4921M6743R4391J3318j11500P0204k3229r7796J99222
606A58493J176m9778J9907M6874k07476Q7777L3392j33835J72795n762J650n815
594A19398j74177k29901L3215K74425n6178J75669j51283L5213J06619O128m8522
583I0606j07926j23751K09825P3602k1970l67315J22142J6885R3781O9493R779
$$ plain form
649 -188219 -172120 -1799 57369 68610 117898 110592 127463 243242 270323 74452 130393
638 130393 168571 331535 232680 412814 692234 493055 254532 423074 258878 148166
628 148166 104579 -44204 96486 188785 148946 37488 102680 269707 232748 113356 58625
617 58625 -52379 52061 -32860 13883 108274 121592 10092 80296 57067 -40729 158493
606 158493 159669 109891 129798 176672 -30804 56973 90365 -43470 129325 123563 125213 119398
594 119398 -54779 -284680 -251465 22960 -33218 142451 -8832 26381 133000 139128 90606
583 90606 -17320 -141071 68754 142356 120386 -246929 -124787 -107902 -14121 55372 65151
$$ [...]
##END NTUPLES=NMR SPECTRUM
##END=
