##TITLE=1H_CA-9213-1
 CDCl3
 8 sc, 
 20.11.2023
##JCAMPDX= 6.0         $$ Bruker NMR JCAMP-DX V2.0
##DATA TYPE= NMR SPECTRUM
##DATA CLASS= NTUPLES
##ORIGIN= UXNMR, Bruker Analytische Messtechnik GmbH
##OWNER= root
$$ XWIN-NMR		Version 3.5
$$ Mon Nov 20 14:38:56 2023 Russian Standard Time (UT+4h)  she@DPX200
##.OBSERVE FREQUENCY= 200.1313
##.OBSERVE NUCLEUS= ^1H
##.ACQUISITION MODE= SIMULTANEOUS
##.ACQUISITION SCHEME= undefined
##.AVERAGES= 8
##.DIGITISER RES= 18
##SPECTROMETER/DATA SYSTEM= spect
##.PULSE SEQUENCE= zg30
##.SOLVENT NAME= D2O
##.SHIFT REFERENCE= (INTERNAL, D2O, 0, 15.467)
##AUDIT TRAIL= $$ (NUMBER, WHEN, WHO, WHERE, WHAT)
$$ ##TITLE= Audit trail, XWIN-NMR		Version 3.5
$$ ##JCAMPDX= 5.01
$$ ##ORIGIN= Bruker BioSpin GmbH
$$ ##OWNER= she
$$ F:/spectra/data/she/nmr/H-F/1/pdata/1/auditp.txt
$$ ##AUDIT TRAIL=  $$ (NUMBER, WHEN, WHO, WHERE, WHAT)
(   1,<2023-11-20 14:37:26.50 +0400>,<she>,<DPX200>,
      <created by zg, POWCHK disabled, PULCHK disabled
       configuration hash MD5:
       00 E9 B6 7A A2 85 ED C7 34 08 36 98 17 FE 4E 26
       data hash MD5: 16K
       40 94 44 36 57 13 62 C6 53 9D 43 CE 3F F9 53 E0>)
(   2,<2023-11-20 14:37:28.93 +0400>,<she>,<DPX200>,
      <Start of raw data processing
       efp BC_mod = 2 LB = 0.24 FT_mod = 6 PKNL = 1 PHC0 = -23866.21 PHC1 = 5.85269 SI = 16K 
       data hash MD5: 16K
       BA D2 A4 84 8B 01 D5 48 FE D4 BA 09 59 F7 58 D3>)
(   3,<2023-11-20 14:37:52.67 +0400>,<she>,<DPX200>,
      <pk PHC0 = -4.02318 PHC1 = 5.6 
       data hash MD5: 16K
       61 A6 5F DA 01 FB CE 02 B8 73 40 D6 6D 98 AB FE>)
(   4,<2023-11-20 14:37:56.31 +0400>,<she>,<DPX200>,
      <abs ABSG = 5 
       data hash MD5: 16K
       84 72 1E 98 63 D5 E2 5D 46 A9 3D D8 DB AE 2E 94>)
(   5,<2023-11-20 14:38:10.62 +0400>,<she>,<DPX200>,
      <pk PHC0 = -0.4632649 PHC1 = 0.6 
       data hash MD5: 16K
       74 98 AC BE 91 8C 19 AB B1 C9 02 A7 D0 85 31 0F>)
(   6,<2023-11-20 14:38:14.07 +0400>,<she>,<DPX200>,
      <abs ABSG = 5 
       data hash MD5: 16K
       E6 6C 79 0B 60 7B CD 41 6E 20 FD 99 26 6E 48 DF>)
$$ ##END=
$$ 
$$ hash MD5
$$ AF D3 1A 00 7F 36 0B 65 83 FC 67 41 68 63 54 53
##$RELAX= 
##$RELAX= 
##$RELAX= 
##$RELAX= 
##$RELAX= 
##$RELAX= 
$$ Bruker specific parameters
$$ --------------------------
##$DU= <F:/spectra>
##$EXPNO= 1
##$NAME= <H-F>
##$PROCNO= 1
##$TYPE= <nmr>
##$USER= <she>
##$AMP= (0..31)
100 100 100 100 100 100 100 100 100 100 100 100 100 100 100 100 100 100 
100 100 100 100 100 100 100 100 100 100 100 100 100 100 
##$AQSEQ= 0
##$AQ_mod= 1
##$AUNM= <au_zg>
##$AUTOPOS= <>
##$BF1= 200.13
##$BF2= 200.13
##$BF3= 200.13
##$BF4= 200.13
##$BF5= 200.13
##$BF6= 200.13
##$BF7= 200.13
##$BF8= 200.13
##$BYTORDA= 1
##$CFDGTYP= 0
##$CFRGTYP= 5
##$CHEMSTR= <none>
##$CNST= (0..31)
1 1 145 1 1 1 1 1 1 1 1 1 1 1 1 1 1 1 1 1 1 1 1 1 1 1 1 1 1 1 1 1 
##$CPDPRG= <>
##$CPDPRG1= <>
##$CPDPRG2= <>
##$CPDPRG3= <>
##$CPDPRG4= <mlev>
##$CPDPRG5= <mlev>
##$CPDPRG6= <mlev>
##$CPDPRG7= <mlev>
##$CPDPRG8= <mlev>
$$ [...]
##$SUBNAM3= <"">
##$SUBNAM4= <"">
##$SUBNAM5= <"">
##$SUBNAM6= <"">
##$SUBNAM7= <"">
##$SUBNAM8= <"">
##$SUBNAM9= <"">
##$SW= 18.0517328524113
##$SWIBOX= (0..15)
0 0 2 0 0 0 0 0 0 0 0 0 0 0 0 0 
##$SW_h= 3612.71676300578
##$TD= 16384
##$TD0= 1
##$TE= 0
##$TE2= 300
##$TE3= 300
##$TEG= 300
##$TL= (0..7)
0 120 120 120 120 120 120 120 
##$TP= (0..7)
150 150 150 150 150 150 150 150 
##$TP07= 0
##$TPNAME0= <>
##$TPNAME1= <>
##$TPNAME2= <>
##$TPNAME3= <>
##$TPNAME4= <>
##$TPNAME5= <>
##$TPNAME6= <>
##$TPNAME7= <>
##$TPOAL= (0..7)
0.5 0.5 0.5 0.5 0.5 0.5 0.5 0.5 
##$TPOFFS= (0..7)
0 0 0 0 0 0 0 0 
##$TUNHIN= 0
##$TUNHOUT= 0
##$TUNXOUT= 0
##$USERA1= <user>
##$USERA2= <user>
##$USERA3= <user>
##$USERA4= <user>
##$USERA5= <user>
##$V9= 5
##$VALIST= <valist>
##$VCLIST= <CCCCCCCCCCCCCCC>
##$VD= 0
##$VDLIST= <DDDDDDDDDDDDDDD>
##$VPLIST= <PPPPPPPPPPPPPPP>
##$VTLIST= <TTTTTTTTTTTTTTT>
##$WBST= 1024
##$WBSW= 4
##$XGAIN= (0..3)
0 0 0 0 
##$XL= 0
##$YL= 0
##$YMAX_a= 408418
##$YMIN_a= -478522
##$ZGOPTNS= <>
##$ZL1= 120
##$ZL2= 120
##$ZL3= 120
##$ZL4= 120
##$ABSF1= 15.38109
##$ABSF2= -2.670757
##$ABSG= 5
##$ABSL= 3
##$ALPHA= 0
##$AQORDER= 0
##$ASSFAC= 0
##$ASSFACI= 0
##$ASSFACX= 0
##$ASSWID= 0
##$AUNMP= <proc_1d>
##$AZFE= 0.1
##$AZFW= 0.1
##$BCFW= 0
##$BC_mod= 2
##$BYTORDP= 0
##$COROFFS= 0
##$CY= -3
##$DATMOD= 1
##$DC= 0
##$DFILT= <>
##$DTYPP= 0
##$F1P= 0
##$F2P= 0
##$FCOR= 1
##$FTSIZE= 16384
##$FT_mod= 6
##$GAMMA= 0
##$GB= 0
##$INTBC= 1
##$INTSCL= 3.70164e-10
##$ISEN= 128
##$LB= 0.24
##$LEV0= 0
##$LPBIN= 0
##$MAXI= 10000
##$MC2= 0
##$MEAN= 0
##$ME_mod= 0
##$MI= 1.114404
##$NCOEF= 0
##$NC_proc= -7
##$NLEV= 6
##$NOISF1= 3.799351
##$NOISF2= 2.8
##$NSP= 0
##$NTH_PI= 0
##$NZP= 0
##$OFFSET= 15.46703
##$PC= 1
##$PHC0= -23870.69
##$PHC1= 12.05269
##$PH_mod= 1
##$PKNL= yes
##$PPARMOD= 0
##$PSCAL= 0
##$PSIGN= 0
##$REVERSE= no
##$SF= 200.130010940455
##$SI= 16384
##$SIGF1= 3
##$SIGF2= 2
##$SINO= 5.538805
##$SIOLD= 16384
##$SREGLST= <1H.CDCl3>
##$SSB= 0
##$STSI= 16384
##$STSR= 0
##$SW_p= 3612.71676300578
##$SYMM= 0
##$S_DEV= 0
##$TDeff= 16384
##$TDoff= 0
##$TI= <>
##$TILT= no
##$TM1= 0
##$TM2= 0
##$TOPLEV= 0
##$USERP1= <user>
##$USERP2= <user>
##$USERP3= <user>
##$USERP4= <user>
##$USERP5= <user>
##$WDW= 1
##$XDIM= 16384
##$YMAX_p= 429947865
##$YMIN_p= -569881
$$ End of Bruker specific parameters
$$ ---------------------------------
##NTUPLES= NMR SPECTRUM
##VAR_NAME=  FREQUENCY,     SPECTRUM/REAL,   SPECTRUM/IMAG
##SYMBOL=    X,             R,               I
##VAR_TYPE=  INDEPENDENT,   DEPENDENT,       DEPENDENT
##VAR_FORM=  AFFN,          ASDF,            ASDF
##VAR_DIM=   16384,         16384,           16384
##UNITS=     HZ,            ARBITRARY UNITS, ARBITRARY UNITS
##FACTOR=    0.220516191357247, 1,           1
##FIRST=     3095.41679736728, 0,            0
##LAST=      -517.299965638499, 0,           0
##MIN=       -517.299965638499, -569881,     0
##MAX=       3095.41679736728, 429947865,    0
$$ Real data points
##PAGE= N=1
##DATA TABLE= (X++(R..R)), XYDATA
$$ [...]
6416A518305j30982m449J24486J93881j95888l54840P1462L41291J13717p7711
$$ 1518305 1387323 1382874 1507360 1701241 1505353 1150513 1221975 1563266 1676983 1599272
6406A599272j02700l0571K24007k04145j85907m7050K1533J9474j26723J67952
$$ 1599272 1496572 1466001 1690008 1485863 1299956 1252906 1274439 1293913 1167190 1335142
6396A335142j259m9762k32892K81420K77729M8738L05178j25400j99142k0507
$$ 1335142 1333883 1284121 1051229 1332649 1610378 1659116 1964294 1838894 1639752 1619245
6386A619245L8335J53026j68414J14336J36809J20675j59067j01706J21827j67769
$$ 1619245 1657580 1810606 1642192 1756528 1893337 2014012 1854945 1753239 1875066 1707297
6376A707297M8019j53262o5204o2263N9201J00141m3223o086M6860L4449j48945
$$ 1707297 1755316 1602054 1536850 1474587 1533788 1633929 1590706 1584620 1631480 1665929 1516984
6365A516984K5172K7304J15759N4563j02343J07721j8026l76990J56755K87077
$$ 1516984 1542156 1569460 1685219 1739782 1637439 1745160 1727134 1350144 1506899 1793976
6355A793976l1526j13332K5648K7814j62434r879J97984q2424m2341J81548N8862
$$ 1793976 1762450 1649118 1674766 1702580 1540146 1530267 1728251 1645827 1603486 1785034 1843896
6344A843896j24626j57076J35566N6694J09848q4336l3983R3687J04859O3444
$$ 1843896 1719270 1562194 1697760 1754454 1864302 1779966 1745983 1839670 1944529 2007973
6334B007973J28563j13865k71301j68376K04143L333O6854O4748j12697n1223
$$ 2007973 2136536 2022671 1751370 1582994 1787137 1790470 1857324 1922072 1809375 1758152
6324A758152j5461R0801j1623j23458P5545M7704n3675J0565M0249j4127k08771
$$ 1758152 1742691 1833492 1821869 1698411 1773956 1821660 1767985 1778550 1818799 1804672 1595901
6313A595901j3340J33075J20534J11460q14o1665K59118l9766j54606J5167K7973
$$ 1595901 1582561 1715636 1836170 1947630 1946816 1885151 2144269 2104503 1949897 1965064 1993037
6302A993037r7492J7269j5709R2264J13662j41623J2244J68252N2928j85787j69477
$$ 1993037 1895545 1912814 1897105 1989369 2103031 1961408 1973652 2141904 2194832 2009045 1839568
6291A839568J50475K01269J24331K82045k37732k06996K18047m2404K8029J23196
$$ 1839568 1990043 2191312 2315643 2597688 2359956 2152960 2371007 2328603 2356632 2479828
6281B479828j41095J21998M0783m0325R8435J4081j1260o3590q4415J6405N6318
$$ 2479828 2338733 2460731 2501514 2461189 2559624 2573705 2562445 2498855 2414440 2430845 2487163
6270B487163K03959L9608J19688m6966p3217K12347K00984j86820K1218o2544
$$ 2487163 2691122 2730730 2850418 2803452 2730235 2942582 3143566 2956746 2977964 2915420
6260B915420j50881P7824N9842q754q7986l2504m4791J83533J56759N919R4753
$$ 2915420 2764539 2842363 2902205 2893451 2805465 2772961 2728170 2911703 3068462 3074381 3169134
6249C169134j44774j05998K76038O5677j95705Q5129Q2543K44537R9093k61592
$$ 3169134 3024360 2918362 3194400 3260077 3064372 3149501 3232044 3476581 3575674 3314082
6239C314082m6169J54086K4864L2579r6476j38400M2328j5932L0091J26448k2032
$$ 3314082 3267913 3421999 3446863 3479442 3382966 3244566 3286894 3270962 3301053 3427501 3405469
6228C405469j41375K28021j65935k4495Q1024k3181k41736J99107J02214j88901
$$ 3405469 3264094 3492115 3326180 3301685 3382709 3359528 3117792 3316899 3419113 3230212
6218C230212o8012k4980J00340p7240n2393M7815K1773Q1048m3833M8453J77696
$$ 3230212 3162200 3137220 3237560 3160320 3107927 3155742 3177515 3258563 3214730 3263183 3440879
6207C440879M0588k11438M8490N2210k2614Q7791p2243K61433j0968o6238p5810
$$ 3440879 3481467 3270029 3318519 3370729 3348115 3435906 3363663 3625096 3614128 3547890 3472080
6196C472080Q8342M0668k76952q0402O9942J54307l3356J9716J70088n372Q1809
$$ 3472080 3560422 3601090 3324138 3243736 3313678 3467985 3434629 3454345 3624433 3619061 3700870
6185C700870k1274j86897J94828j21997p9222J64257m095j1969j90138Q1311N727
$$ 3700870 3679596 3492699 3687527 3565530 3486308 3650565 3646470 3634501 3444363 3525674 3531401
6174C531401J5440k36419J3144J96270l7313p16J67590j9222K7874J10154M0301
$$ 3531401 3546841 3310422 3323566 3519836 3482523 3481807 3649397 3630175 3658049 3768203 3808504
6163C808504o0450N2436j15602r0304K18960L4936O4333k80749k6203p9902J81890
$$ 3808504 3748054 3800490 3684888 3594584 3813544 3848480 3912813 3632064 3605861 3525959 3707849
6152C707849k53496L63117R7900o1851K3993o3976q1405r2392K55444m8393M6942
$$ 3707849 3454353 3817470 3915370 3853519 3877512 3813536 3732131 3639739 3895183 3846790 3893732
6141C893732J1177J10996M8754k9097K13636P043n8842r7795j47377J1757k5685
$$ 3893732 3904909 4015905 4064659 4035562 4249198 4256241 4197399 4099604 3952227 3963984 3938299
6130C938299m597J47553J77512M0976j7991Q5949J73649r7302P5953m6043O7470
$$ 3938299 3933702 4081255 4258767 4299743 4281752 4367701 4541350 4444048 4520001 4473958 4541428
6119D541428R6910J5459O7751J49443O1089N5897j98171j36001J8435J02301P4742
$$ 4541428 4638338 4653797 4721548 4870991 4932080 4987977 4789806 4653805 4672240 4774541 4849283
6108D849283L613K35468j65711o0029Q9195j21946K29191J63804j8421J13589
$$ 4849283 4852896 5088364 4922653 4862624 4951819 4829873 5059064 5222868 5204447 5318036
6098E318036k9726R5345K5061j23409J24598Q9842K4927q1671J19817K9653p5426
$$ 5318036 5288310 5383655 5408716 5285307 5409905 5499747 5524674 5443003 5562820 5592473 5517047
6087E517047J7776K26882Q0199Q0925j23719J54868K60305O1416M2238J24716
$$ 5517047 5534823 5761705 5841904 5922829 5799110 5953978 6214283 6275699 6317937 6442653
6077F442653K26216Q767K7959L08253J19820j3234L8820J96253L27169o6054J78712
$$ 6442653 6668869 6677636 6705595 7013848 7133668 7120434 7159254 7355507 7682676 7616622 7795334
6066G795334K00071q1925L6948J58569n686J40370J6603K98473J02908M3352J68576
$$ 7795334 7995405 7913480 7950428 8108997 8103311 8243681 8260284 8558757 8661665 8705017 8873593
6055H873593P7515n9298J17840K67346J4682L14570K51854K89189R8176J96353
$$ 8873593 8951108 8891810 9009650 9276996 9291678 9606248 9858102 10147291 10245467 10441820
6045A0441820L72904K64659M47312M82308M86651M83461L77042L77139K63296
$$ 10441820 10814724 11079383 11526695 12009003 12495654 12979115 13356157 13733296 13996592
6036A3996592r6446k18821m49565N6553K62370Q7778o1532J48411O0610L17814
$$ 13996592 13900146 13681325 13231760 13288313 13550683 13638461 13576929 13725340 13785950 14103764
6026A4103764K9627J51982L68610P2694l7480J63570M33824J62728M78793j15162
$$ 14103764 14133391 14285373 14653983 14726677 14689197 14852767 15286591 15449319 15928112 15812950
6016A5812950L56388O30918N05361J80566O93488N33728N98270R61146M77261
$$ 15812950 16169338 16800256 17305617 17486183 18179671 18713399 19311669 20272815 20750076
6007B0750076O41914Q59831P72598N27646M70473N67573M77663L50355L38941
$$ 20750076 21391990 22251821 23024419 23552065 24022538 24590111 25067774 25418129 25757070
5998B5757070K72342J33669K20867K42538L86093P03182M23094M12380N57712
$$ 25757070 26029412 26163081 26383948 26626486 27012579 27715761 28138855 28551235 29108947
5989B9108947J025331J034914J088271J378160J367877J636973J707415K242323
$$ 29108947 30134278 31169192 32257463 33635623 35003500 36640473 38347888 40590211
5981D0590211K611306K772179L204366L534980L980837M764569M594286M706940
$$ 40590211 43201517 45973696 49178062 52713042 56693879 61458448 66052734 70759674
5973G0759674M449783L222993J859448N6615q28261j282566j027435n06724K00771
$$ 70759674 75209457 78432450 80291898 80348513 79520252 78237686 77210251 76703527 76904298
5964G6904298N77943J370836K052903K731456L491023L691155L472305L032033
$$ 76904298 77482241 78853077 80905980 83637436 87128459 90819614 94291919 97323952
5956I7323952J873021L64280r57080j496409j485131q20272k8227J104920K416958
$$ 97323952 99196973 99561253 98604173 97107764 95622633 94802361 94774134 95879054 98296012
5947I8296012L473132M872464O154876P382996Q613023R755830J0438636J0103700
$$ 98296012 101769144 106641608 112796484 120179480 128792503 138548333 148986969 159090669
5939A59090669Q669534N861002J633028k977291p283551j0916982j2860134j3008892
$$ 159090669 167760203 173621205 175254233 172276942 164993391 154076409 141216275 128207383
5931A28207383j2259319j1269957r614082q426360p117579o111446n405672m611081
$$ 128207383 115948064 104678107 95064025 86637665 79520086 73408640 68002968 63391887
5923F3391887m182224l168136k951613k673134k486603j908049j645246j449189
$$ 63391887 59209663 56041527 53089914 50416780 47930177 46022128 44376882 42927693
5915D2927693j387840j493812j068806j041285q63097p99255o51740m48252l91537
$$ 42927693 41539853 40046041 38977235 37935950 37072853 36273598 35621858 35173606 34782069
5906C4782069j53238j2734p5094L97379K32322M77434Q70888O83446Q39042R03521
$$ 34782069 34628831 34616097 34541003 34938382 35170704 35648138 36519026 37202472 38041514 38945035
5896C8945035J051694O86989N98425K17293o3202K083j3957L5480k09493l40364
$$ 38945035 39996729 40683718 41282143 41499436 41436234 41438317 41424360 41459840 41250347 40909983
5886D0909983K87442L22779L12326L63981O54498P05153O41953M58034L99524
$$ 40909983 41197425 41520204 41832530 42196511 42851009 43556162 44198115 44656149 45055673
5877D5055673O2968l10464l56751o71010o74437p81136m89920j83042l92878j94387
$$ 45055673 45118641 44808177 44451426 43780416 43105979 42324843 41834923 41651881 41259003 41064616
5867D1064616K26478K53161L82197Q08280J194758J063406J278152J196512R88780
$$ 41064616 41291094 41544255 41926452 42734732 43929490 44992896 46271048 47467560 48456340
5858D8456340K95442k75137o51949q28455j216621j118361r30099n71758k26433
$$ 48456340 48751782 48476645 47824696 46996241 45779620 44661259 43731160 43159402 42932969
5849D2932969k82092q2164N1281K76871K09401M31442M20328J2756Q3311J54273
$$ 42932969 42650877 42568713 42619994 42896865 43106266 43537708 43958036 43970792 44054103 44208376
5839D4208376k54463k29638m87764o37971o37264r49385j115437j076274q63111
$$ 44208376 43953913 43724275 43236511 42598540 41961276 41011891 39896454 38820180 37957069
5830C7957069p31171k54912k37619r4720Q8649M2466j4894j04493l88464o68959
$$ 37957069 37225898 36970986 36733367 36638647 36727296 36769762 36754868 36650375 36261911 35592952
5820C5592952p62596r02039q48070j136667j151082j165903r91563o95967n63040
$$ 35592952 34830356 33928317 33080247 31943580 30792498 29626595 28635032 27939065 27376025
5811B7376025n11041k16718j356n28914o04231o17153p66425n06210o59277q38040
$$ 27376025 26864984 26648266 26646910 26117996 25513765 24896612 24130187 23623977 22964700 22126660
5801B2126660p95981p73233r62521q85858o54922o41357m75922l31943k90042
$$ 22126660 21330679 20557446 19594925 18709067 18054145 17412788 16936866 16604923 16314881
5792A6314881l39525j7706l84214q7785J1586m62357m86777m28094n58045n60782
$$ 16314881 15975356 15957650 15573436 15485651 15497237 15034880 14548103 14120009 13561964 13001182
5782A3001182m70304m76467o70879p60401n46155l15003k96089l46007j44338
$$ 13001182 12530878 12054411 11383532 10623131 10076976 9761973 9465884 9119877 8975539
5773H975539k98622j91251l90194k98828p2848k06476l16803j32241k43062l47820
$$ 8975539 8676917 8485666 8095472 7796644 7723796 7517320 7200517 7068276 6825214 6477394
5763F477394j76027k9280j36306J74948k85230k29628K4131K0083R1767m25290
$$ 6477394 6301367 6272087 6135781 6310729 6025499 5795871 5820002 5840085 5931852 5506562
5753E506562j48358J90504j86723J53829N690j24009j72218j06054L0121O3711
$$ 5506562 5358204 5548708 5361985 5515814 5521504 5397495 5225277 5119223 5149344 5213055
5743E213055o0587r4534n3686j07571n9888J74324j6197j30631k28528j23813
$$ 5213055 5152468 5057934 5004248 4896677 4836789 5011113 4994916 4864285 4635757 4511944
5733D511944M1771M8957m8930j92098J17252r7463M836L8053k31999R7689J45163
$$ 4511944 4553715 4602672 4553742 4361644 4478896 4381433 4386269 4424322 4192323 4290012 4435175
5722D435175j00290K6258j42917l5550k8314j6636r5111j9410M9929m8504r0730
$$ 4435175 4334885 4361143 4218226 4182676 4154362 4137726 4042615 4023205 4073134 4024630 3933900
5711C933900n7193m1702o1642P2420P2137J13939j08885m1552M5378l58767J06800
$$ 3933900 3876707 3835005 3773363 3845783 3917920 4031859 3922974 3881422 3926800 3568033 3674833
5700C674833J54335J8503P4541k3893L1206j54487O0571J6994k56167M1066J4409
$$ 3674833 3829168 3847671 3922212 3898319 3929525 3775038 3835609 3852603 3596436 3637502 3651911
5689C651911J56923J03646k16632J96235K65470l96548p520J40632j06228k38879
$$ 3651911 3808834 3912480 3695848 3892083 4157553 3761005 3753485 3894117 3787889 3549010
5679C549010q0907k7052Q8158m4036K11943k8382o6518l2085J04057N3100q6039
$$ 3549010 3468103 3441051 3529209 3485173 3697116 3668734 3602216 3570131 3674188 3727288 3641249
5668C641249K8002N0369o0982k2892l2774P8831N0841j0383O3299M0224L3613
$$ 3641249 3669251 3719620 3658638 3635746 3602972 3681803 3732644 3722261 3785560 3825784 3859397
5657C859397J36093o1521O0307K2012k6267o7899j13947P0147j00894p0851j1639
$$ 3859397 3995490 3933969 3994276 4016288 3990021 3922122 3808175 3878322 3777428 3706577 3694938
5646C694938O5006J4458k69183L267K430P3685P2318Q3020r4474R07K05674j08619
$$ 3694938 3759944 3774402 3505219 3508486 3510916 3584601 3656919 3739939 3645465 3646372 3852046 3743427
5634C743427o8109k6847m7284J40344J61064j56699J93841j13613Q883n5217N6581
$$ 3743427 3675318 3648471 3601187 3741531 3902595 3745896 3939737 3826124 3835007 3779790 3836371
5623C836371p7490N1053J89107k19636p2497j65323j19880J55769j01096k2572
$$ 3836371 3758881 3809934 3999041 3779405 3706908 3541585 3421705 3577474 3476378 3453806
5613C453806J07874P3498j87301j164N728L7556n3784J84238j42615L4816J33665
$$ 3453806 3561680 3635178 3447877 3446713 3452441 3489997 3436213 3620451 3477836 3512652 3646317
5602C646317l32398k5785J28034J18684k00505M1566J1826k84601K30364J69510
$$ 3646317 3313919 3288134 3416168 3534852 3334347 3375913 3387739 3103138 3333502 3503012
5592C503012K0858j96966J44585p0082j48038K60014M3593j65780j87035J90519
$$ 3503012 3523870 3326904 3471489 3401407 3253369 3513383 3556976 3391196 3204161 3394680
5582C394680J41177j15229K48172j31525k58402j09309N3927K54135M9208j04794
$$ 3394680 3535857 3420628 3668800 3537275 3278873 3169564 3223491 3477626 3526834 3422040
5572C422040N8712O5774J08030j26172K32884m53j76877j22786j7758m0756o9684
$$ 3422040 3480752 3546526 3654556 3528384 3761268 3760815 3583938 3461152 3443394 3402638 3332954
5561C332954R1751j14082J63486J5644J5760j75032q286K1918O6245j49107J04661
$$ 3332954 3424705 3310623 3474109 3489753 3505513 3330481 3322195 3344113 3410358 3261251 3365912
5550C365912K72442k29003J10545j551j65200J5966M0847j25845K6481J53296
$$ 3365912 3638354 3409351 3519896 3518345 3353145 3369111 3409958 3284113 3310594 3463890
5540C463890J1988M9427k4477j51169j3496P256j6245J83809l2231k9821n1312
$$ 3463890 3475878 3525305 3500828 3349659 3336163 3343419 3327174 3510983 3478752 3448931 3397619
5529C397619K1284j6315N9005m2439r4510J7994j86987L4649L04350N6234J2883
$$ 3397619 3418903 3402588 3461593 3419154 3324644 3342638 3155651 3190300 3494650 3550884 3563767
5518C563767p8628l7372j02663K6792j70008M9464K4248K7484l1157k6976K12986
$$ 3563767 3485139 3447767 3345104 3371896 3201888 3251352 3275600 3303084 3271927 3244951 3457937
5507C457937p426l0166K8238k9509K19740j8593p1981N0405K9843j92061M9110
$$ 3457937 3450511 3420345 3448583 3419074 3638814 3620221 3548240 3598645 3628488 3436427 3485537
5496C485537j8869j06536l9520j21070J89367K07196m6325p7249r7537j08686
$$ 3485537 3466668 3360132 3320612 3199542 3388909 3596105 3549780 3472531 3374994 3266308
5486C266308j02608J06946M579P6825L6115o9343j45515n1818M8588j1008m3264
$$ 3266308 3163700 3270646 3275225 3352050 3388165 3318822 3173307 3121489 3170077 3159069 3115805
5475C115805J67535K76335j37794l64566k14695P1328K13100J83534j197r6865
$$ 3115805 3283340 3559675 3421881 3057315 2842620 2913948 3127048 3310582 3309385 3212520
5465C212520P4216R376m5422M0352R360N9232K9360k51449M1768J04757k23053
$$ 3212520 3286736 3296112 3250690 3291042 3300402 3359634 3388994 3137545 3179313 3284070 3061017
5454C061017Q7288J42499p881q9873n8717p1822K41018k42831j05762K93909j31893
$$ 3061017 3148305 3290804 3282923 3193050 3134333 3062511 3303529 3060698 2954936 3248845 3116952
5443C116952l6535R5298k7453P2338Q8081j62674o4460k4620j88795J37449J22380
$$ 3116952 3080417 3175715 3148262 3220600 3308681 3146007 3081547 3056927 2868132 3005581 3127961
5432C127961K02860K5681j81147N2872r102j32470n9859J35353J84025j02744
$$ 3127961 3330821 3356502 3175355 3228227 3219125 3086655 3026796 3162149 3346174 3243430
5422C243430j36971j82290Q2648J19153J07368j66764J01660q7980j28639q0112
$$ 3243430 3106459 2924169 3006817 3125970 3233338 3066574 3168234 3080254 2951615 2871503
5412B871503P1484K71651J0474J57343k70m1655k12950l671J44225K608J96141
$$ 2871503 2942987 3214638 3225112 3382455 3382185 3340530 3127580 3123909 3268134 3270742 3466883
5401C466883k03778Q5504L4053l22069r9491K7284Q5766M3617j71968R1750O1165
$$ 3466883 3263105 3348609 3382662 3060593 2961102 2988386 3074152 3117769 2945801 3037551 3098716
5390C098716k9560J9924m5742R7065l5510l9459j1954k6842J61805j84699o873
$$ 3098716 3069156 3089080 3043338 3140403 3104893 3065434 3053480 3026638 3188443 3003744 2996871
5379B996871k4110p8097O1160J32343p7415N7815k5722p1863M5751l49485M1905
$$ 2996871 2972761 2894664 2955824 3088167 3010752 3068567 3042845 2970982 3016733 2667248 2709153
5368B709153J98357J16245J40455M8714j45718o4000j34334J31158j11670K81976
$$ 2709153 2907510 3023755 3164210 3212924 3067206 3003206 2868872 3000030 2888360 3170336
5358C170336J90492j86369K333q3490j24687M6510j64059J34594J57326j01667
$$ 3170336 3360828 3174459 3176792 3093302 2968615 3015125 2851066 2985660 3142986 3041319
5348C041319m7952J02752n631n9139k55025K59760J9422l9491Q1768J22899o4777
$$ 3041319 2993367 3096119 3090488 3031349 2776324 3036084 3055506 3016015 3097783 3220682 3155905
5337C155905k11467M559o6263j24805K56707K59547m2570j35953Q4225K0192j38055
$$ 3155905 2944438 2948997 2882734 2757929 3014636 3274183 3231613 3095660 3179885 3200077 3062022
5326C062022J72399l3707K0745k5707N0906j68127q424M5726M4035J488K20166
$$ 3062022 3234421 3200714 3221459 3195752 3246658 3078531 3070107 3115833 3159868 3161356 3381522
5315C381522j75894j39574j6622J62958k17282O6184M1204j0452J917N1902j09361
$$ 3381522 3205628 3066054 3049432 3212390 2995108 3061292 3102496 3092044 3093961 3145863 3036502
5304C036502p1870K61947K31963K2678k18400j00533j9699m6213n7431J8543M0169
$$ 3036502 2964632 3226579 3458542 3481220 3262820 3162287 3142588 3096375 3038944 3057487 3097656
5293C097656K65938O8292j10364K28016J27123k62252N3247k9642K59019q8873
$$ 3097656 3363594 3431886 3321522 3549538 3676661 3414409 3467656 3438014 3697033 3608160
5283C608160q6612k51311r3788K12797m9500O0871O7759k1013J4665k68823r3045
$$ 3608160 3521548 3270237 3176449 3389246 3339746 3400617 3468376 3447363 3462028 3193205 3100160
5272C100160J61572J56923Q056j29648J60038R7994k29957r5430j38017J42054
$$ 3100160 3261732 3418655 3426711 3297063 3457101 3555095 3325138 3229708 3091691 3233745
5262C233745J16082J38417j42066R4651J08684j29427L7307j71931J36601R2548
$$ 3233745 3349827 3488244 3346178 3440829 3549513 3420086 3457393 3285462 3422063 3514611
5252C514611r9961L4725J41213j98139J51398O5046l13704J44283J66980n4062
$$ 3514611 3414650 3449375 3590588 3392449 3543847 3608893 3295189 3439472 3606452 3552390
5242C552390k0021j75139o8093K00793J64262N8596J11902J3150k88328O7690
$$ 3552390 3532369 3357230 3289137 3489930 3654192 3712788 3824690 3837840 3549512 3617202
5232C617202J811k50245J37220Q409j32491J34739j38900K1351K27493O2204j2077
$$ 3617202 3619013 3368768 3505988 3514397 3381906 3516645 3377745 3399096 3626589 3688793 3676716
5221C676716j71113j03991K7980Q6422j06541J17805M8660k06836j36305N9007
$$ 3676716 3505603 3401612 3429592 3516014 3409473 3527278 3575938 3369102 3232797 3291804
5211C291804m4906J11670n4523O8744K40531j7553J67162k0579r4304k2138j1797
$$ 3291804 3246898 3358568 3304045 3372789 3613320 3595767 3762929 3742350 3648046 3625908 3614111
5200C614111j76514J60026J41671p2595j01875k09393K15787p0217n5477L1861
$$ 3614111 3437597 3597623 3739294 3666699 3564824 3355431 3571218 3501001 3445524 3477385
5190C477385N4129p859M1779K6038j31636J2080q46L0673K10105O7998l59777
$$ 3477385 3531514 3523655 3565434 3591472 3459836 3471916 3471070 3501743 3711848 3779846 3420069
5179C420069k7079J83483J0931K21915j05790N1012Q1674K1573j62172J06980
$$ 3420069 3392990 3576473 3587404 3809319 3703529 3754541 3836215 3857788 3695616 3802596
5169C802596j89542n2347P153j01758M8656n4710J11049J71888K12190k05349
$$ 3802596 3613054 3560707 3567860 3466102 3514758 3460048 3571097 3742985 3955175 3749826
5159C749826K22719J0874k42661k3495K84451K80812q6816j36679j4784j9961
$$ 3749826 3972545 3983419 3740758 3717263 4001714 4282526 4195710 4059031 4044247 4024286
5149D024286j29441j86354K51442J33788j31639j51451Q0798J12297o3648J2587
$$ 4024286 3894845 3708491 3959933 4093721 3962082 3810631 3891429 4003726 3940078 3952665
5139C952665j9314K9672K04901j02831l1069K54724J13076j8072j68699J00196
$$ 3952665 3933351 3963023 4167924 4065093 4034024 4288748 4401824 4383752 4215053 4315249
5129D315249O3587J70057m5102M2379J0004k340J0330j19675J87950j03098L0583
$$ 4315249 4378836 4548893 4503791 4546170 4556174 4553834 4564164 4444489 4632439 4529341 4559924
5118D559924R5136j21112k2446j85413P7172J47546K00374J65748j80819J26220
$$ 4559924 4655060 4533948 4511502 4326089 4403261 4550807 4751181 4916929 4736110 4862330
5108D862330n583j06376j71277K0067K43150J55267j84168q158J10643l1312K11739
$$ 4862330 4856747 4750371 4579094 4599161 4842311 4997578 4813410 4805252 4915895 4884583 5096322
5097E096322N4354j11521P9579P9890J12133m8733Q7234j05074K5313k6240r1717
$$ 5096322 5150676 5039155 5118734 5198624 5310757 5262024 5349258 5244184 5269497 5243257 5151540
5086E151540j2422o3525K40651J45899O6806J15094r1182j16928r308R8263L5783
$$ 5151540 5139118 5075593 5316244 5462143 5528949 5644043 5552861 5435933 5426625 5524888 5560671
5075E560671J9814J10485k04626M0247K27688J08144J74227l8893j11955J51720
$$ 5560671 5580485 5690970 5486344 5526591 5754279 5862423 6036650 5997757 5885802 6037522
5065F037522j3782J20127j09148J9285J78886J93225J37427j04739L4012j20977
$$ 6037522 6023740 6143867 6034719 6054004 6232890 6426115 6563542 6458803 6492815 6371838
5055F371838R1706J28167r3523M4021j06711p8665J395j3532R462K79595q448
$$ 6371838 6463544 6591711 6498188 6542209 6435498 6356833 6358228 6344696 6354158 6633753 6625305
5044F625305m4663K1979J50304M5029k9380o2010j49774Q2803J42859N788J46226
$$ 6625305 6580642 6602621 6752925 6797954 6768574 6706564 6556790 6639593 6782452 6788240 6934466
5033F934466j75476m7911J54162m1101k44985j81831K23407j5547R4336j20006
$$ 6934466 6758990 6711079 6865241 6824140 6579155 6397324 6620731 6605184 6699520 6579514
5023F579514o8572j04479K09939j56127J43237J86687L5400J4239N4397K11967
$$ 6579514 6510942 6406463 6616402 6460275 6603512 6790199 6825599 6839838 6894235 7106202
5013G106202J18655Q754o3495j10172q4893l8426P9619P0193j2053K29939K8260
$$ 7106202 7224857 7233611 7170116 7059944 6975051 6936625 7016244 7086437 7074384 7304323 7332583
5002G332583K01824n1261j06139J7798k5956k22609J20702K59251j7343J7569
$$ 7332583 7534407 7483146 7377007 7394805 7368849 7146240 7266942 7526193 7508850 7526419
4992G526419J96568J6983N0657J47374j48151J48070J86473j77727m650k3127
$$ 7526419 7722987 7739970 7790627 7938001 7789850 7937920 8124393 7946666 7942016 7918889
4982G918889K9009J88000j3871l7475J38920K05810J87518O6802P1466j21712
$$ 7918889 7947898 8135898 8122027 8084552 8223472 8429282 8616800 8683602 8755068 8633356
4972H633356K27101J29401j04564K41338K42234M1060Q1144M4002o0008k26012
$$ 8633356 8860457 8989858 8885294 9126632 9368866 9409926 9491070 9535072 9475064 9249052
4962I249052M26116L38765K18925K57313p5669J48024K91844K41373M22284K25422
$$ 9249052 9675168 10013933 10232858 10490171 10414502 10562526 10854370 11095743 11518027 11743449
4952A1743449J16849M61280K84323L99878K88834K46122K91676O06974M95758
$$ 11743449 11860298 12321578 12605901 13005779 13294613 13540735 13832411 14439385 14935143
4943A4935143M98233K88205M2434J91652K58707k9329J27832K79863K78197L84571
$$ 14935143 15433376 15721581 15764015 15955667 16214374 16185045 16312877 16592740 16870937 17255508
4933A7255508R5229Q2708J21302K09992N13663J62018L12560M49988M52122N20366
$$ 17255508 17350737 17433445 17554747 17764739 18278402 18440420 18752980 19202968 19655090 20175456
4923B0175456L99168L29375N18085L43350M55193K25687J71375L42043K72777
$$ 20175456 20574624 20903999 21422084 21765434 22220627 22446314 22617689 22959732 23232509
4914B3232509K91013o8824l41172k27185q5820j3807k33132j90952j27933m3568
$$ 23232509 23523522 23454698 23113526 22886341 22800521 22786714 22553582 22362630 22234697 22191129
4904B2191129J0137o4199K12112K5200L7688L68383M45949L53630M54499M21631
$$ 22191129 22201266 22137067 22349179 22374379 22412067 22780450 23226399 23580029 24034528 24456159
4894B4456159K63941J03289M54989M93381M88552M65856L70543O31910M55845
$$ 24456159 24720100 24823389 25278378 25771759 26260311 26726167 27096710 27728620 28184465
4885B8184465N67803O85923P20628P70715Q41424P39125P27211J157839J291842
$$ 28184465 28752268 29438191 30158819 30929534 31770958 32510083 33237294 34395133 35686975
4876C5686975J131668R29774R11488J155903J250600J251973J136252R05044R36607
$$ 35686975 36818643 37748417 38659905 39815808 41066408 42318381 43454633 44359677 45296284
4867D5296284P22577O32125K87236K68545M51961L30108L76624L22188L33307
$$ 45296284 46018861 46650986 46938222 47206767 47658728 47988836 48365460 48687648 49020955
4858D9020955Q31871O85237Q35007R51171J018542J421026J642401J832161J852574
$$ 49020955 49852826 50538063 51373070 52324241 53342783 54763809 56406210 58238371 60090945
4849F0090945J697818J970006K077810J944152K098493J828945J513862J363805
$$ 60090945 61788763 63758769 65836579 67780731 69879224 71708169 73222031 74585836
4841G4585836Q41425L34742L33364P3348j33312M4161k12109n7222j48843k13159
$$ 74585836 75427261 75762003 76095367 76168715 76035403 76079564 75867455 75810233 75661390 75448231
4831G5448231J27403M78347N07154P48714R11926J258775J205989R59896J523039
$$ 75448231 75575634 76053981 76561135 77309849 78221775 79480550 80686539 81646435 83169474
4822H3169474J439716J260405J486879J442015J639420J706254J999671K228864
$$ 83169474 84609190 85869595 87356474 88798489 90437909 92144163 94143834 96372698
4814I6372698J886857K245277K353060K633357K851275K453064K389071J895254
$$ 96372698 98259555 100504832 102857892 105491249 108342524 110795588 113184659 115079913
4806A15079913J025305K80248K91537M9376P4642N83591Q98976J136998J368554
$$ 115079913 116105218 116385466 116677003 116726379 116801021 117384612 118283588 119420586 120789140
4797A20789140J635326J459639J487937J556359J451656J125668K13745o92814
$$ 120789140 122424466 123884105 125372042 126928401 128380057 129505725 129719470 129026656
4789A29026656j162662j497185j413868j058919n43220J06909K53606M48753P70089
$$ 129026656 127863994 126366809 124952941 123894022 123350802 123457711 123711317 124160070 124930159
4780A24930159R49946J012001R59143P14046O33339P46348M98322J60088R430
$$ 124930159 125880105 126892106 127851249 128565295 129198634 129944982 130443304 130603392 130612822
4771A30612822n0576J51573M32995N13357J052530J464745J834239K643863L445998
$$ 130612822 130562246 130713819 131146814 131660171 132712701 134177446 136011685 138655548 142101546
4762A42101546M208386M995511N542391O601622O720519P053482P183829O649640
$$ 142101546 146309932 151305443 156847834 163449456 170169975 177223457 184407286 191056926
4754A91056926M914124K917639P54786j340585k970958m020466m473013m529504
$$ 191056926 195971050 198888689 199643475 198302890 195331932 191311466 186838453 182308949
4746A82308949m643799l816108l115734k848247k366620j801935j391865j791031
$$ 182308949 177665150 173849042 170733308 167885061 165518441 163716506 162324641 160533610
4738A60533610k159701l139020m069770m190168m293459l966742l682017l375154
$$ 160533610 158373909 155234889 151165119 146974951 142681492 138714750 135032733 131657579
4730A31657579k816896k702698k906225k606827k980968l396064l678106m009865
$$ 131657579 128840683 126137985 123231760 120624933 117643965 114247901 110569795 106559930
4722A06559930m524517m867809m922064m804312m635734m277884m115843l995029
$$ 106559930 102035413 97167604 92245540 87441228 82805494 78527610 74411767 70416738
4714G0416738l365763l075812k737516k586710k183823k169821k173214j893183
$$ 70416738 67050975 63975163 61237647 58650937 56467114 54297293 52124079 50230896
4706E0230896j449150j503668j202778j193751j311521j120133j149817j215680
$$ 50230896 48781746 47278078 46075300 44881549 43570028 42449895 41300078 40084398
4698D0084398r90021q69611p92432r60392j184074r33367p56188j151032r11292
$$ 40084398 39094377 38224766 37432334 36471942 35287868 34354501 33598313 32447281 31535989
4689C1535989r53905p71303n94421o99840o43417m72378n22372p58513n37663
$$ 31535989 30582084 29810781 29216360 28516520 27873103 27400725 26878353 26119840 25582177
4680B5582177o16198m05518k83818n42445m44338k49840j39590m60603m60082
$$ 25582177 24965979 24560461 24276643 23734198 23289860 23040020 22900430 22439827 21979745
4671B1979745j71451k12337m04952k29423j67744k2721j88974k9603J3208k53082
$$ 21979745 21808294 21595957 21191005 20961582 20793838 20771117 20582143 20552540 20565748 20312666
4661B0312666k58740j8098j73921J6033r7689j68005J8888r3404k6180J08001
$$ 20312666 20053926 20035828 19861907 19877940 19780251 19612246 19631134 19537730 19511550 19619551
4651A9619551K18516R508N5147J88238K08132j9710L15954K72971J37631K57121
$$ 19619551 19838067 19847575 19902722 20090960 20299092 20279382 20595336 20868307 21005938 21263059
4641B1263059L88757L00879M38302M10454O25178O85211O21354P47660J124643
$$ 21263059 21651816 21952695 22390997 22801451 23426629 24111840 24733194 25480854 26605497
4632B6605497J300157J340087J627085J835782K154321K430512K962449L004709
$$ 26605497 27905654 29245741 30872826 32708608 34862929 37293441 40255890 43260599
4624D3260599L062033L195801K656055J809603N58236q83187k066240k851711
$$ 43260599 46322632 49518433 52174488 53984091 54542327 53659140 51592900 48741189
4616D8741189k981355k881570k449376k388956j971812j815506j529666j366830
$$ 48741189 45759834 42878264 40428888 38039932 36068120 34252614 32722948 31356118
4608C1356118r67387q47955o30534m41696n93028m66799k29894q1645K5223M2454
$$ 31356118 30388731 29540776 28910242 28468546 27875518 27408719 27178825 27097180 27122403 27164857
4598B7164857L41837L03123N85175N71018P43430J132826J138596J429625J618992
$$ 27164857 27506694 27809817 28394992 28966010 29709440 30842266 31980862 33410487 35029479
4589C5029479J768215K236244K627927K502464K977982K804744K722111J815286
$$ 35029479 36797694 39033938 41661865 44164329 47142311 49947055 52669166 54484452
4581E4484452N65516p69166j526459k270926k204185k105662j574347j171677
$$ 54484452 55049968 54280802 52754343 50483417 48279232 46173570 44599223 43427546
4573D3427546o79837k57614J51076O74235O16925M86793j72502r58377j461851
$$ 43427546 42747709 42490095 42641171 43315406 43932331 44419124 44246622 43288245 41826394
4564D1826394k074209k565936k514446k060703j971365j890148j707426j276107
$$ 41826394 39752185 37186249 34671803 32611100 30639735 28749587 27042161 25766054
4556B5766054j160565r81570o89757p84620n68305n66505l10285l16071m41082
$$ 25766054 24605489 23623919 22934162 22149542 21581237 21014732 20704447 20388376 19947294
4547A9947294j54434j92795J8160j14639M0371K70617J79593M29965L70179L90178
$$ 19947294 19792860 19600065 19618225 19503586 19543957 19814574 19994167 20424132 20794311 21184489
4537B1184489R10546J189374R10078J123627J531070J713287J748420J292423
$$ 21184489 22095035 23284409 24194487 25318114 26849184 28562471 30310891 31603314
4529C1603314Q57137J08291m53286j515574k096696k001201j960263j853089j398874
$$ 31603314 32460451 32568742 32115456 30599882 28503186 26501985 24541722 22688633 21289759
4520B1289759j425441j412615q93586r47259p31363n97163n34410o80999m31997
$$ 21289759 19864318 18451703 17558117 16610858 15879495 15282332 14747922 14066923 13634926
4511A3634926l68901n62819n27033j25885j79391m51461k83630J38326l95684
$$ 13634926 13266025 12703206 12176173 12050288 11870897 11419436 11135806 11274132 10878448
4502A0878448k59584o6545l78098j19145k72867j23893k35124J30665l5903j58571
$$ 10878448 10618864 10552319 10174221 10055076 9782209 9658316 9423192 9553857 9517954 9359383
4492I359383P040k00632o2039l51615J82423J24613k69936q1692J46505k03395
$$ 9359383 9366423 9165791 9103752 8752137 8934560 9059173 8789237 8707545 8854050 8650655
4482H650655n6826n087j97433N503M0634j20429k60052n3209k0709N6334K51578
$$ 8650655 8593829 8588742 8391309 8396812 8437446 8317017 8056965 8003756 7983047 8039381 8290959
4471H290959o841O2373M4145K11534q9167j03540j19958R3793M9518K0128k18688
$$ 8290959 8284118 8346491 8390636 8602170 8513003 8409463 8289505 8383298 8432816 8452944 8234256
4460H234256J8845J37474o0040R4808r197j02232K2133M3322p4372J06455n4312
$$ 8234256 8253101 8390575 8330535 8425343 8416146 8313914 8336047 8379369 8304997 8411452 8357140
4449H357140j48737j08510P5171k84482K24646J41907L9440j54183p6301J740
$$ 8357140 8208403 8099893 8175064 7890582 8115228 8257135 8296575 8142392 8066091 8067831
4439H067831N9403M8879R858j86572n623j03593r742J24027j30975J6025q6767
$$ 8067831 8127234 8176113 8185971 7999399 7993776 7890183 7880441 8004468 7873493 7889518 7802751
4428G802751n1999j54148j68267l1966J56288j13336M8228R797k31785j35582
$$ 7802751 7750752 7596604 7428337 7396371 7552659 7439323 7487551 7497348 7265563 7129981
4418G129981L7984Q6810J16759P8934m6057R9171N5187k01657j26965j07210P6463
$$ 7129981 7167965 7254775 7371534 7450468 7404411 7503582 7558769 7357112 7230147 7122937 7199400
4407G199400j08959j6196N1647R6064R1705j05551j49017M6603J39396J42578
$$ 7199400 7090441 7074245 7125892 7221956 7313661 7208110 7059093 7105696 7245092 7387670
4397G387670j13056j17517J78522j94715O336P0646j6132N5259j26254p7174R1109
$$ 7387670 7274614 7157097 7335619 7140904 7147240 7217886 7201754 7257013 7130759 7053585 7144694
4386G144694O3049m5418j10546N6743K39222l51262O5452J706m2093p5879J17042
$$ 7144694 7207743 7162325 7051779 7108522 7347744 6996482 7061934 7063640 7021547 6945668 7062710
4375G062710K61595J0032n1229j65880r4021l03368L77898J34481j44621J34641
$$ 7062710 7324305 7334337 7283108 7117228 7023207 6719839 7097737 7232218 7087597 7222238
4365G222238J3210j10333N0589p5679J48738N8210N052N2891K8415J38799r6108
$$ 7222238 7235448 7125115 7175704 7100025 7248763 7306973 7312025 7364916 7393331 7532130 7436022
4354G436022k39815K46273K74612J8056O8583J25142J06074n6249k93647j91522
$$ 7436022 7196207 7442480 7717092 7735148 7803731 7928873 8034947 7978698 7685051 7493529
4344G493529J24880J79158o1576N7864P9505J4013K58167m5060k49908J68723
$$ 7493529 7618409 7797567 7735991 7793855 7873360 7887373 8145540 8100480 7850572 8019295
4334H019295J44228o1607P3264K88486P8505Q8029L2747j15930J86340J16294
$$ 8019295 8163523 8101916 8175180 8463666 8542171 8630200 8662947 8547017 8733357 8849651
4324H849651R3320j98089j15336J26195K28854k8443j42530N7431j05267K61513
$$ 8849651 8942971 8744882 8629546 8755741 8984595 8956152 8813622 8871053 8765786 9027299
4314I027299R1472L3815n8625J24564K34507j134j31962j13898m9181K45424j58865
$$ 9027299 9118771 9152586 9093961 9218525 9453032 9451898 9319936 9206038 9156857 9402281 9243416
4303I243416N9875K41858L8459j79599N5474R6334l1972J68375J66261J12463
$$ 9243416 9303291 9545149 9583608 9404009 9459483 9555817 9523845 9692220 9858481 9970944
4293I970944l6886o5966Q9019K23169J11880K1963Q1983J74002j42963K42383
$$ 9970944 9934058 9868092 9957111 10180280 10292160 10314123 10396106 10570108 10427145 10669528
4283A0669528J05459k4419J23011Q5978n3227j05842J17851J65326J57604J92650
$$ 10669528 10774987 10750568 10873579 10959557 10906330 10800488 10918339 11083665 11241269 11433919
4273A1433919n1190K12794k7334n172O8106L8723R3884M8160K48682J82823K22355
$$ 11433919 11382729 11595523 11568189 11563017 11631123 11669846 11763730 11811890 12060572 12243395 12465750
4262A2465750k3187j32033N7444L3992K1474J69865K69877J29482J75081R8561
$$ 12465750 12442563 12310530 12367974 12401966 12423440 12593305 12863182 12992664 13167745 13266306
4252A3266306K10172P7561J05571K12078R2868K17305K47377J73896M03236J61847
$$ 13266306 13476478 13554039 13659610 13871688 13964556 14181861 14429238 14603134 15006370 15168217
4242A5168217R3445J73706K82463L82336J62011J76772K93527L56848L74642K11306
$$ 15168217 15261662 15435368 15717831 16100167 16262178 16438950 16732477 17089325 17463967 17675273
4232A7675273J92644J80599M75811L71362L13895L89321O10432K73386K32267
$$ 17675273 17867917 18048516 18524327 18895689 19209584 19598905 20209337 20482723 20714990
4223B0714990K51159K69907K07579K96921L87135M80996O42649N66649N48835
$$ 20714990 20966149 21236056 21443635 21740556 22127691 22608687 23251336 23817985 24366820
4214B4366820K07082L86184L64072N92297O64381O23932M85990O74135P27681
$$ 24366820 24573902 24960086 25324158 25916455 26580836 27204768 27690758 28364893 29092574
4205B9092574O74343Q75717M82955Q21615R90921J005780J018778R20742J150830
$$ 29092574 29766917 30642634 31125589 31947204 32938125 33943905 34962683 35883425 37034255
4196C7034255J044163J036933J051604J187586J314963J492213J684206J498614
$$ 37034255 38078418 39115351 40166955 41354541 42669504 44161717 45845923 47344537
4188D7344537J907698K081641J943424J863477K099662K120019K413595K695854
$$ 47344537 49252235 51333876 53277300 55140777 57240439 59360458 61774053 64469907
4180F4469907K761071K993588L017344L158818L604437L670866L486494L823053
$$ 64469907 67230978 70224566 73241910 76400728 80005165 83676031 87162525 90985578
4172I0985578L736261L848317M131825M330110M152982M190110M519934M734547
$$ 90985578 94721839 98570156 102701981 107032091 111185073 115375183 119895117 124629664
4164A24629664M650714M941841M832764M860658M933020M802892M687244M605989
$$ 124629664 129280378 134222219 139054983 143915641 148848661 153651553 158338797 162944786
4156A62944786M486975M074636L936893L844344L557505L801750L485120L467239
$$ 162944786 167431761 171506397 175443290 179287634 182845139 186646889 190132009 193599248
4148A93599248L084326K911823K858244K643959J809707J540643J151647M66958
$$ 193599248 196683574 199595397 202453641 205097600 206907307 208447950 209599597 210066555
4140B10066555j61943n74379r07308j192058j442489j451152j424982j904021
$$ 210066555 209904612 209330233 208422925 207230867 205788378 204337226 202912244 201008223
4132B01008223j717283j846138k373244k246552k758243l049230l361355l582266
$$ 201008223 199290940 197444802 195071558 192825006 190066763 187017533 183656178 180073912
4124A80073912l880410l761389l495879l390451l477134l206796l272068l243217
$$ 180073912 176193502 172432113 168936234 165545783 162068649 158861853 155589785 152346568
4116A52346568k946743k949090k918802l279376k713481k650384k489285k241517
$$ 152346568 149399825 146450735 143531933 140252557 137539076 134888692 132399407 130157890
4108A30157890j886205k220260j439771j218613j042003o57792l75423m86603
$$ 130157890 128271685 126051425 124611654 123393041 122351038 121693246 121317823 120831220
4100A20831220m24546n90378p69612j085878q19658n62805r36773n22529m33990
$$ 120831220 120406674 119816296 119046684 117960806 117141148 116578343 115641570 115119041 114685051
4091A14685051l9062j93282l35761J32784j06707l8838J00798o1821K36897L49101
$$ 114685051 114645989 114452707 114116946 114249730 114143023 114104185 114204983 114143162 114380059 114729160
4081A14729160O68909O80439Q58556J465505J910843J886373K263075K254798
$$ 114729160 115398069 116078508 116937064 118402569 120313412 122199785 124462860 126717658
4073A26717658J968543K112520K004474J735769J206304J149880J052403Q97981
$$ 126717658 128686201 130798721 132803195 134538964 135745268 136895148 137947551 138845532
4065A38845532O20779O78102M59231L45847N72759K59391R3755j78656k54296
$$ 138845532 139466311 140144413 140603644 140949491 141522250 141781641 141875396 141696740 141442444
4056A41442444m1781m2995m8925k9892M39558J35261K66987J86163j88384m82272
$$ 141442444 141400663 141357668 141308743 141278851 141718409 141853670 142120657 142306820 142118436 141636164
4046A41636164n57995p73176p00711m44631o01397m57784r9036Q5835J23147J04616
$$ 141636164 141078169 140304993 139604282 139159651 138558254 138100470 138001434 138087269 138210416 138315032
4036A38315032J7815k4400k09661o64131q66950j052792j702670k077706k108890
$$ 138315032 138332847 138308447 138098786 137434655 136567705 135514913 133812243 131734537 129625647
4027A29625647j869293j931159j909369k168072k654095k885291k787676k796675
$$ 129625647 127756354 125825195 123915826 121747754 119093659 116208368 113420692 110624017
4019A10624017k636299k100182j963437j663580j069125j009513j160116r10050
$$ 110624017 107987718 105887536 103924099 102260519 101191394 100181881 99021765 98111715
4011I8111715j247222q76182j006187r00779q43099j145015j043397j435197j083002
$$ 98111715 96864493 95988311 94982124 94081345 93238246 92093231 91049834 89614637 88531635
4002H8531635j257594j056626o63634o78176o69126o54277j014502j353485j753264
$$ 88531635 87274041 86217415 85553781 84875605 84206479 83552202 82537700 81184215 79430951
3993G9430951j735466j922765k033580j802055j832264j711360j447876j411056
$$ 79430951 77695485 75772720 73739140 71937085 70104821 68393461 66945585 65534529
3985F5534529j431151j629468j256748j096470j237767j188526j065929r46825
$$ 65534529 64103378 62473910 61217162 60120692 58882925 57694399 56628470 55681645
3977E5681645q35779q29556p02322q21415r46035r01190p87750q62103j002650
$$ 55681645 54845866 54016310 53313988 52492573 51546538 50645348 49857598 48995495 47992845
3968D7992845j083776j446508j135784q68371j046983r53215r70521j164780q93980
$$ 47992845 46909069 45462561 44326777 43458406 42411423 41458208 40487687 39322907 38428927
3959C8428927p80929n27310n37641p93959p82626p11289n65226n15946k94828
$$ 38428927 37647998 37120688 36583047 35789088 35006462 34295173 33729947 33214001 32919173
3950C2919173n13195l64888n19590o13610q87016m48976l92324n18611o28623
$$ 32919173 32405978 32041090 31521500 30907890 30020874 29571898 29179574 28660963 28032340
3941B8032340m56422k43375n15758l33304j43140l24999m67919n4083k01129l53466
$$ 28032340 27575918 27332543 26816785 26483481 26340341 26015342 25547423 25493340 25292211 24938745
3931B4938745k49181O1267j02583k75434J85736n4412m00559m9001j26477k3588
$$ 24938745 24689564 24750831 24648248 24372814 24558550 24504138 24103579 24054578 23928101 23904513
3921B3904513M7238j94789k29337K31948j63462k36514Q514q8104m8234J62093
$$ 23904513 23951751 23756962 23527625 23759573 23596111 23359597 23368111 23280007 23231773 23393866
3911B3393866j14554M9161J10096J106j35154K70381J42486J27136J37543J60036
$$ 23393866 23279312 23328473 23438569 23439675 23304521 23574902 23717388 23844524 23982067 24142103
3901B4142103k5852R5337N24842l36J99284K79532K38370M22197K57515J66341
$$ 24142103 24116251 24211588 24736430 24736094 24935378 25214910 25453280 25875477 26132992 26299333
3891B6299333M32149L49373N66194N41773N50249N20766O52950P52509N52667
$$ 26299333 26731482 27080855 27647049 28188822 28739071 29259837 29912787 30665296 31217963
3882C1217963O90063Q31818P09307Q05099R61633J052761J253488J157096J362428
$$ 31217963 31908026 32739844 33449151 34254250 35215883 36268644 37522132 38679228 40041656
3873D0041656J430594J333713J635707J702058K003746K090000J929358K299429
$$ 40041656 41472250 42805963 44441670 46143728 48147474 50237474 52166832 54466261
3865E4466261K237113K389033K474798K195569K136854K075467K237290K050873
$$ 54466261 56703374 59092407 61567205 63762774 65899628 67975095 70212385 72263258
3857G2263258K193934K060298K046206J966483J851780J369361J380353J430286
$$ 72263258 74457192 76517490 78563696 80530179 82381959 83751320 85131673 86561959
3849H6561959R71506R98551Q43351N52441N17979P7198j86650m87193o61179n59190
$$ 86561959 87533465 88532016 89375367 89927808 90445787 90522985 90336335 89849142 89187963 88628773
3839H8628773o46589p55233p51375p33309p94415p44887j001702q80412p09069
$$ 88628773 87982184 87226951 86475576 85742267 84947852 84202965 83201263 82320851 81611782
3830H1611782n07491n17447m49650l93073R0986K56582K96000L67066Q33397J313440
$$ 81611782 81104291 80586844 80137194 79744121 79835107 80091689 80387689 80754755 81588152 82901592
3820H2901592J500101J987333K305330K622636K665011L293380M054279M089862
$$ 82901592 84401693 86389026 88694356 91316992 93982003 97275383 101329662 105419524
3812A05419524M546462M707649M956707N004168N380314N396522N412481N059528
$$ 105419524 109965986 114673635 119630342 124634510 130014824 135411346 140823827 145883355
3804A45883355N192788N255473N074238M921394M590748M538649M081517L738626
$$ 145883355 151076143 156331616 161405854 166327248 170917996 175456645 179538162 183276788
3796A83276788L338533L182413K635346J974544J525353P11759J82728m96551
$$ 183276788 186615321 189797734 192433080 194407624 195932977 196644736 196827464 196330913
3788A96330913j035224j920894k431895k670201l084399l382000l648600l797331
$$ 196330913 195295689 193374795 190942900 188272699 185188300 181806300 178157700 174360369
3780A74360369l690216m120538m273617m149719m464765m310622m252651m119686
$$ 174360369 170670153 166549615 162275998 158126279 153661514 149350892 145098241 140978555
3772A40978555m289395l982074l642664l455124l120910k812150k318842j946755
$$ 140978555 136689160 132707086 129064422 125609298 122488388 119676238 117357396 115410641
3764A15410641j549224q50863q44325k04849L54665Q65388J209994J590967K261978
$$ 115410641 113861417 113010554 112166229 111961380 112316045 113181433 114391427 115982394 118244372
3755A18244372K760976K694360L559918L766896L980729M204738M423065M574304
$$ 118244372 121005348 123699708 127259626 131026522 135007251 139211989 143635054 148209358
3747A48209358M850794M784321M471321M529299M506065M584293M195372M207171
$$ 148209358 153060152 157844473 162315794 166845093 171351158 175935451 180130823 184337994
3739A84337994M132784M013140L868161L581790L278800K964528K314335J779087
$$ 184337994 188470778 192483918 196352079 199933869 203212669 206177197 208491532 210270619
3731B10270619J639743Q26478L21193m14385r20951j157434j937181k305099k356043
$$ 210270619 211910362 212736840 213058033 212643648 211722697 210565263 208628082 206322983 203966940
3722B03966940l102342l058932l105912l237456l237312l308525l588078l603967
$$ 203966940 200864598 197805666 194699754 191462298 188224986 184916461 181328383 177724416
3714A77724416l718621l771548l765473l951897l975684l684490l605466l238142
$$ 177724416 174005795 170234247 166468774 162516877 158541193 154856703 151251237 148013095
3706A48013095k791949l051361k303567j719501j523207j110484q24201l87508
$$ 148013095 145221146 142169785 139866218 138146717 136623510 135513026 134688825 134301317
3698A34301317j3272K54263O84063Q15513J131909J457300J528862J679401J669334
$$ 134301317 134288045 134542308 135226371 136041884 137173793 138631093 140159955 141839356 143508690
3689A43508690J718400K092953K252676K848852K856871L380324L749368M152797
$$ 143508690 145227090 147320043 149572719 152421571 155278442 158658766 162408134 166560931
3681A66560931M602312N096544N441740N612876N850084O292996O396043P031109
$$ 166560931 171163243 176259787 181701527 187314403 193164487 199457483 205853526 212884635
3673B12884635O915847P091299P208897P589511P965249Q462375Q771150R590271
$$ 212884635 219800482 226891781 234100678 241690189 249655438 258117813 266888963 276479234
3665B76479234J0122769J0623263J1048845J1190450J1758694J1618868J1154600
$$ 276479234 286602003 297225266 308274111 319464561 331223255 342842123 353996723
3658C53996723J0902279J0645859J0058091R164193Q403032P267364O255561N120836
$$ 353996723 364899002 375544861 385602952 394767145 403170177 410437541 416693102 421813938
3650D21813938L997972K720775J415180k57305j699774l136793m756917o302774
$$ 421813938 425811910 428532685 429947865 429690560 427990786 424853993 420097076 413794302
3642D13794302p647634q859162j0123536j1027780j1854312j2358039j3150590
$$ 413794302 406146668 397287506 387163970 376136190 364281878 351923839 338773249
3635C38773249j3533725j3868173j3837292j3715552j3710928j3607780j3220713
$$ 338773249 325239524 311371351 297534059 283818507 270107579 256499799 243279086
3628B43279086j3073417j2700192j2186065j1618768j1257219j0446048r582612
$$ 243279086 230205669 217505477 205319412 193700644 182443425 171997377 162414765
3621A62414765r493752r066217q146133p612558o550857o303640n870660n301064
$$ 162414765 152921013 143854796 135708663 128096105 121545248 115241608 109370948 104069884
3613A04069884m563640m262468l794108l293413l029724k692957k596088k267635
$$ 104069884 99506244 95243776 91449668 88156255 85126531 82433574 79837486 77569851
3605G7569851j743386j441021j252453j203972j114432j090307p86473q55930
$$ 77569851 75826465 74385444 73132991 71929019 70814587 69724280 68937807 68081877
3597F8081877q37843r05408p67306l30143q01749p96108j039796p15409o19375
$$ 68081877 67244034 66338626 65571320 65241177 64439428 63643320 62603524 61888115 61268740
3588F1268740r01553o57109q79026q62378p67075r12799j175785j046116j192612
$$ 61268740 60367187 59710078 58831052 57968674 57201599 56288800 55113015 54066899 52874287
3579E2874287r22492j098744j173155j225775j102015j330981j419783j456879
$$ 52874287 51951795 50853051 49679896 48454121 47352106 46021125 44601342 43144463
3571D3144463j337872j402071j271236j546851j338957j207145j134379j170982
$$ 43144463 41806591 40404520 39133284 37586433 36247476 35040331 33905952 32734970
3563C2734970r75345q39789j041401j019961p98500n85314q22311n80971p27048
$$ 32734970 31759625 30919836 29878435 28858474 28059974 27474660 26652349 26071378 25344330
3554B5344330m86568n82028n65139m96296m94795k28532k22786n40160l63384
$$ 25344330 24857762 24275734 23710595 23214299 22719504 22490972 22268186 21728026 21364642
3545B1364642k90607j28230j80115m38803m66542Q3903j74857o3108k70923k48951
$$ 21364642 21074035 20945805 20765690 20326887 19860345 19944248 19769391 19706283 19435360 19186409
3535A9186409k21357l59249j14106R3149j59513j85431k61698j09813j43618J809
$$ 19186409 18965052 18605803 18491697 18584846 18425333 18239902 17978204 17868391 17724773 17726582
3525A7726582k6012k019K7908k11749j9393J07840j21448K00494J34242m8006
$$ 17726582 17700570 17698551 17726459 17514710 17495317 17603157 17481709 17682203 17816445 17768439
3515A7768439n5589j7658O406J28783N770J77378K27372N4156K24083K23451M36046
$$ 17768439 17712850 17695192 17701598 17830381 17836151 18013529 18240901 18295057 18519140 18742591 19178637
3504A9178637L89867M69089M88807M27804L01536Q8338R8293L94273o9326j97620
$$ 19178637 19568504 20037593 20526400 20954204 21255740 21344078 21442371 21836644 21767318 21569698
3494B1569698m13883l30006m22304m50872l36347m78421m24268n36919m64289
$$ 21569698 21155815 20825809 20403505 19952633 19616286 19137865 18713597 18176678 17712389
3485A7712389j55449l76678n89566n09151l20737m14062o33555k42119j85030
$$ 17712389 17556940 17180262 16590696 16081545 15760808 15346746 14713191 14471072 14286042
3476A4286042l84865n30317l90108j05519m74175m49985O5197j96345k97799j85410
$$ 14286042 13901177 13370860 12980752 12875233 12401058 11951073 12016270 11819925 11522126 11336716
3466A1336716j17956l2494l29173q5078o0094m15186O0858j23025J34922j3236
$$ 11336716 11218760 11186266 10857093 10772015 10711921 10296735 10357593 10234568 10369490 10356254
3456A0356254O8267R827j23897J13961p7034K28672J03417J03730K62766M51267
$$ 10356254 10424521 10434348 10310451 10424412 10347378 10576050 10679467 10783197 11045963 11497230
3446A1497230M08443J12988J76158O75801Q20041P30664R59150J323011J568104
$$ 11497230 11905673 12018661 12194819 12870620 13690661 14421325 15380475 16703486 18271590
3437A8271590K096347J223607q37829k062798j823535j665887j205594q97843
$$ 18271590 20367937 21591544 20753715 18690917 16867382 15201495 13995901 13098058
3429A3098058p86144o20737m77543m49140j73093p4145q4122j25770n2541j9686
$$ 13098058 12311914 11691177 11213634 10764494 10591401 10517256 10433134 10307364 10254823 10235137
3419A0235137N6779K26943J84647L87089M84697N75064P69292J032724J415645
$$ 10235137 10291916 10518859 10703506 11090595 11575292 12150356 12919648 13952372 15368017
3410A5368017J815320J886799O01121j183913k184175k098131j588900j095304
$$ 15368017 17183337 19070136 19671257 18487344 16303169 14205038 12616138 11520834
3402A1520834r04111o81812n44279n46355k29741k26774m02978l61821p6172j82730
$$ 11520834 10616723 9934911 9390632 8844277 8614536 8387762 7984784 7622963 7546791 7364061
3392G364061j43420p2550M7379p2482J6645l13249k30027Q0633j69858j48397
$$ 7364061 7220641 7148091 7195470 7122988 7139633 6826384 6596357 6676990 6507132 6358735
3382F358735J44136N2747r7010l625O5250J3224M4808n8420k92538N8431N3970
$$ 6358735 6502871 6555618 6458608 6454983 6520233 6533457 6578265 6519845 6227307 6285738 6339708
3371F339708n0600P6453P2397L2958k98308K04896O1991j25384L9929j60602r1652
$$ 6339708 6289108 6365561 6437958 6470916 6172608 6377504 6439495 6314111 6354040 6193438 6101786
3360F101786k6041n1003J84625j08383k47676k03879q8837L379r9585Q9484j88406
$$ 6101786 6075745 6024742 6209367 6100984 5853308 5649429 5560592 5563971 5464386 5553870 5365464
3349E365464j05633q8901q920J24331N260j44638r7883k22236k10580l6468j32329
$$ 5365464 5259831 5170930 5162010 5286341 5291601 5146963 5049080 4826844 4616264 4579796 4447467
3338D447467J38571n090j62009k14741J162K4527j01588k37835M5688n653O9469
$$ 4447467 4586038 4580948 4418939 4204198 4205360 4229887 4128299 3890464 3936152 3930499 3999968
3327C999968m9693j96814J63628p9647o386k61820m3109n5353j36486J06240N1030
$$ 3999968 3950275 3753461 3917089 3837442 3831056 3569236 3526127 3470774 3334288 3440528 3491558
3316C491558j76786K24864o4469j21415N3360j4477m6786J23312L8656O7625J15716
$$ 3491558 3314772 3539636 3475167 3353752 3407112 3392635 3345849 3469161 3507817 3575442 3691158
3305C691158l5208k00031j31896j5694M5337J98931k6646j94631j03921J21967
$$ 3691158 3655950 3455919 3324023 3308329 3353666 3552597 3525951 3331320 3227399 3349366
3295C349366L7994l3948O8983q2115j31442k11971k4615j72351j12576J52593
$$ 3349366 3387360 3353412 3422395 3340280 3208838 2996867 2972252 2799901 2687325 2839918
3285B839918J35000p2056J80249k5053j69444J66473j58574j00863j1948J10890
$$ 2839918 2974918 2902862 3083111 3058058 2888614 3055087 2896513 2795650 2783702 2894592
3275B894592r7577Q4457L6152m8951j06725N2636j01464j06310j32970J68717
$$ 2894592 2797015 2881472 2917624 2868673 2761948 2814584 2713120 2606810 2473840 2642557
3265B642557N0500n7658k47313K5748M1128J53929p6288N7145J81070K44170j87709
$$ 2642557 2693057 2635399 2388086 2413834 2454962 2608891 2532603 2589748 2770818 3014988 2827279
3254B827279j93580J84547k75528r8813n833J28804j42122J33157m4001M0997
$$ 2827279 2633699 2818246 2542718 2443905 2438072 2566876 2424754 2557911 2513910 2554907
3244B554907J65286q0478m4417p45j061J31745j5219j0688m8846J2806j35313
$$ 2554907 2720193 2639715 2595298 2594553 2593492 2725237 2710018 2699330 2650484 2663290 2527977
3233B527977K38760j77888n8212K13612o8671J4657l2646m428R8795j54913R0257
$$ 2527977 2766737 2588849 2530637 2744249 2675578 2690235 2657589 2653161 2751956 2597043 2687300
3222B687300n0062j7210R6427R4796M3296L6411J06757o2647M430k33548Q9702
$$ 2687300 2637238 2620028 2716455 2811251 2854547 2890958 2997715 2935068 2939498 2705950 2795652
3211B795652J37001n6725P0587n6167j36514L26474J24961o3566R765l232J16836
$$ 2795652 2932653 2875928 2946515 2890348 2753834 3080308 3205269 3141703 3151468 3148236 3265072
3200C265072L6812l4056n0530o4969J03124R8359K03068r3020J50814K05350J2101
$$ 3265072 3301884 3267828 3217298 3152329 3255453 3353812 3556880 3463860 3614674 3820024 3832125
3189C832125R2884K22321O1382J85466J57997J58089J62464K52270J01113J22265
$$ 3832125 3925009 4147330 4208712 4394178 4552175 4710264 4872728 5124998 5226111 5348376
3179E348376J80366k2167J52023M25946n0480j77304m2936J14678Q2117m1317
$$ 5348376 5528742 5506575 5658598 6084544 6034064 5856760 5813824 5928502 6010619 5969302
3169E969302k15667q5801j8370K49663J42394j79380J39694L0872K97595j36320
$$ 5969302 5753635 5667834 5649464 5899127 6041521 5862141 6001835 6032707 6330302 6193982
3159F193982K31108k4936J04782L46987L15329Q7299L36867O46431P16708M24594
$$ 6193982 6425090 6400154 6504936 6851923 7167252 7254551 7591418 8237849 8954557 9379151
3149I379151M74356J82826k59921o25174p28916l64540n74198l93973k44543k16264
$$ 9379151 9853507 10036333 9776412 9151238 8422322 8057782 7483584 7089611 6845068 6628804
3139F628804n36881l84352j93861L1093j24048j62176l6608j43219l26986M8649
$$ 6628804 6091923 5707571 5513710 5544803 5420755 5258579 5221971 5078752 4751766 4800415
3129D800415N2410J2973m1079R2372J10393J48864J45098m2365r4073l6751J10891
$$ 4800415 4852825 4865798 4824719 4917091 5027484 5176348 5321446 5279081 5185008 5148257 5259148
3118E259148p8236J44553k49735k12832j58327l26796k71989o9920j43188k081
$$ 5259148 5180912 5325465 5075730 4862898 4704571 4377775 4105786 4035866 3892678 3890597
3108C890597j37182k81818p284l38984N0815k30648j50472J28825j92739q9026
$$ 3890597 3753415 3471597 3464313 3125329 3176144 2945496 2795024 2923849 2731110 2642084
3098B642084j52847J7933j581o3994l6139M57J6571j31814O4590j15398j35321
$$ 2642084 2489237 2507170 2505589 2441595 2405456 2405913 2422484 2290670 2355260 2239862 2104541
3087B104541q4337k23163N8373P6858O8370J6375O7060j65892j8442q1624K7255
$$ 2104541 2020204 1797041 1855414 1932272 2000642 2017017 2084077 1918185 1899743 1818119 1845374
3076A845374J76990l00152K76856O2256k28101k116J6281J9881l48120p6381K36150
$$ 1845374 2022364 1722212 1999068 2061324 1833223 1831107 1847388 1867269 1519149 1442768 1678918
3065A678918j39663J34639J99172k0956K156k46752L0411O6926j45571Q645L01111
$$ 1678918 1539255 1673894 1873066 1852110 1854266 1607514 1637925 1704851 1559280 1567925 1869036
3054A869036j56589j01889j48899l4378J30902M3802O112k02209j62914K3922
$$ 1869036 1712447 1610558 1461659 1427281 1558183 1601985 1608097 1405888 1242974 1266896
3044A266896K34599J60906k11700P3760j46424m8101M7565k6014r7470J18810
$$ 1266896 1501495 1662401 1450701 1524461 1378037 1329936 1377501 1351487 1254017 1372827
3034A372827m314l8865k08292J2495L11486o0806k16525P166J02795q3511J56717
$$ 1372827 1368513 1329648 1121356 1133851 1445337 1384531 1168006 1175172 1277967 1194456 1351173
3023A351173j36291J38738n6574O4649p9164p3052j73482K1146J7703O7323q7425
$$ 1351173 1214882 1353620 1297046 1361695 1282531 1209479 1035997 1057143 1074846 1142169 1054744
3012A054744Q7593L0189P8545J92356j60472j1640o6032j6658J164R0015K4568
$$ 1054744 1142337 1172526 1251071 1443427 1282955 1271315 1205283 1188625 1189789 1279804 1304372
3001A304372k41115j45632J69096K31931j00554m031J29596p6204m5710j39752
$$ 1304372 1063257 917625 1086721 1318652 1218098 1214067 1343663 1267459 1221749 1081997
2991A081997j27200J22219J82790p5632j51463R8823r8232l7833o0222k23113
$$ 1081997 954797 1077016 1259806 1184174 1032711 1131534 1033302 995469 935247 712134
2981G12134J77493J47866J87376p381k3339j28934j21176q6440n0518L14609l8465
$$ 712134 889627 1037493 1224869 1217488 1194149 1065215 944039 857599 807081 1121690 1083225
2970A083225k1638n0718j03252Q1265J1189o4212M7047K6521L0963j94870j08472
$$ 1083225 1061587 1010869 907617 988882 1000071 935859 982906 1009427 1040390 845520 737048
2959G37048J04801L39223k02240j16355P6118n8854P3367J5902l3467P8720p035
$$ 737048 841849 1181072 978832 862477 938595 879741 953108 969010 935543 1014263 1007228
2948A007228p5080J1932K2475l5950o9852n060J31657J26455q7543j62572P7418
$$ 1007228 932148 944080 966555 930605 860753 855693 987350 1113805 1026262 863690 941108
2937I41108J68669l3694k38003r0565J20495J7980N3177K6109M3809p707q5830
$$ 941108 1109777 1076083 838080 747515 868010 885990 939167 965276 1009085 1001378 915548
2926I15548p5478Q9428j57019K19287q2205j43148K28490m9123l6501J13159r2642
$$ 915548 840070 929498 772479 991766 909561 766413 994903 945780 909279 1022438 929796
2915I29796p640j6399m3008k5516k38777M2554K29599k80576Q4530J43175j6621
$$ 929796 922156 905757 862749 837233 598456 641010 870609 590033 674563 817738 801117
2904H01117q7401P0203J1560r4050j11127O7163J02999K7528p6981k6503K00218
$$ 801117 713716 783919 795479 701429 590302 657465 760464 787992 711011 684508 884726
2893H84726o3262M4036m8451j33932J5361n6182Q0033j71392m3801J10952P5296
$$ 884726 821464 865500 817049 683117 698478 642296 722329 550937 507136 618088 693384
2882F93384L0484J750l3422j44427J50050L59628K3597k07689k22893l6224R1898
$$ 693384 723868 725618 692196 547769 697819 1057447 1081044 873355 650462 614238 706136
2871G06136j10577p4660j5531M0205J47608Q474J002P8125J0931q2669p0412Q2033
$$ 706136 595559 520899 505368 545573 693181 701655 702657 780782 791713 709044 638632 720665
2859G20665N193K15538o9938m2444J98153l19799p2269K64115M3699j43192j24775
$$ 720665 725858 941396 871458 829014 1027167 707368 635099 899214 942913 799721 674946
2848F74946J58457P9159K41552j16236k34675j59736k7608K55323p5577m2810
$$ 674946 833403 912562 1154114 1037878 803203 643467 615859 871182 795605 752795
2838G52795J99644j38915j4863J38862k51024K5380J41289n7661k7166j32427
$$ 752795 952439 813524 798661 937523 686499 711879 853168 795507 768341 635914
2828F35914q5862l3009m0648J51339J57856j42064J13147J80001j98090k2948
$$ 635914 550052 517043 476395 627734 785590 643526 756673 936674 738584 715636
2818G15636n6830l6198O5J9999J6534n0557R1496j1397J21640J2503p6677k37839
$$ 715636 658806 622608 622673 642672 659206 608649 700145 688748 810388 822891 746214 508375
2806E08375K1654K20230Q0106j42936N1352L853j4455p9651o5973J8956j44321
$$ 508375 530029 750259 830365 687429 738781 742634 728179 648528 582555 601511 457190
2795D57190M1550j33126j13681K35871J92755L2128m0520m9740J24081m6509p2538
$$ 457190 498740 365614 251933 487804 680559 712687 672167 622427 746508 699999 627461
2784F27461n3773J16326r7018j77898P1403L5352r6643R4454K3077M1677J47526
$$ 627461 573688 690014 592996 415098 486501 521853 425210 519664 542741 584418 731944
2773G31944j29665J67330j08544k20421R6275J32317J7826O1658j0615j42439
$$ 731944 602279 769609 661065 440644 536919 669236 687062 748720 738105 595666
2763E95666M0832p9007N938O7814K1022n8521o6111k0436K0183L3938j77018J45322
$$ 595666 636498 557491 563429 631243 652265 593744 527633 507197 527380 561318 384300 529622
2751E29622k6660K12760j5832j37680O8348q5922K3633J25250j12722K08798N5787
$$ 529622 502962 715722 699890 562210 630558 544636 568269 693519 580797 789595 845382
2740H45382j99214o6391r9987J24378Q9431n2830l33025J38336K16986j50271
$$ 845382 646168 579777 479790 604168 693599 640769 307744 446080 663066 512795
2730E12795o2047J2481k5912J86930J27042j27243j31848J52916o7941j2504J08407
$$ 512795 450748 463229 437317 624247 751289 624046 492198 645114 577173 564669 673076
2719F73076j22041l6891J48862K5567q7699N0699j58354j8701q1533J99838J94855
$$ 673076 551035 514144 663006 688573 600874 651573 493219 474518 392985 592823 787678
2708G87678j06970j70755j26976J60842Q3170j92050j34144J46857j5507n097
$$ 787678 680708 509953 382977 543819 626989 434939 300795 447652 432145 427048
2698D27048M7437K73655j91996R6196m018j87576j03859K67470J17471l97067
$$ 427048 474485 748140 556144 652340 648322 460746 356887 624357 741828 344761
2688C44761Q4055N3684n6648j20297j705L8448K3388j5306n8015J66552j4585
$$ 344761 428816 482500 425852 305555 303850 342298 365686 350380 292365 458917 444332
2677D44332K36702k2364l03705N820l6731K0208K26718L0007R6547o6456n7942
$$ 444332 681034 658670 354965 360785 324054 344262 570980 600987 697534 631078 573136
2666E73136j47831O299J60217J8384L5642j38583m1515m379K31765k0701j02699
$$ 573136 425305 431604 591821 610205 645847 507264 465749 461370 693135 672434 569735
2655E69735j39852j81162R6272J41934l005K3205p6820n0901K3656J18042N562
$$ 569735 429883 248721 344993 486927 483922 507127 430307 379406 403062 521104 526666
2644E26666J7417J52454n8729l4370j45054j0712J86094J2126l5331j24374L7221
$$ 526666 544083 696537 637808 603438 458384 447672 633766 645892 610561 486187 523408
2633E23408J14961j66721J06282J0626J24214J37898k31625n0861O6380o3547
$$ 523408 638369 471648 577930 588556 712770 850668 619043 568182 634562 571015
2623E71015k51664R3538K48441j78318J14588J29819l3276L6157J08413r578k37798
$$ 571015 319351 412889 661330 483012 597600 727419 694143 730300 838713 829135 591337
2612E91337L7036r0676p3584m1581n3615R6319r9584J33615J85291l4899j78523
$$ 591337 628373 537697 464113 422532 368917 465236 365652 499267 684558 649659 471136
2601D71136L2751m0724J90657q0384l3479J44532r9987k0149q7763M7951J185
$$ 471136 503887 463163 653820 573436 539957 684489 584502 564353 476590 524541 525726
2590E25726J71195k11153j27836O9763K07964k6924J83543o5211M930j98073R6797
$$ 525726 696921 485768 357932 427695 635659 608735 792278 727067 731997 533924 630721
2579F30721j74934o6128L8488Q744R5962k31060J43508P7155L2454J76613P4620
$$ 630721 455787 389659 428147 436891 532853 301793 445301 522456 554910 731523 806143
2568H06143j02075k01989k3951J36293M5663r2030r325N210O6126l3023r7184
$$ 806143 704068 502079 478128 614421 660084 568054 558729 563939 630065 597042 499858
2557D99858K68089n4823j86319q7995k21139m7276K35429j2921j08310j06776
$$ 499858 767947 713124 526805 438810 217671 170395 405824 392903 284593 177817
2547A77817J74976J92875J12066N5978j26651N2278j38971q1892O9234J69662
$$ 177817 352793 545668 657734 713712 587061 639339 500368 418476 487710 657372
2537F57372O4662r5621j96639Q0211J34103o3650J28619Q4290K17947j78117k74809
$$ 657372 722034 626413 429774 509985 644088 580438 709057 793347 1011294 833177 558368
2526E58368J26967k29720k20980L18533l4859l63L1479p1887R4774q4519J43051
$$ 558368 685335 455615 234635 553168 518309 517946 549425 477538 572312 487793 630844
2515F30844p9224k38380J45144J48229n5820l9122n9221q646K24932r8681p1085
$$ 630844 551620 313240 458384 606613 550793 511671 452450 443804 668736 570055 498970
2504D98970K73447n1652j36279K32621K3845j64356m5534l6905j05812K55542
$$ 498970 772417 720765 584486 817107 840952 676596 631062 594157 488345 743887
2494G43887K4499Q3043j05840l20035K5571J25754j5075n3043L4824J72044k0233
$$ 743887 768386 851429 745589 425554 451125 576879 561804 508761 543585 715629 695396
2483F95396K01750j03989p3869l3983p3856J3217M611K00643L9018o8988j05002
$$ 695396 897146 793157 719288 685305 611449 624666 629277 829920 868938 799950 694948
2472F94948J90404L0606m6604l7174k87185P2773O9261K50079p2192j32082J01098
$$ 694948 885352 915958 869354 832180 544995 617768 687029 937108 864916 732834 833932
2461H33932j1868m9450o141R4209q2050Q7388n8157n8148J61888O4595K09666
$$ 833932 822064 772614 766473 860682 778632 866020 807863 749715 911603 976198 1185864
2450A185864q9749j62384o1769J61086J64595j61821q0622j12587Q1337K9758
$$ 1185864 1096115 933731 871962 1033048 1197643 1035822 955200 842613 923950 953708
2440I53708J59419Q5173J24464N096n4353J93349j69615k13085J24876J19842
$$ 953708 1113127 1198300 1322764 1327860 1273507 1466856 1297241 1084156 1209032 1328874
2430A328874j00477j23162K22572Q3842Q5588o4612K3072N4285P1325j26018Q2225
$$ 1328874 1228397 1105235 1327807 1411649 1497237 1432625 1455697 1509982 1581307 1455289 1537514
2419A537514k7049J28876J50870r420K86422R6435j22727l30722J52510R6123
$$ 1537514 1510465 1639341 1790211 1780791 2067213 2163648 2040921 1710199 1862709 1958832
2409A958832P9074J01858j74252J44289J13419L4167M1683J49452l8405J44005
$$ 1958832 2037906 2139764 1965512 2109801 2223220 2257387 2299070 2448522 2410117 2554122
2399B554122N3203K50734q0999j08077k82228L6976M41499J33005L14504J87585
$$ 2554122 2607325 2858059 2777060 2668983 2386755 2423731 2865230 2998235 3312739 3500324
2389C500324k40366J9888R3595j22353J61401J82458J61601J85028K36749K00917
$$ 3500324 3259958 3279846 3373441 3251088 3412489 3594947 3756548 3941576 4178325 4379242
2379D379242O7375J59067J32763J97185K01014K12553M00329J87152L70033L34341
$$ 4379242 4446617 4605684 4738447 4935632 5136646 5349199 5749528 5936680 6306713 6641054
2369F641054L87514J03828N71754N09650O15535M59479O30489P92121N36385M19764
$$ 6641054 7028568 7132396 7704150 8213800 8829335 9288814 9919303 10711424 11247809 11667573
2359A1667573J144481J233408J334729J754198K323827L048346L506624M629498
$$ 11667573 12812054 14045462 15380191 17134389 19458216 22506562 26013186 30642684
2351C0642684N532577P145943R182999J0005248K725134o994941r424681q952050
$$ 30642684 36175261 43321204 52504203 62509451 65234585 58239644 48814963 39862913
2343C9862913o796266n511056m145551l103452k606673j724885j498671j207712
$$ 39862913 33066647 27555591 23410040 20306588 17699915 15975030 14476359 13268647
2335A3268647r29726p07255p50064o93741o98466m74012o60711o75728o53199
$$ 13268647 12338921 11631666 10881602 10187861 9489395 9015383 8354672 7678944 7025745
2326G025745n60904o19815l36488k76649l93033l86347l1307k57696j86214k6574
$$ 7025745 6464841 5845026 5508538 5231889 4838856 4452509 4421202 4163506 3977292 3950718
2316C950718j85671k28718j46173M3455l56964l19019J08038j71227L7048j04327
$$ 3950718 3765047 3536329 3390156 3433611 3076647 2757628 2865666 2694439 2731487 2627160
2306B627160o2310r7657j42570o8218j70448L9791p2419k4013J0757J13218j12149
$$ 2627160 2564850 2467193 2324623 2256405 2085957 2125748 2053329 2029316 2040073 2153291 2041142
2295B041142j8926j06622j29023o9571l5445n7631j70033J0118j92764J18181
$$ 2041142 2022216 1915594 1786571 1717000 1681555 1623924 1453891 1464009 1271245 1389426
2285A389426Q9931j03218r9329O1048k94576J96451J00407j80348J32754l22942
$$ 1389426 1479357 1376139 1276810 1337858 1043282 1239733 1340140 1159792 1292546 969604
2275I69604m6037N8244p436j13636o7298O0458J12242O1611k53279R9465j12816
$$ 969604 923567 981811 974375 860739 793441 853899 966141 1027752 774473 873938 761122
2264G61122j38555O8366k19302J86105J12346J62420n6501q4722q2186j79755
$$ 761122 622567 690933 471631 657736 770082 932502 876001 791279 709093 529338
2254E29338O9816J69900j42948J00245j9972K3913K2357J06076p7061j25617Q591
$$ 529338 599154 769054 626106 726351 706379 730292 752649 858725 781664 656047 664638
2243F64638P9767P128l02860O2638J00961O4357j7596J8352j76382O0017J18023
$$ 664638 744405 751533 448673 511311 612272 676629 659033 677385 501003 561020 679043
2232F79043j36910J28232j12798O9411r2134q9265J18804J02078n0526j08377
$$ 679043 542133 670365 557567 626978 534844 445579 564383 666461 615935 507558
2222E07558M4907l0838P368j13767j94174M6444n3812o2386K3161K3809Q2477
$$ 507558 552465 521627 528995 415228 221054 267498 213686 151300 174461 198270 280747
2211B80747J26572J03732Q5334n5286p4954K02727k80325j19575K28176j58756
$$ 280747 407319 511051 596385 541099 466145 668872 388547 268972 497148 338392
2201C38392j16530j5273J4086K08392j64492j7345p7929p1454K26419J04722k68523
$$ 338392 221862 206589 220675 429067 264575 247230 169301 97847 324266 428988 160465
2190A60465j33710K84703Q1838r1805p2111Q5270O3450L1985Q3199j56808Q1685
$$ 160465 26755 311458 393296 301491 229380 314650 378100 410085 493284 336476 418161
2179D18161J67681J71513l33652j66232m4889L8115n3068j06970n1133L80501
$$ 418161 585842 757355 423703 257471 212582 250697 197629 90659 39526 420027
2169D20027j57835k51345O3155O627p8659K4653K37621j42045M2286J25640j3764
$$ 420027 262192 10847 74002 80629 1970 26623 264244 122199 164485 290125 276361
2158B76361j13915p5605J99397j28100k979K01314k3452n4615k41843J19151o4836
$$ 276361 162446 86841 286238 158138 155159 356473 333021 278406 36563 155714 90878
2147I0878K6924k09707M5116K10312j0035j08645K39703j09437Q6303O0849J16547
$$ 90878 117802 -91905 -46789 163523 153488 44843 284546 175109 261412 322261 438808
2136D38808q3994r6674k86706l9545j8323r1383J63946J37032O1896O6177J88298
$$ 438808 354814 258140 -28566 -68111 -86434 -177817 -13871 123161 185057 251234 439532
2125D39532p7010k73054k81604J35676J58952Q2853j54285k0926L31655n5392
$$ 439532 362522 89468 -192136 -56460 102492 185345 31060 10134 341789 286397
2115B86397j20183P7329k4945o8142J641J08097j47038O5752R8921j78071o9552
$$ 286397 166214 243543 218598 150456 152097 260194 113156 178908 277829 99758 30206
2104C0206J86349L4249j84639O2813o052n2294J1358J38136R742n8332J14376
$$ 30206 216555 250804 66165 128978 122926 70632 81990 220126 229868 171536 285912
2093B85912N8350l6480j69629j52055j3009K4061O264O962N2480n6110N0707K70645
$$ 285912 344262 307782 138153 -13902 -26911 -2850 3414 10376 62856 6746 57453 328098
2081C28098J43254J26133K263n1813k06266K5226m8123q0758M6432j67651j72694
$$ 328098 471352 597485 599748 547935 341669 366895 318772 238014 284446 116795 -55899
2070e5899K98566k99093R8829L93911r2643j64437m2803n2484j54745R4389O7461
$$ -55899 242667 -56426 42403 436314 343671 179234 136431 83947 -70798 23591 91052
2059I1052J8977J41784l23470P8784q3794O2285J50508m6318n9463n3051j50231
$$ 91052 110029 251813 -71657 7127 -76667 -14382 136126 89808 30345 -22706 -172937
2048a72937J97029J79451M6009P1317j40953M7264k6835j02842j04380j5569R531
$$ -172937 24092 203543 249552 320869 179916 227180 200345 97503 -6877 -22446 -12915
2037a2915J77399L9049J26811k09172j4904J47457m3411j36153j38374N2924J58308
$$ -12915 164484 203533 330344 121172 106268 253725 210314 74161 -64213 -11289 147019
2026A47019R758Q5029N3317M2955q4716O799j60431j26093J53495K4776J45756
$$ 147019 156777 241806 295123 338078 253362 260161 99730 -26363 127132 151908 297664
2015B97664p107J18073k87671j06267N9815j74590K48745N9085o8424m060k06837
$$ 297664 290557 408630 120959 14692 74507 -100083 148662 207747 139323 135263 -71574
2004g1574J17230N158m3796J92799o5758J38627r1859j8404j27481J78791j7216
$$ -71574 45656 50814 7018 199817 134059 272686 180827 162423 34942 213733 196517
1993A96517j09917q8782L4003J26698K0371j38952l1445Q2989J08851M7504j61525
$$ 196517 86600 -2182 31821 158519 178890 39938 8493 91482 200333 247837 86312
1982H6312j49166J4278K68748j20717q4185K35774l0018m1794J16596j5610j5812
$$ 86312 -62854 -48576 220172 99455 15270 251044 221026 179232 295828 280218 264406
1971B64406o6898j01380m3282k30502L6589J32731k46437j67452K17712K20658
$$ 264406 197508 96128 52846 -177656 -141067 -8336 -254773 -422225 -204513 16145
1961A6145K19409O0940j9514J41382n0233j53155k63588J0938j07884J93863M7082
$$ 16145 235554 296494 276980 418362 368129 214974 -48614 -37676 -145560 48303 95385
1950I5385j56299L543J2433K67293p4633k5669n0153J88102n7831j51310j06708
$$ 95385 -60914 -57371 -44938 222355 147722 122053 71900 260002 202171 50861 -55847
1939e5847K9310m5515M8812j58180R2865K80228k96573J36953J122P5375L4770
$$ -55847 -26537 -72052 -23240 -181420 -88555 191673 -104900 32053 33175 108550 143320
1928A43320l0365j67298k09240K99809j4713Q9640L6468j11582J2494j04616J00208
$$ 143320 112955 -54343 -263583 36226 21513 111153 147621 36039 48533 -56083 44125
1917D4125J11407m3162k36848p8314N1459j1370K1865L36102j92879J0953R0143
$$ 44125 155532 112370 -124478 -202792 -151333 -162703 -140838 195264 2385 13338 103481
1906A03481k77489J27631J90628q1583l5008o7312k2878j1484K2901J84794l4888
$$ 103481 -174008 -46377 144251 62668 27660 -39652 -62530 -74014 -51113 133681 98793
1895I8793l0168J55558j35055R278L2522Q9272j46541j75751l3497K4509J42260
$$ 98793 68625 224183 89128 98406 130928 220200 73659 -102092 -135589 -111080 31180
1884C1180J68781q8007j14823m2719j06308K18361L2626j36539p2834K25711K3869
$$ 31180 199961 111954 -2869 -45588 -151896 66465 99091 -37448 -110282 115429 139298
1873A39298m6403q8039j15650k6645J23629J76479j16537j3362K54365n0179n3917
$$ 139298 92895 4856 -110794 -137439 -13810 162669 46132 32770 287135 236956 183039
1862A83039r660J32442q0085j34072Q6921j24953O5510m9000J43268j37948l1488
$$ 183039 173379 305821 225736 91664 178585 53632 119142 70142 213410 75462 43974
1851D3974n164r9612J15694K42835j75387j39995J21167N8615J84915j22950j98190
$$ 43974 38810 -60802 54892 297727 122340 -17655 103512 162127 347042 224092 25902
1840B5902j735j65977O0221q739Q9309J43877m7776M2273J69672k17194l9964
$$ 25902 24167 -141810 -81589 -90328 -1019 142858 95082 137355 307027 89833 49869
1829D9869J08512k8859j8644k85822J52058o460P4386N4877q5635L443Q14j1702
$$ 49869 158381 129522 110878 -174944 -22886 -29346 45040 99917 14282 17725 18539 6837
1817F837o4368k6366j44151R6012J29182J7744J10961J1645K2309l7901l2329
$$ 6837 -57531 -83897 -228048 -132036 -2854 14890 125851 137496 159805 121904 89575
1806H9575j36559j4953l1881j12717K14827O550n0992K48496j07080P5392K7157
$$ 89575 -46984 -61937 -93818 -206535 8292 14842 -36150 212346 105266 180658 207815
1795B07815o6193j72407P1636K5355p9768j23739N1718J03633J05618m7515M2237
$$ 207815 141622 -30785 40851 66206 -13562 -137301 -85583 18050 123668 76153 118390
1784A18390j07585R6671M3547k49076k4904J67345K69637M1037j44873q3040P3828
$$ 118390 10805 107476 151023 -98053 -122957 44388 314025 355062 210189 127149 200977
1773B00977p9197l8816l39502J23375J31198J43817m0084k2060q878k6393n6151
$$ 200977 121780 82964 -256538 -133163 -1965 141852 101768 79708 70830 44437 -11714
1762a1714m0975j2663q1775M5215J19992L9024j39862J59988j19212p105J00784
$$ -11714 -52689 -65352 -147127 -101912 18080 57104 -82758 77230 -41982 -49087 51697
1751E1697R7989K5880l6187j44027L0866M3290K6624K571N5332j55335j76376
$$ 51697 149686 175566 139379 -4648 26218 69508 96132 98703 154035 -1300 -177676
1740a77676J19680J71317R0938k0999q9014k38939n8564J34874J35477J00604
$$ -177676 -57996 113321 204259 183260 94246 -144693 -203257 -68383 67094 167698
1730A67698J23036o8124k10951j03959J13867j44945R722m0699p8817J77880j17222
$$ 167698 290734 222610 11659 -92300 21567 -123378 -113656 -154355 -233172 -55292 -172514
1719a72514j5947K28899J5834p2313n42k4811o0856j33430R9403J76048o6242
$$ -172514 -188461 40438 56272 -16041 -16583 -41394 -102250 -235680 -136277 39771 -26471
1708b6471J57016L7746j60874l0703M7260k53906m6081r8406R7959K12361j22804
$$ -26471 130545 168291 7417 -23286 23974 -229932 -276013 -374419 -276460 -64099 -186903
1697a86903p3884R0487j13919k2559O3688Q5663J83993j28569p5968N9545K03381
$$ -186903 -260787 -170300 -284219 -306778 -243090 -157427 26566 -102003 -177971 -118426 84955
1686H4955K8842q6191P7148n1197j8046j7779p8139K4379R7904j5620k27273J25481
$$ 84955 113797 27606 104754 53557 35511 17732 -60407 -36028 61876 46256 -181017 -55536
1674e5536j81056o5683Q3163J22206P0788J0003p9981o3933J48246R587P1512
$$ -55536 -236592 -302275 -219112 -96906 -26118 -16115 -96096 -160029 -11783 -2196 69316
1663F9316O0513j25020j9997J92015j76765j64432k240J9691l0790N985M13210
$$ 69316 129829 4809 -15188 176827 62 -164370 -166610 -146919 -177709 -171724 241486
1652B41486j63280L1475R0146j30583L9297l171j13036R7800Q7775n6808j09539
$$ 241486 78206 109681 199827 69244 108541 105370 -7666 90134 177909 121101 11562
1641A1562k8849R9805k64631O7308O0364J01262M4027K9219K25066m3474l3106
$$ 11562 -17287 82518 -182113 -114805 -54441 46821 90848 120067 345133 301659 268553
1630B68553R558l5554M2354J02364k25867k82062N6312J01453Q2702k00956O0184
$$ 268553 278111 242557 284911 387275 161408 -120654 -64342 37111 119813 -81143 -20959
1619b0959k0566k7852j75759K45538n8830l6110O2067q1412J22585j42853K39344
$$ -20959 -41525 -69377 -245136 402 -58428 -94538 -32471 -113883 8702 -134151 105193
1608A05193j763r9026n4942m9713J4693j20950O6812J42784O2350j00114J14512
$$ 105193 103430 4404 -50538 -100251 -85558 -206508 -139696 3088 65438 -34676 79836
1597G9836N0338n2997k93744k54203P7731L79158J70620r9683k05334J93911O1822
$$ 79836 130174 77177 -216567 -470770 -393039 -13881 156739 57056 -148278 45633 107455
1586A07455O9464K6754L4169K5437o0216o7597m735Q9994q1615j74361J7868P9408
$$ 107455 176919 203673 237842 263279 203063 135466 130731 220725 139110 -35251 -17383 62025
1574F2025n8774J17885p0564j97514J99966L4396l6989K29377k87300L6817j45824
$$ 62025 3251 121136 50572 -146942 53024 87420 50431 279808 -7492 29325 -116499
1563a16499O3760J49809q6974L5353N7211J07985J61604k71487N4643Q4747J23094
$$ -116499 -52739 97070 10096 45449 102660 210645 372249 100762 155405 240152 363246
1552C63246k15689j37401M602k37527Q9290J6747K32480j67219Q9745J50003k21753
$$ 363246 147557 10156 14758 -222769 -133479 -116732 115748 -51471 38274 188277 -33476
1541c3476O3474k002l7480J7806K8671j20440P5997R405j31356P1622K9907j12054
$$ -33476 29998 27996 -9484 8322 36993 -83447 -7450 1955 -129401 -57779 -27872 -139926
1529a39926M0802K35670j64326j24856J81478O3730l09K4897K36012j93051n0765
$$ -139926 -99124 136546 -27780 -152636 28842 92572 92263 117160 353172 160121 109356
1518A09356j13401r0556J80623o4916Q178J9907m2120M986p448N3161r8180K5548
$$ 109356 -4045 -94601 86022 21106 29284 49191 7071 12057 4609 57770 -40410 -14862
1506a4862k7224q79J8696j72676o6499K42482J60687J00604j04453P023j05282
$$ -14862 -42086 -42965 -24269 -196945 -263444 -20962 139725 240329 135876 142899 37617
1495C7617k0552j20210R4564k30765J51850K37427k2198m3900n3655O3117j53390
$$ 37617 17065 -103145 -8581 -239346 -87496 149931 127733 83833 30178 93295 -60095
1484f0095L7999J64651p4810l5845n295o5746p5946q1376J25623L7126J70498
$$ -60095 -22096 142555 67745 31900 26605 -39141 -115087 -196463 -70840 -33714 136784
1473A36784l4461j86272j10416K8715n447j0232K0467J0377O638L1078M6937J51916
$$ 136784 102323 -83949 -194365 -165650 -171097 -181329 -160862 -150485 -143847 -112769 -65832 86084
1461H6084j18225J6814L986P6903J0816j14332k6968P4317j25527l8925N0863
$$ 86084 -32141 -15327 -11341 65562 76378 -37954 -64922 9395 -116132 -155057 -104194
1450a04194k5360j45137J34757k673K67875N0857k00067q6522J08911j31135J29938
$$ -104194 -129554 -274691 -139934 -142607 125268 176125 -23942 -110464 -1553 -132688 -2750
1439b750m1141l9504K59084Q6942k58846J43741j07907o9459J7044j83337J82125
$$ -2750 -43891 -83395 175689 262631 3785 147526 39619 -29840 -12796 -196133 -14008
1428a4008J64416j0850n1630j8120l6140K6095P8074p7431P8502j33880j00040
$$ -14008 150408 139558 87928 69808 33668 59763 137837 60406 138908 5028 -95012
1417i5012J63497J07684j52916k56793J05520J20212o5172m5681J82633Q9622
$$ -95012 68485 176169 23253 -233540 -128020 -7808 -72980 -118661 63972 153594
1407A53594j00218j47781L2597k6774K143J65322P7581n8372m7143j4574K6503
$$ 153594 53376 -94405 -61808 -88582 -86439 78883 156464 98092 50949 36375 62878
1396F2878K2651p9767m0702Q917Q8249j76975J54640R9654o411m4822o6715J8557
$$ 62878 85529 5762 -34940 -26023 62226 -114749 39891 139545 133134 88312 21597 40154
1384D0154J6346J71856j26818k2166J3852O4902j04645O4902j43991M4496Q1820
$$ 40154 56500 228356 101538 79372 93224 158126 53481 118383 -25608 18888 100708
1373A00708r7473j34725j2055Q8952J53665j76680k1120J17188O1532l2378j22872
$$ 100708 3235 -131490 -143545 -54593 99072 -77608 -98728 18460 79992 47614 -75258
1362g5258M0597n533M9633J64704m5019J07254n7730M160k26736j7323k5919J52658
$$ -75258 -34661 -40194 9439 174143 129124 236378 178648 182808 -43928 -61251 -87170 65488
1350F5488J52168p4323q7920k79251K4112K90883j94364Q3323L9559j73621k5159
$$ 65488 217656 143333 55413 -223838 -199726 91157 -103207 -19884 19675 -153946 -179105
1339a79105N0094K9593r8477K04524J06650Q0207j30615p8047k03856K0112J67408
$$ -179105 -129011 -99418 -197895 6629 113279 193486 62871 -15176 -219032 -198920 -31512
1328c1512r807j53710K5153N5542j5257n382j54299O2747J34177K77126l0397
$$ -31512 -41319 -195029 -169876 -114334 -129591 -134973 -289272 -226525 -92348 184778 154381
1317A54381j90910k34721j11498K39086n3788L44642N5068k95369K87213K9643
$$ 154381 -36529 -271250 -382748 -143662 -197450 147192 202260 -93109 194104 223747
1307B23747k50283j67504J00647J30572K11149j37192l5754J1529l6522J70404
$$ 223747 -26536 -194040 -93393 37179 248328 111136 75382 86911 50389 220793
1297B20793p8563j85456N1256l2159N3287o171r7087R7460J90585l51650j95537
$$ 220793 142230 -43226 8030 -24129 29158 22987 -74100 23360 213945 -137705 -333242
1286c33242J23699J95412K07912K9560j08003j82206Q2705Q8901k8454R0086j16173
$$ -333242 -209543 -14131 193781 223341 115338 -66868 15837 104738 76284 166370 50197
1275E0197k35999p5972J0868L39996l30807q1427K6076K11329Q9536M7226m1532
$$ 50197 -185802 -261774 -250906 89090 -241717 -323144 -297068 -85739 3797 51023 9491
1264I491q0053q0610J25206J29355j81947j28173J1484M6353j09667q4358Q8553
$$ 9491 -70562 -151172 -25966 103389 -78558 -206731 -195247 -148894 -258561 -342919 -254366
1253b54366J22750K27152J825n4440j32786j00393P5330m6960K3313J35472r5490
$$ -254366 -131616 95536 97361 42921 -89865 -190258 -114928 -161888 -138575 -3103 -98593
1242i8593j39584K1951K83397L3176Q487j05058Q8096l507q7899P1655j3357n8339
$$ -98593 -238177 -216226 67171 100347 108834 3776 91872 88365 466 72121 58764 425
1230D25P878k29479J12960n062p4590J4964j11036J87527Q6152m30n2481J05190
$$ 425 8303 -221176 -108216 -113278 -187868 -172904 -283940 -96413 -10261 -10691 -63172 42018
1218D2018j15879k3028K23576l3574j69337M8402j50920J47422K5482j83627j3942
$$ 42018 -73861 -96889 126687 93113 -76224 -27822 -178742 -31320 -5838 -189465 -203407
1207b03407l1125J41421P6222J09019O0214p8751O4726j62997p8033K572P2711
$$ -203407 -234532 -93111 -16889 92130 152344 73593 138319 -24678 -102711 -100139 -27428
1196b7428K35204J2946l09622j5901N5268K8199O1637J67691m4453j56615j2943
$$ -27428 207776 220722 -88900 -104801 -49533 -21334 40303 207994 163541 6926 -6017
1185f017n7108J0996k71307M1033M6485M1368M2590K56215L2486j56828n7123
$$ -6017 -63125 -52129 -323436 -282403 -235918 -194550 -151960 104255 136741 -20087 -77210
1174g7210p7708M7449P6439p4101j32436R7343J32404N0300k0393n0352j36077
$$ -77210 -154918 -107469 -31030 -105131 -237567 -140224 -7820 42480 22087 -28265 -164342
1163a64342l2142o1275R5151J34501o9651j06580P2215r6785N8441O8902O7737
$$ -164342 -196484 -257759 -162608 -28107 -97758 -204338 -132123 -228908 -170467 -101565 -33828
1152c3828q5427J09695J9431P1789j04676Q0968Q7094m165j50750J77208K1524
$$ -33828 -119255 -9560 9871 81660 -23016 57952 145046 140881 -9869 167339 188863
1141A88863p0892M4229m3419n2216j76925J27002j37418n8484J99961K1048n206
$$ 188863 117971 162200 118781 66565 -110360 16642 -120776 -179260 20701 41749 36543
1130C6543j06157k24138P1420P5415M5304O1326J45351r2115j54379J5768L0091
$$ 36543 -69614 -293752 -222332 -146917 -101613 -40287 105064 12949 -141430 -125662 -95571
1119i5571p0924r6765j42903Q3976R8792L39K14510j79540o0865K07374J66768
$$ -95571 -166495 -263260 -406163 -322187 -223395 -223056 -8546 -188086 -248951 -41577 125191
1108A25191j7524k0991j661o8736j5562k17300j25358J17902O1165k5739J42350
$$ 125191 107667 86676 85015 16279 717 -216583 -341941 -224039 -162874 -188613 -46263
1097d6263J17179q1621m3165M8152r6224m7461L48275p1331k45299J91124k94626
$$ -46263 70916 -10705 -53870 -5718 -101942 -149403 198872 127541 -117758 73366 -221260
1086b21260M9772M7084N2654R973N6932N4528j73282N9845n1439j62001j5269
$$ -221260 -171488 -124404 -71750 -61777 -4845 49683 -123599 -63754 -115193 -277194 -292463
1075b92463P8908J95492O9040P404j15064M0560K05882o3212o8586k13929k0509
$$ -292463 -213555 -18063 50977 58381 -56683 -16123 189759 126547 57961 -155968 -176477
1064a76477p4814n9857L22888j58999o7165J97683j46764k1895P3819j8514j27432
$$ -176477 -251291 -311148 11740 -147259 -214424 -16741 -163505 -185400 -111581 -130095 -257527
1053b57527m0481K70270J80743j54723M75J65465j68784M6095j46252J46420O2181
$$ -257527 -298008 -27738 153005 -1718 -1243 164222 -4562 41533 -104719 41701 103882
1042A03882j64323j44321O4412J8073L8369J50626M7428j19836m5483k1558K3267
$$ 103882 -60441 -204762 -140350 -122277 -83908 66718 114146 -5690 -51173 -72731 -49464
1031d9464K47284k06271O8322K2543j19769n9719Q4195m1191k975P6637q9181
$$ -49464 197820 -8451 59871 82414 -37355 -97074 -12879 -54070 -57045 19592 -69589
1020f9589j23648o017K03410J49209j74246m2031m0211M0071L3763l9221J4036
$$ -69589 -193237 -199254 4156 153365 -20881 -62912 -103123 -63052 -29289 -68510 -54474
1009e4474K61219R4189p6658j72580L7456j6786j25631n6233R0812N6575N2696
$$ -54474 206745 300934 224276 51696 89152 72366 -53265 -109498 -18686 37889 90585
998I0585j31023j15589l6007j6573J26807j28182O9584J08090J24697R8132K3057
$$ 90585 -40438 -156027 -192034 -208607 -81800 -209982 -140398 -32308 92389 190521 213578
987B13578j11255k10451J8236l9240K344J07702K3775j53560k59269K49800K75173
$$ 213578 102323 -108128 -89892 -129132 -126788 -19086 4689 -148871 -408140 -158340 116833
976A16833j19224J58227O044k13109n7496j0405p4997J53543K99961k3588j2505
$$ 116833 -2391 155836 161880 -51229 -108725 -119130 -194127 -40584 259377 235789 223284
965B23284j38822J0083n8827l50L4164l9607M1313M3081j54896L31201r3858j19161
$$ 223284 84462 94545 35718 35368 69532 29925 71238 114319 -40577 290624 196766 77605
953G7605J07229q528l2798j0454j09894O2399L7549L4509M6070o6469j70335l7948
$$ 77605 184834 176306 143508 133054 23160 85559 123108 157617 203687 137218 -33117 -71065
941g1065J7247j86769n141J13286J25102j04936J68750p9580l4894P3883j29332
$$ -71065 -53818 -240587 -245728 -132442 -7340 -112276 56474 -23106 -58000 15883 -113449
930a13449j75766J43005n3604P5267J99263L6014l269l33285q30J39137R7718
$$ -113449 -289215 -146210 -199814 -124547 74716 110730 107461 -225824 -226654 -87517 10201
919A0201J137j65554J64234J58890r4631K239J4989p8577M1752N778j24882J16795
$$ 10201 11338 -154216 10018 168908 74277 76516 91505 12928 54680 60458 -64424 52371
907E2371K724l28695J95289o7363k7347K41204J55492q891m550l6720r3380K8794
$$ 52371 55095 -273600 -78311 -145674 -173021 68183 223675 214784 210234 173514 80134 108928
895A08928j34439J7826N2103m2540J09330L8258l5677j32819q3823R5763l9771
$$ 108928 -25511 -7685 44418 1878 111208 149466 113789 -19030 -102853 -7090 -46861
884d6861R4582q0264j02134M9843p3546O1874J07159j33638r4561O745J61622
$$ -46861 47721 -32543 -134677 -84834 -158380 -96506 10653 -122985 -217546 -210801 -49179
873d9179J32005m2937J12077j70900M1410j07663j72232O8902J30556l4925J2285
$$ -49179 82826 39889 151966 -18934 22476 -85187 -257419 -188517 -57961 -92886 -80601
862h0601J37135l0623l3251j0303j0499J9108m4240L7856R6133M0764p5343j24538
$$ -80601 56534 25911 -7340 -17643 -28142 -9034 -53274 -15418 80715 121479 46136 -78402
850g8402J77066m0797J5294o984j83558M4334J5497K33835j05459j42708L0661
$$ -78402 98664 57867 73161 66177 -117381 -73047 -57550 176285 70826 -71882 -41221
839d1221J71551l5636j51756L9544O104N6967k7230o604j95177R3189J29216J4395
$$ -41221 130330 94694 -57062 -17518 -11414 45553 18323 11719 -183458 -90269 38947 53342
827E3342J1925j03854J33124J02539j06057J01393j56903m1965m9634J00321P959
$$ 53342 65267 -38587 94537 197076 91019 192412 35509 -6456 -56090 44231 52190
816E2190j12440J36952L9935j83215J43104j05716j7578p6327J16952N1253j3007
$$ 52190 -60250 76702 116637 -66578 76526 -29190 -46768 -123095 -6143 45110 32103
805C2103L5535N8056N9002R481j4502O0308j57115n0614k9916R4668J25936j40784
$$ 32103 67638 125694 184696 194177 179675 239983 82868 32254 2338 97006 222942 82158
793H2158r0264k99713K94278J62250J45777j20581j72745j08296M8017n5204J77950
$$ 82158 -8106 -307819 -13541 148709 294486 173905 1160 -107136 -59119 -114323 63627
782F3627Q1043k71238p3471P9789j64379j4874L52921J80741k4796j05777l21907
$$ 63627 144670 -126568 -200039 -120250 -284629 -299503 53418 234159 209363 103586 -218321
771b18321L5189J89474j74309O0255P4231Q8858J93814j3516o3364k72828O5205
$$ -218321 -183132 6342 -167967 -107712 -33481 55377 249191 235675 172311 -100517 -35312
760c5312l7044k40522K09061m7589O2905J37101O1094j39114n826J03945L6454
$$ -35312 -72356 -312878 -103817 -151406 -88501 48600 109694 -29420 -35246 68699 105153
749A05153k72281j05048J32752N8139j61667K4254j69938J48116J33805q6107
$$ 105153 -167128 -272176 -139424 -81285 -242952 -218698 -388636 -240520 -106715 -192822
739a92822L589k215J53488l7672j3864m9604p7837J81692J04526o9978K80895
$$ -192822 -189233 -191448 -37960 -75632 -89496 -139100 -216937 -35245 69281 -697 280198
728B80198j31749k9864Q7096j17285r3828k4316L329J46847p9252r1088j76043
$$ 280198 148449 118585 205681 88396 -5432 -29748 -26419 120428 41176 -49912 -225955
717b25955j9842K27286J34453l7040k6622k39411J04828L8891j59470j0271J13356
$$ -225955 -245797 -18511 115942 78902 52280 -187131 -82303 -43412 -202882 -213153 -99797
706i9797J24799j2272k7485j22877J37673N0642j00141q4496j46712J34285L9243
$$ -99797 25002 12730 -14755 -137632 41 50683 -49458 -133954 -280666 -146381 -107138
695a07138p8844J94652R6106j60505q6602J57462J8753J2861J31195o4974N1901
$$ -107138 -185982 8670 104776 -55729 -142331 15131 33884 46745 177940 112966 164867
684A64867j02199j0354k106j96693L0548J43071j5437j16530j7661J09251p3148
$$ 164867 62668 52314 50208 -146485 -115937 27134 11697 -104833 -122494 -13243 -86391
673h6391j51944J35918P4461R2887j01176j17379K39685k7846n3153j5895j17537
$$ -86391 -238335 -102417 -27956 64931 -36245 -153624 86061 58215 5062 -10833 -128370
662a28370m2023k6544j05192N3459J35689R0539J7917j5636K23424q0742J75029
$$ -128370 -170393 -196937 -302129 -248670 -112981 -22442 -4525 -20161 203263 122521 297550
651B97550j9799p9015J4130J12065j24071K0083q2649k04154n3363K15955r1785
$$ 297550 277751 198736 212866 324931 200860 220943 138294 -65860 -119223 96732 4947
640D947p0982K4775p7414K04895r376R9738Q0616L087j67682j69893J21545n4725
$$ 4947 -66035 -41260 -118674 86221 76845 176583 257199 260286 92604 -77289 44256 -10469
628a0469K495R0207k735J7001k17341J40708j1853m0561j38408k55213L5591L94278
$$ -10469 -7974 82233 79498 96499 -120842 19866 8013 -32548 -170956 -426169 -390578 3700
616C700K3013j33125j33768J58701J56357j38092J36630P592J9528j93120j29018
$$ 3700 26713 -106412 -240180 -81479 74878 -63214 73416 81008 100536 -92584 -221602
605b21602o2226M0099K48004J61871O8067j12598j28038j47583K8026J0020m3914
$$ -221602 -283828 -243729 4275 166146 234213 121615 -6423 -154006 -125980 -115960 -159874
594a59874K75350r4159r5382k19523P1352J29650l2658M626p8851K49106J1582
$$ -159874 115476 21317 -74065 -293588 -222236 -92586 -125244 -120618 -199469 49637 61219
583F1219l4722K22887J628j10694m2860J8407n4204J00537j78333K11089L604
$$ 61219 26497 249384 251012 140318 97458 115865 61661 162198 -16135 194954 198558
572A98558j09264o8829n8813K9611L2478L4150o1788N6733j75908o385J38238
$$ 198558 89294 20465 -38348 -8737 23741 57891 -3897 52836 -123072 -129457 8781
$$ [...]
##END NTUPLES=NMR SPECTRUM
##END=
