##TITLE=1H_CA-9209-1
 DMSO-d6
 8 sc, 
 2.11.2023
##JCAMPDX= 6.0         $$ Bruker NMR JCAMP-DX V2.0
##DATA TYPE= NMR SPECTRUM
##DATA CLASS= NTUPLES
##ORIGIN= UXNMR, Bruker Analytische Messtechnik GmbH
##OWNER= root
$$ XWIN-NMR		Version 3.5
$$ Thu Nov  2 12:52:54 2023 Russian Standard Time (UT+4h)  she@DPX200
##.OBSERVE FREQUENCY= 200.13135
##.OBSERVE NUCLEUS= ^1H
##.ACQUISITION MODE= SIMULTANEOUS
##.ACQUISITION SCHEME= undefined
##.AVERAGES= 8
##.DIGITISER RES= 18
##SPECTROMETER/DATA SYSTEM= spect
##.PULSE SEQUENCE= zg30
##.SOLVENT NAME= DMSO
##.SHIFT REFERENCE= (INTERNAL, DMSO, 0, 15.7436)
##AUDIT TRAIL= $$ (NUMBER, WHEN, WHO, WHERE, WHAT)
$$ ##TITLE= Audit trail, XWIN-NMR		Version 3.5
$$ ##JCAMPDX= 5.01
$$ ##ORIGIN= Bruker BioSpin GmbH
$$ ##OWNER= she
$$ F:/spectra/data/she/nmr/H-F/1/pdata/1/auditp.txt
$$ ##AUDIT TRAIL=  $$ (NUMBER, WHEN, WHO, WHERE, WHAT)
(   1,<2023-11-02 12:51:17.18 +0400>,<she>,<DPX200>,
      <created by zg, POWCHK disabled, PULCHK disabled
       configuration hash MD5:
       00 E9 B6 7A A2 85 ED C7 34 08 36 98 17 FE 4E 26
       data hash MD5: 16K
       40 9A F7 2D F7 3C E3 F5 7D C5 DC F2 A3 CC 94 8B>)
(   2,<2023-11-02 12:51:19.53 +0400>,<she>,<DPX200>,
      <Start of raw data processing
       efp BC_mod = 2 LB = 0.24 FT_mod = 6 PKNL = 1 PHC0 = -23878.03 PHC1 = 17.0527 SI = 16K 
       data hash MD5: 16K
       1E 11 CB 93 32 9F 7C 6D 5F D7 D3 FF F8 5D 66 33>)
(   3,<2023-11-02 12:51:41.46 +0400>,<she>,<DPX200>,
      <pk PHC0 = 4.455217 PHC1 = -11.4 
       data hash MD5: 16K
       84 EF CF 67 8A E7 EA 86 32 BD DF 4D 35 F1 34 F1>)
(   4,<2023-11-02 12:51:46.62 +0400>,<she>,<DPX200>,
      <abs ABSG = 5 
       data hash MD5: 16K
       68 B6 3B 5B E6 06 0E 94 6D 4C FD F4 92 FF 53 60>)
$$ ##END=
$$ 
$$ hash MD5
$$ E8 8E D0 D2 B4 C1 6D 8C 10 19 5D 07 5C C5 17 D2
##$RELAX= 
##$RELAX= 
##$RELAX= 
##$RELAX= 
##$RELAX= 
##$RELAX= 
$$ Bruker specific parameters
$$ --------------------------
##$DU= <F:/spectra>
##$EXPNO= 1
##$NAME= <H-F>
##$PROCNO= 1
##$TYPE= <nmr>
##$USER= <she>
##$AMP= (0..31)
100 100 100 100 100 100 100 100 100 100 100 100 100 100 100 100 100 100 
100 100 100 100 100 100 100 100 100 100 100 100 100 100 
##$AQSEQ= 0
##$AQ_mod= 1
##$AUNM= <au_zg>
##$AUTOPOS= <>
##$BF1= 200.13
##$BF2= 200.13
##$BF3= 200.13
##$BF4= 200.13
##$BF5= 200.13
##$BF6= 200.13
##$BF7= 200.13
##$BF8= 200.13
##$BYTORDA= 1
##$CFDGTYP= 0
##$CFRGTYP= 5
##$CHEMSTR= <none>
##$CNST= (0..31)
1 1 145 1 1 1 1 1 1 1 1 1 1 1 1 1 1 1 1 1 1 1 1 1 1 1 1 1 1 1 1 1 
##$CPDPRG= <>
##$CPDPRG1= <>
##$CPDPRG2= <>
##$CPDPRG3= <>
##$CPDPRG4= <mlev>
##$CPDPRG5= <mlev>
##$CPDPRG6= <mlev>
##$CPDPRG7= <mlev>
##$CPDPRG8= <mlev>
##$CPDPRGB= <>
##$CPDPRGT= <>
##$D= (0..31)
0 1.2 0 0 0 0 0 0 0 0.06 0 0.03 0 0 0 0 0.0002 0 0 0 0 0 0 0 0 0 0 0 0 
0 0 0 
##$DATE= 1698915076
##$DBL= (0..7)
120 120 120 120 120 120 120 120 
##$DBP= (0..7)
150 150 150 150 150 150 150 150 
##$DBP07= 0
##$DBPNAM0= <>
##$DBPNAM1= <>
##$DBPNAM2= <>
##$DBPNAM3= <>
##$DBPNAM4= <>
$$ [...]
##$SUBNAM3= <"">
##$SUBNAM4= <"">
##$SUBNAM5= <"">
##$SUBNAM6= <"">
##$SUBNAM7= <"">
##$SUBNAM8= <"">
##$SUBNAM9= <"">
##$SW= 18.05172834244
##$SWIBOX= (0..15)
0 0 2 0 0 0 0 0 0 0 0 0 0 0 0 0 
##$SW_h= 3612.71676300578
##$TD= 16384
##$TD0= 1
##$TE= 0
##$TE2= 300
##$TE3= 300
##$TEG= 300
##$TL= (0..7)
0 120 120 120 120 120 120 120 
##$TP= (0..7)
150 150 150 150 150 150 150 150 
##$TP07= 0
##$TPNAME0= <>
##$TPNAME1= <>
##$TPNAME2= <>
##$TPNAME3= <>
##$TPNAME4= <>
##$TPNAME5= <>
##$TPNAME6= <>
##$TPNAME7= <>
##$TPOAL= (0..7)
0.5 0.5 0.5 0.5 0.5 0.5 0.5 0.5 
##$TPOFFS= (0..7)
0 0 0 0 0 0 0 0 
##$TUNHIN= 0
##$TUNHOUT= 0
##$TUNXOUT= 0
##$USERA1= <user>
##$USERA2= <user>
##$USERA3= <user>
##$USERA4= <user>
##$USERA5= <user>
##$V9= 5
##$VALIST= <valist>
##$VCLIST= <CCCCCCCCCCCCCCC>
##$VD= 0
##$VDLIST= <DDDDDDDDDDDDDDD>
##$VPLIST= <PPPPPPPPPPPPPPP>
##$VTLIST= <TTTTTTTTTTTTTTT>
##$WBST= 1024
##$WBSW= 4
##$XGAIN= (0..3)
0 0 0 0 
##$XL= 0
##$YL= 0
##$YMAX_a= 461408
##$YMIN_a= -545757
##$ZGOPTNS= <>
##$ZL1= 120
##$ZL2= 120
##$ZL3= 120
##$ZL4= 120
##$ABSF1= 15.6301
##$ABSF2= -2.421747
##$ABSG= 5
##$ABSL= 3
##$ALPHA= 0
##$AQORDER= 0
##$ASSFAC= 0
##$ASSFACI= 0
##$ASSFACX= 0
##$ASSWID= 0
##$AUNMP= <proc_1d>
##$AZFE= 0.1
##$AZFW= 0.1
##$BCFW= 0
##$BC_mod= 2
##$BYTORDP= 0
##$COROFFS= 0
##$CY= -3
##$DATMOD= 1
##$DC= 0
##$DFILT= <>
##$DTYPP= 0
##$F1P= 0
##$F2P= 0
##$FCOR= 1
##$FTSIZE= 16384
##$FT_mod= 6
##$GAMMA= 0
##$GB= 0
##$INTBC= 1
##$INTSCL= 3.70164e-10
##$ISEN= 128
##$LB= 0.24
##$LEV0= 0
##$LPBIN= 0
##$MAXI= 10000
##$MC2= 0
##$MEAN= 0
##$ME_mod= 0
##$MI= 1.114404
##$NCOEF= 0
##$NC_proc= -5
##$NLEV= 6
##$NOISF1= 3.799351
##$NOISF2= 2.8
##$NSP= 0
##$NTH_PI= 0
##$NZP= 0
##$OFFSET= 15.74358
##$PC= 1
##$PHC0= -23873.57
##$PHC1= 5.6527
##$PH_mod= 1
##$PKNL= yes
##$PPARMOD= 0
##$PSCAL= 0
##$PSIGN= 0
##$REVERSE= no
##$SF= 200.130005594897
##$SI= 16384
##$SIGF1= 3
##$SIGF2= 2
##$SINO= 5.538805
##$SIOLD= 16384
##$SREGLST= <1H.CDCl3>
##$SSB= 0
##$STSI= 16384
##$STSR= 0
##$SW_p= 3612.71676300578
##$SYMM= 0
##$S_DEV= 0
##$TDeff= 16384
##$TDoff= 0
##$TI= <>
##$TILT= no
##$TM1= 0
##$TM2= 0
##$TOPLEV= 0
##$USERP1= <user>
##$USERP2= <user>
##$USERP3= <user>
##$USERP4= <user>
##$USERP5= <user>
##$WDW= 1
##$XDIM= 16384
##$YMAX_p= 296447816
##$YMIN_p= -187355
$$ End of Bruker specific parameters
$$ ---------------------------------
##NTUPLES= NMR SPECTRUM
##VAR_NAME=  FREQUENCY,     SPECTRUM/REAL,   SPECTRUM/IMAG
##SYMBOL=    X,             R,               I
##VAR_TYPE=  INDEPENDENT,   DEPENDENT,       DEPENDENT
##VAR_FORM=  AFFN,          ASDF,            ASDF
##VAR_DIM=   16384,         16384,           16384
##UNITS=     HZ,            ARBITRARY UNITS, ARBITRARY UNITS
##FACTOR=    0.220516191357247, 1,           1
##FIRST=     3150.76272636648, 0,            0
##LAST=      -461.954036639297, 0,           0
##MIN=       -461.954036639297, -187355,     0
##MAX=       3150.76272636648, 296447816,    0
$$ Real data points
##PAGE= N=1
##DATA TABLE= (X++(R..R)), XYDATA
$$ [...]
13003a927k3512j9947J6976j6630J6432K6727P392n2070J5205N2865J076m7914
$$ -1927 -25439 -45386 -28410 -45040 -28608 -1881 5511 -46559 -31354 21511 22587 -25327
12991b5327m2413L5617J7085n0003J8787O6971q265L2830o1332m9354o653l774
$$ -25327 -67740 -32123 -15038 -65041 -46254 20717 12452 45282 -16050 -65404 -72057 -75831
12979g5831l455J20462K3751q679m5701M9794m4023M4562J6020j0306K0395r5217
$$ -75831 -79286 41176 64927 56248 10547 60341 16318 60880 76900 66594 86989 -8228
12967h228P33K123N2311p117L7283o1549k9418K4581O670m4464k0182R273N132
$$ -8228 -7495 -5372 46939 39822 77105 15556 -13862 10719 17389 -27075 -47257 -37984 -32852
12954c2852j4826m57M5088J444k9852l1J6514N3518r9120l6459L6900j5908K4914
$$ -32852 -47678 -48135 -3047 -1603 -31455 -31486 -14972 38546 -60574 -97033 -60133 -76041 -51127
12941e1127l698j3699N2196N3164q9590l4736j1240N1419N2546j4919J646N9885
$$ -51127 -54825 -68524 -16328 36836 -52754 -87490 -98730 -47311 5235 -9684 -8038 51847
12929E1847K0473k6208k8541k624j3383k4159N1220K2668m5967L9324l1578j6770
$$ 51847 72320 46112 17571 14947 1564 -22595 28625 51293 5326 44650 13072 -3698
12917c698O8638o0786o9309q630j3423R5445M5674p8877J3017r550j2727p503
$$ -3698 64940 4154 -65155 -73785 -87208 8237 53911 -24966 -11949 -21499 -34226 -41729
12905d1729j2345J2608J1583l025M2923j6185j7777k4950L5514q516M854k8283
$$ -41729 -54074 -41466 -29883 -32908 10015 -6170 -23947 -48897 -13383 -21899 -17045 -45328
12893d5328L1621K7809O045M434j1247j2411J4320j4745l5011J8457L8394K509
$$ -45328 -13707 14102 20147 24581 13334 923 15243 498 -34513 -16056 22338 24847
12881B4847J1675L195l1408N802m0250K6565N4352J8185p3384k6913O427M7650
$$ 24847 36522 39717 8309 14111 -26139 426 54778 72963 -421 -27334 -20907 26743
12869B6743r151k2546k9503K699P776O4878P620N971q2854J1025k2087N4323k3997
$$ 26743 17592 -4954 -34457 -31758 -23982 40896 48516 54487 -28367 -17342 -39429 14894 -9103
12856i103o2173J12603M1486j3032j09130q84K2474j8059L0173r398j8002M3153
$$ -9103 -71276 41327 82813 69781 -39349 -40233 -17759 -35818 -5645 -15043 -33045 10108
12844A0108j2424J9989k7067q823Q490M6532P392n5996q8696L3254J29616k4972
$$ 10108 -2316 17673 -9394 -18217 -9727 36805 44197 -11799 -100495 -67241 62375 37403
12832C7403q4267L0208l9309M5434k4725K1889O98k6093k1028k063l031M5225
$$ 37403 -46864 -16656 -55965 -10531 -35256 -13367 -12669 -38762 -59790 -61853 -64884 -19659
12820a9659M3733k1662L2954M73k6261j4626m755K0825N656k9707N4322l7886
$$ -19659 24074 2412 35366 35839 9578 -5048 -9803 11022 16678 -13029 41293 3407
12808C407m681m2396m5904O7326M8163l93m0031m4149o5201L4945M9200K7777
$$ 3407 -1274 -43670 -89574 -22248 25915 25522 -14509 -58658 -123859 -88914 -39714 -11937
12796a1937N1299J4768m2467o5742K5708l9174J2308O7181m630j8844m4658J4199
$$ -11937 39362 54130 11663 -54079 -28371 -67545 -55237 11944 7314 -11530 -56188 -41989
12784d1989O9333K3533M0016o3178m1903M0763j8080j9424M741k3096l1034m243
$$ -41989 27344 50877 90893 27715 -14188 26575 8495 -10929 -6188 -29284 -60318 -64561
12772f4561J2678R361j8680j5065P5403P0743o4664j00186K825J119N4733J7771
$$ -64561 -51883 -42522 -61202 -76267 -864 69879 5215 -94971 -92146 -91027 -36294 -18523
12760a8523k083M1265L0879j4540l7527r141M6941N631m9033J4415L6142k3509
$$ -18523 -20606 20659 51538 36998 -529 -9670 37271 42902 -6131 8284 44426 20917
12748B0917J2060R688n3240m190L5712Q60j5575J3681o3906L4139J5596M679j0857
$$ 20917 32977 42665 -10575 -14765 20947 21807 6232 19913 -43993 -9854 5742 10421 -436
12735d36P307j5102n800N1399m7917L0418k9910k7653J1523L7369j4906K2722
$$ -436 6871 -8231 -14031 37368 -10549 19869 -10041 -37694 -26171 11198 -3708 19014
12723A9014j0303o251k3585J2247L7651L09J8161K762m2977K5545J3613J2795
$$ 19014 8711 2460 -21125 -8878 28773 29082 47243 50005 7028 32573 46186 58981
12711E8981M280n9231j4145k6398M5129M9528p1750J8460Q1946J1423n7933P698
$$ 58981 63261 4030 -10115 -36513 8616 58144 -13606 4854 86800 98223 40290 47988
12699D7988N6900k5162m4793j4324k0700K504N0966J1026j9453n3073l1048N4466
$$ 47988 104888 79726 34933 20609 -91 2413 53379 64405 44952 -8121 -39169 15297
12687A5297M3883K417J7697k1002l3172l0896M4942K936N0293m359j5855m5580
$$ 15297 59180 61597 79294 58292 25120 -5776 39166 42102 92395 88036 72181 26601
12675B6601J4579k8379K8205J801p416j0940J2518N708j2920J9591l08J470k8546
$$ 26601 41180 12801 41006 42807 35391 24451 36969 42677 29757 49348 49040 50510 21964
12662B1964r949k2149K0556Q3403J7285j9719j1587k9809m1098j6131O0592j5318
$$ 21964 12015 -10134 10422 93825 111110 91391 79804 49995 8897 -7234 53358 38040
12650C8040M965k2949m4661P2015j7178k1681M8318j0450K1648j1454p3048O463
$$ 38040 43005 20056 -24605 47410 30232 8551 56869 46419 68067 56613 -16435 -9972
12638i972o625K1401l5915J5437J0607L2419p203L0552M1836q8896m136L9020
$$ -9972 -16597 4804 -31111 -15674 -5067 27352 20149 50701 92537 3641 -495 38525
12626C8525k5078k1452L7355L4624n935O5918m2645n9229P7394m6874k3841j456
$$ 38525 13447 -8005 29350 63974 58039 123957 81312 22083 99477 52603 28762 27306
12614B7306l1321L2143k856l7968M1958j3960N4631M7257l7038p045o369m6317
$$ 27306 -4015 28128 25272 -12696 29262 15302 69933 117190 80152 73107 66738 20421
12602B0421k364M5003k9868M4126L5393p9594L1932l535L6965j4720M876R094
$$ 20421 18057 63060 33192 77318 112711 33117 65049 61514 98479 83759 88635 97729
12590I7729n6283l7452N1684L8569l1200J7011M3789n5547J5693j746K4863N9946
$$ 97729 41446 3994 55678 94247 63047 80058 123847 68300 83993 82247 107110 167056
12578A67056r5309k8717M5854m4795O2396M6370m810m8036m4309m716J07411J2979
$$ 167056 71747 43030 88884 44089 106485 152855 148045 100009 55700 50984 158395 171374
12566A71374k0269k2261o7521L2517N4742K2665m5298M770j1188M200k8680J4992
$$ 171374 151105 128844 61323 93840 148582 171247 125949 130719 119531 123731 95051 110043
12554A10043n8970j4615O8529l694K1087m91k9012k3171J5533J1761M1522m4022
$$ 110043 51073 36458 104987 101293 122380 121889 92877 69706 85239 97000 138522 94500
12542I4500k895K9074K3006K5671K7454M2567n0679o7426N4810N4410p4751L186
$$ 94500 91605 120679 143685 169356 196810 239377 188698 121272 176082 230492 155741 158927
12530A58927N0120P6690n2574l8361O1496k4850m7643N9365K2588R883m6963M5616
$$ 158927 209047 285737 233163 194802 256298 231448 183805 243170 265758 275641 228678 274294
12518B74294P0275n6498j7235K0869l9479j8812k2304J6317j5102k779j1279P631
$$ 274294 344569 288071 270836 291705 252226 233414 211110 227427 212325 209546 198267 205898
12506B05898K6373O409M7198L4428K4462k4408m7700l0340N1746k5011j8471L9429
$$ 205898 232271 238680 285878 320306 344768 320360 272660 242320 294066 269055 250584 290013
12494B90013o0455L2776q968N016K9890l7299J8029J4729l57j8702K4372J9757
$$ 290013 229558 262334 253366 258382 288272 250973 269002 283731 283374 264672 289044 308801
12482C08801j2402l6124J5699M0n1428L7954K9758M2441j560J8622M5683M753
$$ 308801 296399 260275 275974 276014 224586 262540 292298 334739 333179 351801 397484 402237
12470D02237K4495L072j6992j6529j7031l3931J0583j6865K3849O6695P9201r632
$$ 402237 426732 429804 412812 396283 379252 345321 355904 339039 362888 429583 508784 499152
12458D99152n2921N7754j9482K8736R995k1271K2059k2119J8331M8179J5096l8432
$$ 499152 446231 503985 484503 513239 523234 501963 524022 501903 520234 568413 583509 545077
12446E45077k7565Q588L3624K6538n721j0357R2040q070n3897J9221R8471L2974
$$ 545077 517512 526100 559724 586262 580541 570184 662224 654154 600257 619478 717949 750923
12434G50923n2418j7317J9012N4152o5472J6427J0880j9553o657M1742M6527k0404
$$ 750923 698505 681188 700200 754352 688880 705307 716187 696634 689977 731719 778246 757842
12422G57842P6952k6829R069R11l0891k9312N4938M8787J2377M9231O8258J5048
$$ 757842 834794 807965 817034 817945 787054 757742 812680 861467 873844 923075 991333 1006381
12410A006381l0538K245J1167j9157n697N7677L4487K2987O4591J4002L6398N6062
$$ 1006381 975843 978088 989255 970098 964401 1022078 1056565 1079552 1144143 1158145 1194543 1250605
12398A250605m1240M0215N1964L0729l613L5412O2929L370N9665p50R4082K4165
$$ 1250605 1209365 1249580 1301544 1332273 1328660 1364072 1427001 1430371 1490036 1489286 1583368 1607533
12386A607533J5029Q1965k7654N6656R5937J13165K5429P3588J6893N1358R8744
$$ 1607533 1622562 1704527 1676873 1733529 1829466 1942631 1968060 2041648 2058541 2109899 2208643
12375B208643K6978L7906L5353P5260J42341m4464N4619M7854N4411J19769N0237
$$ 2208643 2235621 2273527 2308880 2384140 2526481 2482017 2536636 2584490 2638901 2758670 2808907
12364B808907L0136J05426P9921R4937O6366N0990Q7468M8255J56349J08771N4381
$$ 2808907 2839043 2944469 3024390 3119327 3185693 3236683 3324151 3372406 3528755 3637526 3691907
12353C691907Q6270J71738J24583J00158P7425J40619J72467J66055R9781J19371
$$ 3691907 3778177 3949915 4074498 4174656 4252081 4392700 4565167 4731222 4831003 4950374
12343D950374K12666J86531K11258J89360J45831K07301K63756K60130K01113
$$ 4950374 5163040 5349571 5560829 5750189 5896020 6103321 6367077 6627207 6828320
12334F828320L14617L04304L05351K91454K71909L13169L79328M13412M38553
$$ 6828320 7142937 7447241 7752592 8044046 8315955 8629124 9008452 9421864 9860417
12325I860417M17022M73828M59081N42612N22842N43908O82668O99246O58016
$$ 9860417 10277439 10751267 11210348 11752960 12275802 12819710 13502378 14201624 14859640
12316A4859640O68870P63210Q82103Q88842Q31204Q15074Q75265Q69637Q04278
$$ 14859640 15528510 16291720 17173823 18062665 18893869 19708943 20584208 21453845 22258123
12307B2258123P40108O67537O99815N94326M59352K46130J16522l8955j89948
$$ 22258123 22998231 23665768 24365583 24959909 25419261 25665391 25781913 25742958 25553010
12298B5553010l20178m78086n34793o65722p84667p92105q73988q63359q80821
$$ 25553010 25232832 24754746 24219953 23554231 22769564 21977459 21103471 20240112 19359291
12289A9359291p86933q51703q86544q18301p13022p64302o28020o02559o46540
$$ 19359291 18572358 17720655 16834111 16015810 15302788 14538486 13910466 13307907 12661367
12280A2661367o15441n28858m45670n30331m70391m79893m02420l56588l57374
$$ 12661367 12045926 11517068 11071398 10541067 10070676 9590783 9188363 8831775 8474401
12271H474401l74162k71851l24806k61928l12745k47659j80324j99599k62509
$$ 8474401 8100239 7828388 7503582 7241654 6928909 6681250 6500926 6301327 6038818
12262F038818j85667j97346k28881j80708j76887j27692j90525j51465j93551
$$ 6038818 5853151 5655805 5426924 5246216 5069329 4941637 4751112 4599647 4406096
12253D406096j19282m6199j17796j67848j20891r7592p6702j32885j37073j30994
$$ 4406096 4286814 4240615 4122819 3954971 3834080 3736488 3659786 3526901 3389828 3258834
12243C258834o4279p6169m3135j51470o4636n7982L1000m6179j22859j11058p1465
$$ 3258834 3194555 3118386 3075251 2923781 2859145 2801163 2832163 2785984 2663125 2552067 2480602
12232B480602m0921o5941L7552n0696j12310j00675k9089L8854j08049j2453j8249
$$ 2480602 2439681 2373740 2411292 2360596 2248286 2147611 2118522 2157376 2049327 2036874 2018625
12221B018625q5004o6266m1775M5695m0251k3201m0400r477o8130n3449m0530
$$ 2018625 1933621 1867355 1825580 1871275 1831024 1807823 1767423 1757946 1689816 1636367 1595837
12210A595837m0829n7591O6202k1062p3764n3623p837m2762n8461k0783l8670
$$ 1595837 1555008 1497417 1563619 1542557 1468793 1415170 1407333 1364571 1306110 1285327 1246657
12199A246657P427l6740J0299k6080L096P584j04690j1925m8699J7533L3157n7289
$$ 1246657 1254084 1217344 1227643 1201563 1204659 1212243 1107553 1095628 1046929 1064462 1097619 1040330
12187A040330j5620J1731k9463p402j7904q7482k608K7651M5143j5756j660m3477
$$ 1040330 1024710 1036441 1006978 999576 981672 894190 891582 919233 964376 948620 946960 903483
12175I03483p5102J7820m1046n2318N6822O0866q4273o250Q018k3375j2787l2755
$$ 903483 828381 846201 805155 752837 809659 870525 786252 780002 788020 764645 751858 719103
12163G19103j589r170p2733m0825L7333K8515J4270l9786m0579M6346j7423M111
$$ 719103 717514 708344 635611 594786 632119 660634 674904 635118 594539 640885 623462 627573
12151F27573j3041j2044j2735p642K7550J1198q2250m4957K2893n2226l3170N9674
$$ 627573 614532 602488 589753 582111 609661 620859 538609 493652 516545 464319 431149 490823
12139D90823L817J2282K3612m166n3916K4437N6348l1833r0407j7773L5459n2969
$$ 490823 494640 506922 530534 526368 472452 496889 553237 521404 430997 413224 448683 395714
12127C95714n3475K1473R3394j7096M944l7967M826k4895k4539M9112n200j1632
$$ 395714 342239 363712 457106 440010 444954 406987 411813 386918 362379 411491 406291 394659
12115C94659L2407m7529m8990l990O966K8619m637j2495J2487r888O131l438k0902
$$ 394659 427066 379537 330547 326557 333523 362142 357505 345010 357497 347609 353740 350302 329400
12102C29400m2862N102k0122L8279O756q195J5096l8577l210L4883P090M3177
$$ 329400 286538 291640 271518 309797 316553 308358 323454 284877 281667 316550 323640 366817
12090C66817P693O0319j7404n2871j2251K1814o6638j4346Q810k5033L0281l1331
$$ 366817 374510 434829 417425 364554 352303 374117 307479 293133 301943 276910 307191 275860
12078B75860J0475K3319K4153o4574m517r103j7850n8954K4627M5194k5931L3221
$$ 275860 286335 309654 333807 269233 264716 255613 237763 178809 203436 248630 222699 255920
12066B55920q388j9j8737m8359J5907m6537J693K7208r418l4640Q3053J5671o7329
$$ 255920 247532 247513 228776 180417 196324 149787 151480 178688 169270 134630 217683 233354 166025
12053A66025j5214L092j3653R234K1456k9070O2997j1642K5103n0288M6240L6950
$$ 166025 150811 153903 140250 149484 170940 141870 204867 193225 218328 168040 214280 251230
12041B51230n2089J088R110l1776M046n1034R314K1666j2277Q5709J240n5675
$$ 251230 199141 200229 209339 177563 181609 130575 139889 161555 149278 234987 236227 180552
12029A80552L405p60l5878L7429j8292k951N8572n5117k9137R989m4782J8394
$$ 180552 183957 183197 147319 184748 166456 163505 222077 166960 137823 147812 103030 121424
12017A21424K1756J5297m8512j6474J1685M2968k0594N1539l1831k7145M1942
$$ 121424 143180 158477 109965 93491 105176 148144 127550 179089 147258 120113 162055
12006A62055j2055K5721l7737o0735J1385L4709m814o988J2447K1770r779K3071
$$ 162055 150000 175721 137984 77249 88634 123343 118529 111541 123988 145758 135979 159050
11994A59050J9877k3570K3565l9710M8174o1886l4678p941n33K1387q991l5647
$$ 159050 178927 155357 178922 139212 187386 125500 90822 82881 82348 103735 94744 59097
11982E9097K2772o843m1198J648O828K5667l21K7076J0787j5819O719K4454J0298
$$ 59097 81869 75026 33828 35476 42304 67971 67650 94726 105513 89694 96413 120867 131165
11969A31165l4319L0583j9904k9904J1207l776M065J3225l087K191L3519n3528
$$ 131165 96846 127429 107525 77621 88828 85052 89117 102342 99255 101446 134965 81437
11957H1437m9633j8034q904L1893J2865m0151n1136J6054M5625M7896J6908j2686
$$ 81437 31804 13770 4866 36759 49624 9473 -41663 -25609 20016 67912 84820 72134
11945G2134K3895k0228l9947L1550J9651q2325P39N235j6174O5245K4541j7330
$$ 72134 96029 75801 35854 67404 87055 4730 5469 10704 -5470 59775 84316 66986
11933F6986L4937k7569j4542P6878p640m0221n4521j7447J3504k728K574J2102
$$ 66986 101923 74354 59812 136690 129050 88829 34308 16861 30365 27637 30211 42313
11921D2313n8162k1800R1287j9704L8447J982K7978j06613r958L8139J9339L293
$$ 42313 -15849 -37649 53638 33934 72381 74363 102341 -4272 -14230 23909 43248 46541
11909D6541N6460l0397Q274n1129N2435K860L9101k8225n7182k1229k5665N0075
$$ 46541 103001 72604 80878 29749 82184 85044 124145 95920 38738 17509 -8156 41919
11897D1919L1047m4708k0905P6471J178J6518j6241k2769q247J859l581n303q272
$$ 41919 72966 28258 7353 83824 85002 101520 85279 62510 54263 56122 52541 47238 38966
11884C8966J5416j3645M318m8443J8792j7782L0526Q9326l6773k3824l344M5547
$$ 38966 54382 40737 45055 -3388 15404 -2378 28148 117474 80701 56877 53533 99080
11872I9080l3659o9815J9975K123L0161M963m697j2243k8007P26L6353n8546n1912
$$ 99080 65421 -4394 15581 17704 47865 52828 48131 35888 7881 8607 44960 -13586 -65498
11859f5498P8359N8072J9322o879j9394j2482m2897L32k9153O1878J9174L0644
$$ -65498 12861 70933 90255 83376 63982 51500 8603 8935 -20218 41660 60834 91478
11847I1478l4521k1427m719k9182j7415L3817l0161m126O5955K9932k8632m3659
$$ 91478 56957 35530 30811 1629 -15786 18031 -12130 -16256 49699 79631 50999 7340
11835G340k1500M8979j1695n3628K1007M1032j037M2749j360o8566k4117R419
$$ 7340 -14160 34819 23124 -30504 -9497 31535 30498 73247 71887 3321 -20796 -11377
11823a1377O7802l2929j9080M8720l5371m7704m235J0340k5362O0794q496L3848
$$ -11377 56425 23496 4416 53136 17765 -29939 -34174 -23834 -49196 11598 3102 36950
11811C6950j4700k7847M9167L5604j05894q0593J03103L0988l1595M1369m460
$$ 36950 22250 -5597 43570 79174 -26720 -107313 -4210 26778 -4817 36552 32092
11800C2092j05189j7604L7222M1356n1756p3615N0526R0702L5076l5576m368O7037
$$ 32092 -73097 -90701 -53479 -12123 -63879 -137494 -86968 3734 38810 3234 -1134 65903
11788F5903r1561o1000P2980M485j065K1686j4759L2897r969J8496n837l6311
$$ 65903 -25658 -86658 -13678 -9193 -10258 11428 -3331 29566 19597 38093 32256 -4055
11776d055K0640P692l2589p425K5337J5678o050M830L0572J784r05K3366r831
$$ -4055 16585 24277 -8312 -15737 9600 25278 19228 24058 54630 56414 55509 78875 69044
11763F9044l3397K8073N2787q201k7686o6005k2570l0576P4313J9155l4437m004
$$ 69044 35647 63720 116507 108306 80620 14615 -7955 -38531 35782 54937 20500 16496
11751A6496L9067o4772m4121Q7733p6768n9284K9664K1920J2605L2036K3786M8967
$$ 16496 55563 -9209 -53330 34403 -42365 -101649 -71985 -50065 -37460 -5424 18362 67329
11739F7329k7403k3469J0250N1724q3221K8019J9484p3914K896J4745M7806j6826
$$ 67329 39926 16457 26707 78431 -4790 23229 42713 -31201 -28305 -13560 34246 17420
11727A7420K5887k0714r138k8979n3252k3502Q6571k4044M5541o130j247L6161
$$ 17420 43307 22593 13455 -15524 -68776 -92278 -5707 -29751 15790 9660 8413 44574
11715D4574N0877o4805l0628J9020n4918k7988o63L6360L4559n6653m5392R3068
$$ 44574 95451 30646 18 19038 -35880 -63868 -64531 -28171 6388 -50265 -95657 -2589
11703b589L0380p4651M4133O8006q3822j1674m9066J3206P66J2428P7310Q593
$$ -2589 27791 -46860 -2727 65279 -18543 -30217 -79283 -66077 -65311 -52883 24427 33020
11691C3020J3487p1362l3652L6169M1341j6376M26l1199J3023K219k6530p028
$$ 33020 46507 -24855 -58507 -22338 19003 2627 3053 -28146 -15123 -12904 -39434 -46462
11679d6462n619J0618N3419M5447K4233J1328k6534R460j9270L7595J7994j3206
$$ -46462 -52081 -41463 11956 57403 81636 92964 66430 75890 56620 94215 112209 99003
11667I9003o8116J719j08416L6836L0914m2929M2520j6744l4013R017K6723J9619
$$ 99003 30887 32606 -75810 -38974 -8060 -50989 -8469 -25213 -59226 -50209 -23486 -3867
11655c867o8579j6406P733L5000J5721L7210l4676J8753L1096L8063l4926k7418
$$ -3867 -72446 -88852 -81119 -46119 -30398 6812 -27864 -9111 21985 60048 25122 -2296
11643b296L1019j8354j8875M8617J5856o590k3641l5547M0709m1860r107o026
$$ -2296 28723 10369 -8506 40111 55967 49377 25736 -9811 30898 -10962 -20069 -26095
11631b6095O5050n9012L2546r76k5812j5059K9424p797M4263K3490O177m70k2688
$$ -26095 38955 -20057 12489 11513 -14299 -29358 66 -7731 36532 60022 66199 65729 43041
11618D3041N7984n2719l399M675L08r0595p5880L0665N5950j0057k0892J5959
$$ 43041 101025 48306 44907 49582 49890 -40705 -116585 -85920 -29970 -40027 -60919 -44960
11606d4960M3775j171k4823K3722l8774N014L1858l7540L0471N6995l0453m0601
$$ -44960 -1185 -2356 -27179 -3457 -42231 -37217 -5359 -42899 -12428 44567 14114 -26487
11594b6487m1445J13068k3981q1147M7810l0039L3956p657K017K5697k46o0193
$$ -26487 -67932 45136 21155 -59992 -12182 -42221 -8265 -15922 -13905 11792 11546 -48647
11582d8647n9099M2472K6011l188R8080K1292j5060j2194j14039j7888R3546l8794
$$ -48647 -107746 -65274 -39263 -42451 55629 76921 61861 49667 -64372 -82260 11286 -27508
11570b7508k5217N0308M525J2220l3341M9658L5441m1835r8820j9115Q4088N0180
$$ -27508 -52725 -2417 2108 14328 -19013 30645 66086 24251 -74569 -93684 -9596 40584
11558D0584l4037n6527P2331k8163K2134Q595p3548m1565K668O3113M2506j0121
$$ 40584 6547 -49980 22351 -5812 16322 24917 -48631 -90196 -87528 -24415 18091 7970
11546G970m3549K4603j3870p884l6063k1559R1747m7497k1862L3845L2895O0483
$$ 7970 -35579 -10976 -24846 -32730 -68793 -90352 1395 -46102 -67964 -34119 -1224 59259
11534E9259J6932m1568o8236r414N6634l497n4005J5472Q9410J8964n8261L2024
$$ 59259 76191 34623 -33613 -43027 13607 10110 -43895 -28423 60987 79951 21690 53714
11522E3714o0174k8124l0749L8997M6420q1060R992Q9022o862j815P0142j6276
$$ 53714 -6460 -34584 -65333 -26336 20084 -60976 -50984 38038 31176 29361 99503 83227
11510H3227o6438j0403L365j1838q958l3813N3035j8841j5591R2363o3644M135
$$ 83227 16789 6386 9751 -2087 -11045 -44858 8177 -10664 -26255 66108 2464 6599
11498F599L0983k6342j5337Q6854P784j06448j0955P070P3134P7467n0312j04445
$$ 6599 37582 11240 -4097 82757 90541 -15907 -26862 -19792 53342 130809 80497 -23948
11486b3948p209j767p366L2909k8955J5375M6617q645l2430p325j7367J8030l8727
$$ -23948 -31157 -32924 -40290 -7381 -36336 -20961 25656 17011 -15419 -22744 -40111 -22081 -60808
11473f0808M9718Q0928l2758k0969j30j5114j4857K4386K4519n9744J8491m1237
$$ -60808 -11090 69838 37080 16111 15981 867 -13990 10396 34915 -24829 -6338 -47575
11461d7575n3499K9960K08j350K1979J6933M1546N1428o9029P180k1M0376J9009
$$ -47575 -101074 -71114 -70906 -72256 -50277 -33344 8202 59630 -9399 -2219 -2240 38136 57145
11448E7145l996L0303p6809K9248L397r1510l410j2443R758J0399L0284l4184
$$ 57145 53149 83452 6643 35891 39288 -52222 -55632 -68075 -58317 -47918 -17634 -51818
11436e1818M396J7140K1183O531J9028n5074q756J5886K5807N8647o6212K376
$$ -51818 -47422 -30282 -9099 -2568 16460 -38614 -47370 -31484 -5677 52970 -13242 -10866
11424a0866k0637K586M0224L260M5971l6651k3330L3729p2638k2075J6823K5070
$$ -10866 -31503 -28917 11307 14567 60538 23887 557 34286 -38352 -60427 -43604 -18534
11412a8534L4904P4338m9561l0642L540J6716J2585o4682L198J1338k9761k4083
$$ -18534 16370 90708 41147 10505 14045 30761 43346 -21336 -18138 -6800 -36561 -60644
11400f0644P2982n3669K6871M819k636q37L032J7863k4266J8389L4164m7212p5478
$$ -60644 12338 -41331 -14460 -9641 -12277 -13114 -10082 7781 -16485 1904 36068 -11144 -86622
11387h6622p695K4693J7518N3724L8364n9073o129O5387o8090m3395J7407J074
$$ -86622 -94317 -69624 -52106 1618 39982 -19091 -25220 40167 -27923 -71318 -53911 -52837
11375e2837L6438K5358M381j2571m4300L4524N2515k8066m5618K696J9972k4734
$$ -52837 -16399 8959 13340 769 -43531 -9007 43508 15442 -30176 -27480 -7508 -32242
11363c2242N7104K4926o4617l752K9963p2389m0094j8187J07644L0574j1520J8491
$$ -32242 24862 49788 -14829 -18581 11382 -61007 -101101 -119288 -11644 18930 7410 25901
11351B5901L468k2993m6683K9965j4272p0080L3767M7332l6245K3058l5496o9382
$$ 25901 29369 6376 -40307 -10342 -24614 -94694 -60927 -13595 -49840 -26782 -62278 -131660
11339a31660M7781K589N1540K4012l6313j0718K0275N9064m3852m5372K8397J6214
$$ -131660 -83879 -81290 -29750 -5738 -42051 -52769 -32494 26570 -17282 -62654 -34257 -18043
11327a8043O3309M58k4091n5227p8996M7764L6971M4156j5928L2463l031j3666
$$ -18043 45266 45724 21633 -33594 -112590 -64826 -27855 16301 373 32836 29805 16139
11315A6139N8801L31p1629r648k3039k5053J6469n6204M5260N6911n3536o180
$$ 16139 74940 75271 3642 -6006 -29045 -54098 -37629 -93833 -48573 8338 -45198 -51378
11303e1378j3936J0736J9659K4648O1227k5019n5545o121R353n2801J8552m543
$$ -51378 -65314 -54578 -34919 -10271 50956 25937 -29608 -35729 -26376 -79177 -60625 -65168
11291f5168O174j802M0737M940J6829J6077q406Q180j0586M154N631m9313n1694
$$ -65168 -58994 -60796 -20059 -15119 1710 17787 9381 17561 6975 11129 16760 -32553 -84247
11278h4247L0327j69K8579j5263m1728n425N8572M9074K298j7093p4787J5063
$$ -84247 -53920 -54089 -25510 -40773 -82501 -87926 -29354 19720 22018 4925 -69862 -54799
11266e4799Q4851o9277J3380K1639j4723M3966l3281p0223L5781J7525k7726K6004
$$ -54799 30052 -39225 -25845 -4206 -18929 25037 -8244 -78467 -42686 -25161 -52887 -26883
11254b6883k0897k3381N3591n2048j386J3859J0008O1665k1784J5267O2353j9866
$$ -26883 -47780 -71161 -17570 -69618 -71004 -57145 -47137 14528 -7256 8011 70364 50498
11242E0498o5599l550k0786j9599k0195M2354J5632l2120J4184J2417O4537m7150
$$ 50498 -15101 -18651 -39437 -59036 -79231 -36877 -21245 -53365 -39181 -26764 37773 -9377
11230i377l2002J2949j0606L0248J4020J0473l1965m1615J7361L2453K6078K2629
$$ -9377 -41379 -28430 -39036 -8788 5232 15705 -16260 -57875 -40514 -8061 18017 40646
11218D0646q9846P233J8264K8000q182O063O681o3762L9661L9459k3048l0747
$$ 40646 -49200 -41967 -23703 4297 -3885 2178 8859 -54903 -15242 24217 1169 -29578
11206b9578l4173p566L2508Q3839K2015p5694J679j6371l2083k2147N16L1182
$$ -29578 -63751 -71317 -38809 45030 67045 -8649 -6970 -23341 -55424 -77571 -77055 -45873
11194d5873j962L9221l9891O291r901L6153M6753k9697O081J1306r0937L0064
$$ -45873 -47835 -8614 -48505 -42214 -52115 -15962 30791 1094 7175 18481 -72456 -42392
11182d2392n794O168r804P531M1909O0425n312o1554l9816q0274O0367L8516m9611
$$ -42392 -48186 -42018 -51822 -44291 -2382 58043 52731 -8823 -48639 -128913 -68546 -30030 -79641
11169g9641M3574L6416m8825M7673O680k5039j7087Q525p938M3088K3393Q424
$$ -79641 -36067 349 -48476 -803 5877 -19162 -36249 -27724 -35662 7426 30819 39243
11157C9243l4186L5569J888l5201K7636k0645k0325P1943j2022j4381J6256n1415
$$ 39243 5057 40626 42514 7313 34949 14304 -6021 65922 53900 39519 55775 4360
11145D360l2162O8520M31P179o0081p6261n6808N5879O1364m569l349M039K0826
$$ 4360 -27802 40718 41149 48328 -11753 -88014 -144822 -88943 -27579 -32148 -35497 -31458 -10632
11132a0632j2296k1557k3394j1831p218n366Q289l547K2237J3611l6439J3464
$$ -10632 -22928 -44485 -67879 -79710 -86928 -92294 -84005 -87552 -65315 -51704 -88143 -74679
11120g4679K0143l671k0896k8942J8071O2541L7661m7363j2279l9378R9403k5523
$$ -74679 -54536 -58207 -79103 -108045 -89974 -27433 10228 -37135 -49414 -88792 10611 -14912
11108a4912p2019J9392M377K2823l6959P0092M8005m6599n9616l8431N6332N5833
$$ -14912 -86931 -67539 -63162 -40339 -77298 -7206 40799 -5800 -65416 -103847 -47515 8318
11096H318N135n3408l3182J1713N0531n871J5567K2152L2265k9788j7739M219
$$ 8318 13453 -39955 -73137 -61424 -10893 -16764 -1197 20955 53220 23432 5693 9912
11084I912j04869N8323P6359L5916q6248l0760J1098L8747j0220k0629n074J05373
$$ 9912 -94957 -36634 39725 75641 -10607 -41367 -30269 8478 -1742 -22371 -27445 77928
11072G7928k4915l5851l3866k1952O803N425J0093M3494K2663l6103p2134R283
$$ 77928 53013 17162 -16704 -38656 -31853 -26428 -16335 27159 49822 13719 -58415 -49132
11060d9132O760N2328j4036M0577k1633n4850k1099n4824O8550N7923L5024R056
$$ -49132 -42372 9956 -4080 36497 14864 -39986 -61085 -115909 -47359 10564 45588 54644
11048E4644L4889o7230j6526k9149n1259Q0084k8639J8577p0689P316M3918l7157
$$ 54644 89533 22303 5777 -23372 -74631 5453 -23186 -4609 -75298 -67982 -24064 -61221
11036f1221L5404J617L6516q6330J0647M4068M0692J0451l2391K3864M0673k0152
$$ -61221 -25817 -24200 12316 -74014 -63367 -19299 21393 31844 -547 23317 63990 43838
11024D3838k3114o830l7215j4863j6663j8947K2430M4935k0484j1593K8529k1887
$$ 43838 20724 13894 -23321 -38184 -54847 -73794 -51364 -6429 -26913 -38506 -9977 -31864
11012c1864n154J8399o3181l79J3384O0182K7055m5610j1958l825O2506J3457
$$ -31864 -37018 -18619 -81800 -82179 -68795 -8613 18442 -27168 -39126 -42951 19555 33012
11000C3012l4987m1396K3367l7142J5023L4926J7834k6138K5644k1877N8065L5936
$$ 33012 -1975 -43371 -20004 -57146 -42123 -7197 10637 -15501 10143 -11734 46331 82267
10988H2267k6355K0912m2782q6313k0546K3896J04934j444n6027o311o087k8854
$$ 82267 55912 76824 34042 -52271 -72817 -48921 56013 54569 -1458 -7769 -13856 -42710
10976d2710L6514K2237k376l425k9164k9412N2756N8473k0223n3973l233q307
$$ -42710 -6196 16041 13665 10240 -18924 -48336 4420 62893 42670 -11303 -14536 -22843
10964b2843q8401O4638j2950l8383p175L4028M1779L6879Q867J5922k4342l1387
$$ -22843 -111244 -46606 -59556 -97939 -105114 -71086 -29307 7572 16439 32361 8019 -23368
10952b3368K0405Q235r625Q156j3541o952J5805K9070j6622n9231L3341K2924
$$ -23368 -2963 5272 -4353 3803 -9738 -16690 -885 28185 11563 -47668 -14327 8597
10940H597m3135m3007L4637P7555m2025r530K2352k8201J4672J8594K5553J9331
$$ 8597 -34538 -77545 -42908 34647 -7378 -16908 5444 -22757 -8085 10509 36062 55393
10928E5393M0458r1246n6683O9463k7580m9909J7832j3623p691N7880R415M7478
$$ 55393 95851 4605 -52078 17385 -10195 -60104 -42272 -55895 -63586 -5706 3709 51187
10916E1187k263k444j8123Q067N30k2555m2917r069K100p783k3877m8083L0258
$$ 51187 48924 46480 28357 36424 36954 14399 -28518 -37587 -35487 -43270 -67147 -115230 -84972
10903h4972J6249K6670M4871m2920j0533K5250p1347l1422R0120L07J6729Q2778
$$ -84972 -68723 -42053 2818 -40102 -50635 -25385 -96732 -128154 -38034 -37727 -20998 61780
10891F1780j1302j11674L6264Q0616m6795n4345l0510O8854M7527J5323R723j1593
$$ 61780 50478 -61196 -24932 55684 8889 -45456 -75966 -7112 40415 55738 65461 53868
10879E3868m1562k967L6665o0507L3682K9617q88j2294j5220k9778K5449p957
$$ 53868 12306 9339 46004 -14503 19179 48796 47908 35614 20394 -9384 16065 8108
10867H108o6179k8470K6310M0566o5227J2973L846l8282N6709M5998K3142j9593
$$ 8108 -58071 -86541 -60231 -19665 -84892 -71919 -68073 -106355 -49646 -3648 19494 -99
10855i9q396k7802k4588L4209o22J6240j8413O115k3040j9463K4828J45840m3546
$$ -99 -8495 -36297 -60885 -26676 -27298 -11058 -29471 -23356 -46396 -65859 -41031 104809 61263
10842F1263n2431k590O2735J4894m945l2053j8538m9638N1553J6286j5801m3189
$$ 61263 8832 6242 68977 83871 78926 46873 28335 -21303 30250 46536 30735 -12454
10830a2454k6691M5941j3235j7155k5329N7862J0378j9807M9600l8703J2348k0480
$$ -12454 -39145 6796 -6439 -23594 -48923 8939 19317 -490 49110 10407 22755 2275
10818B275O075K0562p5994k9698N3176J6045n3464J0215M6853m1205N837K9849
$$ 2275 8350 28912 -47082 -76780 -23604 -7559 -61023 -50808 -3955 -45160 -39323 -9474
10806i474J0063R405m0988l2028J5041M1687m92L3536o0987P5M4317L7893o7247
$$ -9474 589 9994 -30994 -63022 -47981 -6294 -6786 26750 -34237 -34162 10155 48048 -19199
10793a9199R7616k4892l7674L2104K090n7073n875q586M4314n8143N9242L0062
$$ -19199 78417 53525 15851 47955 50045 -7028 -12903 -21489 22825 -35318 23924 53986
10781E3986p8869m507J3925J0725O0862J3861k4847M8079n0868m6822q420o387
$$ 53986 -24883 -29390 -15465 -4740 56122 69983 45136 93215 42347 -4475 -12895 -19282
10769a9282j4135J7387K7905K8972K6495n0570L8399j068l7128j3646n9389Q7101
$$ -19282 -33417 -16030 11875 40847 67342 16772 55171 54103 16975 3329 -56060 31041
10757C1041N1143q153k4302k7566k9388n791n199L7524O3695m5627m7445l131
$$ 31041 82184 74031 49729 22163 -7225 -13016 -18215 19309 83004 37377 -10068 -13199
10745a3199m45j8318l8129q076J9487J7273K5411K4971k7288P2979o511k7353
$$ -13199 -13644 -31962 -70091 -78167 -58680 -41407 -15996 8975 -18313 54666 48155 20802
10733B0802r909R867j7984J3342o8454k8433N6120Q262L3961n3628K1139m090
$$ 20802 10893 20760 2776 16118 -52336 -80769 -24649 -16387 17574 -36054 -14915 -19005
10721a9005K4204L989M0012o0034k4282N8050k4957M8862k879J2114l6066m6932
$$ -19005 5199 9188 49200 -10834 -35116 22934 -2023 46839 43960 56074 20008 -26924
10709b6924K0405M1803n5680j5521O6040L079l2904K5191J7545J2964R665k1337
$$ -26924 -6519 35284 -20396 -35917 30123 33202 298 25489 43034 55998 65663 44326
10697D4326l2613m7653L4162k6226l6551K9296j3987N456L5994M6067l654O393
$$ 44326 11713 -35940 -1778 -28004 -64555 -35259 -49246 -43790 -7796 38271 34617 41010
10685D1010j1814J8854p0273n5518K1555L8583n0191J0461J07920k5015m5326
$$ 41010 29196 48050 -22223 -77741 -56186 -17603 -67794 -57333 50587 25572 -19754
10674a9754m0639l6685J0921q185O3825M7311j969l5611p811O5752L4991O67k0768
$$ -19754 -60393 -97078 -86157 -94342 -30517 16794 14825 -20786 -28597 37155 72146 72813 52045
10661E2045j0717n9661m1006l0517L287N2126M3758O3132p9884l3759M1301j7978
$$ 52045 41328 -18333 -59339 -89856 -86569 -34443 9315 72447 -7437 -41196 105 -17873
10649a7873j2128j0353L13O2935j0239k4588L1378R796M8615m5273l2189J3748
$$ -17873 -30001 -40354 -40041 22894 12655 -11933 19445 29241 77856 32583 394 14142
10637A4142J3058j2197k8549k6765K1278K1361J4887k8160j7361K8406N1990j0367
$$ 14142 27200 15003 -13546 -40311 -19033 2328 17215 -10945 -28306 100 52090 41723
10625D1723k8905Q4033N0372l8679j04082j4141O5473P92m5903K4336K4534N0596
$$ 41723 12818 96851 147223 108544 4462 -9679 55794 56586 10683 35019 59553 110149
10613A10149J30l6253j0827J7072J4950m3858K2184j8445l4185j6959k0104L9604
$$ 110149 110279 74026 63199 80271 95221 51363 73547 55102 20917 3958 -16146 23458
10601B3458K1484k5598N0716m0702L795K1569K9471j4359o9603n974L6710L842
$$ 23458 44942 19344 70060 29358 33153 54722 84193 69834 231 -5743 30967 34809
10589C4809q3J6625p2016J6144K8321N455M345q5204M6780Q3571M691m2536m2353
$$ 34809 34726 51351 -20665 -4521 23800 29255 33600 -51604 -4824 78747 83438 40902 -1451
10576a451J7822L1489k0089r053k1897L2432q795n1832o281k4860N0446l4457
$$ -1451 16371 47860 27771 18718 -3179 29253 20458 -31374 -37655 -62515 -12069 -46526
10564d6526p084N5396o7675J4071R072L7457N7635o0221n3362j0812M4344P4028
$$ -46526 -53610 1786 -65889 -51818 -42746 -5289 52346 -7875 -61237 -72049 -27705 46323
10552D6323l6117K2601l3311p636N9717m9137k570p64j1528M1435K5172r612j4067
$$ 46323 10206 32807 -504 -8140 51577 2440 -130 -894 -12422 29013 54185 44573 30506
10539C0506l5635r580r90K2110N5937K4207n4193m9719O6455j0868n4923K6587
$$ 30506 -5129 -14709 -15699 6411 62348 86555 32362 -17357 49098 38230 -16693 9894
10527I894n1734L8675N3481M7483l1999k2144K4288m5713j4473L8042K3028k0151
$$ 9894 -41840 -3165 50316 97799 65800 43656 67944 22231 7758 45800 68828 48677
10515D8677o0699K852J032n6897Q4238K4472l581K9941k3359m2561L096L4865
$$ 48677 -12022 -9170 -8138 -65035 19203 43675 40094 70035 46676 4115 7211 42076
10503D2076j8145J1157n2373K4125J5262j1207l4794M7307m2689m4297P8325L011
$$ 42076 23931 35088 -17285 6840 22102 10895 -23899 23408 -19281 -63578 14747 17758
10491A7758M7577j8823j7765K0682m008m6919j830m7004Q444M3309L6388O0112
$$ 17758 65335 46512 28747 49429 45421 -1498 -3328 -50332 -41888 1421 37809 97921
10479I7921o0974Q224k3622K0263L5779K9338l1701o9754l4378J7917L1245K7782
$$ 97921 36947 45171 21549 41812 77591 106929 75228 5474 -28904 -10987 20258 48040
10467D8040j0315k8984K8706j8885J5913l3083K2999O943j0026N3739L0060r222
$$ 48040 37725 8741 37447 18562 34475 1392 24391 31334 21308 75047 105107 95885
10455I5885k7750K5618q7910m605Q3928J8092l3971l0400M8982R242l8816l1827
$$ 95885 68135 93753 5843 1238 85166 103258 69287 38887 87869 97111 58295 26468
10443B6468L3281j1302k6123K2857K6693n9268M9800R523J000M224p913k9478
$$ 26468 59749 48447 22324 45181 71874 12606 62406 71929 72929 77153 69240 39762
10431C9762k0088P5099m5208l2418k400p327J4559k5134P464M4444N874o214j1150
$$ 39762 19674 94773 49565 17147 14747 7420 21979 -3155 4309 48753 54627 48413 37263
10418C7263M5515r202K6929N944k1615J3158q851k8198J5217J3246j5686N254
$$ 37263 82778 73576 100505 106449 84834 97992 89141 60943 76160 89406 73720 78974
10406G8974p998l2138j1605j1104k2311l9438K8230K6217K8034J0551p5640L4841
$$ 78974 70976 38838 27233 16129 -6182 -45620 -17390 8827 36861 47412 -28228 6613
10394F613Q9609p0747n3074J9443m1486O2059J3527O934J5743J7629M9718m758
$$ 6613 96222 25475 -27599 -8156 -49642 12417 25944 32878 48621 66250 115968 111210
10382A11210m1175l9830j2935N1541l3670o249M443N4872l3029k8741N9343o6254
$$ 111210 70035 30205 17270 68811 35141 28892 33335 88207 55178 26437 85780 19526
10370A9526j9816M6966l4670K5096K2983k2355j4174l4994k3764n055O9021R739
$$ 19526 -290 46676 12006 37102 60085 37730 23556 -11438 -35202 -40257 28764 38503
10358C8503k3170M2923K356o9734M5856k5435l781N682N4580O3628q6751k28k4687
$$ 38503 15333 58256 60612 -9122 36734 11299 7518 13200 67780 131408 44657 44429 19742
10345A9742l4801M3414m6220p2030L0018P6202N1751K165J6227n4336m6131J0414
$$ 19742 -15059 28355 -17865 -89895 -59877 16325 68076 70241 86468 32132 -13999 -3585
10333c585Q490O0487L573L1500n1398j9611L1302j5234K9464K5745L0880p8318
$$ -3585 4905 65392 68965 100465 49067 29456 60758 45524 74988 100733 131613 53295
10321E3295r482j1730q173J04045J934j0455m9834q6851K4988l153l1621K043
$$ 53295 43813 32083 23910 127955 129889 119434 69600 -17251 7737 4584 -27037 -24994
10309b4994O2825L8322J8819r38l5683L2l2468K1398m9511R490P3058m9435K5466
$$ -24994 37831 76153 94972 94034 58351 58383 25915 47313 -2198 7292 80350 30915 56381
10296E6381j371k3093J3231k2340M1191N8696j6200n5316J0921L6378m7430j9541
$$ 56381 55010 31917 45148 22808 63999 122695 106495 51179 62100 98478 51048 31507
10284C1507M430m6168P863l858l4246L4143J07876J3432m0125J2436j7716L2166
$$ 31507 35937 -10231 -2368 -6226 -40472 -6329 101547 114979 74854 87290 69574 101740
10272A01740r604J0799K0260n2840l2392J3337j2989M3692J8390j1749K9054l8561
$$ 101740 92136 102935 123195 70355 37963 51300 38311 82003 100393 88644 117698 79137
10260G9137k6187L8924o7276J4091L8386m171l898p702M0570k7615j40M2259j5896
$$ 79137 52950 91874 24598 38689 77075 72904 69006 61304 101874 74259 74119 116378 100482
10247A00482q6714J5046k3687n089L3741J3222l2478k555L4173P3272K1937K4151
$$ 100482 13768 28814 5127 38 33779 47001 14523 11968 46141 119413 141350 165501
10235A65501j3056l3800p580n5185l3232M1590K9696k3907r865k9324r448O1242
$$ 165501 152445 118645 111065 55880 22648 64238 93934 70027 60162 30838 21390 82632
10223H2632L7361q419k4550J8471K1134m4006k0433J2883N1643k9536j7284J816
$$ 82632 119993 111574 87024 105495 126629 82623 62190 75073 126716 97180 79896 81712
10211H1712o4655j6458N4767l2161k308M0678M3478N8289m216o0751L5967j679
$$ 81712 17057 599 55366 23205 20897 61575 105053 163342 159126 98375 134342 132663
10199A32663l2119Q341m9083L8965R54m5483P1723K6858P556k2094k9706J2986
$$ 132663 100544 108885 59802 98767 99721 54238 125961 152819 160375 138281 108575 121561
10187A21561n223l9420j9101N5608l2163m3973K542O8036l1317N0649J11691j3457
$$ 121561 116338 76918 57817 113425 81262 37289 39831 107867 76550 127199 238890 225433
10175B25433j3171r8814p9298K2893O9407L3787n17j8314k593J068L0464l216
$$ 225433 212262 113448 34150 57043 126450 160237 159720 141406 138813 139881 170345 167129
10163A67129k9264j3678k1247L1277j417l0725P7470m384N1094k31n0877J7259
$$ 167129 137865 124187 102940 134217 132800 102075 179545 175161 226255 226024 175147 192406
10151A92406j3544n608L5481k730n0291n793l2686m2029O1378M2240o2665j0896
$$ 192406 178862 173254 208735 206005 155714 149921 117235 75206 136584 178824 116159 105263
10139A05263M7036L3204j3127J6891O914m6317p418L1375M1728M4484m5396K2875
$$ 105263 152299 185503 172376 189267 196181 149864 142446 173821 215549 260033 214637 237512
10127B37512J2454j3445j926O5666J8008J7151k0375n1296j1425J24646J8509
$$ 237512 249966 236521 234595 300261 318269 335420 315045 263749 252324 376970 395479
10116C95479J0181J4740q4386L373J12788J4266p3973O1393O9277N8861P5110
$$ 395479 405660 420400 336014 339387 452175 466441 392468 453861 523138 581999 657109
10105F57109J06657J09004J22561J74615J21113K02602J95368M9925r2071j99563
$$ 657109 763766 872770 995331 1169946 1291059 1493661 1689029 1738954 1646883 1447320
10095A447320k05710j88717k21992j07129m181j53833n9944k2892l29K9289m0922
$$ 1447320 1241610 1052893 830901 723772 719591 565758 505814 482922 482593 511882 470960
10084D70960p3141k708J09128l3867o1117M6828p2m2492l8590k5166L7036J7447
$$ 470960 397819 395111 504239 470372 409255 456083 456011 413519 374929 349763 386799 404246
10072D04246K0327j4936Q610M7474L3055J24301J054n9774R706l2216j20283L6340
$$ 404246 424573 409637 418247 465721 498776 623077 624131 564357 574063 541847 421564 457904
10060D57904O0601m54L3299M0235l3499Q467l5651o6991l9385J4652m7091j9482
$$ 457904 518505 518051 551350 591585 558086 566553 530902 463911 424526 439178 392087 372605
10048C72605L7879k3367p4008K5329M2579l2710m053Q9343j2236l4111L7307K4582
$$ 372605 410484 387117 313109 338438 381017 348307 344254 433597 421361 387250 424557 449139
10036D49139J954K1978m2021l509M0715o652M5091M1827O571M4252J0050k4361
$$ 449139 451093 473071 431050 427541 468256 461604 506695 548522 555093 599345 609395 585034
10024E85034m4339N6979k6013N505p0944m9746K6048l8791Q935j5985J8844o4663
$$ 585034 540695 597674 571661 577166 506222 456476 482524 443733 452668 436683 455527 390864
10012C90864q1432M0223L777n0569K3226j11326m3489N232k3498O1579L2252N5102
$$ 390864 309432 349655 353432 302863 326089 214763 171274 176506 153008 214587 246839 301941
10000C01941k7679r9910L0056L6779n6002m115L1150L8959K6299m8337M2972m5248
$$ 301941 274262 174352 204408 241187 185185 181070 212220 251179 277478 229141 272113 226865
9988B26865o4988m161M3689k2991N8648K0569o580k5837M6399J4117L4266p8993
$$ 226865 161877 157716 201405 178414 237062 257631 251051 225214 271613 285730 319996 241003
9976B41003p7709O4487l5200L5826M1253O3843k9908j933j4461L4445k7527j7085
$$ 241003 163294 227781 192581 228407 269660 333503 303595 301662 287201 321646 294119 277034
9964B77034m030R691R018r813L2160n0391R104M6858q3503p6982Q0998J660Q510
$$ 277034 273004 282695 291713 281900 314060 263669 272773 319631 236128 159146 240144 241804 250314
9951B50314N1093k4399j8174J6007q2776N8127N3594K7108p339K2419q1961K5204
$$ 250314 301407 277008 258834 274841 192065 250192 303786 330894 323555 345974 264013 289217
9939B89217Q5251j8143J0337L6824o7028n2996J8261L5858j6917L4289o8521n716
$$ 289217 374468 356325 366662 403486 336458 283462 301723 337581 320664 354953 286432 280716
9927B80716K1357n9851J6486K9876j1795q814J4332j4635O2337Q55K1097o317
$$ 280716 302073 242222 258708 288584 276789 267975 282307 267672 330009 330864 351961 345644
9915C45644O802M9745p4390n911K1941m2609l7450p767N5133J1619j8352Q6892
$$ 345644 352446 402191 327801 321890 343831 301222 263772 256005 311138 322757 304405 391297
9903C91297k4587k0349J7001Q359N9823K8722j2768k5420K5503P040m8797L4281
$$ 391297 366710 346361 363362 371721 431544 460266 447498 422078 447581 454621 405824 440105
9891D40105l2997m2246M7642P9331o8771n2374P3243j2529Q570k2886L7532K3003
$$ 440105 407108 364862 412504 491835 423064 370690 443933 431404 439974 417088 454620 477623
9879D77623l1464J9294k2311q475Q1707n8059J7873O8936K4646l2588k1226k1744
$$ 477623 446159 465453 443142 434667 516374 458315 476188 545124 569770 537182 515956 494212
9867D94212N2676m7153J7918k9055P7545J2599l8716L4126M516J8886O8251k0486
$$ 494212 546888 499735 517653 488598 566143 578742 540026 574152 578668 597554 665805 645319
9855F45319j13j9090R437m7084Q1302O6305j5694m7643q73M5483L824N9133L2624
$$ 645319 645206 626116 635553 588469 669771 736076 720382 672739 671866 717349 721173 780306 812930
9842H12930j6163K9314Q285J8898P8668J3073M0344O2129K1100p186P6030l6414
$$ 812930 796767 826081 834366 853264 931932 945005 985349 1047478 1068578 1061392 1137422 1101008
9830A101008M0605J35656J01173L7488O5675J00629J45366J42003P8075J64517
$$ 1101008 1141613 1277269 1378442 1415930 1481605 1582234 1727600 1869603 1947678 2112195
9820B112195K13126K31797J76710K45427J92310J92047J10382R6838K1161j30154
$$ 2112195 2325321 2557118 2733828 2979255 3171565 3363612 3473994 3570832 3591993 3461839
9810C461839j88878k03406q7503j41889j86295j98279j26973j18712j71534q0309
$$ 3461839 3272961 3069555 2982052 2840163 2653868 2455589 2328616 2209904 2038370 1958061
9800A958061p9014m2083j22484j03965p0121m1366n8585p9746n5508N4905J3687
$$ 1958061 1879047 1836964 1714480 1610515 1540394 1499028 1440443 1360697 1305189 1360094 1373781
9789A373781L8110j0238J5910P2502M3106j4179J2769P5008J3213K8987M4603
$$ 1373781 1411891 1401653 1417563 1490065 1533171 1518992 1531761 1606769 1619982 1648969 1693572
9778A693572P4081M2562N2797L3846J04550P5151o0766n7600P550r8710o4466
$$ 1693572 1767653 1810215 1863012 1896858 2001408 2076559 2015793 1958193 1965743 1867033 1802567
9767A802567p3205P749m6630J5173j9628L5471m2555r027k5356M1398L5584Q686
$$ 1802567 1729362 1737111 1690481 1705654 1686026 1721497 1678942 1669915 1644559 1685957 1721541 1730227
9755A730227j9355K882k5125K6617m7103j0234J7069q7779M0238K5219M9171O0952
$$ 1730227 1710872 1713754 1688629 1715246 1668143 1657909 1674978 1587199 1627437 1652656 1701827 1762779
9743A762779L4571K7685k8595P2269P0407q817P825Q148L2906L3155l8800R525
$$ 1762779 1797350 1825035 1796440 1868709 1939116 1930299 1938124 1946272 1979178 2012333 1973533 1983058
9731A983058K7335O3356l6589M9027Q2354J3607p41K3406L8050P8064K1750P7970
$$ 1983058 2010393 2073749 2037160 2086187 2168541 2182148 2181407 2204813 2242863 2320927 2342677 2420647
9719B420647J2623k2960N3657J03365Q0888P3594M9404k5175O4458J09321n0436
$$ 2420647 2433270 2410310 2463967 2567332 2648220 2721814 2771218 2746043 2810501 2919822 2869386
9708B869386J20448M4517O260O8054J28671J04513P8453R7072J18339R3766R9076
$$ 2869386 2989834 3034351 3040611 3108665 3237336 3341849 3420302 3517374 3635713 3729479 3828555
9697C828555M0980J35923J05105Q3750K09031J60456J75819J58685J53752J94715
$$ 3828555 3869535 4005458 4110563 4194313 4403344 4563800 4739619 4898304 5052056 5246771
9687E246771J42924K18103K09629K13147K33637K12788J75599J52036J41064R3675
$$ 5246771 5389695 5607798 5817427 6030574 6264211 6476999 6652598 6804634 6945698 7039373
9677G039373J26892J43217R6003J14848P3921J02174J40560J31934J68467J72174
$$ 7039373 7166265 7309482 7405485 7520333 7594254 7696428 7836988 7968922 8137389 8309563
9667H309563K02401J78943J35318K39258K45487Q1018K07694J75541K05077L05659
$$ 8309563 8511964 8690907 8826225 9065483 9310970 9391988 9599682 9775223 9980300 10285959
9657A0285959L08974K35096K58932L09441M67154M51547M56549L04563M40137
$$ 10285959 10594933 10830029 11088961 11398402 11865556 12317103 12773652 13078215 13518352
9648A3518352M79388N11473N74476P29584N94124P10258P29512Q23279P24146
$$ 13518352 13997740 14509213 15083689 15813273 16407397 17117655 17847167 18670446 19394592
9639A9394592P80775Q21367Q67711P90535R58259Q12489R93261R51699J059115
$$ 19394592 20175367 20996734 21864445 22654980 23613239 24425728 25418989 26370688 27429803
9630B7429803J146141J559367J580340J993013K191753K772952L091874L720001
$$ 27429803 28575944 30135311 31715651 33708664 35900417 38673369 41765243 45485244
9622D5485244M090136N056244N564668O845987Q333281J0591924J2199087J3783784
$$ 45485244 49575380 54631624 60196292 67042279 75375560 85967484 98166571 111950355
9614A11950355J6029025K0023589K4450307L1146684L5466059L9611855J7769942
$$ 111950355 127979380 148002969 172453276 203599960 239066019 278677874 296447816
9607B96447816k3222732m0132019m1191202l3675801k5953981j9448911j5837634
$$ 296447816 273225084 233093065 191901863 158226062 132272081 112823170 96985536
9600I6985536j2754492j0509030q352762p055197n593750m628345l799131l247412
$$ 96985536 84231044 73722014 65369252 58314055 52720305 48091960 44292829 41045417
9592D1045417k533072k359400k045451j909386j594536j556395j395306j374821
$$ 41045417 38512345 36152945 34107494 32198108 30603572 29047177 27651871 26277050
9584B6277050j204644j116870r98023r10149q74705q04951o34730o58423n48187
$$ 26277050 25072406 23955536 22957513 22047364 21172659 20367708 19732978 19074555 18526368
9575A8526368n45708n81256n26540n59234n71304n71813m37382n11871m27695
$$ 18526368 17980660 17399404 16872864 16313630 15742326 15170513 14733131 14221260 13793565
9566A3793565l96858m20755m33898k00795j71232l62704k72998k67613k38991
$$ 13793565 13396707 12975952 12542054 12341259 12170027 11807323 11534325 11266712 11027721
9557A1027721k48198j85903j76423k99714j48251j27037r5348q0342r5180k8056
$$ 11027721 10779523 10593620 10417197 10117483 9969232 9842195 9746847 9666505 9571325 9543269
9547I543269n3512o2090k7241p8898J8417J0468K7685L2290J38461J58938J65931
$$ 9543269 9489757 9427667 9400426 9321528 9339945 9350413 9378098 9410388 9548849 9707787 9873718
9536I873718K52044K96773L41313L12597J98111J74894M8356N0432r6690k0566
$$ 9873718 10125762 10422535 10763848 11076445 11274556 11449450 11497806 11548238 11451548 11430982
9526A1430982j03745j50864j05738j85324k26075k00039l24167k49810j85518
$$ 11430982 11327237 11176373 11070635 10885311 10659236 10459197 10135030 9885220 9699702
9517I699702j43841j26516j1344L2732K4243k7415L3486R7253J64288J19578K39164
$$ 9699702 9555861 9429345 9418001 9450733 9474976 9447561 9481047 9578300 9742588 9862166 10101330
9506A0101330K41732J78732J91633K57329L64718N23914M84733N33675L97836
$$ 10101330 10343062 10521794 10713427 10970756 11335474 11859388 12344121 12877796 13275632
9497A3275632L63061L26012J78336J56865J99136K74112K13734J2236J29571J8032
$$ 13275632 13638693 13964705 14143041 14299906 14499042 14773154 14986888 14999124 15128695 15146727
9487A5146727p8386N7621P9173J58049K36034K73381L84613L15793L83720M66279
$$ 15146727 15068341 15125962 15205135 15363184 15599218 15872599 16257212 16573005 16956725 17423004
9477A7423004N93649N87145O51195P49830Q34154R38676J054525J182442J432772
$$ 17423004 18016653 18603798 19254993 20004823 20838977 21777653 22832178 24014620 25447392
9468B5447392J552397J739661J921605K101709K253872K695138L001013L112204
$$ 25447392 26999789 28739450 30661055 32762764 35016636 37711774 40712787 43824991
9460D3824991L453511L982056M554450N303902O071350O714146O974228O168587
$$ 43824991 47278502 51260558 55815008 61118910 67190260 73904406 80878634 87047221
9452H7047221M952503M193166L410576J734899k22837k408442m004233m536710
$$ 87047221 91999724 96192890 99603466 101338365 101115528 98707086 94702853 90166143
9444I0166143n351671o646178p167154o743234n758344m678082l561850k649520
$$ 90166143 84814472 78168294 71001140 64257906 58499562 53821480 50259630 47610110
9436D7610110j919776j282240o91649k24830K58661O13577R95601J329959J603596
$$ 47610110 45690334 44408094 43716445 43491615 43750276 44363853 45359454 46689413 48293009
9427D8293009K097519K523702K917292L407941M026993M897373N893405O732294
$$ 48293009 50390528 52914230 55831522 59239463 63266456 68163829 74057234 80789528
9419H0789528P258831O738162N405962M268128L250807J515570p88416k868328
$$ 80789528 88048359 94786521 100192483 104460611 107711418 109226988 108438572 105570244
9411A05570244m741995n743463o319386p580048q583924q445946p550774o355476
$$ 105570244 100828249 95084786 88765400 81185352 72601428 64155482 56604708 50249232
9403E0249232n285012m307338l590844l084664k633771k212232j887560j590954
$$ 50249232 44964220 40656882 37066038 33981374 31347603 29135371 27247811 25656857
9395B5656857j424582j324494j152582j019413q55555p79282p68506o57966o05424
$$ 25656857 24232275 22907781 21755199 20735786 19880231 19100949 18332443 17674477 17069053
9386A7069053n90145p04246n80044o34864n25781m32328m95431l30453k90480
$$ 17069053 16478908 15774662 15194618 14559754 14033973 13601645 13106214 12775761 12485281
9377A2485281l03328l23976k33502k38448k58672k47885k36876k92268m37295
$$ 12485281 12181953 11857977 11624475 11386027 11127355 10879470 10642594 10350326 9913031
9368I913031l49418l64867l91449l82167l21866k20125k29151k39822j46822k03488
$$ 9913031 9563613 9198746 8807297 8425130 8103264 7883139 7653988 7414166 7267344 7063856
9358G063856j94931j66857j65382j44116j17764r7316j92114j73783j52490j62365
$$ 7063856 6868925 6702068 6536686 6392570 6274806 6177490 5985376 5811593 5659103 5496738
9348E496738j26910j29018j09474j31006j24129o6587j10632n6089j13365l9617
$$ 5496738 5369828 5240810 5131336 5000330 4876201 4809614 4698982 4642893 4529528 4489911
9338D489911k1478m3922q2173j26287K6084r422n2342r1033m9306r2000q9496
$$ 4489911 4468433 4424511 4342338 4216051 4242135 4232713 4180371 4089338 4040032 3948032 3858536
9327C858536q8466r563J501r4342o1563r9413m2152K1736p9317q3339r3705m9156
$$ 3858536 3770070 3760507 3762008 3667666 3606103 3506690 3464538 3486274 3406957 3323618 3229913 3180757
9315C180757m3549p2595k8039r263r2418n8128q3625J2062n3736l3167l7635j7275
$$ 3180757 3137208 3064613 3036574 3027311 2934893 2876765 2793140 2805202 2751466 2718299 2680664 2663389
9303B663389k3863N6698Q6466m0687P483o8943n2784K1628K1228J9587J06106
$$ 2663389 2639526 2696224 2782690 2742003 2749486 2680543 2627759 2649387 2670615 2690202 2796308
9292B796308j2685l2723M5014K905n3411K3084k0191j11411r0197n8220j15413
$$ 2796308 2783623 2750900 2795914 2798819 2745408 2768492 2748301 2636890 2546693 2488473 2373060
9281B373060p5594K3159k1203j12541l2265j6292n7445p7152P3397J4321o9l6340
$$ 2373060 2297466 2320625 2299422 2186881 2154616 2138324 2080879 2003727 2077124 2091445 2091376 2055036
9269B055036q5869k1174K0443K9303n8397j171m784l4760R345K1439q080M9567
$$ 2055036 1969167 1947993 1968436 1997739 1939342 1938171 1933387 1898627 1907972 1929411 1921331 1970898
9257A970898K3851j1416p04O1251J06144j4172m5251L2905K4414L1607k2765j05459
$$ 1970898 1994749 1983333 1982629 2043880 2150024 2135852 2090601 2123506 2147920 2179527 2156762 2051303
9245B051303J5238K226k4132O522k6070j3030N2463l7441j1762l0017L2633O6728
$$ 2051303 2066541 2068767 2044635 2051157 2025087 2012057 2064520 2027079 2015317 1985300 2017933 2084661
9233B084661K5985K9162O7256q313R5875J7886j7629k3028l3222N1127J4185l9520
$$ 2084661 2110646 2139808 2207064 2198751 2294626 2312512 2294883 2271855 2238633 2289760 2303945 2264425
9221B264425l5902q5644p1811j04728r7116n8735j4929J8591o5805l8419N1167
$$ 2264425 2228523 2142879 2071068 1966340 1869224 1810489 1795560 1814151 1748346 1709927 1761094
9210A761094m7328j315N4973j6622L7959J17793K38n1292J9481J29797K4180M
$$ 1761094 1713766 1712451 1767424 1750802 1788761 1906554 1906792 1855500 1874981 2004778 2028958 2028962
9198B028962Q1037K3959J9786P3267R4781M3194M8714M035k1735J4157k3166O270
$$ 2028962 2109999 2133958 2153744 2227011 2321792 2364986 2413700 2417735 2396000 2410157 2386991 2393261
9186B393261j16109q9322n8019j4908j035P6111Q0597L1368Q5622L5426O6607
$$ 2393261 2277152 2187830 2129811 2114903 2113868 2189979 2270576 2301944 2387566 2422992 2489599
9175B489599o3478j32909j33250p7221p6979n3084q1882j4735m1630k7211k6353
$$ 2489599 2426121 2293212 2159962 2082741 2005762 1952678 1870796 1856061 1814431 1787220 1760867
9164A760867k6980P0487j6839K9638K5152R233N6893k05L3674L395J597q0815
$$ 1760867 1733887 1804374 1787535 1817173 1842325 1851558 1908451 1908246 1941920 1945315 1946912 1866097
9152A866097k9069l5834j3230k8791K3928l970m3182j18294j3463j4953P166J0750
$$ 1866097 1837028 1801194 1787964 1759173 1783101 1779131 1735949 1617655 1604192 1589239 1596405 1607155
9140A607155k6782j0592N0844J5771M1933n7595Q966j5759M9304N2235P3805O5179
$$ 1607155 1580373 1569781 1620625 1636396 1678329 1620734 1629700 1613941 1663245 1715480 1789285 1854464
9128A854464k9538M7433r021O9841R4758L2134R9173O0340K8690Q5874J50951
$$ 1854464 1824926 1872359 1863338 1933179 2027937 2060071 2159244 2219584 2248274 2334148 2485099
9117B485099J30905J14882J88077K39496Q0134o7995k19476k26547j79586j51718
$$ 2485099 2616004 2730886 2918963 3158459 3238593 3170598 2951122 2724575 2544989 2393271
9107B393271j18278r0715r5446m1545j5308j0035j4660p5923j3610M8227L5787
$$ 2393271 2274993 2184278 2088832 2047287 2031979 2021944 2007284 1931361 1917751 1965978 2001765
9096B001765J9828m1436J0307R0013J29827J0820L0997M8828r647J1034J9578
$$ 2001765 2021593 1980157 1990464 2080477 2210304 2221124 2252121 2300949 2291302 2302336 2321914
9085B321914K9186o0079K5646O632p941j8975m9603m8024L8356n3717K4334J3896
$$ 2321914 2351100 2291021 2316667 2323299 2315358 2296383 2246780 2198756 2237112 2183395 2207729 2221625
9073B221625P320M1727O2403L2015R403j3861M6796K3659J53122O3511K5427K1617
$$ 2221625 2228945 2270672 2333075 2365090 2374493 2360632 2407428 2431087 2584209 2647720 2673147 2694764
9061B694764J03404M8290k9467R8695P8259L9727J21498L8067J0620o143J0359
$$ 2694764 2798168 2846458 2816991 2915686 2993945 3033672 3155170 3193237 3203857 3197714 3208073
9050C208073j3900R167N9454J5280p713k8346N408Q8715M2217K4661K8445L362
$$ 3208073 3194173 3203340 3262794 3278074 3270361 3242015 3247423 3336138 3378355 3403016 3431461 3434823
9038C434823M4265P5803L6640J7570O4407O2154O8167J2470r288l3242K7402k2133
$$ 3434823 3479088 3554891 3591531 3609101 3673508 3735662 3803829 3816299 3807011 3773769 3801171 3779038
9026C779038Q0695P8287J4877R2719K4079P1485J35835M3414L0684R6177J4691
$$ 3779038 3859733 3938020 3952897 4045616 4069695 4141180 4277015 4320429 4351113 4447290 4461981
9015D461981M1640J36718J12161J08540J24751J05177J63203J25981J28532J15358
$$ 4461981 4503621 4640339 4752500 4861040 4985791 5090968 5254171 5380152 5508684 5624042
9005E624042J85774J78684J80542K24024K06480K47399K60927L50374L10667L35812
$$ 5624042 5809816 5988500 6169042 6393066 6599546 6846945 7107872 7458246 7768913 8104725
8995H104725M83527N12352M82831M87429L99914L87319M12864J60048J42850J30833
$$ 8104725 8588252 9100604 9583435 10070864 10470778 10858097 11270961 11431009 11573859 11704692
8985A1704692p3972o9546j69424j18793J423m5866j12107r1186j19213n3494J4644
$$ 11704692 11630720 11561174 11391750 11272957 11274380 11228514 11116407 11025221 10906008 10852514 10867158
8974A0867158R8278J33486K28125K77874J99990K74489M53668L39154L78264M32361
$$ 10867158 10965436 11098922 11327047 11604921 11804911 12079400 12533068 12872222 13250486 13682847
8964A3682847N09118O09499O24038O59489P85087R28408R51870J093460J117566
$$ 13682847 14191965 14801464 15425502 16084991 16870078 17798486 18750356 19843816 20961382
8955B0961382J151500J151914R31629O70401N25246L43489K60294K48460J91415
$$ 20961382 22112882 23264796 24196425 24866826 25392072 25735561 25995855 26244315 26435730
8946B6435730J06068M1959J85695M47620O56872Q31996J059369J516949J731922
$$ 26435730 26541798 26583757 26769452 27217072 27873944 28705940 29765309 31282258 33014180
8937C3014180K105151K612115L176315L818313M587020N320903N841242N332135
$$ 33014180 35119331 37731446 40907761 44726074 49313094 54633997 60475239 65807374
8929F5807374M212001L840073L476235K257404L71171j787024k943466l170768
$$ 65807374 70019375 73859448 77335683 79593087 79964258 78177234 75233768 72063000
8921G2063000m043270n072626n211020m454562l557821k766331k105358j535484
$$ 72063000 68019730 62947104 57736084 53281522 49723701 46957370 44852012 43316528
8913D3316528j025743n31546k42286q3033J25197K67035N20413Q87850J289601
$$ 43316528 42290785 41759239 41516953 41433920 41559117 41826152 42346565 43234415 44524016
8904D4524016J787758K240243K875539L657690M304137N225866O349146P649418
$$ 44524016 46311774 48552017 51427556 55085246 59389383 64615249 70964395 78613813
8896G8613813R053940J0353693J0964150R159535O848116O132710N205177K122293
$$ 78613813 87667753 98021446 108985596 118145131 124993247 131125957 136331134 138453427
8888A38453427j932644n710739p273897p498047r057477j0622216j0702158r718558
$$ 138453427 136520783 130810044 123536147 116038100 106980623 96358407 85656249 75937691
8880G5937691q169305o612556n196037m284941l628344l090900k504567k090503
$$ 75937691 67768386 61155830 55959793 51674852 48046508 44955608 42451041 40360538
8872D0360538j659400j269987r96361r47845q41961q26850q73908q41980q20140
$$ 40360538 38701138 37431151 36434790 35486945 34644984 33818134 32944226 32102246 31282106
8863C1282106p51574p50188p12182n89312m44235l04491k03876n6481Q1149P5096
$$ 31282106 30530532 29780344 29068162 28478850 28034615 27730124 27526248 27469767 27550916 27626012
8853B7626012K05275L02889M53433N48029O31657N88987N63172N70427P36612
$$ 27626012 27831287 28134176 28587609 29135638 29767295 30356282 30919454 31489881 32226493
8844C2226493Q79943J115204J175669J366612J773610K187953K572839L015399
$$ 32226493 33106436 34221640 35397309 36763921 38537531 40725484 43298323 46313722
8836D6313722L569657M274747N144637N893701O075088M339749J154383o02564
$$ 46313722 49883379 54158126 59302763 65196464 71271552 75611301 76765684 76163120
8828G6163120o58727q030R4838k123600n081532o199198n814564m805233l778003
$$ 76163120 75504393 75496363 75591201 73467601 68386069 62186871 56372307 51567074 47789071
8819D7789071k824398k100089j413824r32555m90916j90476J27606M34917P98978
$$ 47789071 44964673 42864584 41450760 40518205 40027289 39836813 39964419 40399336 41198314
8810D1198314J202124J584321K087552K627528L170971L863995M864977O085460
$$ 41198314 42400438 43984759 46072311 48699839 51870810 55734805 60599782 66685242
8802F6685242P307355Q225344Q282638N657129K064347P38240J177204K068570
$$ 66685242 73992597 82217941 90500579 96157708 98222055 98960295 100137499 102206069
8794A02206069P89690l415798p005639p889704p035868n857974n850176o236456
$$ 102206069 102995759 99579961 92574322 84684618 77648750 71790776 65940600 59704144
8786E9704144n872179n088433m143679l303261k650416k252087j710522j319409
$$ 59704144 53831965 48743532 44599853 41296592 38646176 36394089 34683567 33364158
8778C3364158j058372p95042n56078l51765j61257Q8848L67268O17230R38934
$$ 33364158 32305786 31510744 30954666 30602901 30441644 30530492 30897760 31514990 32453924
8769C2453924J279863J667266K117746K772916L416595L857555L590233J677692
$$ 32453924 33733787 35401053 37518799 40291715 43708310 47565865 51156098 52833790
8761E2833790l69157j180431j004948l82335p72308k640595m227678m682410m230335
$$ 52833790 52464633 51284202 50279254 49896919 49124611 46484016 42256338 37573928 33343593
8752C3343593l473190k818996k281696j764925j530710j335312j132979r44851
$$ 33343593 29870403 27051407 24769711 23004786 21474076 20138764 19005785 18060934
8744A8060934q99409p90881o85550n80993n13020m85254m33237m48934m39186
$$ 18060934 17161525 16370644 15685094 15104101 14591081 14105827 13672590 13223656 12784470
8735A2784470n15659m37335m05575l52804l53224l59075k75225l01709l17428
$$ 12784470 12268811 11831476 11425901 11073097 10719873 10360798 10085573 9783864 9466436
8726I466436j71218j57055q2243j50660j23379q7303m6969j17794n1884Q5824
$$ 9466436 9295218 9138163 9055920 8905260 8781881 8694578 8647609 8529815 8477931 8563755
8716H563755n78r294m2906n0905j27403k27547j40971j01927r6258o3049o7425
$$ 8563755 8563177 8553883 8510977 8460072 8332669 8105122 7964151 7862224 7765966 7702917 7635492
8705G635492j23717j46966j48454r0778q8142p1658k7519m7973p753N4565J2406
$$ 7635492 7511775 7364809 7216355 7125577 7037435 6965777 6938258 6890285 6882532 6937097 6949503
8694F949503o3844L5313M9071n302N3628M2666m995j9357N7259O1215K8924Q1002
$$ 6949503 6885659 6920972 6970043 6964741 7018369 7061035 7056040 7036683 7093942 7155157 7184081 7265083
8682G265083J17319K4429J7284O7450O7889M5075L4984N9450O1480Q8595M9464
$$ 7265083 7382402 7406831 7424115 7491565 7559454 7604529 7639513 7698963 7760443 7849038 7898502
8671G898502M0324K24328M8630J05710J46365J35253L23130K48055K19232K65838
$$ 7898502 7938826 8163154 8211784 8317494 8463859 8599112 8922242 9170297 9389529 9655367
8661I655367K63709L34704L49873M44003L77870M65301N09529N00359O02197N92923
$$ 9655367 9919076 10253780 10603653 11047656 11425526 11890827 12400356 12900715 13502912 14095835
8651A4095835N56291M11732L23488L25234K62335K36653Q4328J16745J43217L11046
$$ 14095835 14652126 15063858 15387346 15712580 15974915 16211568 16295896 16412641 16555858 16866904
8641A6866904L21374M00524N22723N55635P99454Q48286J001910J102128J407168
$$ 16866904 17188278 17588802 18111525 18667160 19466614 20314900 21316810 22418938 23826106
8632B3826106J608128K028245K432057K786730L223898L756638M669914N557201
$$ 23826106 25434234 27462479 29894536 32681266 35905164 39661802 44331716 49888917
8624D9888917O281266O732663N818890K893032N74625j3728M26614O84064j809590
$$ 49888917 56170183 62902846 68721736 71614768 72189393 72175665 72602279 73286343 71476753
8615G1476753m893170o102156n929239n038020l973926l176656k586636k010571
$$ 71476753 66583583 60481427 54552188 49514168 45540242 42363586 39776950 37766379
8607C7766379j382318q87896m01229j27909J51866M84200Q36290J297957J687646
$$ 37766379 36384061 35496165 35094936 34967027 35118893 35603093 36439383 37737340 39424986
8598C9424986K136510K725764L262140M123072M904761O091316P097635P886473
$$ 39424986 41561496 44287260 47549400 51672472 56577233 62668549 69766184 77652657
8590G7652657P577515N934275M978510M570040K783422M2262k714087m416033
$$ 77652657 85230172 91164447 96142957 100712997 103496419 103538681 100824594 96408561
8582I6408561m571835n636705p876301q759898q225065p092939n772233m568501
$$ 96408561 91836726 86200021 78323720 69563822 61338757 54245818 48473585 43905084
8574D3905084l577620k880720k304274j867682j380738j109991o24456m99605
$$ 43905084 40327464 37446744 35142470 33274788 31894050 30784059 30159603 29659998
8566B9659998l26511O929K82917O47855R61397J183811J680542K244498K875765
$$ 29659998 29333487 29340416 29623333 30271188 31232585 32416396 34096938 36341436 39217201
8557C9217201L485465L811691L336415J268399o03724j048911p98252n61282j946811
$$ 39217201 42702666 46514357 49850772 51119171 50515447 49466536 48668284 48107002 46160191
8548D6160191l979042m752847m553814l930392l225076k517091k187658j787338
$$ 46160191 42181149 37428302 32874488 28944096 25719020 23201929 21014271 19226933
8540A9226933j462680j272601j037715q95547p58838o36823o23777n58775n04653
$$ 19226933 17764253 16491652 15453937 14558390 13799552 13162729 12538952 11980177 11475524
8531A1475524m38116m12863m66433l30222k76639k79684l80667l05997k61889
$$ 11475524 11037408 10624545 10158112 9827890 9551251 9271567 8890900 8584903 8323014
8522H323014k25381j92978j57242k30044j89824k39082l00061k16453k55279j82066
$$ 8323014 8097633 7904655 7747413 7517369 7327545 7088463 6788402 6571949 6316670 6134604
8512F134604j22977k15278j92941j64130j72536r4293r7368j49917p7451j62274
$$ 6134604 6011627 5796349 5603408 5439278 5266742 5172449 5075081 4925164 4847713 4685439
8502D685439j18914r4957q9180j08485j37466j37368q3298r8321j57983r408n6880
$$ 4685439 4566525 4471568 4382388 4273903 4136437 3999069 3915771 3817450 3659467 3650059 3593179
8491C593179j35943n0645o8627l5892m5460l4905j6568m1464o8840r0752j0054
$$ 3593179 3457236 3406591 3337964 3302072 3256612 3221707 3205139 3163675 3094835 3004083 2994029
8480B994029o0648r3819l5214p5578R729k2245p1947L6231j3919K4945N5346j5939
$$ 2994029 2933381 2839562 2804348 2728770 2738499 2716254 2644307 2680538 2666619 2691564 2746910 2730971
8468B730971n7946k3399o0958l8845o1696q1247r5989p7603n5674n0788o5265
$$ 2730971 2673025 2649626 2588668 2549823 2488127 2406880 2310891 2233288 2177614 2126826 2061561
8457B061561l4445l892p3112q4248M9367J3210k0000k672k5965n0312j0952P035
$$ 2061561 2027116 2023224 1950112 1865864 1915231 1928441 1908441 1905769 1879804 1829492 1818540 1825575
8445A825575o425K3193K8280J1394r3364k0086N4691J6110J8897l313M211K1297
$$ 1825575 1819150 1842343 1870623 1882017 1788653 1768567 1823258 1839368 1858265 1854952 1859163 1880460
8433A880460m5509k7975m2029k8960Q260k7130j22458p4053q7372n8007J4538
$$ 1880460 1834951 1806976 1764947 1735987 1744247 1717117 1594659 1520606 1433234 1375227 1389765
8422A389765r0291k4182J4331j6140j4479m3473n6974N035l1240P2442M9153L5702
$$ 1389765 1299474 1275292 1289623 1273483 1259004 1215531 1158557 1163592 1132352 1204794 1253947 1289649
8410A289649j6734l7592J6721J9646q0593j876l2825m6171J0898O6341J1644q6469
$$ 1289649 1272915 1235323 1252044 1271690 1191097 1189221 1156396 1110225 1121123 1187464 1199108 1112639
8398A112639l7361P1369R368p2961j907m8790m0293j12546j01915M6989J2523
$$ 1112639 1075278 1146647 1156015 1083054 1081147 1032357 992064 879518 777603 824592 837115
8387H37115n4965m3865k9457K3857J7373L463j9893k1927p3275J8201n1147j6624
$$ 837115 782150 738285 708828 732685 750058 753521 733628 711701 638426 656627 605480 588856
8375E88856J2405k3518L0441J9380k0404N7771r7487K5263N4301O307k276k8560
$$ 588856 601261 577743 608184 627564 607160 664931 567444 592707 647008 653315 651039 622479
8363F22479k0668K7573l0949q6652m742Q828L2107k8832J566k1346q174J2018
$$ 622479 601811 629384 598435 511783 507041 515869 547976 519144 520710 499364 491190 503208
8351E03208K1095o0130N5112j2455j3415j1226m5848k1841J4549J6939j5560J2126
$$ 503208 524303 464173 519285 506830 493415 482189 436341 414500 429049 445988 430428 442554
8339D42554m8461R0743J0906o8829l5115K5333l1861l1115Q3120p8254p174J3828
$$ 442554 394093 484836 495742 426913 391798 417131 385270 354155 437275 359021 351847 365675
8327C65675j7596M1288m2095j1879R624n3877M6279M7655o1208k9816N4318J714
$$ 365675 348079 389367 347272 335393 345017 291140 337419 385074 323866 294050 348368 350082
8315C50082k9484L2586j3119M93K5053k8800k3139O2023p4963l457K4343m8632
$$ 350082 320598 353184 340065 340558 365611 336811 313672 375695 300732 297275 321618 272986
8303B72986K1243l6100L9990O1524l4887O4201o633k4791J0581m7032j5696r905
$$ 272986 294229 258129 298119 359643 324756 388957 382324 357533 368114 321082 305386 295481
8291B95481J3269n2876P5090L3154o0507k9320J4763L7285l0208p6592K1539q652
$$ 295481 308750 255874 330964 364118 303611 274291 289054 326339 296131 219539 241078 232426
8279B32426J0748R2987K3363j8157n1337r772M1451J8304J7567o7449k5488p366
$$ 232426 243174 336161 359524 341367 290030 280258 321709 340013 357580 290131 264643 257277
8267B57277j0750R4991N5251k476J03K6900K5262N5006K3658j00622J8074Q0716
$$ 257277 246527 341518 396769 394293 394396 421296 446558 501564 525222 424600 442674 523390
8255E23390L1653l9123P769j1587o7230j079p2100m6613M77j130J0379m3884L6983
$$ 523390 555043 515920 523689 512102 444872 443793 371693 325080 325557 324427 334806 290922 327905
8242C27905l7754l8583J9326K3848K1492k2318J8082n38K0209M0878p025J6925
$$ 327905 290151 251568 270894 294742 316234 293916 311998 311460 331669 372547 365522 382447
8230C82447J03127M985L5086K6872M2317J3001l1500n0887J26145o1735j34192
$$ 382447 485574 490559 525645 552517 594834 607835 576335 525448 651593 589858 455666
8219D55666p045K4797j2346m5274p8066m8114k3610j2195l4476K4716P3594j2665
$$ 455666 448621 473418 461072 415798 337732 289618 266008 253813 219337 244053 317647 304982
8207C04982k5915m4051J3493k2221n866k8560m0710k7298Q7164j1232k4898O1242
$$ 304982 279067 235016 248509 226288 220422 191862 151152 123854 211018 199786 174888 236130
8195B36130J3272l4615l4681j05635J55959O4389n187J8846l3715j5224n29L958
$$ 236130 249402 214787 180106 74471 230430 294819 289632 308478 274763 259539 259010 262968
8183B62968l4514j04238q6189M6228J191J5104J8147L84n6226J060J9468k897
$$ 262968 228454 124216 38027 84255 85446 100550 118697 119081 62855 63915 83383 80486
8171H0486K1568o518q815K4529O670J5105j6423j9822m4552N2692K4114K3344
$$ 80486 102054 95536 86721 111250 117920 133025 116602 96780 52228 104920 129034 152378
8159A52378n2809k9850L8369K069j5285p450k7398K2848l8828J095j863j2785
$$ 152378 99569 69719 108088 110157 94872 87422 60024 82872 44044 45139 43276 30491
8147C0491J1057k7924K2170K0436O2590P836o2452n9198M7318l8216P9462L9771
$$ 30491 41548 13624 35794 56230 118820 126656 64204 5006 52324 14108 93570 133341
8135A33341o4356j7102J5101j1746O602k0303K353J3615n1231L2814M9313l0817
$$ 133341 68985 51883 66984 55238 61840 41537 43890 57505 6274 39088 88401 57584
8123E7584m8422P073J7661K9470j6661J2441j5986K4395l1811M7237P596o2322
$$ 57584 9162 16235 33896 63366 46705 59146 43160 67555 35744 82981 90577 28255
8111B8255k0710j6118m6896l6495N0806M6793L1472O3505o7042k5543N6806j2929
$$ 28255 7545 -8573 -55469 -91964 -41158 5635 37107 100612 33570 8027 64833 51904
8099E1904L6696N8727o0656j09209K4419N6734J8587J744J13k5861K0709m9044
$$ 51904 88600 147327 86671 -22538 1881 58615 77202 78946 79059 53198 73907 24863
8087B4863J6806N6599n9111J3379Q302j4043J6162N4840J9393q903l8496l7049
$$ 24863 41669 98268 39157 52536 60838 46795 62957 117797 137190 128287 89791 52742
8075E2742k2194n57k3227k3112K7073o188j864r1662N1400M6029L6715l1564p5654
$$ 52742 30548 29991 6764 -16348 10725 4537 2673 -88989 -37589 8440 45155 13591 -62063
8062f2063J07024K3236r4211J2250L534K9340N103O831o6548j439j2440j3817
$$ -62063 44961 68197 -26014 -13764 -10230 19110 24213 31044 -35504 -36943 -49383 -63200
8050f3200N3439M8196j3477K8759l5032k7098j1757K2616K9694j6259J7422j6254
$$ -63200 -9761 38435 24958 53717 18685 -8413 -20170 2446 32140 15881 33303 17049
8038A7049k0286q1915N9664M2262K0769l2160j6747N6333m3139l2437K5570L192
$$ 17049 -3237 -85152 -25488 16774 37543 5383 -11364 44969 1830 -30607 -5037 -1845
8026a845k0780J6095J4757N4788j4741l0167L1729l2621k9771r7639J2424M2701
$$ -1845 -22625 -6530 8227 63015 48274 18107 49836 17215 -12556 -110195 -97771 -55070
8014e5070M5153K7341l3223j9464k0062k0128N0628j9606K615m586m9345K154
$$ -55070 -9917 17424 -15799 -35263 -55325 -75453 -24825 -44431 -41816 -46402 -95747 -93593
8002i3593N0257L980q0918N2289k0575L3972q479J128L3202K6222M0088j9205
$$ -93593 -43336 -39356 -120274 -67985 -88560 -54588 -63067 -61939 -28737 -2515 37573 18368
7990A8368M1134K8699k9492o1600M1580j6898j2974j422o7960P4346m903j8527
$$ 18368 59502 88201 58709 -2891 38689 21791 8817 7395 -60565 13781 8878 -9649
7978i649o9453K5020N0315m0749k2672J3446L0527r4158L1287L1959n9573N1509
$$ -9649 -79102 -54082 -3767 -44516 -67188 -53742 -23215 -117373 -86086 -54127 -113700 -62191
7966f2191L9964r034J5804l0238K3718M344J813O464L2291j5564j3967L9058j7335
$$ -62191 -22227 -31261 -15457 -45695 -21977 -17633 -15820 -9356 22935 7371 -6596 32462 15127
7953A5127o8469R897J8037O354N570J1766l1952L3912J4946k6055J7895L3242
$$ 15127 -53342 -43445 -25408 -19054 -13484 -1718 -33670 242 15188 -10867 7028 40270
7941D0270j8170n2951L4270l568O351N0640j6768J8882j4797j6862p0324M453
$$ 40270 22100 -30851 3419 -149 6202 56842 40074 58956 44159 27297 -43027 -38574
7929c8574O0234J923n2139k9623J3725k4211M5765Q4041k5960k7390n198j4220
$$ -38574 21660 23583 -28556 -58179 -44454 -68665 -22900 61141 35181 7791 2593 -11627
7917a1627J0044k1009n8635K6470L2609n7077j6739J3521r127L9002n228j9116
$$ -11627 -1583 -22592 -81227 -54757 -22148 -79225 -95964 -82443 -91570 -52568 -57796 -76912
7905g6912L3400J378r0384N6407k8719K4510K5207k8838Q2334L7695n099q2059
$$ -76912 -43512 -42134 -132518 -76111 -104830 -80320 -55113 -83951 -1617 36078 30979 -51080
7893e1080M0022Q605n120K7539p2477k6862j9567k7891M9230K7568k0312J3280
$$ -51080 -11058 -2453 -7573 19966 -52511 -79373 -98940 -126831 -77601 -50033 -70345 -57065
7881e7065L6260k1348o8850P2573R7835q7525p232l5463K8151j9020J9887N310
$$ -57065 -20805 -42153 -111003 -38430 59405 -28120 -35352 -70815 -42664 -61684 -41797 -36487
7869c6487M1170l3039K2374j9110j6088o932j8101l1388n1934O7680Q823j2625
$$ -36487 4683 -28356 -5982 -25092 -41180 -48112 -66213 -97601 -149535 -81855 -73032 -85657
7857h5657M5013L477O4172j6152m6344k5374J9605P8616n5081m8036J5907k1368
$$ -85657 -40644 -37167 27005 10853 -35491 -60865 -41260 37356 -17725 -65761 -49854 -71222
7845g1222R48J2928J5630P0737k5794m7355l0394L3052k6022n3841J3433k5165
$$ -71222 -70274 -57346 -41716 29021 3227 -44128 -74522 -41470 -67492 -121333 -107900 -133065
7833a33065n4290M0111L5417p738P4852k9342j4152J5182k1681M9672j4093n8382
$$ -133065 -187355 -147244 -111827 -119565 -44713 -74055 -88207 -73025 -94706 -45034 -59127 -117509
7821a17509J2681L5542m652l4591k5452O4175K4387q0364J1842L967l5780K1636
$$ -117509 -104828 -69286 -73938 -108529 -133981 -69806 -45419 -125783 -113941 -109974 -145754 -124118
7809a24118L3841o819J5429J3360l4897J3295K0261J3731O1883o0048n8754K0224
$$ -124118 -90277 -97096 -81667 -68307 -103204 -89909 -69648 -55917 5966 -54082 -112836 -92612
7797i2612Q7854j1071m7441j2443Q7949O5168j46374n7579O2947M3450m4142m4783
$$ -92612 -4758 -15829 -63270 -75713 12236 77404 -68970 -126549 -63602 -20152 -64294 -109077
7785a09077j4251j392J5079p068M5185N3704N084l210j2152m2024j9787k1531
$$ -109077 -123328 -124720 -109641 -116709 -71524 -17820 -12736 -15946 -28098 -70122 -89909 -111440
7773a11440N612M3392L2288n691R903j3162j7788l4959o4658O2763j6990K0586
$$ -111440 -105828 -62436 -30148 -35839 -25936 -39098 -56886 -91845 -156503 -93740 -110730 -90144
7761i0144J9263L5820O749l4425j1466p607k7579L4066M3512p2303q41L0426m162
$$ -90144 -70881 -35061 -28312 -62737 -74203 -81810 -109389 -75323 -31811 -104114 -104955 -74529 -78691
7748g8691j3790M6374j9752K5719L9747l1397l6422k832N1927k7041O268J3230
$$ -78691 -92481 -46107 -65859 -40140 -393 -31790 -68212 -71044 -19117 -46158 -39890 -26660
7736b6660k0990n4005M4857k6481O6602j959n1206m5620k6201j9955K7458j7801
$$ -26660 -47650 -101655 -56798 -83279 -16677 -18636 -69842 -115462 -141663 -161618 -134160 -151961
7724a51961O2607O3685j781r2949K6345j3948M1223K3351n8980k7739M2796M4544
$$ -151961 -89354 -25669 -27450 -120399 -94054 -108002 -66779 -43428 -102408 -130147 -87351 -42807
7712d2807m2134p4559L3990O221j1702L678K9262R7512J6300l2377j05360q972
$$ -42807 -84941 -159500 -125510 -119289 -130991 -127313 -98051 -539 15761 -16616 -121976 -130948
7700a30948J9053j5200O1885l3o5540k5472k1837N9326K0932K958k8507J2976
$$ -130948 -111895 -127095 -65210 -65243 -130783 -156255 -178092 -118766 -97834 -94876 -123383 -110407
7688a10407m7077K8947J3141K8813m0664N5338q055j3823k196N96J4704j2245
$$ -110407 -157484 -128537 -115396 -86583 -127247 -71909 -79964 -93787 -95983 -95387 -80683 -92928
7676i2928k057k1814j2289r23P0021j9480P156k5526j1944l005M8364n737k8115
$$ -92928 -94985 -116799 -129088 -130011 -59990 -79470 -72314 -97840 -109784 -112789 -64425 -70162 -98277
7663i8277L3478n2608O9578l4910p143J5772j5137J3399k1341j8274K3761m118
$$ -98277 -64799 -117407 -47829 -82739 -89882 -74110 -89247 -75848 -97189 -115463 -91702 -95820
7651i5820q442M1219k1274n5665K8538P061M217M9512O835j9446J791p543J6242
$$ -95820 -104262 -63043 -84317 -139982 -111444 -104383 -100166 -50654 -43819 -63265 -61474 -69017 -52775
7638e2775M925M3135j2553k189J7860J5815o2191o3239L6319J07M425j9903K7858
$$ -52775 -47850 -4715 -17268 -19457 -1597 14218 -47973 -111212 -74893 -74786 -70361 -90264 -62406
7625f2406m0844l408M0096k2405m9414P561L4687j4501K7187J4265J6932p6642
$$ -62406 -103250 -106658 -66562 -88967 -138381 -130820 -96133 -110634 -83447 -69182 -52250 -128892
7613a28892J3792k474M0676q731j9680L6380j095j5622M6537l8606Q0205L918
$$ -128892 -115100 -117574 -76898 -85629 -105309 -68929 -70024 -85646 -39109 -77715 2490 6408
7601F408o5084j9255J0136J3160K4543l6758j6044J4222n3645m4667N5997l1520
$$ 6408 -58676 -77931 -67795 -54635 -30092 -66850 -82894 -68672 -122317 -166984 -110987 -142507
7589a42507K8173K6436j7945O3161j1513p038j12910K0131L0699L9288N9696M020
$$ -142507 -114334 -87898 -105843 -42682 -54195 -61233 -174143 -154012 -123313 -84025 -24329 -20309
7577b0309l6818J5633k7742N1623j5223j0034P820n0910Q737R549m1217J12O75
$$ -20309 -57127 -41494 -69236 -17613 -32836 -42870 -35050 -85960 -77223 -67674 -108891 -108779 -108104
7564a08104r845n214M8053L4587j7981l5471L733K5047J04383j7916n0849l1938
$$ -108104 -117949 -123163 -75110 -40523 -58504 -93975 -90242 -65195 39188 21272 -29577 -61515
7552f1515j889N386K3610m6763n635R16N402J5230L3521n7688o718M5243l3780
$$ -61515 -63404 -58018 -34408 -81171 -86806 -85890 -80488 -65258 -31737 -89425 -96143 -50900 -84680
7539h4680o7007O3646J6360k333J4274m4761n170k720J9002J6741l1584M2384
$$ -84680 -151687 -88041 -71681 -74014 -59740 -104501 -109671 -112391 -93389 -76648 -108232 -65848
7527f5848j2402m1079O2562K078j1897k0109n1902O5554J0517k4670k5631L3750
$$ -65848 -78250 -119329 -56767 -54689 -66586 -86695 -138597 -73043 -62526 -87196 -112827 -79077
7515g9077K4011n667J261r653J6961l4387N967J5089L8187N61J6584k9641k6183
$$ -79077 -55066 -60733 -59472 -69125 -52164 -86551 -80584 -65495 -27308 -26747 -10163 -39804 -65987
7502f5987p38L0159l4528m9212n096L0382K5248j370j1049P0820M712r2675l8070
$$ -65987 -66725 -36566 -71094 -120306 -125402 -95020 -69772 -71142 -82191 -11371 -6659 -99334 -137404
7489a37404K1234K0494N4676Q5866k3186o6163N960J4033j2110j9340N9954j4657
$$ -137404 -116170 -95676 -41000 44866 21680 -44483 -38523 -24490 -36600 -55940 4014 -10643
7477a0643q3092Q444R083N03J7564r14O033l2616L9748k6710K080M4172J1792
$$ -10643 -93735 -85291 -76208 -75705 -58141 -59055 -53022 -85638 -45890 -72600 -70520 -26348 -14556
7464a4556r697k0611K0107r5266L0356M2005k6963N7880m2733j5353L5686r350
$$ -14556 -24253 -44864 -24757 -120023 -89667 -47662 -74625 -16745 -59478 -74831 -39145 -48495
7452d8495m9142L9109K6826j08007Q174M5089j3948K4642J790J3212l9458m8484
$$ -48495 -97637 -58528 -31702 -139709 -131535 -86446 -100394 -75752 -73962 -60750 -100208 -148692
7440a48692j7710M8653Q6390J3426j8087m5361J0489J0748j4364K8240k3511j5844
$$ -148692 -166402 -117749 -31359 -17933 -36020 -81381 -70892 -60144 -74508 -46268 -69779 -85623
7428h5623k1855J1414o755K0286K5662m3359J6982K5196j8083j6082N069L6584
$$ -85623 -107478 -96064 -102819 -82533 -56871 -100230 -83248 -58052 -76135 -92217 -87148 -50564
7416e0564M3959j8205K5298l7835j18371Q2656O535J8546j9408m8668K3266K2205
$$ -50564 -6605 -24810 488 -37347 -155718 -73062 -66527 -47981 -67389 -116057 -92791 -70586
7404g0586r763l811O3477k8210n3818O7429l8636L9706l7757p1395L4633M8065
$$ -70586 -80349 -84160 -20683 -48893 -102711 -35282 -73918 -34212 -71969 -143364 -108731 -60666
7392f0666j2934p2438K0583M4365O2180j088j2772l4033N2602j9468l2753k4064
$$ -60666 -73600 -146038 -125455 -81090 -18910 -19998 -32770 -66803 -14201 -33669 -66422 -90486
7380i0486r75n1734j0751K5695k053L4003j448O3124k131l4169L6066K4185O7360
$$ -90486 -91461 -143195 -153946 -128251 -130304 -96301 -97749 -34625 -36756 -70925 -34859 -10674 56686
7367E6686l7732m3565O623K7165p9241K9198j194n3897N1951L263l187K8812m0727
$$ 56686 18954 -24611 -17988 9177 -70064 -40866 -42060 -95957 -44006 -40743 -43930 -15118 -55845
7354e5845k1044j4763L3773J0246k0104L9835K9935O0178l5875j621n2004J0300
$$ -55845 -76889 -91652 -57879 -47633 -67737 -27902 2033 62211 26336 24715 -27289 -16989
7342a6989M081k4747L6603k9337J330K6563J134J9466J9601k7353N1350Q642l1795
$$ -16989 -12908 -37655 -1052 -30389 -29059 -2496 -1362 18104 37705 10352 61702 70344 38549
7329C8549L6705k7431M4262L175l4718L1403j1150m1927m6138L2487n1249j5841
$$ 38549 75254 47823 92085 95260 60542 91945 80795 38868 -7270 25217 -26032 -41873
7317d1873M4709m2410j4969j3196L9952k7051m7921N8691K0560l9780n7588K6741
$$ -41873 2836 -39574 -54543 -67739 -27787 -54838 -102759 -44068 -23508 -63288 -120876 -94135
7305i4135K7445L2159m09j209K3575k1819M0466j773p8152J2938K5900M5244n0072
$$ -94135 -66690 -34531 -34940 -36149 -12574 -34393 6073 4300 -73852 -60914 -35014 10230 -39842
7292c9842m2566J2096K8513j6726l5680O1849k5211l8915k4016N9611p669j4968
$$ -39842 -82408 -70312 -41799 -58525 -94205 -32356 -57567 -96482 -120498 -60887 -68556 -83524
7280h3524K5537r157l518K312k1921k3240N636R695J8502N561j0096j0613M5250
$$ -83524 -57987 -67144 -70662 -68350 -90271 -113511 -107875 -98180 -79678 -74117 -84213 -94826 -49576
7267d9576M054k6038k610o972K5999k088N1960m7523k6145M0340k7920J6773m3915
$$ -49576 -45522 -71560 -74170 -81142 -55143 -57231 -5271 -52794 -78939 -38599 -66519 -49746 -93661
7254i3661p544J5846m3009L2532L2742J9961j8392R61M7416l3697k9985k0053
$$ -93661 -101205 -85359 -128368 -95836 -63094 -43133 -61525 -60564 -13148 -46845 -76830 -96883
7242i6883r776j1172L3435n932J3912l0720J2289J1702l5448k434L9014k3253
$$ -96883 -106659 -117831 -84396 -90328 -76416 -107136 -94847 -83145 -118593 -121027 -82013 -105266
7230a05266R1484l6673n7410J1333j9788R499J4051m8550J5275M24J9120L0174
$$ -105266 -13782 -50455 -107865 -96532 -116320 -106821 -92770 -141320 -126045 -125621 -106501 -76327
7218g6327O987J9532k1059J4634J4942l6775m3686N9576L7036n3761l6825Q3401
$$ -76327 -69340 -49808 -70867 -56233 -41291 -78066 -121752 -62176 -25140 -78901 -115726 -32325
7206c2325J8061j6235j5135M1849o9456J0536Q553k0921l8089N8344M3284p6701
$$ -32325 -14264 -30499 -45634 -3785 -73241 -62705 -54152 -75073 -113162 -54818 -11534 -88235
7194h8235Q595Q869O637N3090L1267j1840k5786M0143m585j6608m8684M380k8339
$$ -88235 -79640 -70771 -64134 -11044 20223 8383 -17403 22740 18155 1547 -47137 -42757 -71096
7181g1096j551m6410M7351J3741N320O3311k8117l8219j7840O550j3556l4740
$$ -71096 -72647 -119057 -71706 -57965 -52645 10666 -17451 -55670 -73510 -66960 -80516 -115256
7169a15256r335J4742M2505P038l0147K0891O7277Q967K7100O988j14498j8211
$$ -115256 -124591 -109849 -67344 -60306 -90453 -69562 -2285 6682 33782 40770 -73728 -91939
7157i1939j3059N1255j3783l5607J3106p359J443k3215K8633Q062j411K6975o2279
$$ -91939 -104998 -53743 -67526 -103133 -90027 -97386 -95943 -119158 -90525 -82463 -83874 -56899 -119178
7144a19178J9063J1896l0920J3122j9946k331k645N4560Q1431k130o1773L801
$$ -119178 -100115 -88219 -119139 -106017 -125963 -128294 -130939 -76379 5052 2922 -58851 -55050
7132e5050o1060j7834N6942L1849m723k8343m632J6016k4802m3210P7755O166
$$ -55050 -116110 -133944 -77002 -45153 -49876 -78219 -82851 -66835 -91637 -134847 -57092 -50926
7120e0926k3930k7957K9704J2696j7342L6711q01m4131k0668J04301P529m7628
$$ -50926 -74856 -102813 -73109 -60413 -77755 -41044 -41845 -85976 -106644 -2343 5186 -42442
7108d2442K9274j1083o3551J718L8886J2246j4963j6416k2233l2062O3291O289
$$ -42442 -13168 -24251 -87802 -86084 -47198 -34952 -49915 -66331 -88564 -120626 -57335 -51046
7096e1046l1433L6129m1722m4498J6847K2257O6473j4516n1174J0682k3618M3103
$$ -51046 -82479 -46350 -88072 -132570 -115723 -93466 -26993 -41509 -92683 -82001 -105619 -62516
7084f2516K5574L7566L4465r3892j635L6849L1219J1775m157k2550k283k1947
$$ -62516 -36942 624 35089 -58803 -60438 -23589 7630 19405 15248 -7302 -9585 -31532
7072c1532K8876j4835m6975K7700M0989p7269o997O1969L0632j4098p8249L5980
$$ -31532 -2656 -17491 -64466 -36766 4223 -73046 -80043 -18074 12558 -1540 -79789 -43809
7060d3809P0337L4709M6309j61936k7260M715j3292r635j2327N9129j5587k7370
$$ -43809 26528 61237 107546 -54390 -81650 -76935 -90227 -99862 -112189 -53060 -68647 -96017
7048i6017P6823j7291n0207k3377J161L3742R8177M9882r1574p6475L5611k159
$$ -96017 -19194 -36485 -86692 -110069 -108908 -75166 23011 72893 -18681 -95156 -59545 -61704
7036f1704J8847L7221j6853K1645L3653o8178k1180L5571j4108K3073j8244K536
$$ -61704 -42857 -5636 -22489 -844 32809 -35369 -56549 -20978 -35086 -12013 -30257 -27721
7024b7721r0890J2659N3468j5124K0184j2556L5728k2704j2393l3315L6172j6481
$$ -27721 -118611 -105952 -52484 -67608 -47424 -59980 -24252 -46956 -59349 -92664 -56492 -72973
7012g2973K5183M5951k3562J4162n5904K7969k5402K5522L6109k4095o593k0313
$$ -72973 -47790 -1839 -25401 -11239 -67143 -39174 -64576 -39054 -2945 -27040 -33633 -53946
7000e3946m0277N8036K9818J9587n0730L4334p0357n5635M7363J05729L6406k3246
$$ -53946 -94223 -36187 -6369 13218 -37512 -3178 -73535 -129170 -81807 23922 60328 37082
6988C7082O931l6272k9152Q746L2810k462o426L0927j8976l3739n2185l0634J6886
$$ 37082 44013 7741 -21411 -12665 20145 17683 11257 42184 23208 -10531 -62716 -93350 -76464
6975g6464L493J0220j9611Q538Q7247k2583m2057l2351L6102M054M3577J4029
$$ -76464 -72971 -62751 -82362 -73824 13423 -9160 -51217 -83568 -47466 -43412 165 14194
6963A4194l9579j2580L4185k3506j3553M2790l653k0423k8783J8851L8138m581
$$ 14194 -25385 -37965 -3780 -27286 -40839 1951 -1702 -22125 -50908 -32057 6081 1500
6951A500p2136l9228O6235j696q822J2699l7631k5198K5116O7090l8008o97k4529
$$ 1500 -70636 -109864 -43629 -45325 -54147 -41448 -79079 -104277 -79161 -12071 -50079 -50776 -75305
6938g5305K2058K132K226m6432j3347J10780K744M264l4967o4615M1607N441o1959
$$ -75305 -53247 -51115 -48889 -95321 -108668 2112 4856 9120 -25847 -90462 -48855 -43414 -105373
6925a05373r569K1710q557J6107j7006l0071Q0250l7751j4761L6379L8800K5282
$$ -105373 -114942 -93232 -101789 -85682 -102688 -132759 -52509 -90260 -105021 -68642 -29842 -4560
6913d560n0378L5810K0823J0881j2671J4477K1311Q677j3015k7821l525p8043
$$ -4560 -54938 -19128 1695 12576 -95 14382 35693 44370 31355 3534 9 -78034
6901g8034m6687J8708P4180r807j6285p751J5916N2638o1901Q559L7336p178j7596
$$ -78034 -124721 -106013 -31833 -41640 -57925 -65676 -49760 2878 -59023 -50464 -13128 -20306 -37902
6888c7902k721L5069q1718Q2074j7788k7427R2173k500o9992l1501O801o2231
$$ -37902 -40623 -5554 -87272 -5198 -22986 -50413 41760 39260 -30732 -62233 -55432 -117663
6876a17663Q7055Q596m4888j879J10587m1460o0583j1154L3993j9694J2071R4862
$$ -117663 -30608 -22012 -66900 -68779 41808 348 -60235 -71389 -37396 -57090 -45019 49843
6864D9843R661m5961n6293J7506j1161k0829j2245j803M3854R896M655m3827J8438
$$ 49843 59504 13543 -42750 -25244 -36405 -57234 -69479 -71282 -27428 -17532 -12877 -56704 -38266
6851c8266m7048L3654N690o511j3893J4843l9698j6923J5070p321K2938L4920
$$ -38266 -85314 -51660 -45970 -52481 -66374 -51531 -91229 -108152 -93082 -100403 -77465 -42545
6839d2545L044j2260N8803J0116l3937o207K1491J0904m8624l6607k179k9042
$$ -42545 -39501 -51761 7042 17158 -16779 -22986 -1495 9409 -39215 -75822 -78001 -107043
6827a07043L6667k3397J5020M6995l1297p327k1603L2139j4461O7616n626m0587
$$ -107043 -70376 -93773 -78753 -31758 -63055 -70382 -91985 -59846 -74307 -6691 -12317 -52904
6815e2904k2436J469k30m7532l8882L6780Q4785j5616j7447J4170P9582j104q2745
$$ -52904 -75340 -73871 -74101 -121633 -160515 -123735 -38950 -54566 -72013 -57843 21739 20635 -62110
6802f2110p864J3722l4362l7262M7275L1829l9643J385K2967K7843l3558N4529
$$ -62110 -69974 -56252 -90614 -127876 -80601 -48772 -88415 -87030 -64063 -36220 -69778 -15249
6790a5249o1522N5984J5862m4047p260L0160K9590m6380J0543o3662N1695P3349
$$ -15249 -76771 -20787 -4925 -48972 -56232 -26072 3518 -42862 -32319 -95981 -44286 29063
6778B9063o2033l8011J1262R6462j6754l1033l4699k1121J3566l3827j9245M6166
$$ 29063 -32970 -70981 -59719 36743 19989 -11044 -45743 -66864 -53298 -87125 -106370 -60204
6766f0204k2579J1409N9686P2749j7488k8171k5425o5114K8003l7416O2704K1858
$$ -60204 -82783 -71374 -11688 61061 43573 15402 -10023 -75137 -47134 -84550 -21846 12
6754A2l6396k0264m357m522k253M3647L1676r178o7861j2220L6001K3081o1923
$$ 12 -36384 -56648 -61005 -65527 -67780 -24133 7543 -1635 -69496 -81716 -45715 -22634 -84557
6741h4557L5774j448r84N3415L0877m5456q1014K8715L4313m1437O1690n7083
$$ -84557 -48783 -50231 -51215 2200 33077 -12379 -93393 -64678 -30365 -71802 -10112 -67195
6729f7195m5519P296K6738N2137J5127l4627N4660K1697k652l172q822o146J1724
$$ -67195 -112714 -105418 -78680 -26543 -11416 -46043 8617 30314 27662 24490 15668 9522 21246
6716B1246p1608m2599r15J5043K954J7631M2044J7262n9470O7966l5694k8823
$$ 21246 -50362 -92961 -93876 -78833 -75879 -58248 -16204 1058 -58412 9554 -26140 -54963
6704e4963K6287p1938K6678O4648o2676L5481P2210m4851m5731K2588j661J4026
$$ -54963 -28676 -100614 -73936 -9288 -71964 -36483 35727 -9124 -54855 -32267 -33928 -19902
6692a9902M4816m2495M4845r7590r303J7493O2945M9119J191J4414k1407l9767
$$ -19902 24914 -17581 27264 -70326 -79629 -62136 809 49928 51119 65533 44126 4359
6680D359M1673k2579k171l6128L9146M7470J1030l9891k7534R188J1873q0519
$$ 4359 46032 23453 21282 -14846 24300 71770 82800 42909 15375 24563 36436 -44083
6668d4083j4588j3018Q560J1801J6130l1170K1632n1901k8589L4042R2635k7292
$$ -44083 -58671 -71689 -63129 -51328 -35198 -66368 -44736 -96637 -125226 -91184 1451 -25841
6656b5841j9573M5569M22j9250M8094o8052l9929J9021k4628l1561Q4100K9887
$$ -25841 -45414 155 577 -18673 29421 -38631 -78560 -59539 -84167 -115728 -31628 -1741
6644a741J671m2580M8751L617l6664l6088n2222O3350N7455O6385k8131m4126
$$ -1741 -70 -42650 6101 9718 -26946 -63034 -115256 -51906 5549 71934 43803 -323
6632c23m9592K8066l092K5222R166m0225L7665K9649J4489j25603k7266Q2301
$$ -323 -49915 -21849 -24941 281 9447 -30778 6887 36536 51025 -74578 -101844 -19543
6620a9543J910k6333J0956J3242k3155M8238O753N6349q3026J9243m5676k2023
$$ -19543 -17633 -43966 -33010 -19768 -42923 5315 12068 68417 -14609 4634 -41042 -63065
6608f3065L6481O4295o5558k2257J6827R409J9594m2196K108k5236p695k8624
$$ -63065 -26584 37711 -27847 -50104 -33277 -23868 -4274 -46470 -44362 -69598 -77293 -105917
6596a05917K6807N4677M1420k8464m0353L4871m533m78l650j4167J5885j667K6469
$$ -105917 -79110 -24433 16987 -11477 -51830 -16959 -21492 -21970 -25620 -39787 -23902 -25569 900
6583I00N2632l2229l6366J9143k741m3042J16736K547R409k0234k034q92o014
$$ 900 53532 21303 -15063 4080 1339 -41703 75033 77580 86989 66755 64721 63829 57815
6570E7815P858r4272K6803j5837k5690K0233K8809O5059l7747j7498r182L7461
$$ 57815 65673 -28599 -1796 -17633 -43323 -23090 5719 70778 33031 15533 6351 43812
6558D3812m3275j6778N0106l2470j1264L768J284j1806N6588j7500j3085N9017
$$ 43812 537 -16241 33865 1395 -9869 -6101 -4817 -16623 39965 22465 9380 68397
6546F8397m809l0220k5322o0491L1956O9612n1946k7041m929K3987j4111K6703
$$ 68397 63588 33368 8046 -52445 -20489 49123 -2823 -29864 -34793 -10806 -24917 1786
6534A786N8803n1969m6094L0337J6365N1395m0985K343K1255j9574p795J5357
$$ 1786 60589 8620 -37474 -7137 9228 60623 19638 21981 43236 23662 15867 31224
6522C1224o2238l5067P0486j2863K9711j5405k5110J2348l3858N7179J9179k0423
$$ 31224 -31014 -66081 4405 -8458 21253 5848 -19262 -6914 -40772 16407 35586 15163
6510A5163L7651j6160K1318L616j3358j4093l8466q262J1736P1964M2885o6984
$$ 15163 52814 36654 57972 61588 48230 34137 -4329 -12591 -855 71109 113994 47010
6498D7010k7371M76j5998p305O7032o8638p1580L9032n194N7412L2690n8916m6819
$$ 47010 19639 20115 4117 -3188 63844 -4794 -76374 -37342 -42536 14876 47566 -11350 -58169
6485e8169N1714J9415N618l2649Q288K5551Q289K2558k9531L7456j1690L774n2174
$$ -58169 -6455 12960 18578 -14071 -5783 19768 28057 50615 21084 58540 46850 50624 -1550
6472a550j1726n9627k5510N5721J03669P8530r2054q0517J03350o6205N4393l3519
$$ -1550 -13276 -72903 -98413 -42692 60977 139507 47453 -33064 70286 4081 58474 24955
6460B4955l9939O0360m7403o45L2071L0568J9817J628n5416k5460J927k6198j5200
$$ 24955 -14984 45376 -2027 -2672 29399 59967 79784 81412 25996 536 2463 -23735 -38935
6447c8935K9189O7004M2136Q652M557k9808p3696j1043o763L8724o787o4J6402
$$ -38935 -9746 57258 99394 108046 112603 82795 9099 -1944 -8707 30017 23230 23166 39568
6434C9568J6698j6368k6542O2080o292k1311k1223K2944m0844P5068j2331k588
$$ 39568 56266 39898 13356 75436 69144 47833 26610 49554 8710 83778 71447 68859
6422F8859J3003l8641m6526N6246L3765J2562J7029j4152J5643j9029m3345j9049
$$ 68859 81862 43221 -3305 52941 86706 99268 116297 102145 117788 98759 55414 36365
6410C6365k58K0323Q1801o0087J989K7415n699J9485m5159M775Q3413k6281k01
$$ 36365 36107 56430 138231 78144 80133 107548 101849 121334 76175 80950 164363 138082 137881
6397A37881J30l1152j0684K7781l0167K0452o2331l52K0538n3550P6155P996j8431
$$ 137881 138011 106859 96175 123956 93789 114241 51910 51558 72096 18546 94701 102697 84266
6384H4266j1508n3013m4796Q8831l206M8457K9053p2224l4655N069N8711N0906
$$ 84266 72758 19745 -25051 63780 60574 109031 138084 65860 31205 36274 94985 145891
$$ [...]
##END NTUPLES=NMR SPECTRUM
##END=
