##TITLE=1H_CA-9208-6
 CDCl3
 8 sc, 
 1.11.2023
##JCAMPDX= 6.0         $$ Bruker NMR JCAMP-DX V2.0
##DATA TYPE= NMR SPECTRUM
##DATA CLASS= NTUPLES
##ORIGIN= UXNMR, Bruker Analytische Messtechnik GmbH
##OWNER= root
$$ XWIN-NMR		Version 3.5
$$ Wed Nov  1 13:59:36 2023 Russian Standard Time (UT+4h)  she@DPX200
##.OBSERVE FREQUENCY= 200.13135
##.OBSERVE NUCLEUS= ^1H
##.ACQUISITION MODE= SIMULTANEOUS
##.ACQUISITION SCHEME= undefined
##.AVERAGES= 8
##.DIGITISER RES= 18
##SPECTROMETER/DATA SYSTEM= spect
##.PULSE SEQUENCE= zg30
##.SOLVENT NAME= DMSO
##.SHIFT REFERENCE= (INTERNAL, DMSO, 0, 15.7403)
##AUDIT TRAIL= $$ (NUMBER, WHEN, WHO, WHERE, WHAT)
$$ ##TITLE= Audit trail, XWIN-NMR		Version 3.5
$$ ##JCAMPDX= 5.01
$$ ##ORIGIN= Bruker BioSpin GmbH
$$ ##OWNER= she
$$ F:/spectra/data/she/nmr/H-F/1/pdata/1/auditp.txt
$$ ##AUDIT TRAIL=  $$ (NUMBER, WHEN, WHO, WHERE, WHAT)
(   1,<2023-11-01 13:58:19.01 +0400>,<she>,<DPX200>,
      <created by zg, POWCHK disabled, PULCHK disabled
       configuration hash MD5:
       00 E9 B6 7A A2 85 ED C7 34 08 36 98 17 FE 4E 26
       data hash MD5: 16K
       99 06 A5 90 90 8E 22 9C 61 69 3D 8C C1 1A 50 AA>)
(   2,<2023-11-01 13:58:22.20 +0400>,<she>,<DPX200>,
      <Start of raw data processing
       efp BC_mod = 2 LB = 0.24 FT_mod = 6 PKNL = 1 PHC0 = -23871.09 PHC1 = 8.452708 SI = 16K 
       data hash MD5: 16K
       43 09 EB 09 5F 14 F5 B4 F6 9B 1D 38 E8 AE 5E EA>)
(   3,<2023-11-01 13:58:48.43 +0400>,<she>,<DPX200>,
      <pk PHC0 = 3.52994 PHC1 = -6.199999 
       data hash MD5: 16K
       86 AB 89 7B CF CC 80 F2 D4 C4 7D C9 AB 20 64 55>)
(   4,<2023-11-01 13:58:52.28 +0400>,<she>,<DPX200>,
      <abs ABSG = 5 
       data hash MD5: 16K
       B4 BB 47 52 4A F3 8F 9B BC 3B E9 08 AF AF 6B 38>)
$$ ##END=
$$ 
$$ hash MD5
$$ A7 CB 10 85 2C 9A CC 0F 7A A6 F5 00 29 C0 D7 50
##$RELAX= 
##$RELAX= 
##$RELAX= 
##$RELAX= 
##$RELAX= 
##$RELAX= 
$$ Bruker specific parameters
$$ --------------------------
##$DU= <F:/spectra>
##$EXPNO= 1
##$NAME= <H-F>
##$PROCNO= 1
##$TYPE= <nmr>
##$USER= <she>
##$AMP= (0..31)
100 100 100 100 100 100 100 100 100 100 100 100 100 100 100 100 100 100 
100 100 100 100 100 100 100 100 100 100 100 100 100 100 
##$AQSEQ= 0
##$AQ_mod= 1
##$AUNM= <au_zg>
##$AUTOPOS= <>
##$BF1= 200.13
##$BF2= 200.13
##$BF3= 200.13
##$BF4= 200.13
##$BF5= 200.13
##$BF6= 200.13
##$BF7= 200.13
##$BF8= 200.13
##$BYTORDA= 1
##$CFDGTYP= 0
##$CFRGTYP= 5
##$CHEMSTR= <none>
##$CNST= (0..31)
1 1 145 1 1 1 1 1 1 1 1 1 1 1 1 1 1 1 1 1 1 1 1 1 1 1 1 1 1 1 1 1 
##$CPDPRG= <>
##$CPDPRG1= <>
##$CPDPRG2= <>
##$CPDPRG3= <>
##$CPDPRG4= <mlev>
##$CPDPRG5= <mlev>
##$CPDPRG6= <mlev>
##$CPDPRG7= <mlev>
##$CPDPRG8= <mlev>
##$CPDPRGB= <>
##$CPDPRGT= <>
##$D= (0..31)
0 1.2 0 0 0 0 0 0 0 0.06 0 0.03 0 0 0 0 0.0002 0 0 0 0 0 0 0 0 0 0 0 0 
0 0 0 
##$DATE= 1698832698
##$DBL= (0..7)
120 120 120 120 120 120 120 120 
##$DBP= (0..7)
150 150 150 150 150 150 150 150 
##$DBP07= 0
##$DBPNAM0= <>
##$DBPNAM1= <>
##$DBPNAM2= <>
##$DBPNAM3= <>
##$DBPNAM4= <>
$$ [...]
##$SUBNAM3= <"">
##$SUBNAM4= <"">
##$SUBNAM5= <"">
##$SUBNAM6= <"">
##$SUBNAM7= <"">
##$SUBNAM8= <"">
##$SUBNAM9= <"">
##$SW= 18.05172834244
##$SWIBOX= (0..15)
0 0 2 0 0 0 0 0 0 0 0 0 0 0 0 0 
##$SW_h= 3612.71676300578
##$TD= 16384
##$TD0= 1
##$TE= 0
##$TE2= 300
##$TE3= 300
##$TEG= 300
##$TL= (0..7)
0 120 120 120 120 120 120 120 
##$TP= (0..7)
150 150 150 150 150 150 150 150 
##$TP07= 0
##$TPNAME0= <>
##$TPNAME1= <>
##$TPNAME2= <>
##$TPNAME3= <>
##$TPNAME4= <>
##$TPNAME5= <>
##$TPNAME6= <>
##$TPNAME7= <>
##$TPOAL= (0..7)
0.5 0.5 0.5 0.5 0.5 0.5 0.5 0.5 
##$TPOFFS= (0..7)
0 0 0 0 0 0 0 0 
##$TUNHIN= 0
##$TUNHOUT= 0
##$TUNXOUT= 0
##$USERA1= <user>
##$USERA2= <user>
##$USERA3= <user>
##$USERA4= <user>
##$USERA5= <user>
##$V9= 5
##$VALIST= <valist>
##$VCLIST= <CCCCCCCCCCCCCCC>
##$VD= 0
##$VDLIST= <DDDDDDDDDDDDDDD>
##$VPLIST= <PPPPPPPPPPPPPPP>
##$VTLIST= <TTTTTTTTTTTTTTT>
##$WBST= 1024
##$WBSW= 4
##$XGAIN= (0..3)
0 0 0 0 
##$XL= 0
##$YL= 0
##$YMAX_a= 159651
##$YMIN_a= -217948
##$ZGOPTNS= <>
##$ZL1= 120
##$ZL2= 120
##$ZL3= 120
##$ZL4= 120
##$ABSF1= 15.74028
##$ABSF2= -2.311569
##$ABSG= 5
##$ABSL= 3
##$ALPHA= 0
##$AQORDER= 0
##$ASSFAC= 0
##$ASSFACI= 0
##$ASSFACX= 0
##$ASSWID= 0
##$AUNMP= <proc_1d>
##$AZFE= 0.1
##$AZFW= 0.1
##$BCFW= 0
##$BC_mod= 2
##$BYTORDP= 0
##$COROFFS= 0
##$CY= -3
##$DATMOD= 1
##$DC= 0
##$DFILT= <>
##$DTYPP= 0
##$F1P= 0
##$F2P= 0
##$FCOR= 1
##$FTSIZE= 16384
##$FT_mod= 6
##$GAMMA= 0
##$GB= 0
##$INTBC= 1
##$INTSCL= 3.70164e-10
##$ISEN= 128
##$LB= 0.24
##$LEV0= 0
##$LPBIN= 0
##$MAXI= 10000
##$MC2= 0
##$MEAN= 0
##$ME_mod= 0
##$MI= 1.114404
##$NCOEF= 0
##$NC_proc= -9
##$NLEV= 6
##$NOISF1= 3.799351
##$NOISF2= 2.8
##$NSP= 0
##$NTH_PI= 0
##$NZP= 0
##$OFFSET= 15.74028
##$PC= 1
##$PHC0= -23867.56
##$PHC1= 2.252709
##$PH_mod= 1
##$PKNL= yes
##$PPARMOD= 0
##$PSCAL= 0
##$PSIGN= 0
##$REVERSE= no
##$SF= 200.130006255849
##$SI= 16384
##$SIGF1= 3
##$SIGF2= 2
##$SINO= 5.538805
##$SIOLD= 16384
##$SREGLST= <1H.CDCl3>
##$SSB= 0
##$STSI= 16384
##$STSR= 0
##$SW_p= 3612.71676300578
##$SYMM= 0
##$S_DEV= 0
##$TDeff= 16384
##$TDoff= 0
##$TI= <>
##$TILT= no
##$TM1= 0
##$TM2= 0
##$TOPLEV= 0
##$USERP1= <user>
##$USERP2= <user>
##$USERP3= <user>
##$USERP4= <user>
##$USERP5= <user>
##$WDW= 1
##$XDIM= 16384
##$YMAX_p= 416001506
##$YMIN_p= -2160977
$$ End of Bruker specific parameters
$$ ---------------------------------
##NTUPLES= NMR SPECTRUM
##VAR_NAME=  FREQUENCY,     SPECTRUM/REAL,   SPECTRUM/IMAG
##SYMBOL=    X,             R,               I
##VAR_TYPE=  INDEPENDENT,   DEPENDENT,       DEPENDENT
##VAR_FORM=  AFFN,          ASDF,            ASDF
##VAR_DIM=   16384,         16384,           16384
##UNITS=     HZ,            ARBITRARY UNITS, ARBITRARY UNITS
##FACTOR=    0.220516191357247, 1,           1
##FIRST=     3150.10236516193, 0,            0
##LAST=      -462.614397843849, 0,           0
##MIN=       -462.614397843849, -2160977,    0
##MAX=       3150.10236516193, 416001506,    0
$$ Real data points
##PAGE= N=1
##DATA TABLE= (X++(R..R)), XYDATA
$$ [...]
$$ plain form
6217 16560861 17602888 17441184 17433075 17512871 16923603 17274487 18388049 18457639 17833637 17863193
6207 17863193 18096688 18555547 18604817 18525322 19366712 19656442 19585857 19305699 18867445 18609044
6197 18609044 19376634 19574868 20693001 21564012 21334603 22418839 22186826 21688082 22993427
6188 22993427 22204244 21786218 23129015 24046911 24308384 24736879 25163249 25310953 25557546
6179 25557546 26749271 26887195 26841687 26545726 26181214 26317452 26284831 25725092 24916203 24041164
6169 24041164 22978877 22453975 22257863 22199916 21899209 21449911 21292080 21265240 20196058
6160 20196058 20166267 19693453 19240049 18821618 18582179 18409161 17855994 17973986 18467049 18830896
6150 18830896 18960114 18155361 18037674 18148447 17958220 17321611 17151925 17840457 18160234
$$ packed form
6217A6560861J042027j61704q109P9796n89268L50884J113562O9590o24002K9556
6207A7863193K33495M58859M9270p9495Q41390K89730p0585k80158m38254k58401
6197A8609044P67590J98234J118133Q71011k29409J084236k32013m98744J305345
6188B2993427p89183m18026J342797R17896K61473M28495M26370J47704K46593
6179B5557546J191725J37924m5508k95961l64512J36238l2621n59739q08889q75039
6169B4041164j062287n24902j96112n7947l00707m49298j57831k6840j069182
6160B0196058k9791m72814m53404m18431k39439j73018n53167J17992M93063L63847
6150A8830896J29218q04753j17687J10773j90227o36609j69686O88532L19777
$$ plain form
6141 18160234 18163640 17756514 17559603 17128964 17121084 17619197 17296361 17521719 17236240 16336768
6131 16336768 16711097 17332084 16991230 17358422 17522205 17165202 16547535 16436388 16385481 17031436
6121 17031436 17262868 17178983 17540925 17647796 16926705 16794186 17037878 16792900 16189608 16468421
6111 16468421 16624262 16631333 17216284 16334573 16691754 17072454 17369270 16984047 16674837 16177636
6101 16177636 15919772 17224492 17946769 18965854 18518556 18079397 17589004 17219142 17676759
6092 17676759 17767235 17478562 17156668 18026654 17675211 16672897 17416509 17545964 17540384 17514858
6082 17514858 17494507 17079928 17026128 17609841 17816177 18305436 17914020 18187665 18562275 17856946
6072 17856946 17994166 18100542 18038681 18176148 17842190 17956700 17106958 17257703 17488625 17053018
$$ packed form
6141A8160234L406m07126j96911m30639p880M98113l22836K25358k85479q99472
6131A6336768L74329O20987l40854L67192J63783l57003o17667j11147n0907O45955
6121A7031436K31432q3885L61942J06871p21091j32519K43692k44978o03292K78813
6111A6468421J55841P071N84951q81711L57181L80700K96816l85223l09210m97201
6101A6177636k57864J304720P22277J019085m47298m39159m90393l69862M57617
6092A7676759R0476k88673l21894Q69986l51443j002314P43612J29455n580k5526
6082A7514858k0351m14579n3800N83713K06336M89259l91416K73645L74610p05329
6072A7856946J37220J06376o1861J37467l33958J14510q49742J50745K30922m35607
$$ plain form
6062 17053018 16609483 16758029 17546015 18274351 18706856 19388964 19656373 19091190 18536640
6053 18536640 19337927 19009948 18353237 18470099 19089572 19417836 19494829 19195748 18793801 18835543
6043 18835543 18289993 18004334 18270876 18666380 18558111 18371249 18062740 18736357 18900182
6034 18900182 19197526 19681391 18704723 18757062 19437693 19271460 19861399 19589277 19201584 19077017
6024 19077017 19741178 19589404 19511988 19925863 19861638 19165228 18990548 19321453 19625362 19353691
6014 19353691 19529635 19964201 20043135 19278671 19397323 19080994 18251379 18718830 19371977 19269047
6004 19269047 19416468 19288566 19526211 20226234 19865843 20236635 20302808 20114444 19681013 20092559
5994 20092559 20147889 20014925 20027798 20080818 20643839 20949453 20250174 20255108 20724708 21344681
$$ packed form
6062A7053018m43535J48546P87986P28336M32505O82108K67409n65183n54550
6053A8536640Q01287l27979o56711J16862O19473L28264P6993k99081m01947M1742
6043A8835543n45550k85659K66542L95504j08269j86862l08509O73617J63825
6034A8900182K97344M83865r76668N2339O80631j66233N89939k72122l87693j24567
6024A9077017O64161j51774p7416M13875o4225o96410j74680L30905L03909k71671
6014A9353691J75944M34566P8934p64464J18652l16329q29615M67451O53147j02930
6004A9269047J47421j27902K37645P00023l60391L70792O6173j88364m33431M11546
5994B0092559N5330j32964J2873N3020N63021L05614o99279M934M69600O19973
$$ plain form
5984 21344681 20691344 20408832 20580787 20807775 21601179 21535329 21069447 21335973 20812089 21837577
5974 21837577 21864319 21294443 21795369 22027067 21997917 21842345 21140990 20921709 21792440 21935411
5964 21935411 21552232 21067714 21458494 22225455 22395613 22951610 23165971 22720995 22416878
5955 22416878 23386110 23174582 22331810 22384349 21824491 21715708 22754525 22972417 23149094
5946 23149094 22768110 22991926 23885368 23337338 23294781 23114394 23030925 24100998 24497329 23070978
5936 23070978 23281937 23961066 24215834 23633609 23617919 23373503 23044385 23812672 23656269 24209909
5926 24209909 25162779 24425129 24344930 25331770 25219039 24450005 24015863 24378958 24775281 25218424
5916 25218424 24388027 24342003 24176469 24227508 24779211 24400544 24797857 24211641 24960559 25274427
$$ packed form
5984B1344681o53337k82512J71955K26988P93404o5850m65882K66526n23884J025488
5974B1837577K6742n69876N00926K31698k9150j55572p01355k19281Q70731J42971
5964B1935411l83179m84518L90780P66961J70158N55997K14361m44976l04117
5955B2416878R69232k11528q42772N2539n59858j08783J038817K17892J76677
5946B3149094l80984K23816Q93442n48030m2557j80387q3469J070073L96331j426351
5936B3070978K10959O79129K54768n82225j5690k44416l29118P68287j56403N53640
5926B4209909R52870p37650q0199R86840j12731p69034m34142L63095L96323M43143
5916B5218424q30397m6024j65534N1039N51703l78667L97313n86216P48918L13868
$$ plain form
5906 25274427 24421644 24903258 24973112 24404886 24619840 24635467 25725924 25792549 25208982 25720802
5896 25720802 25613344 25745678 25862160 26183068 26208396 25357062 25408739 25721315 26400490 25629380
5886 25629380 25166179 25735591 26267176 26179754 25775801 25478706 25613279 25642677 26262272 26209650
5876 26209650 25967771 26366168 26621377 26742103 26142296 25984703 27083376 26750210 27126965
5867 27126965 26988789 27095809 26679813 26076303 26569688 27333301 27909779 27911257 27130907 27469887
5857 27469887 28095168 27203590 27670586 27385525 26824019 25949700 26151247 26631371 26766528
5848 26766528 26744547 27161726 26919225 27134568 27711788 27635698 27752076 27763749 27188228 27357637
5838 27357637 28654043 28819449 28436519 28068308 27731599 28676742 27939741 27898147 28943072
$$ packed form
5906B5274427q52783M81614O9854n68226K14954J5627J090457O6625n83567N11820
5896B5720802j07458J32334J16482L20908K5328q51334N1677L12576O79175p71110
5886B5629380m63201N69412N31585q7422m03953k97095J34573K9398O19595n2622
5876B6209650k41879L98397K55209J20726n99807j57593J098673l33166L76755
5867B7126965j38176J07020m15996o03510M93385P63613N76478J478p80350L38980
5857B7469887O25281q91578M66996k85061n61506q74319K01547M80124J35157
5848B6766528k1981M17179k42501K15343N77220p6090J16378J1673n75521J69409
5838B7357637J296406J65406l82930l68211l36709R45143p37001m1594J044925
$$ plain form
5829 28943072 28822705 29365726 29684758 29673933 29977676 29502859 29306605 29281722 30059342 30696098
5819 30696098 30464455 31003102 30796998 31032757 31679573 31269120 32021165 32323797 32273202 32078539
5809 32078539 32855715 32633608 33076462 33197570 33073082 33766383 34757684 34911639 35320956
5800 35320956 35522028 35501341 36836428 37625211 37766420 37411165 37664846 38326248 38138010
5791 38138010 38494423 38466471 38446384 39044608 40010107 40399369 40117084 41271390 42133599 42155352
5781 42155352 42102127 43168914 43889884 43933428 43609474 44443548 44871593 44985200 44619756 44711381
5771 44711381 44554697 44588933 44981942 44064184 44154448 45067845 44423343 44694257 44119550 43431529
5761 43431529 43353486 42861459 43096210 43081108 43090703 43588558 43343532 42978196 43858948 43973954
$$ packed form
5829B8943072j20367N43021L19032j0825L03743m74817j96254k4883P77620O36756
5819C0696098k31643N38647k06104K35759O46816m10453P52045L02632n0595j94663
5809C2078539P77176k22107M42854J21108j24488O93301R91301J53955M09317
5800C5320956K01072k0687J335087P88783J41209l55255K53681O61402j88238
5791C8138010L56413k7952k0087N98224R65499L89262k82285J154306Q62209K1753
5781D2155352n3225J066787P20970M3544l23954Q34074M28045J13607l65444R1625
5771D4711381j56684L4236L93009r17758R0264R13397o44502K70914n74707o88021
5761D3431529p8043m92027K34751j5102R595M97855k45026l65336Q80752J15006
$$ plain form
5751 43973954 43685040 43519698 43547060 42559099 42460972 42863525 42804725 43082694 43950321 43876753
5741 43876753 43690511 42704612 42116709 42871101 42385977 42726882 42619266 42406245 42327192 42904532
5731 42904532 43593730 43325993 43441287 43772716 43959050 43592111 43703523 43202437 43478458
5722 43478458 43164077 43000255 43792942 44517389 44984510 44829944 44985492 45380397 45108985
5713 45108985 44735222 45506990 44918888 44907610 45604789 46885927 46456010 46753604 46817926 46124642
5703 46124642 46614832 47041867 46003756 46359162 46455336 47078895 47777533 48606988 47224564
5694 47224564 47027498 48041968 47650304 47658587 47747597 48074934 48390410 48723524 48544048 48071529
5684 48071529 48134321 47751656 47620262 48148264 48691043 49702351 50020989 51645857 51373874
$$ packed form
5751D3973954k88914j65342K7362r87961r8127M02553n8800K77969Q67627p3568
5741D3876753j86242r85899n87903P54392m85124L40905j07616k13021p9053N77340
5731D2904532O89198k67737J15294L31429J86334l66939J11412n01086K76021
5722D3478458l14381j63822P92687P24447M67121j54566J55548L94905k71412
5713D5108985l73763P71768n88102j1278O97179J281138m29917K97594O4322o93284
5703D6124642M90190M27035j038111L55406R6174O23559O98638Q29455j382424
5694D7224564j97066J014470l91664Q283Q9010L27337L15476L33114j79476m72519
5684D8071529O2792l82665j31394N28002N42779J011308L18638J624868k71983
$$ plain form
5675 51373874 51514714 51737091 52422035 52147261 52425794 52988546 53631066 54266961 54398618
5666 54398618 54919235 55675844 56148128 56589399 57078598 58595171 59493296 60735773 61483759
5657 61483759 62844459 63208402 63712610 64624770 65056526 65483020 65754373 66114415 65829714
5648 65829714 66082897 65809597 65628840 66193855 65484764 65211671 65172673 65586892 65879949 66402031
5638 66402031 66562612 66571217 67421379 68115123 69065021 68955414 70230174 71207099 71775231 72207533
5628 72207533 73114592 73561636 73809014 74338888 74382248 73395642 73698443 72381245 71784518
5619 71784518 70526114 68343693 66719920 64607521 62490743 61785208 60743335 58455627
5611 58455627 57451443 56239840 55392560 54485432 53440065 53492807 52491723 50951161 51253016
$$ packed form
5675E1373874J40840K22377O84944k74774K78533N62752O42520O35895J31657
5666E4398618N20617P56609M72284M41271M89199J516573Q98125J242477P47986
5657F1483759J360700L63943N04208R12160M31756M26494K71353L60042k84701
5648F5829714K53183k73300j80757N65015p09091k73093l8998M14219K93057N22082
5638F6402031J60581Q605Q50162O93744R49898j09607J274760R76925N68132M32302
5628G2207533R07059M47044K47378N29874M3360r86606L02801j317198n96727
5619G1784518j258404k182421j623773k112399k116778p05535j041873k287708
5611E8455627j004184j211603q47280r07128j045367N2742j001084j540562L01855
$$ plain form
5602 51253016 50641222 50266125 49635886 49369010 49196530 48102051 47748751 47471987 47700746
5593 47700746 47964124 47548498 48108636 48001107 46727592 46017289 45646466 45448327 45587913
5584 45587913 45276709 45280349 46519641 46304577 45037808 45057842 45122364 44613206 45885511 45993839
5574 45993839 46968202 47143449 46290016 45061438 44794846 45037159 45889566 45275843 44883200
5565 44883200 44703855 44962375 45110684 44671711 44981432 44959199 44981390 43868021 44052023 44763681
5555 44763681 45014425 43247927 43135941 43634666 43347718 43094201 42522883 42046522 42104426
5546 42104426 41855944 41844784 41309836 41625516 42430106 42426041 41627342 41348598 41224691 41408948
5536 41408948 41135169 41217654 40866765 41061361 40944281 40786770 41171841 40895871 39987781 39829222
$$ packed form
5602E1253016o11794l75097o30239k66876j72480j094479l53300k76764K28759
5593D7700746K63378m15626N60138j07529j273515p10303l70823j98139J39586
5584D5587913l11204L640J239292k15064j266769K0034O4522n09158J272305J08328
5574D5993839R74363J75247q53433j228578k66592K42313Q52407o13723l92643
5565D4883200j79345K58520J48309m38973L09721k2233K2191j113369J84002P11658
5555D4763681K50744j766498j11986M98725k86948k53517n71318m76361N7904
5546D2104426k48482j1160n34948L15680Q04590m065p98699k78744j23907J84257
5536D1408948k73779Q2485l50889J94596j17080j57511L85071k75970r08090j58559
$$ plain form
5526 39829222 40077010 39680197 38765293 39459399 39365188 38834744 38828040 38350600 38470143 38209590
5516 38209590 37603926 37403971 37327725 38186685 37784489 37070344 38266587 38555735 38556785 38233028
5506 38233028 38470318 38508789 38564743 38415755 38234442 38234655 37766114 37355061 37915356 38392337
5496 38392337 38750501 39252570 39424184 39288383 39012333 39124941 40042523 40980633 41353781
5487 41353781 40678822 40455713 40279332 40054359 40904546 41866415 42485796 42111393 42219306
5478 42219306 43985166 45593003 45808981 45988497 46593996 47841749 47133612 46716783 46153582
5469 46153582 45121675 44503597 44584292 44288603 43539954 43919017 44090918 44139869 43488752 43115692
5459 43115692 43658593 44656586 44018726 43639549 44209679 44633333 45411110 46162743 46644951
$$ packed form
5526C9829222K47788l96813r14904O94106r4211n30444o704m77440J19543k60553
5516C8209590o05664j99955p6246Q58960m02196p14145J196243K89148J050l23757
5506C8233028K37290L8471N5954j48988j81313K13m68541m11053N60295M76981
5496C8392337L58164N02069J71614j35801k76050J12608R17582R38110L73148
5487D1353781o74959k23109j76381k24973Q50187R61869O19381l74403J07913
5478D2219306J765860J607837K15978J79516O05499J247753p08137m16829n63201
5469D6153582j031907o18078Q0695k95689p48649L79063J71901M8951o51117l73060
5459D3115692N42901R97993o37860l79177N70130M23654P77777P51633M82208
$$ plain form
5450 46644951 47804701 48529905 49325420 50263099 52018931 52973993 54259674 55893604 56454720
5441 56454720 56913006 57313025 57517962 56718840 56215729 56745031 57013681 56666826 55705702
5432 55705702 56104673 56303415 57188654 57082368 58287947 58733396 59823751 59835072 60539567
5423 60539567 61975631 62793851 64439651 65680135 67098096 67805994 69753222 71162418
5415 71162418 71679974 74152512 76665044 78372301 79280606 81197378 82532161 82593635 83440075
5406 83440075 84287970 85214234 85548340 86168689 87683396 89913127 90657473 91785501 92865797
5397 92865797 94091311 95442043 96380966 96629402 97041777 96121260 95736000 95084769 92427725
5388 92427725 91318347 90159945 87792364 85987686 84410582 83498360 82010006 80186573
$$ packed form
5450D6644951J159750P25204P95515R37679J755832R55062J285681J633930N61116
5441E6454720M58286M00019K04937p99122n03111N29302K68650l46855r61124
5432E5705702L98971J98742Q85239j06286J205579M45449J090355J1321P04495
5423F0539567J436064Q18220J645800J240484J417961P07898J947228J409196
5415G1162418N17556K472538K512532J707257R08305J916772J334783O1474Q46440
5406H3440075Q47895R26264L34106O20349J514707K229731P44346J128028J080296
5397I2865797J225514J350732R38923K48436M12375r20517l85260o51231k657044
5388I2427725j109378j158402k367581j804678j577104r12222j488354j823433
$$ plain form
5380 80186573 79636784 78677057 77489859 76401602 74998837 75329613 75096329 75116958 74664351
5371 74664351 74910081 75058840 74819255 74970084 76141064 76651251 77169476 77654764 78571784
5362 78571784 79839207 81392956 83144792 84745029 86765307 87792052 89163105 90337870
5354 90337870 92935974 94332353 95216509 96937109 98139934 99688944 100337964 100659195 101888881
5345 101888881 102686504 102737124 101668811 99958323 98807709 97570744 96614427 95245528 93979774
5336 93979774 91893346 90920930 89867512 88023116 85523940 84373725 82352732 80563652
5328 80563652 78704676 77369484 76003769 73808982 72946790 72189683 70390297 68704527
5320 68704527 68483691 66423205 64646675 64317293 64048596 63013627 61845055 61353783 61225839
$$ packed form
5380H0186573n49789r59727j187198j088257j402765L30776k33284K0629m52607
5371G4664351K45730J48759k39585J50829J170980N10187N18225M85288R17020
5362G8571784J267423J553749J751836J600237K020278J026745J371053J174765
5354I0337870K598104J396379Q84156J720600J202825J549010O49020L21231J229686
5345A01888881P97623N0620j068313j710488j150614j236965r56317j368899j265754
5336I3979774k086428r72416j053418j844396k499176j150215k020993j789080
5328H0563652j858976j335192j365715k194787q62192p57107j799386j685770
5320F8704527k20836k060486j776530l29382k68697j034969j168572m91272j27944
$$ plain form
5311 61225839 60834363 59562151 58280288 57850640 57373496 57777344 56468166 55307862 54825934
5302 54825934 54925401 54515309 52832238 52091521 51669558 51027901 49933029 50488838 50096746
5293 50096746 49243426 49029701 47611555 47535902 47924622 48047658 47339966 47591424 46653743
5284 46653743 46648040 46489899 46635666 46464186 47011720 48632063 49074365 50175145 50864956
5275 50864956 52039349 53379670 52106478 50012962 48553892 47337165 46324771 45817929
5267 45817929 45270033 44243455 43553108 42944460 43929975 43485067 42827510 42115653 40839011
5258 40839011 41596627 42017646 41428190 41395434 41084689 40608642 40318580 40078958 40194310 40366864
5248 40366864 39281480 39330656 39156530 39257916 38838433 39139848 40189725 39228572 39587170
$$ packed form
5311F1225839l91476j272212j281863m29648m77144M03848j309178j160304m81928
5302E4825934R9467m10092j683071p40717m21963o41657j094872N55809l92092
5293E0096746q53320k13725j418146p5653L88720J23036p07692K51458r37681
5284D6653743n703j58141J45767j71480N47534J620343M42302J100780O89811
5275E0864956J174393J340321j273192k093516j459070j216727j012394n06842
5267D5817929n47896j026578o90347o08648R85515m44908o57557p11857j276642
5258D0839011P57616M21019n89456l2756l10745m76047k90062k39622J15352J72554
5248D0366864j085384M9176j74126J01386m19483L01415J049877r61153L58598
$$ plain form
5239 39587170 40298785 41277682 41651043 42793084 44910233 47603189 49657726 50847974 51247493
5230 51247493 49892895 47096709 45019682 42364465 41252931 39638257 38497577 37948998
5222 37948998 36853768 36015138 35228640 35856263 35739645 34351144 33340076 33315510 33616909
5213 33616909 34092593 34136453 33332195 33188897 33977933 33424645 33361191 33587267 32621438 32292546
5203 32292546 32253938 32062295 31910918 31632349 31492361 30973640 31654139 31966075 32074382 32369807
5193 32369807 32182570 31755185 32497325 32505508 32525972 32774356 32130937 33100181 33455818 33688539
5183 33688539 34291957 34065508 35481684 36730213 36557174 37456087 37124036 37262399 38160372
5174 38160372 38911633 39678595 39235558 38399473 37746253 37363035 37455631 37262226 36035147
$$ packed form
5239C9587170P11615R78897L73361J142041K117149K692956K054537J190248L99519
5230E1247493j354598k796186k077027k655217j111534j614674j140680n48579
5222C7948998j095230q38630p86498O27623j16618j388501j011068k4566L01399
5213C3616909M75684M3860q04258j43298P89036n53288o3454K26076r65829l28892
5203C2292546l8608j91643j51377k78569j39988n18721O80499L11936J08307K95425
5193C2369807j87237m27385P42140Q183K0464K48384o43419R69244L55637K32721
5183C3688539O03418k26449J416176J248529j73039Q98913l32051J38363Q97973
5174C8160372P51261P66962m43037q36085o53220l83218R2596j93405j227079
$$ plain form
5165 36035147 34978090 34791664 34314663 33666071 33703432 32774260 33351418 33148907 31689759
5156 31689759 30530561 31018790 31359422 31395995 30850570 31256664 30769718 31066549 31014949 31068169
5146 31068169 30942426 29515018 29992157 30819077 31487872 30804924 30755154 30403260 30857099
5137 30857099 30518068 31166483 31147608 30996048 31576106 31191709 30811225 30694380 31454305 30479443
5127 30479443 31087705 30995109 30575646 30299933 30871206 30857983 30752549 31013568 30671754 29972527
5117 29972527 29830205 29418696 29637338 30774268 30098116 29970237 30480182 31356398 31812019
5108 31812019 31382874 32293042 33028243 33696490 34475963 34391934 34626946 33942684 34306073 33550294
5098 33550294 33132845 32626142 33626362 34308859 33681483 33224755 33755107 33672424 33544963
$$ packed form
5165C6035147j057057j86426m77001o48592L7361r29172N77158k02511j459148
5156C1689759j159198M88229L40632L6573n45425M06094m86946K96831n1600N3220
5146C1068169j25743j427408M77139Q26920O68795o82948m9770l51894M53839
5137C0857099l39031O48415j8875j51560N80058l84397l80484j16845P59925r74862
5127C0479443O08262r2596m19463k75713N71273j3223j05434K61019l41814o99227
5117B9972527j42322m11509K18642J136930o76152j27879N09945Q76216M55621
5108C1812019m29145R10168P35201O68247P79473q4029K35012o84262L63389p55779
5098C3550294m17449n06703J000220O82497o27376m56728N30352q2683j27461
$$ plain form
5089 33544963 32906017 32274610 31743862 31592774 31986167 31625441 30937288 29993706 30563386
5080 30563386 31032534 30611173 31306955 31516743 31712189 32029103 32688161 32832052 33314539
5071 33314539 33214312 33490503 33673109 33345304 33419111 33026808 33414025 32763674 32140367 32188198
5061 32188198 31886756 31633249 31881342 31275386 31415841 30774013 30369084 29537684 29347903
5052 29347903 29095250 28687796 28703485 28979490 29273534 29193310 29155795 29747575 30015008 30221051
5042 30221051 29812091 30180189 30248061 30528969 30877236 30693094 30546645 30381341 30781225 31839723
5032 31839723 32216720 32743930 33294178 33132627 33893015 35312496 36486811 36974407 38206625
5023 38206625 39059482 39821974 40885468 41011393 41758160 43252443 42933405 43281373 42829663
$$ packed form
5089C3544963o38946o31407n30748j51088L93393l60726o88153r43582N69680
5080C0563386M69148m21361O95782K09788J95446L16914O59058J43891M82487
5071C3314539j00227K76191J82606l27805P3807l92303L87217o50351o23307M7831
5061C2188198l01442k53507K48093o05956J40455o41828m04929q31400j89781
5052B9347903k52653m07454J5689K76005K94044q0224l7515N91780K67433K06043
5042C0221051m08960L68098O7872K80908L48267j84142j46449j65304L99884J058498
5032C1839723L76997N27210N50248j61551P60388J419481J174315M87596J232218
5023C8206625Q52857P62492J063494J25925P46767J494283l19038L47968m51710
$$ plain form
5014 42829663 42696511 42964509 43450278 43105418 41659363 42012585 42184684 41589816 41255876
5005 41255876 40321859 39717119 39295256 39398615 38423649 37622580 37085254 36696874 35986072
4996 35986072 35269396 35420024 34703354 35164951 35304783 35189336 35758321 35869060 37214117
4987 37214117 36852436 36669018 36340865 37534226 38360887 38886173 38530263 36547132 35360517
4978 35360517 34491318 33744339 33066610 32380240 32034968 32212563 31529967 31317971 30698268
4969 30698268 29905240 30204518 30929010 30843924 31711292 31134401 31237464 31003853 31604342 31620296
4959 31620296 31703677 32371761 33512117 34099821 34872643 35253166 35944719 37301825 37350732
4950 37350732 38039272 38195352 38207777 36802927 36222138 35954640 35559474 34552435 34002582
$$ packed form
5014D2829663j33152K67998M85769l44860j446055L53222J72099n94868l33940
5005D1255876r34017o04740m21863J03359r74966q01069n37326l88380p10802
4996C5986072p16676J50628p16670M61597J39832j15447N68985J10739J345057
4987C7214117l61681j83418l28153J193361Q26661N25286l55910j983131j186615
4978C5360517q69199p46979o77729o86370l45272J77595o82596k11996o19703
4969C0698268p93028K99278P24492q5086Q67368n76891J03063k33611O00489J5954
4959C1620296Q3381O68084J140356N87704P72822L80523O91553J357106M8907
4950C7350732O88540J56080J2425j404850n80789k67498l95166j007039n49853
$$ plain form
4941 34002582 34198628 34752211 34296865 35095158 34501534 34565013 35495574 34485846 33855285
4932 33855285 34158364 34431510 33690072 33875239 34035590 34552899 34447826 35204094 35671677
4923 35671677 35384503 35130554 36349700 36757189 36156079 36346591 36250597 35443116 36067917
4914 36067917 36261640 35718315 35813018 35918630 35761201 35775912 36721966 37024502 36616930 36062298
4904 36062298 36646221 36482625 36281455 36225964 35969029 36245158 36124872 37360779 36747163
4895 36747163 36785178 37878098 37597894 37825377 37952032 37619400 36895379 38275274 38535624
4886 38535624 38978219 39884941 40799589 41752238 41862920 42823710 42699229 41913284 41539600
4877 41539600 41596024 41173591 40631670 40500924 40687498 40258641 39574431 38470373 39001148
$$ packed form
4941C4002582J96046N53583m55346P98293n93624O3479R30561j009728o30561
4932C3855285L03079K73146p41438J85167J60351N17309j05073P56268M67583
4923C5671677k87174k53949J219146M07489o01110J90512r5994q07481O24801
4914C6067917J93723n43325R4703J05612j57429J4711R46054L02536m07572n54632
4904C6062298N83923j63596k01170n5491k56935K76129j20286J235907o13616
4895C6747163L8015J092920k80204K27483J26655l32632p24021J379895K60350
4886C8535624M42595R06722R14648R52649J10682R60790j24481p85945l73684
4877D1539600N6424m22433n41921j30746J86574m28857o84210j104058N30775
$$ plain form
4868 39001148 39102152 38907043 38881927 40026188 40209126 40437089 40903283 40755957 40822100 40832509
4858 40832509 40952855 41251872 41469187 41231717 41157565 41053710 40478502 40140395 41871747
4849 41871747 42242720 42756288 43446364 43468316 43497373 43280070 43626340 43963013 44375369 44837905
4839 44837905 46126778 45934741 45699956 46585452 46921768 47387508 48382618 48943975 48587581
4830 48587581 48978505 49335971 49900957 49743331 50945291 52134094 52954806 53029681 53526581
4821 53526581 53722205 55026704 55442933 55548282 56637132 56731364 57237933 58175498 59608191
4812 59608191 60778125 60814423 60663990 61371674 61721118 62141256 62205461 62893056 62754020 63790573
4802 63790573 64713249 65357329 65758725 65669132 66715294 67081883 68574041 70119839 71514542
$$ packed form
4868C9001148J01004j95109k5116J144261J82938K27963M66194j47326O6143J0409
4858D0832509J20346K99017K17315k37470p4152j03855n75208l38107J731352
4849D1871747L70973N13568O90076K1952K9057k17303L46270L36673M12356M62536
4839D4837905J288873j92037k34785Q85496L36316M65740R95110N61357l56394
4830D8587581L90924L57466N64986j57626J201960J188803Q20712P4875M96900
4821E3526581J95624J304499M16229J05349J088850R4232N06569R37565J432693
4812E9608191J169934L6298j50433P07684L49444M20138O4205O87595j39036J036553
4802F3790573R22676O44080M01396q9593J046162L66589J492158J545798J394703
$$ plain form
4793 71514542 72093121 73304505 74587882 76242405 77799742 78588402 78700764 79281943 79865618
4784 79865618 80289587 80409023 80650896 81065191 81325426 82062510 82387248 81975823 82541289
4775 82541289 82430495 82786550 82361874 82163969 82344996 82031798 83003901 83563327 83633617 84169535
4765 84169535 84452714 85768535 87396909 87997688 88967616 89941417 90513257 91603336 92206948
4756 92206948 93241621 94806697 95743143 96041519 96147446 96630651 96653659 96326427 97240591
4747 97240591 97581683 97610640 98614173 98082031 99099281 100007589 100241869 100764671 100903439
4738 100903439 101037847 101734803 102370415 103574653 104299114 105892014 106189243 107603175 107964226
4729 107964226 108847224 110372181 111706991 113036611 113879391 115385361 116004353 116515383 116422792
$$ packed form
4793G1514542N78579J211384J283377J654523J557337P88660J12362N81179N83675
4784G9865618M23969J19436K41873M14295K60235P37084L24738m11425N65466
4775H2541289j10794L56055m24676j97905J81027l13198R72103N59426P0290N35918
4765H4169535K83179J315821J628374O00779R69928R73801N71840J090079O03612
4756I2206948J034673J565076R36446K98376J05927M83205K3008l27232R14164
4747I7240591L41092K8957J003533n32142J017250R08308K34280N22802J38768
4738A00903439J34408O96956O35612J204238P24461J592900K97229J413932L61051
4729A07964226Q82998J524957J334810J329620Q42780J505970O18992N11030r2591
$$ plain form
4720 116422792 117126620 118815567 118376271 118800228 119390816 119668412 120286160 119693960 119155256
4711 119155256 118442845 117429746 116765373 116630082 116365771 115888917 115796536 115199665 114845667
4702 114845667 114746728 114813529 115405116 115339543 114138993 115315282 115963502 116171534 116158309 116418231
4692 116418231 117385132 117600510 118731730 119918695 119768197 120746606 121544868 121071445 120913891
4683 120913891 121354108 121318738 120266438 121091740 121193347 121219147 120518582 119677646 120111535
4674 120111535 120749088 120653308 120832177 121757718 122219480 121569099 120929699 120584847 121739237
4665 121739237 122627052 123549747 124359521 124061193 124718883 125690908 126158880 127076158 126890178
4656 126890178 127264389 126284587 126846504 128253477 128667617 129948218 131212126 132148959 133364802
$$ packed form
4720A16422792P03828J688947m39296M23957N90588K77596O17748n92200n38704
4711A19155256p12411j013099o64373j35291k64311m76854r2381n96871l53998
4702A14845667r8939O6801N91587o5573j200550J176289O48220K08032j3225K59922
4692A16418231R66901K15378J131220J186965j50498R78409P98262m73423j57554
4683A20913891M40217l5370j052300Q25302J01607K5800p00565q40936M33889
4674A20111535O37553r5780J78869R25541M61762o50381o39400l44852J154390
4665A21739237Q87815R22695Q09774k98328O57690R72025M67972R17278j85980
4656A26890178L74211r79802N61917J406973M14140J280601J263908R36833J215843
$$ plain form
4647 133364802 133636516 134855080 137348407 138969562 141674782 143346475 144929364 146696072
4639 146696072 147732462 148298806 148146971 148256583 147040860 145596838 143679578 140605013
4631 140605013 137286490 134189233 131777614 130409215 128066894 126508742 124008899 122235785
4623 122235785 120719416 118254999 117234898 115208343 114699442 113861900 113194619 112292196 112415049
4614 112415049 112671296 113134363 112168876 111348552 110393734 109637913 109114631 107705869 107445798
4605 107445798 106054428 103674986 102812333 101229097 99971720 99008387 97276701 96583442
4597 96583442 94829862 93490286 92262597 91314137 89799387 88810454 86646057 84789817
4589 84789817 83662309 83731962 83293379 81547536 80567271 79546172 79761081 79777709 79036681
$$ packed form
4647A33364802K71714J218564K493327J621155K705220J671693J582889J766708
4639A46696072J036390N66344j51835J09612j215723j444022j917260l074565
4631A40605013l318523l097257k411619j368399k342321j558152k499843j773114
4623A22235785j516369k464417j020101k026555n08901q37542o67281r02423J22853
4614A12415049K56247M63067r65487q20324r54818p55821n23282j408762k60071
4605A07445798j391370k379442q62653j583236j257377r63333j731686o93259
4597I6583442j753580j339576j227689r48460j514750r88933k164397j856240
4589H4789817j127508O9653m38583j745843r80265j021099K14909J6628p41028
$$ plain form
4580 79036681 77852497 77486053 77147259 76815051 75217468 74750913 74095230 73265283 72467626
4571 72467626 71267188 69968484 68604133 68030061 67663084 67107333 65789820 64663712 63756999
4562 63756999 63206593 61992342 61673436 61109319 60421345 60683941 60936630 60520598 60727870
4553 60727870 59714130 59423452 59707506 59133045 58634155 58655255 58748769 57285125 56459477
4544 56459477 56422451 56092953 55665518 54698174 54460661 53880707 53256398 53841752 52528312
4535 52528312 51605819 52170952 51952103 51906842 51325130 50829752 50771921 50829819 50926928 50797550
4525 50797550 51337425 51352577 51275252 51799423 52391138 52622665 53300858 53198992 52543646 51505501
4515 51505501 51385755 51663681 51462513 50549310 50097842 50305021 51064494 51406419 51538449
$$ packed form
4580G9036681j184184l66444l38794l32208j597583m66555o55683q29947p97657
4571G2467626j200438j298704j364351n74072l66977n55751j317513j126108r06713
4562F3756999n50406j214251l18906n64117o87974K62596K52689m16032K07272
4553F0727870j013740k90678K84054n74461m98890K1100R3514j463644q25648
4544E6459477l7026l29498m27435r67344k37513n79954o24309N85354j313440
4535E2528312r22493N65133k18849m5261n81712m95378n7831N7898R7109j29378
4525E0797550N39875J5152p7325N24171N91715K31527O78193j01866o55346j038145
4515E1505501j19746K77926k01168r13203m51468K07179P59473L41925J32030
$$ plain form
4506 51538449 52163375 52825801 52516083 52513357 52642574 52161834 52377546 52699844 52846493 51925730
4496 51925730 52164667 52702992 52760610 52849236 53082608 53817415 54808333 55470229 56543402 57433761
4486 57433761 57832471 58735037 59142108 59307574 60092429 61426708 62285052 63091753 63436144
4477 63436144 64938663 66716589 69172749 72299581 75625552 77855184 79405257 80060114
4469 80060114 78601104 77299039 76225013 76476668 75793740 76345188 76769820 77669626 78310282
4460 78310282 79456593 80540615 81503967 81423056 80783353 81388571 81387596 81002500 81726693 82341269
4450 82341269 82275946 83174801 83682324 83898391 84418515 86415225 87206676 87731641 89718205
4441 89718205 91841555 93366408 96443101 98366077 99643276 100979489 102690213 103954271
$$ packed form
4506E1538449O24926O62426l09718k726J29217m80740K15712L22298J46649r20763
4496E1925730K38937N38325N7618Q8626K33372P34807R90918O61896J073173Q90359
4486E7433761L98710R02566M07071J65466P84855J334279Q58344Q06701L44391
4477F3436144J502519J777926K456160L126832L325971K229632J550073O54857
4469H0060114j459010j302065j074026K51655o82928N51448M24632Q99806O40656
4460G8310282J146311J084022R63352q0911o39703O05218r75l85096P24193O14576
4450H2341269o5323Q98855N07523K16067N20124J996710P91451N24965J986564
4441H9718205K123350J524853L076693J922976J277199J336213J710724J264058
$$ plain form
4433 103954271 104623100 107009988 108984355 111435216 115782137 119327919 122121479 125633532
4425 125633532 131196989 135222603 138557910 140059491 140457053 140034591 137585300 134835219
4417 134835219 131070376 127815055 125902549 125344120 123337093 122467933 122172951 121743126 122104345
4408 122104345 122258645 123487573 126298799 128113534 129591688 131800507 134035943 134853031
4400 134853031 135267570 136854011 138419322 140076638 142053833 143102147 144061990 143055915
4392 143055915 140957144 138139502 135070122 131636257 128865009 127495970 127356345 127348932 127494382
4383 127494382 128859564 130701986 132571792 134343772 136022745 136549780 138533333 139444501
4375 139444501 141274294 142203561 144918594 148627833 151582785 155339312 157668796 157200728
$$ packed form
4433A03954271O68829K386888J974367K450861M346921L545782K793560L512053
4425A25633532N563457M025614L335307J501581L97562m22462k449291k750081
4417A34835219l764843l255321j912506n58429k007027q69160k94982m29825L61219
4408A22104345J54300J228928K811226J814735J478154K208819K235436Q17088
4400A34853031M14539J586441J565311J657316J977195J048314R59843j006075
4392A43055915k098771k817642l069380l433865k771248j369039j39625p413J45450
4383A27494382J365182J842422J869806J771980J678973N27035J983553R11168
4375A39444501J829793R29267K715033L709239K954952L756527K329484m68068
$$ plain form
4367 157200728 155434489 152554400 147030754 141072813 133243474 125764309 119325055 113290406
4359 113290406 107347950 101718158 97301361 93122759 89060933 85936843 83285824 80874514
4351 80874514 77668069 75255980 73867297 72029925 69826062 69108600 68637749 67540297
4343 67540297 66587790 67398213 67487134 66655390 66668267 67700434 68469080 68344696 68542259 67829326
4333 67829326 65347098 63514851 62392791 60616171 59093478 57579094 55831570 54102014
4325 54102014 52697448 51663217 50677666 49537413 48664096 47759177 46737715 45857486 45309662
4316 45309662 44769884 45040385 44744959 44036894 43847877 42575645 42214854 41825716 40857868
4307 40857868 40179923 39782203 39866861 40077229 39907304 39921422 39349064 38012967 38412837 38345446
$$ packed form
4367A57200728j766239k880089n523646n957941p829339p479165o439254o034649
4359A13290406n942456n629792m416797m178602m061826l124090k651019k411310
4351H0874514l206445k412089j388683j837372k203863p17462m70851j097452
4343F7540297r52507Q10423Q8921q31744J2877J032167P68646j24384J97563p12933
4333F7829326k482228j832247j122060j776620j522693j514384j747524j729556
4325E4102014j404566j034231r85551j140253q73317r04919j021462q80229n47824
4316D5309662n39778K70501k95426p08065j89017j272232l60791l89138r67848
4307D0857868o77945l97720Q4658K10368j69925J4118n72358j336097L99870o7391
$$ plain form
4297 38345446 37794696 37231109 36502682 36010979 35934349 35536001 36142407 36696675 36819381 36690237
4287 36690237 36236083 35730850 35531497 35309255 35720328 36037480 35501108 34707150 35720186
4278 35720186 35726374 35372282 35000282 35164342 35394781 35853345 35709395 35204572 34578021 34588646
4268 34588646 35514182 36579483 35644403 35223737 35418126 34366375 33580731 33329519 32697566
4259 32697566 32552445 33393112 32436263 32066845 31846706 32560961 32096225 32590683 33637465
4250 33637465 33558064 32240970 32623393 32330320 32477117 33082465 31915535 31644013 32136436
4241 32136436 32273246 33015246 32799340 32916215 32759588 32853617 32845313 32848537 33177618 33817034
4231 33817034 33501542 33524175 33895855 34373698 34207640 32696132 32470360 32083061 32854796
$$ packed form
4297C8345446n50750n63587p28427m91703p6630l98348O06406N54268J22706j29144
4287C6690237m54154n05233j99353k22242M11073L17152n36372p93958J013036
4278C5720186O188l54092l72000J64060K30439M58564j43950n04823o26551J0625
4268C4588646R25536J065301r35080m20666J94389j051751p85644k51212o31953
4259C2697566j45121Q40667r56849l69418k20139P14255m64736M94458J046782
4250C3637465p9401j317094L82423k93073J46797O05348j166930k71522M92423
4241C2136436J36810P42000k15906J16875j56627R4029q304L224L29081O39416
4231C3817034l15492K2633L71680M77843j66058j511508k25772l87299P71735
$$ plain form
4222 32854796 32835942 31546678 31526885 31607250 31498711 31283813 31414918 31405896 32474094 32057850
4212 32057850 31619764 31690036 32384146 32590623 32863338 33227467 32959394 33066841 33390522 33288155
4202 33288155 33162023 32990681 33070793 33858945 33729050 33954396 33186408 33250915 32611179 32803085
4192 32803085 32846383 33624097 33889237 33508549 33596018 32914922 33347801 34851549 34473627 33875575
4182 33875575 34115722 35182328 35338136 34319725 34563379 35379134 35923916 37262588 37555720
4173 37555720 37742549 38329846 38951737 39069515 39264054 39997691 39616897 39991300 40355092
4164 40355092 39371550 40025899 39381535 39310078 39027950 39003311 38801698 38379672 38879770 37947369
4154 37947369 38067273 38491128 37815242 37176839 35571759 35176481 35644394 35316009 35176341
$$ packed form
4222C2854796j8854j289264j9793Q0365j08539k14898J31105r022J068198m16244
4212C2057850m38086P0272O94110K06477K72715L64129k68073J07447L23681j02367
4202C3288155j26132j71342Q0112P88152j29895K25346p67988O4507o39736J91906
4192C2803085M3298P77714K65140l80688Q7469o81096M32879J503748l77922n98052
4182C3875575K40147J066606J55808j018411K43654Q15755N44782J338672K93132
4173C7555720J86829N87297O21891J17778J94539P33637l80794L74403L63792
4164D0355092r83542O54349o44364p1457k82128k4639k01613m22026N00098r32401
4154C7947369J19904M23855o75886o38403j605080l95278M67913l28385j39668
$$ plain form
4145 35176341 34656531 34842955 35037284 34933691 35135160 34938084 34590798 34681935 34311053 34030941
4135 34030941 34593064 35179404 35869957 36027404 35783736 35134883 35069130 36197637 36215880 36372016
4125 36372016 36675632 37229998 38013039 37957644 38406374 38804218 39610829 40059205 40321069 40846500
4115 40846500 40803391 41561473 42447631 42753490 43981494 44357314 44326604 45414542 45180953
4106 45180953 45650332 46088585 47808165 49059475 49267873 49095048 48725479 49548065 49421424
4097 49421424 49800965 51738358 52291964 53150052 54431179 54579331 55050592 55829686 57161085
4088 57161085 58755655 59796735 61784693 63043799 65152581 67071546 69349308 71951350
4080 71951350 74878627 78095801 82666193 87799159 93987059 102272563 113038127 124060993
$$ packed form
4145C5176341n19810J86424J94329j03593K01469j97076l47286R1137l70882k80112
4135C4030941N62123N86340O90553J57447k43668o48853o5753J128507J8243J56136
4125C6372016L03616N54366P83041n5395M48730L97844Q06611M48376K61864N25431
4115D0846500m3109P58082Q86158L05859J228004L75820l0710J087938k33589
4106D5180953M69379M38253J719580J251310K08398j72825l69569Q22586j26641
4097D9421424L79541J937393N53606Q58088J281127J48152M71261P79094J331399
4088E7161085J594570J041080J987958J259106K108782J918965K277762K602042
4080G1951350K927277L217174M570392N132966O187900Q285504J0765564J1022866
$$ plain form
4072 124060993 130965436 128272689 120848212 111996621 103730750 97491808 92761438 90500321
4064 90500321 88468221 86585535 85888495 85749381 86242340 86756400 87563023 88484853 88802153
4055 88802153 88971230 89485425 91283345 91984019 92606065 93422784 94666796 95232256 97335847
4046 97335847 98164511 98543042 99594071 100957922 102763873 104345596 104622896 105406974 106314520
4037 106314520 106670532 107368188 108684942 109621202 110521067 112160512 112669780 113346158 114540975
4028 114540975 115997714 117121099 117515380 118050828 118850598 119523302 121160432 121643505 121916002
4019 121916002 123119857 123712788 123499105 124908004 126358469 127501817 128173510 128229429 129643363
4010 129643363 130776471 131339160 132423235 133603186 134194510 134340527 134834058 135153247 135710213
$$ packed form
4072A24060993O904443k692747p424477q851591q265871o238942m730370k261117
4064I0500321k032100j882686o97040j39114M92959N14060Q06623R21830L17300
4055H8802153J69077N14195J797920P00674O22046Q16719J244012N65460K103591
4046I7335847Q28664L78531J051029J363851J805951J581723K77300P84078R07546
4037A06314520L56012O97656J316754R36260Q99865J639445N09268O76378J194817
4028A14540975J456739J123385L94281N35448P99770O72704J637130M83073K72497
4019A21916002J203855N92931k13683J408899J450465J143348O71693N5919J413934
4010A29643363J133108N62689J084075J179951N91324J46017M93531L19189N56966
$$ plain form
4001 135710213 136635838 136395726 135670091 134265749 133858262 134365608 133805470 132208402 131083711
3992 131083711 129853208 128953828 126782139 125343832 124171849 123537383 121871969 120610565
3984 120610565 119155058 117399922 115790992 113530687 111868430 109652518 107878611 106606277
3976 106606277 104412735 102359329 100594963 98853738 97773932 96683468 94947955 92998002
3968 92998002 91607340 90250452 88209608 86954209 87221775 86506667 85483984 84409390
3960 84409390 82910155 81941107 80680898 79539911 78845099 77087543 76862418 75755220 73858132
3951 73858132 73500423 72298398 71204604 70613424 70907112 69736884 69528138 68939287 68458386
3942 68458386 68522526 67606437 67815941 67603002 67146071 67417861 67120874 67419787 67346045 66711088
$$ packed form
4001A35710213R25625k40112p25635j404342m07487N07346n60138j597068j124691
3992A31083711j230503q99380k171689j438307j171983o34466j665414j261404
3984A20610565j455507j755136j608930k260305j662257k215912j773907j272334
3976A06606277k193542k053406j764366j741225j079806j090464j735513j949953
3968I2998002j390662j356888k040844j255399K67566p15108j022683j074594
3960H4409390j499235r69048j260209j140987o94812j757556k25125j107198j897088
3951G3858132l57709j202025j093794n91180K93688j170228k08746n88851m80901
3942F8458386O4140r16089K09504k12939m56931K71790k96987K98913p3742o34957
$$ plain form
3932 66711088 67078418 67124647 67559895 68212063 68604063 68313725 68155088 69060462 70189676
3923 70189676 70297154 70628515 70609024 71242334 71915617 71373633 71799078 71872194 72556334 72720119
3913 72720119 73066589 73760943 73729577 74344313 74786900 75268967 75110830 75366605 75888245 76525614
3903 76525614 75892628 76933899 76351412 76442847 76621727 76102231 75812654 76840151 77088002
3894 77088002 76106080 76584229 77121023 77544086 77882674 77639538 77388410 77715743 77747359 78523845
3884 78523845 78281314 78498991 78939142 78670745 79718370 80258823 80547565 80407556 80942378
3875 80942378 82084137 82142355 83211475 83655561 84093211 84627268 85663964 86835387 85889460
3866 85889460 86210271 88342244 88456994 88744227 88808995 89955692 91135946 90979033 92183063
$$ packed form
3932F6711088L67330M6229M35248O52168L92000k90338j58637R05374J129214
3923G0189676J07478L31361j9491O33310O73283n41984M25445P3116O84140J63785
3913G2720119L46470O94354l1366O14736M42587M82067j58137K55775N21640O37369
3903G6525614o32986J041271n82487R1435J78880n19496k89577J027497K47851
3894G7088002r81922M78149N36794M23063L38588k43136k51128L27333L1616P76486
3884G8523845k42531K17677M40151k68397J047625N40453K88742j40009N34822
3875H0942378J141759N8218J069120M44086M37650N34057J036696J171423r45927
3866H5889460L20811K131973J14750K87233O4768J146697J180254j56913J204030
$$ plain form
3857 92183063 92791098 92969549 93110678 93839653 94170541 93735885 94325524 94975445 94323946
3848 94323946 94174659 93743316 93056046 92227408 90863009 90482746 89776385 88522579 87770415
3839 87770415 87265902 85612240 83625831 82579901 81549314 80015949 78965329 78209628
3831 78209628 77037897 75630605 74370989 72971616 72397235 71223464 68719876 67009487
3823 67009487 65830596 64866412 63740218 63628226 62869113 62452720 61883977 61103237 61673428
3814 61673428 61325153 61260921 61400414 61576183 61845665 61485136 61619221 60985090 60822351 60877403
3804 60877403 60548196 60802222 60437168 60072211 60188608 60611726 60282343 59875011 60637103
3795 60637103 60710696 60713522 60999212 61155681 60257448 58982592 58935192 58117916 58919928 59350070
$$ packed form
3857I2183063O08035J78451J41129P28975L30888m34656N89639O49921o51499
3848I4323946j49287m31343o87270q28638j364399l80263p06361j253806p52164
3839H7770415n04513j653662j986409j045930j030587j533365j050620p55701
3831G8209628j171731j407292j259616j399373n74381j173771k503588j710389
3823F7009487j178891r64184j126194j11992p59113m16393n68743p80740N70191
3814F1673428l48275o4232J39493J75769K69482l60529J34085o34131j62739N5052
3804F0877403l29207K54026l65054l64957J16397M23118l29383m07332P62092
3795F0637103P3593K826K85690J56469q98233j274856m7400q17276Q02012M30142
$$ plain form
3785 59350070 59330372 58131694 57763607 58196055 57903635 58061073 57991091 57810423 57106730 56649761
3775 56649761 56272147 55822118 55887209 56618375 56041245 54878685 55027214 55308597 55633979
3766 55633979 56183367 56221796 56289673 56757815 56529137 56098643 56529848 55768427 56230073 56595885
3756 56595885 56348066 55841600 55520726 56129663 56242473 55879796 55293675 55155487 55181470 54754942
3746 54754942 54928568 55152265 55092469 54934561 54939066 55199526 54944852 55118421 55576344 57042805
3736 57042805 56816857 57038315 57538270 57296283 57661535 58993828 58879910 59328006 59218576
3727 59218576 59617885 60290940 60722080 61251044 62001877 62692947 63974464 65354394 66784997
3718 66784997 67026589 68173784 69060426 69384488 71036764 72498679 73619963 74534723 76257378
$$ packed form
3785E9350070j9698j198678l68087M32448k92420J57438o9982j80668p03693m56969
3775E6649761l77614m50029O5091P31166n77130j162560J48529K81383L25382
3766E5633979N49388L8429O7877M68142k28678m30494M31205p61421M61646L65812
3756E6595885k47819n06466l20874O08937J12810l62677n86121j38188K5983m26528
3746E4754942J73626K23697n9796j57908M505K60460k54674J73569M57923J466461
3736E7042805k25948K21458M99955k41987L65252J332293j13918M48096j09430
3727E9218576L99309O73055M31140N28964P50833O91070J281517J379930J430603
3718F6784997K41592J147195Q86642L24062J652276J461915J121284R14760J722655
$$ plain form
3709 76257378 77131731 78205364 78649918 80297268 81372061 82081780 82748301 83806623 84733269
3700 84733269 84960784 86183199 86136390 87160352 88125883 88950569 88893989 88574531 89222274
3691 89222274 89762389 89928211 89887992 89796879 90635409 90351748 89687612 90232723 90564385 90774019
3681 90774019 90641442 90638332 90243231 91209247 91985647 93012523 92401685 93349274 94507726
3672 94507726 94048875 94614881 95880830 97010508 98289760 99143234 101312786 102163390 103685675
3663 103685675 105182153 106174513 107699005 110936930 112357881 114079645 116519302 117937038
3655 117937038 119702886 121883020 124037756 126166650 128441199 131048480 133630391 136583016
3647 136583016 138308406 140327093 142182629 143756010 146875688 148964787 151449921 154181482
$$ packed form
3709G6257378Q74353J073633M44554J647350J074793P09719O66521J058322R26646
3700H4733269K27515J222415m6809J023962R65531Q24686n6580l19458O47743
3691H9222274N40115J65822m0219r1113Q38530k83661o64136N45111L31662K09634
3681I0774019j32577l110l95101R66016P76400J026876o10838R47589J158452
3672I4507726m58851N66006J265949J129678J279252Q53474K169552Q50604J522285
3663A03685675J496478R92360J524492L237925J420951J721764K439657J417736
3655A17937038J765848K180134K154736K128894K274549K607281K581911K952625
3647A36583016J725390K018687J855536J573381L119678K089099K485134K731561
$$ plain form
3639 154181482 156949564 158527424 160184705 161690772 163662939 165993976 167841956 170622343
3631 170622343 172260245 174350168 176664142 177797276 180139703 182444691 184222973 186606283
3623 186606283 188470089 190041958 191604348 194442794 198196997 200893908 204741363 207883957
3615 207883957 210807317 214597921 218339394 221610005 225972862 231347792 235965211 240479194
3607 240479194 245277817 250965400 255710706 260811854 265990005 269980328 275290364 279879430
3599 279879430 283787835 288131352 291583159 293624895 297222443 300585400 303642877 305967996
3591 305967996 307708752 309539712 311097911 312347492 312999324 314531602 314538306 314362705 314032196
3582 314032196 312215844 311737772 310484557 308556842 306682981 305362599 303295844 302829093
$$ packed form
3639A54181482K768082J577860J657281J506067J972167K331037J847980K780387
3631A70622343J637902K089923K313974J133134K342427K304988J778282K383310
3623A86606283J863806J571869J562390K838446L754203K696911L847455L142594
3615B07883957K923360L790604L741473L270611M362857N374930M617419M513983
3607B40479194M798623N687583M745306N101148N178151L990323N310036M589066
3599B79879430L908405M343517L451807K041736L597548L362957L057477K325119
3591C05967996J740756J830960J558199J249581O51832J532278O704j75601l30509
3582C14032196j816352m78072j253215j927715j873861j320382k066755m66751
$$ plain form
3574 302829093 301741805 300524631 298277364 296615774 295369378 292873410 290701570 289348509
3566 289348509 287569922 285732354 285036120 283537710 281456978 279942335 278447007 275791556
3558 275791556 273910004 271812665 269669857 268245239 265428929 262038640 259112550 256631915
3550 256631915 254714774 252508354 249639920 245822487 243205982 240682609 236852594 233865656
3542 233865656 231122880 227112058 224547680 221874739 218393847 214564894 210529724 207008689
3534 207008689 202948617 200243395 197477673 194526096 191521513 188523544 185312767 182825102
3526 182825102 178998789 176031795 174037268 171309162 168721076 166278858 164633451 161144984
3518 161144984 158531942 157100443 155222124 152869946 151766087 150256321 148852599 146894567
$$ packed form
3574C02829093j087288j217174k247267j661590j246396k495968k171840j353061
3566B89348509j778587j837568o96234j498410k080732j514643j495328k655451
3558B75791556j881552k097339k142808j424618k816310l390289k926090k480635
3550B56631915j917141k206420k868434l817433k616505k523373l830015k986938
3542B33865656k742776m010822k564378k672941l480892l828953m035170l521035
3534B07008689m060072k705222k765722k951577l004583k997969l210777k487665
3526A82825102l826313k966994j994527k728106k588086k442218j645407l488467
3518A61144984k613042j431499j878319k352178j103859j509766j403722j958032
$$ plain form
3510 146894567 146083461 145495204 144530706 143500204 142321499 140907314 140589655 138967626 138607434
3501 138607434 137369489 135992046 135418195 133892717 133491673 132673719 131386171 130444304 129274748
3492 129274748 127793156 125709742 124034257 122201022 119593578 118545769 116467977 114356728
3484 114356728 112918462 110163111 107817908 106541094 104543747 103779813 102175611 99938351
3476 99938351 97731004 96298223 94328199 93278548 91830664 90603095 89344168 87922036
3468 87922036 87682308 86996522 86052064 85485671 84364737 83073917 83203480 83677048 82972035
3459 82972035 81808370 82057329 82452848 81318575 80895380 80911900 81678908 81747117 80981516
3450 80981516 81020632 81823830 82273690 82358348 81918478 80998399 79922565 80237850 80327805 80003894
$$ packed form
3510A46894567q11106n88257r64498j030502j178705j414185l17659j622029l60192
3501A38607434j237945j377443n73851j525478m01044q17954j287548r41867j169556
3492A29274748j481592k083414j675485j833235k607444j047809k077792k111249
3484A14356728j438266k755351k345203j276814j997347p63934j604202k237260
3476I9938351k207347j432781j970024j049651j447884j227569j258927j422132
3468H7922036k39728o85786r44458n66393j120934j290820J29563M73568p05013
3459H2972035j163665K48959L95519j134273m23195J6520P67008O8209p65601
3450H0981516L9116Q03198M49860Q4658m39870r20079j075834L15285Q9955l23911
$$ plain form
3440 80003894 79501188 78381066 78146245 77608623 77966692 77368230 76185954 75728526 75799683
3431 75799683 75421769 74577841 74266986 73357339 73037571 72246974 71468369 72255720 72129306
3422 72129306 71687150 71349290 71848941 71921037 72042471 71250159 70515990 71268166 71148387 70372922
3412 70372922 70698457 70907443 70043146 69658574 69245161 69643135 70298145 69593520 70182302
3403 70182302 70651692 70520271 69738942 69739559 69519711 69373138 68839550 68555035 68462922 68395088
3393 68395088 68105414 68321164 68830471 69338911 68892557 67951718 67791054 68236154 68262059 67895488
3383 67895488 68092689 68694135 68744140 68721796 69118701 69180979 69155340 69450661 69687422 71156150
3373 71156150 72495993 73561446 74688444 75348851 76733151 79525593 81331166 82603223
$$ packed form
3440H0003894n02706j120122k34821n37622L58069n98462j182276m57428P1157
3431G5799683l77914q43928l10855r09647l19768p90597p78605P87351j26414
3422G2129306m42156l37860M99651P2096J21434p92312p34169P52176j19779p75465
3412G0372922L25535K08986q64297l84572m13413L97974O55010p04625N88782
3403G0182302M69390j31421p81329O17k19848j46573n33588k84515r2113o7834
3393F8395088k89674K15750N09307N08440m46354r40839j60664M45100K5905l66571
3383F7895488J97201O01446N0005k2344L96905O2278k5639K95321K36761J468728
3373G1156150J339843J065453J126998O60407J384300K792442J805573J272057
$$ plain form
3365 82603223 84384588 86247954 88626614 91107396 93578828 95760640 98061560 100276720
3357 100276720 103718328 106596004 108532642 110356833 110970124 111504308 112604521 113947431
3349 113947431 114176016 113552618 113156276 111556763 110674702 110433391 108679720 106793691 105497567
3340 105497567 103329315 102059998 99995915 97771853 95262255 92873305 90977951 88722233
3332 88722233 86280327 84196119 82457991 81321584 79600197 77320147 76388304 75856369
3324 75856369 74149157 73750817 72949702 72084443 72033741 71363878 69478197 68641023 68092420
3315 68092420 68117931 67133523 65296531 63802261 63267355 62160278 60652782 59677590 58430416
3306 58430416 57212789 56698097 56602271 55791834 55588388 56502132 54969345 54789190 53973527
$$ packed form
3365H2603223J781365J863366K378660K480782K471432K181812K300920K215160
3357A00276720L441608K877676J936638J824191O13291N34184J100213J342910
3349A13947431K28585o23398l96342j599513q82061k41311j753671j886029j296124
3340A05497567k168252j269317k064083k224062k509598k388950j895354k255718
3332H8722233k441906k084208j738128j136407j721387k280050r31843n31935
3324G5856369j707212l98340q01115q65259n0702o69863j885681q37174n48603
3315F8092420K5511r84408j836992j494270n34906j107077j507496r75192j247174
3306E8430416j217627n14692r5826q10437k03446R13744j532787j80155q15663
$$ plain form
3297 53973527 54259561 54661610 54471587 54432447 53717373 53533492 53541461 54057709 55050785 55669601
3287 55669601 55105149 54727314 54787266 55289948 54746320 54911636 54933574 54564101 53840286 54059993
3277 54059993 54419761 54200512 53571434 54448154 54409444 55128183 54653334 54497939 55456865 55618702
3267 55618702 56308645 57528570 57004530 57609027 58501310 58395270 59292743 60743562 61267557
3258 61267557 61589855 62346944 63709347 64095310 64529910 65749926 68202077 70735636 72702105
3249 72702105 75240919 78256038 82150779 84874346 88555428 91861292 94311841 96564646
3241 96564646 100099088 102751206 104847767 107153182 108478158 108511401 106758088 104492077
3233 104492077 101521361 98921581 96475807 93015386 90551593 88335864 86324379 83277209
$$ packed form
3297E3973527K86034M02049j90023l9140p15074j83881P969N16248R93076O18816
3287E5669601n64452l77835N9952N02682n43628J65316K1938l69473p23815K19707
3277E4059993L59768k19249o29078Q76720l8710P18739m74849j55395R58926J61837
3267E5618702O89943J219925n24040O04497Q92283j06040Q97473J450819N23995
3258F1267557L22298P57089J362403L85963M34600J220016K452151K533559J966469
3249G2702105K538814L015119L894741K723567L681082L305864K450549K252805
3241I6564646L534442K652118K096561K305415J324976L3243j753313k266011
3233A04492077k970716k599780k445774l460421k463793k215729k011485l047170
$$ plain form
3225 83277209 80210053 78003635 77042847 74632260 73289940 72057164 70841008 70232157
3217 70232157 68734433 68885172 69331883 69368400 69663709 68758019 65735072 64642940 62285936
3208 62285936 59860556 57580913 55930032 55226864 55033323 54702667 54833534 54765746 54789106
3199 54789106 55987249 57002071 57760211 58167594 56366464 54680237 52944571 51493301
3191 51493301 50387383 49789416 48732102 47808699 48190380 48296623 48169257 49518720 49607048
3182 49607048 50247667 51071403 52620694 51431312 50345487 49419340 47711763 47526536 46874294
3173 46874294 46298729 46087016 46078219 46152286 46564802 47831037 48226098 48281388 49765261 51525869
3163 51525869 52769104 52734017 53015999 51962331 50986182 49555120 48643760 48052856 47219435
$$ packed form
3225H3277209l067156k206418r60788k410587j342320j232776j216156o08851
3217G0232157j497724J50739M46711L6517K95309r05690l022947j092132k357004
3208F2285936k425380k279643j650881p03168j93541l30656J30867o7788K3360
3199E4789106J198143J014822P58140M07383j801130j686227j735666j451270
3191E1493301j105918n97967j057314r23403L81681J06243j27366J349463Q8328
3182D9607048O40619Q23736J549291j189382j085825r26147j707577j85227o52242
3173D6874294n75565k11713q797P4067M12516J266235L95061N5290J483873J760608
3163E1525869J243235l5087K81982j053668r76149j431062r11360n90904q33421
$$ plain form
3154 47219435 46965434 46475948 46764107 47698521 48527224 50455584 50835874 51229853 49784405
3145 49784405 49156068 47932143 47340793 46088643 44653703 44375771 44303603 44208487 45044403
3136 45044403 45110725 45301947 46554748 47651745 49778077 51368246 53557559 55243191 56666116
3127 56666116 57850580 57637507 57515950 57123181 56481946 56585740 55033442 52961120 51117759
3118 51117759 49761859 48880434 47610203 47912971 47511996 46791177 45443540 44318699 43920492
3109 43920492 43536774 42693760 41970668 41981270 42372521 42344055 42122210 42322364 43799324 44463148
3099 44463148 45224228 46815566 47978971 48427183 49670140 51214837 51747104 51961790 48620859
3090 48620859 47075848 46470009 45726380 43871720 43238498 43619414 43144855 42288746 42342729
$$ packed form
3154D7219435k54001m89486K88159R34414Q28703J928360L80290L93979j445448
3145D9784405o28337j223925n91350j252150j434940k77932p2168r5116Q35916
3136D5044403O6322J91222J252801J096997K126332J590169K189313J685632J422925
3127E6666116J184464k13073j21557l92769o41235J03794j552298k072322j843361
3118E1117759j355900q81425j270231L02768m00975p20819j347637j124841l98207
3109D3920492l83718q43014p23092J0602L91251k8466k21845K00154J476960O63824
3099D4463148P61080J591338J163405M48212J242957J544697N32267K14686l340931
3090D8620859j545011o05839p43629j854660o33222L80916m74559q56109N3983
$$ plain form
3081 42342729 42892923 43000600 43085117 43402511 44047295 43431775 43560249 43457065 43862191 43010896
3071 43010896 42999988 42654710 42585673 43069180 42827550 41595401 41572866 41836235 41982807 41332362
3061 41332362 41449693 42096645 42394271 42577904 42810539 43895134 44562723 44923365 45915908
3052 45915908 46672061 46708049 47026774 48040186 48920125 49552397 50023484 50628580 52116919
3043 52116919 52947403 53326376 52606009 52444043 51674933 52316459 52480257 52971160 52439806
3034 52439806 52387061 51968376 51468789 51013743 50058306 49982330 50840130 51302695 52441115 52961557
3024 52961557 54325852 56790959 58156950 59422762 61643728 62475724 63002231 62336055 62207686
3015 62207686 61415388 60505542 59515393 59691169 59538219 58216140 57630715 57730028 58461289
$$ packed form
3081D2342729N50194J07677Q4517L17394O44784o15520J28474j03184M05126q51295
3071D3010896j0908l45278o9037M83507k41630j232149k2535K63369J46572o50445
3061D1332362J17331O46952K97626J83633K32635J084595O67589L60642R92543
3052D5915908P56153L5988L18725J013412Q79939O32272M71087O05096J488339
3043E2116919Q30484L78973p20367j61966p69110O41526J63798M90903n31354
3034E2439806n2745m18685m99587m55046r55437p5976Q57800M62565J138420N20442
3024E2961557J364295K465107J365991J265812K220966Q31996N26507o66176j28369
3015F2207686p92298r09846r90149J75776j52950j322079n85425R9313P31261
$$ plain form
3006 58461289 58586275 58475636 57876809 57825907 58233411 58552423 58304284 58042233 58197656 58803965
2996 58803965 59236829 59611908 60288232 62117908 63318293 65558204 68113849 70164745 72437176
2987 72437176 74990027 76691868 75581911 73460866 71759050 69559142 68044652 66975505
2979 66975505 65893416 64596924 63374508 63116603 62551653 62708423 62209191 60748079 61275274
2970 61275274 61367636 62063379 62254438 63475221 63146574 62210771 61046275 60103274 59245989
2961 59245989 59018702 58275675 58765161 58266593 58602395 58995232 60323214 59922980 58832688
2952 58832688 58851889 57937892 57639485 58753178 58637228 58243256 59096687 58760863 57731674
2943 57731674 55294950 54860664 53738851 53427521 54198859 55085541 55725893 57037833 58323312
$$ packed form
3006E8461289J24986j10639n98827n0902M07504L19012k48139k62051J55423O06309
2996E8803965M32864L75079O76324J829676J200385K239911K555645K050896K272431
2987G2437176K552851J701841j109957k121045j701816k199908j514490j069147
2979F6975505j082089j296492j222416k57905n64950J56770m99232j461112N27195
2970F1275274R2362O95743J91059J220783l28647r35803j164496r43001q57285
2961E9245989k27287p43027M89486m98568L35802L92837J327982m00234j090292
2952E8832688J9201r13997k98407J113693j15950l93972Q53431l35824j029189
2943E7731674k436724m34286j121813l11330P71338Q86682O40352J311940J285479
$$ plain form
2934 58323312 58805535 58657833 56876814 54156097 52088493 49684428 47316083 45494161
2926 45494161 44458602 44271276 43791898 42904969 42333188 41413845 40321898 39940651 40486040
2917 40486040 41035890 41657201 41784652 42180334 41509919 40796102 40725123 40279294 39445579 39419452
2907 39419452 39123971 39897666 40078627 41673393 42028528 42115824 42106885 42304311 42149536 41259537
2897 41259537 41444749 40281698 38081459 36680591 36168406 35619862 35309554 34660452 34098648
2888 34098648 33716998 33130948 32285949 31377102 31563566 30545274 30809037 30850814 30113992
2879 30113992 30014460 29556578 29814423 29264216 29831434 29687200 29819634 29186704 28622543 28658486
2869 28658486 29207200 28588368 28193600 27615678 27030242 26465845 26028446 25245822 24904979
$$ packed form
2934E8323312M82223j47702j781019k720717k067604k404065k368345j821922
2926D5494161j035559j87326m79378q86929n71781r19343j091947l81247N45389
2917D0486040N49850O21311J27451L95682o70415p13817p0979m45829q33715k6127
2907C9419452k95481P73695J80961J594766L55135Q7296q939J97426j54775q89999
2897D1259537J85212j163051k200239j400868n12185n48544l10308o49102n61804
2888C4098648l81650n86050q44999r08847J86464j018292K63763M1777p36822
2879C0113992r9532m57882K57845n50207N67218j44234J32434o32930n64161L5943
2869B8658486N48714o18832l94768n77922n85436n64397m37399p82624l40843
$$ plain form
2860 24904979 24631448 24847522 24283819 23934316 23631354 23438781 22748116 22584111 22937157
2851 22937157 22443922 21348747 21491785 21169173 20766245 21825669 21393798 21477205 20702711
2842 20702711 19365418 19291303 20566428 20588468 20182351 19513341 19536706 19017502 17946720
2833 17946720 17250338 16384848 15463038 14272399 14635174 13868513 12576984 13079227 13349416
2824 13349416 12468933 13038147 13130352 12642898 12001751 11230672 11358375 11594372 11975428 11065601
2814 11065601 10448949 10867804 11298720 10506933 9835340 9994283 10356461 11049495 9789320
2805 9789320 9284966 9010966 8452527 8228893 7472403 7426579 7775728 7326641 6201202 5530012
2795 5530012 6430062 6935139 6399416 6530672 6660422 6347216 6364538 6290966 6296908 5652961
$$ packed form
2860B4904979k73531K16074n63703l49503l02962j92573o90665j64005L53046
2851B2937157m93235j095175J43038l22612m02928J059424m31871Q3407p74494
2842B0702711j337293p4115J275125K2040m06117o69010K3365n19204j070782
2833A7946720o96382q65490r21810j190639L62775p66661j291529N02243K70189
2824A3349416q80483N69214R2205m87454o41147p71079J27703K35997L81056r09827
2814A1065601o16652M18855M30916p91787o71593J58943L62178O93034j260175
2805I789320n04354k74000n58439k23634p56490m5824L49149m49087j125439o71190
2795E530012R00050N05077n35723J31256J29750l13206J7322p3572N942o43947
$$ plain form
2785 5652961 6023970 6037903 6121101 6058249 5130977 5662981 4973784 4933216 4707565 5066444
2775 5066444 4365073 4206417 4318020 4423043 4539120 4538888 4807131 4647686 4031337 3476632
2765 3476632 3522792 3901762 3242668 2999319 3237965 2799520 3520271 2941055 2777427 3087114
2755 3087114 2783615 3519548 4061860 3057734 2864807 3100520 2649223 2608386 2717950 2684749
2745 2684749 2809631 2920508 2703428 2646468 2472958 2942402 2595385 2555074 2591325 3321922
2735 3321922 4502041 3363185 2511859 3108097 2537630 2128787 2320810 2077727 1395182
2726 1395182 2409788 2214407 2521884 3197777 3055778 2874283 2261168 1852736 2075878
2717 2075878 1760289 1620094 1664594 1071262 1940439 2338038 1861139 2084920 1890983 1827262
$$ packed form
2785E652961L71009J3933Q3198o2852r27272N32004o89197m0568k25651L58879
2775E066444p01371j58656J11603J05023J16077k32K68243j59445o16349n54705
2765C476632M6160L78970o59094k43349K38646m38445P20751n79216j63628L09687
2755C087114l03499P35933N42312j004126j92927K35713m51297m0837J09564l3201
2745B684749J24882J10877k17080n6960j73510M69444l47017m0311L6251P30597
2735C321922J180119j138856q51326N96238n70467m08843J92023k43083o82545
2726A395182J014606j95381L07477O75893j41999j81495o13115m08432K23142
2717B075878l15589j40195M4500n93332Q69177L97599m76899K23781j93937o3721
$$ plain form
2707 1827262 1670671 2025410 2452364 1957327 1666228 869537 608681 765509 1084089 1269371
2697 1269371 2280445 2721355 1489798 886680 543043 1534012 1751754 1005865 1196837
2688 1196837 887378 1345824 1685924 1790757 1496674 1591043 1334954 507811 1036824 1751915
2678 1751915 1894851 1741268 1443192 1585127 1647748 1868837 2012489 2361916 1346225 1270727
2668 1270727 743900 952035 1696321 1352172 1107083 1611733 1435739 938175 797881 1118979
2658 1118979 1559291 1623983 1119290 1430682 1254559 1468661 1907576 2039754 3067592 2821537
2648 2821537 1440599 2405206 2620682 1193942 1368892 1866389 1990910 1433538 1236115
2639 1236115 1802668 1777629 1381445 880969 714807 1419761 1682998 1336050 1083598 1856371
$$ packed form
2707A827262j56591L54739M26954m95037k91099p96691k60856J56828L18580J85282
2697A269371J011074M40910j231557o03118l43637R90969K17742p45889J90972
2688A196837l09459M58446L40100J04833k94083R4369k56089q27143N29013P15091
2678A751915J42936j53583k98076J41935O2621K21089J43652L49427j015691p5498
2668A270727n26827K08135P44286l44149k45089N04650j75994m97564j40294L21098
2658A118979M40312O4692n04693L11392j76123K14102M38915J32178J027838k46055
2648B821537j380938R64607K15476j426740J74950M97497J24521n57372j97423
2639A236115N66553k5039l96184n00476j66162P04954K63237l46948k52452P72773
$$ plain form
2629 1856371 1587901 1561645 1595174 1590138 1199543 783391 1979953 2217396 2613596 2354121
2619 2354121 1913145 855300 1013444 801304 151451 1522005 1193356 1181292 1231419 903028
2609 903028 919184 908396 1811404 1616854 1333101 1526064 1736068 1537882 1767921 2285631
2599 2285631 2558470 1893929 2323496 2425588 1678012 2005476 2238172 2445023 2713791 2186050
2589 2186050 1651810 1792570 1341254 1906329 1480001 2276823 2117597 1617847 2045522 1974996
2579 1974996 887985 1372528 2335584 2619124 2351427 2382298 2177168 1730767 932361 850509
2569 850509 1230439 2114408 2430107 1917367 566037 492182 1334186 2319219 2381095 1714768
2559 1714768 1507736 1185190 1172912 1756620 2436079 1865470 1594930 1348360 1923359 1471356
$$ packed form
2629A856371k68470k6256L3529n036l90595m16152J196562K37443L96200k59475
2619B354121m40976j057845J58144k12140o49853J370554l28649j2064N0127l28391
2609I03028J6156j0788R03008j94550k83753J92963K10004j98186K30039N17710
2599B285631K72839o64541M29567J02092p47576L27464K32696K06851K68768n27741
2589B186050n34240J40760m51316N65075m26328P96822j59226m99750M27675p0526
2579A974996j087011M84543R63056K83540k67697L0871k05130m46401p98406q1852
2569H50509L79930Q83969L15699n12740j351330p3855Q42004R85033O1876o66327
2559A714768k07032l22546j2278N83708O79459n70609k70540k46570N74999m52003
$$ plain form
2549 1471356 1671454 1799841 1320726 1714757 2076856 3078040 2328210 1800018 2096890
2540 2096890 1791681 1143525 42718 868413 884415 332782 497472 541138 1033037 828647
2530 828647 413975 -160303 57599 438947 862432 1296261 568216 644473 1107427 1216707
2520 1216707 706034 297105 -411718 454028 528349 66774 649798 -83938 -227133 -360167
2510 -360167 -179861 139844 858634 794718 988546 1183311 847717 710327 738893 828225
2500 828225 671269 -71652 19463 767475 526404 485092 701605 311011 -16166 161571
2490 161571 696055 1396466 958589 598667 907123 1020210 -90702 497407 704295 -226945
2480 -226945 -250513 129732 -89818 144354 -34385 -97360 23125 -645487 -763262 -333225
$$ packed form
2549A471356K00098J28387m79115L94031L62099J001184p49830n28192K96872
2540B096890l05209o48156j100807Q25695J6002n51633J64690M3666M91899k04390
2530H28647m14672n74278K17902L81348M23485M33829p28045P6257M62954J09280
2520A216707n10673m08929p08823Q65746P4321m61575N83024p33736j43195j33034
2510c60167J80306L19705P18790o3916J93828J94765l35594j37390K8566Q9332
2500H28225j56956p42921R1115P48012k41071m1312K16513l90594l27177J77737
2490A61571N34484P00411m37877l59922L08456J13087j110912N88109K06888r31240
2480b26945k3568L80245k19550K34172j78739o2975J20485o68612j17775M30037
$$ plain form
2470 -333225 -587459 -628129 -259336 -533529 -793534 -721588 214508 11313 -47598 -132459
2460 -132459 -17629 353700 173729 -1108 -16103 75101 -480149 -848856 -1263047 -408395
2450 -408395 -1192821 -1005303 -254004 32618 -273039 -69444 -231258 -1041110 -159292 -468327
2440 -468327 -577738 -411485 -191561 -436617 -197460 -135220 -411509 -518726 -865614 -637843
2430 -637843 -200222 -435892 -1016739 -95482 -1126247 -668657 6063 -508965 -322012 176820
2420 176820 500783 671215 245912 -302577 -380571 -1234240 -1385289 -866278 -937959 -675786
2410 -675786 287891 -228817 -519549 -415192 341096 776164 1619341 1684475 1309234 564672
2400 564672 505814 683182 344821 418420 -201458 -191400 -326965 -1075027 -1329917 -1548872
$$ packed form
2470c33225k54234m0670L68793k74193k60005P1946R36096k03195n8911q4861
2460a32459J14830L71329j79971j74837j4995R1204n55250l68707m14191Q54652
2450d08395p84426J87518P51299K86622l05657K03595j61814q09852Q81818l09035
2440d68327j09411J66253K19924k45056K39157O2240k76289j07217l46888K27771
2430f37843M37621k35670n80847R21257j030765M57590O74720n15028J86953M98832
2420A76820L23963J70432m25303n48489p7994q53669j51049N19011p1681K62173
2410f75786R63677n16708k90732J04357P56288M35068Q43177O5134l75241p44562
2400E64672n8858J77368l38361P3599o19878J0058j35565p48062k54890k18955
$$ plain form
2390 -1548872 -793090 -74617 -376702 181084 369815 -401482 -288584 181083 -35967 -150217
2380 -150217 698967 486658 -367127 -1248106 -877781 -919018 -690047 367528 165103 334169
2370 334169 1528 123194 347236 -140424 -47448 258211 961393 1414431 82437 -537376
2360 -537376 108418 265042 -195559 1130167 1593266 318306 -173334 -503396 -81559
2351 -81559 316027 336954 -217157 -266097 279421 -2154 -402683 -269839 -560228 -254092
2341 -254092 -465446 -273714 -1033826 -766917 -1097105 -510903 -360216 -538137 1999 394814
2331 394814 -36742 -472268 -2622 -718315 -933675 -549031 357304 352429 -158471 -45038
2321 -45038 -369056 -781046 154030 363787 355363 -248909 153599 -324374 -652226 -248061
$$ packed form
2390a548872P55782P18473l02085N57786J88731p71297J12898M69667k17050j14250
2380a50217Q49184k12309q53785q80979L70325m1237K28971J057575k02425J69066
2370C34169l32641J21666K24042m87660R2976L05659P03182M53038j331994o19813
2360e37376O45794J56624m60601J325726M63099j274960m91640l30062M21837
2351h1559L97586K0927n54111m8940N45518k81575m00529J32844k90389L06136
2341b54092k11354J91732p60112K66909l30188N86202J50687j77921N40136L92815
2331C94814m31556m35526M69646p15693k15360L84644R06335m875n10900J13433
2321d5038l24018m11990R35076K09757q424o04272M02508m77973l27852M04165
$$ plain form
2311 -248061 -824289 -682808 -92145 -739599 -1073542 -869527 317389 465167 544762 353199
2301 353199 400241 568809 707481 608091 371766 611956 432414 -104077 239618 328627
2291 328627 244280 -375980 55122 1033377 458248 818878 962255 903796 543377 1345280
2281 1345280 945967 189600 -95400 214696 78978 382598 220308 -552324 -790002 37893
2271 37893 255456 249472 527901 903055 1171704 832732 528045 391519 872481 408809
2261 408809 -322017 308864 30963 -15032 139948 133520 495601 563028 -628455 -698434
2251 -698434 27310 -63783 -140682 130701 319725 -492632 334252 409635 434315 272734
2241 272734 1118252 676129 594024 1368339 575799 192881 330635 570545 745879 435508
$$ packed form
2311b48061n76228J41481N90663o47454l33943K04015J186916J47778P9595j91563
2301C53199M7042J68568J38672r9390k36325K40190j79542n36491L43695Q9009
2291C28627q4347o20260M31102R78255n75129L60630J43377n8459l60419Q01903
2281A345280l99313p56367k85000L10096j35718L03620j62290p72632k37678Q27895
2271C7893K17563n984K78429L75154K68649l38972l04687j36526M80962m63672
2261D08809p30826O30881k77901m5995J54980o428L62081O7427j191483o9979
2251f98434P25744r1093p6899K71383J89024q12357Q26884P5383K4680j61581
2241B72734Q45518m42123q2105P74315p92540l82918J37754K39910J75334l10371
$$ plain form
2231 435508 927877 1281492 1224997 601807 687723 1094157 317809 806928 1489049 1108515
2221 1108515 1146197 713632 266878 -218065 -350983 -39579 337227 717540 1439340 644058
2211 644058 1332424 1096623 1162606 260928 1029809 1839015 1680645 1539942 1058258 1730797
2201 1730797 1939318 2241463 1611307 2106815 2362677 1235205 665570 1149610 1111046 1035496
2191 1035496 1080066 1262281 1844709 1916268 1396422 2286178 2655244 2993146 2308698 2357954
2181 2357954 2019036 2298612 1697073 2135467 2303277 3109179 3033106 2498149 3311145 3317743
2171 3317743 3031636 3495552 3243743 3697644 3586557 3817354 3994517 4451894 4684054 5345838
2161 5345838 5133157 4775345 4527670 5113854 5651254 4822009 4654179 5310034 5520508 5434686
$$ packed form
2231D35508M92369L53615n6495o23190Q5916M06434p76348M89119O82121l80534
2221A108515L7682m32565m46754m84943j32918L11404L76806L80313P21800p95282
2211F44058O88366k35801O5983r01678P68881Q09206j58370j40703m81684O72539
2201A730797K08521L02145o30156M95508K55862j127472n69635M84040l8564p5550
2191A035496M4570J82215N82428P1559n19846Q89756L69066L37902o84448M9256
2181B357954l38918K79576o01539M38394J67810Q05902p6073n34957Q12996O598
2171C317743k86107M63916k51809M53901j11087K30797J77163M57377K32160O61784
2161E345838k12681l57812k47675N86184N37400q29245j67830O55855K10474q5822
$$ plain form
2151 5434686 5979426 5646463 5992214 5694002 5825554 5741220 5093527 5617257 6133576 6654514
2141 6654514 7463407 7980503 8024607 9261408 9289428 9012174 9154676 8885095 9232515 9151259
2131 9151259 9903228 11051654 12329127 12421623 13851527 14068974 14967597 15901514 16700291
2122 16700291 17643873 18380848 18521857 19457869 20748865 21890991 24028766 26633717 28714780
2113 28714780 30635221 32477333 34716128 36674293 40115975 44089395 49858470 56274967
2105 56274967 64487997 74777673 87256475 104652929 127513351 153442933 172867655
2098 172867655 171723291 153965403 128798068 102674580 83311882 68542558 57391115
2091 57391115 49350469 41883841 36789178 32555968 28980446 27646021 26170519 25501031
$$ packed form
2151E434686N44740l32963L45751k98212J31552q4334o47693N23730N16319N20938
2141F654514Q08893N17096M4104J236801K8020k77254J42502k69581L47420q1256
2131I151259P51969J148426J277473R2496J429904K17447Q98623R33917P98777
2122A6700291R43582P36975J41009R36012J290996J142126K137775K604951K081063
2113B8714780J920441J842112K238795J958165L441682L973420N769075O416497
2105E6274967Q213030J0289676J2478802J7396454K2860422K5929582J9424722
2098A72867655j144364j7757888k5167335k6123488j9362698j4769324j1151443
2091E7391115q040646p466628n094663m233210l575522j334425j475502o69488
$$ plain form
2083 25501031 23224533 21304054 19883203 18296791 17255064 16682084 15485428 14150527
2075 14150527 12462742 11661704 11329743 10973822 10274220 9396675 9107681 9299352 8613739
2066 8613739 7856315 7613157 7507565 7722725 7209424 6448782 6651716 5492294 4677282
2057 4677282 5451767 4997374 5157841 4628315 4525584 4710493 4289467 4216103 4300809 4135646
2047 4135646 4227228 4097970 3667854 3714108 2372251 2470004 3155211 3810494 4030173 2792001
2037 2792001 2430208 2663865 2187121 2232668 2619360 2536462 2279089 2534457 3277789 2844859
2027 2844859 2598967 3006963 1773033 1537870 1269212 1653691 2231176 1857889 2433799
2018 2433799 1983176 1819087 2138865 1577049 1211429 1987706 1297245 254498 672816
$$ packed form
2083B5501031k276498j920479j420851j586412j041727n72980j196656j334901
2075A4150527j687785q01038l31961l55921o99602q77545k88994J91671o85613
2066H613739p57424k43158j05592K15160n13301p60642K02934j159422q15012
2057D677282P74485m54393J60467n29526j02731J84909m21026p3364Q4706j65163
2047D135646R1582j29258m30116M6254j341857R7753O85207O55283K19679j238172
2037B792001l61793K33657m76744M5547L86692q2898k57373K55368P43332m32930
2027B844859k45892M07996j233930k35163k68658L84479N77485l73287N75910
2018B433799m50623j64089L19778n61816l65620P76277o90461j042747M18318
$$ plain form
2009 672816 496001 981384 2316572 970453 114198 456613 1102274 1213233 111599
2000 111599 431447 109355 568286 237212 -412127 384566 539758 636005 299375 778011
1990 778011 1189706 1360134 1039332 -205981 290415 279428 69068 763635 267162 565512
1980 565512 366449 657298 748658 -25620 -269557 236457 804827 -169191 -101976 522562
1970 522562 675180 262674 483213 340069 -529861 -201495 371081 -452796 -627622 387435
1960 387435 655557 499712 882954 589341 -77727 -29993 352938 -117033 261428 -118224
1950 -118224 276109 -25137 485300 1177661 487034 457194 396407 393387 -279528 70948
1940 70948 -163149 -630003 -1175215 -292040 87676 47768 19001 739251 1309788 1436598
$$ packed form
2009F72816j76815M85383J335188j346119q56255L42415O45661J10959j101634
2000A11599L19848l22092M58931l31074o49339P96693J55192R6247l36630M78636
1990G78011M11695J70428l20802j245313M96396j0987k10360O94567m96473K98350
1980E65512j99063K90849R1360p74278k43937N06014N68370r74018O7215O24538
1970E22562J52618m12506K20539j43144q69930L28366N72576q23877j74826J015057
1960C87435K68122j55845L83242k93613o67068M7734L82931m69971L78461l79652
1950a18224L94333l01246N10437O92361o90627k9840o0787l020o72915L50476
1940G0948k34097m66854n45212Q83175L79716l9908k8767P20250N70537J26810
$$ plain form
1930 1436598 774132 111097 156832 -396815 104065 22324 -862396 -530403 -462883 -876902
1920 -876902 -924537 -266837 149611 510732 29180 -389739 -249302 284116 1194630 1314548
1910 1314548 1207461 525354 276027 -358297 -830661 -707985 -1151508 -988186 -740230 -469430
1900 -469430 -207101 -75798 -79780 -307297 -135430 -153876 -704209 -472939 -817705 -1525689
1890 -1525689 -514395 99202 -270197 -167177 233067 -80358 -302472 251759 196140 75906
1880 75906 -136818 -60678 -95697 -185260 206741 -486634 248116 611546 252971 187342 178664
1869 178664 408997 -182060 -50072 323447 -114497 -1082013 -678166 -648122 -1015223 -197352
1859 -197352 140465 296661 312694 -536538 -535233 30413 -496594 -806520 -369454 625618
$$ packed form
1930A436598o62466o63035M5735n53647N00880q1741q84720L31993O7520m14019
1920h76902m7635O57700M16448L61121m81552m18919J40437N33418R10514J19918
1910A314548j07087o82107k49327o34324m72364J22676m43523J63322K47956K70800
1900d69430K62329J31303l982k27517J71867j8446n50333K31270l44766p07984
1890a525689J011294O13597l69399J03020M00244l13425k22114N54231n5619j20234
1880G5906k12724P6140l5019q9563L92001o93375P34750L63430l58575o5629q678
1869A78664K30333n91057J31988L73519m37944r67516M03847L0044l67101Q17871
1859a97352L37817J56196J6033q49232J305N65646n27007l09926M37066R95072
$$ plain form
1849 625618 675962 -450903 75311 928946 1189139 338593 58704 494886 11798 -18732
1839 -18732 28124 80706 303336 556105 687335 751851 176305 162668 571263 311707 81016
1828 81016 845106 423339 488220 953494 612949 749460 1330719 1352276 728851 631022
1818 631022 1307042 1085066 100182 193673 -579629 -353930 -669274 -383994 -29895 -286133
1808 -286133 -164371 -874421 -608455 -397430 258954 343958 612290 765990 -56692 -531479
1798 -531479 -990229 -656237 -679662 -367177 -441946 -540483 -676303 -898519 -336646 -705619
1788 -705619 -698214 -720541 -1736892 -1701437 -185990 -24081 -115360 -185120 -409532 48101
1778 48101 -685177 -943059 -21194 20104 -408760 -654716 -610443 -715384 -428683 -1376991
$$ packed form
1849F25618N0344j126865N26214Q53635K60193q50546k79889M36182m83088l0530
1839a8732M6856N2582K22630K52769J31230O4516n75546j3637M08595k59556k30691
1828H1016P64090m21767O4881M65274l40545J36511N81259K1557o23425r7829
1818F31022O76020k21976r84884R3491p73302K25699l15344K85280L54099k56238
1808b86133J21762p10050K65966K11025O56384Q5004K68332J53700q22682m74787
1798e31479m58750L33992k3425L12485p4769r8537j35820k22216N61873l68973
1788g05619P405k2327j016351L5455J515447J61909r1279o9760k24412M57633
1778D8101p33278k57882R21865M1298m28864k45956M4273j04941K86701r48308
$$ plain form
1768 -1376991 -1083582 -1327142 -1629791 -1601898 -1078632 -617275 -531265 10461 -670562 -664732
1758 -664732 -363524 -216774 -166857 -609699 -653120 -540013 -1009858 -1394771 -1158489 -377176
1748 -377176 -224867 -547600 -724976 -1268410 -919618 -713763 -392334 -109524 -281327 -13150
1738 -13150 302838 -202726 -637044 -863377 -286241 85407 -128106 -228265 -273229 197084
1728 197084 634405 -163169 -665555 -285496 -288376 -319530 -729132 349385 901343 70185
1718 70185 -57053 -117347 87441 218229 -168042 102957 -512595 35785 660057 -12810
1708 -12810 258911 -166583 -141145 7133 -908078 -326370 -457868 -381854 -830302 51729
1698 51729 864138 189554 -692430 -806733 -528211 -175661 -564879 -555497 -714030 -845657
$$ packed form
1768a376991K93409k43560l02649K7893N23266M61357Q6010N41726o81023N830
1758f64732L01208J46750M9917m42842m3421J13107m69845l84913K36282P81313
1748c77176J52309l22733j77376n43434L48792K05855L21429K82810j71803K68177
1738a3150L15988n05564m34318k26333N77136L71648k13513j00159m4964M70313
1728A97084M37321p97574n02386L80059k880l1154m09602J078517N51958q31158
1718G0185j27238o0294K04788J30788l86271K70999o15552N48380O24272o72867
1708a2810K71721m25494K5438J48278r15211N81708j31498P6014m48448Q82031
1698E1729Q12409o74584q81984j14303K78522L52550l89218R382j58533j31627
$$ plain form
1688 -845657 -737159 -816694 -946667 -317322 -1368276 -807278 -582478 -523424 -424381 -43816
1678 -43816 -14270 -506790 -126024 -1092569 -860623 -1636004 -663351 -995307 -675860 677649
1668 677649 525481 -318720 -411491 102785 -225776 -609319 -264517 438974 185712 -103299
1658 -103299 88247 -341403 -513302 -609542 -615342 -371462 -285296 392371 579886 776794
1648 776794 625826 571958 294027 -618143 -110846 -450622 -659128 -549167 -754225 -1137684
1638 -1137684 -1169432 -1039803 -40875 529160 411339 -21192 361442 -30123 59842 223932
1628 223932 -799483 -415129 -24678 -6612 -501204 -1001251 -320442 -422048 -616059 -584015
1618 -584015 -953992 -968881 -915020 -134160 410660 755682 547196 -17099 -1102684 -697622
$$ packed form
1688h45657J08498p9535j29973O29345j050954N60998K24800N9054R9043L80565
1678d3816K9546m92520L80766r66545K31946p75381R72653l31956L19447J353509
1668F77649j52168q44201r2771N14276l28561l83543L44802P03491k53262k89011
1658a03299J91546m29650j71899r6240n800K43880Q6166O77667J87515J96908
1648G76794j50968n3868k77931r12170N07297l39776k08506J09961k05058l83459
1638a137684l1748J29629R98928N70035j17821m32531L82634l91565Q9965J64090
1628B23932j023415L84354L90451J8066m94592n00047O80809j01606j94011L2044
1618e84015l69977j4889N3861P80860N44820L45022k08486n64295j085585M05062
$$ plain form
1608 -697622 -133879 257070 351611 363324 -198697 -697785 -875495 -399006 99006 -830854
1598 -830854 -411751 700190 444126 365941 1101978 1213271 858356 -193460 73453 -110908
1588 -110908 -760507 -771010 -293217 -551212 31083 661005 1067137 573574 -438970 142433
1578 142433 -79030 584244 222139 30051 605610 238912 -175134 -670204 -623478 -387049
1568 -387049 -382744 -690833 -94177 -426122 -224871 -319374 -959127 -1630627 -1073472 -1724352
1558 -1724352 -1127795 -503389 14136 -102962 -1044609 -268434 -179451 -72858 161164 83185
1548 83185 111214 607825 712920 -202491 -690739 -1033696 -878473 255674 411816 687404
1538 687404 244816 567409 -135089 -303418 -587478 -603608 -587593 -899149 -844789 2248
$$ packed form
1608f97622N63743L90949R4541J1713n62021m99088j77710M76489M98012r29860
1598h30854M19103J111941k56064p8185P36037J11293l54915j051816K66913j84361
1588a10908o49599j0503M77793k57995N82295O29922M06132m93563j012544N81403
1578A42433k21463O63274l62105j92088N75559l66698m14046m95070M6726K36429
1568c87049M305l08089N96656l31945K01251r4503o39753o71500N57155o50880
1558a724352N96557O24406N17525j17098r41647P76175Q8983J06593K34022p7979
1548H3185K8029M96611J05095r15411m88248l42957J55223J134147J56142K75588
1538F87404m42588L22593p02498j68329k84060j6130J6015l11556N4360Q47037
$$ plain form
1528 2248 185888 -144836 -673308 -281189 394750 97038 274566 314302 -495932 13335
1518 13335 -769274 -446932 -583414 -562518 -413471 -360720 -276343 -1160304 -824811 -946266
1508 -946266 -832988 -1437383 -1577436 -662682 -194120 -307163 -300598 -403991 -1002650 -1312155
1498 -1312155 -403236 -176849 388443 -637908 -1207648 -490006 170737 286654 -37535
1489 -37535 -743071 -340782 -417411 -959448 380769 81665 402897 808248 1101185 555570
1479 555570 996320 650230 -538526 -248373 -634882 -73480 685955 467817 -175081 -528341
1469 -528341 -532652 -1004082 -234369 456183 320523 860386 801824 110776 -468365 -616284
1459 -616284 -27595 106371 84238 393547 -591412 -64618 421272 147414 -128316 -93138
$$ packed form
1528B248J83640l30724n28472L92119O75939k97712J77528L9736q10234N09267
1518A3335p82609L22342j36482K0896J49047N2751Q4377q83961L35493j21455
1508i46266J13278o04395j40053R14754M68562j13043O565j03393n98659l09505
1498a312155R08919K26387N65292j026351n69740P17642O60743J15917l24189
1489c7535p05536M02289p6629n42037J340217k99104L21232M05351K92937n45615
1479E55570M40750l46090j188756K90153l86509N61402P59435k18138o42898l53260
1469e28341m311m71430P69713O90552j35660N39863n8562o91048n79141j47919
1459f16284N88689J33966k2133L09309r84959N26794M85890k73858k75730L5178
$$ plain form
1449 -93138 -410163 128889 516598 96018 -990351 -289107 -166116 -1045741 -42469 21
1439 21 -379047 -242467 195004 964773 114702 -342452 349833 -50292 -990818 -1268835
1429 -1268835 -1846757 -1039850 -345022 543919 272870 711690 371347 -816984 -1219979
1420 -1219979 -860672 -165123 136749 403183 -968612 -1198620 -108079 -206101 150927
1411 150927 311020 307899 204091 -328660 716716 -24076 635951 705008 -137 -41105
1401 -41105 -270394 -757075 -1007226 -856980 -417878 -224813 87055 -345501 -872805 -1210257
1391 -1210257 379644 46975 -474620 -172569 1047333 602371 354727 518714 938621
1382 938621 1242153 60408 543582 306280 -53975 -467481 -488976 171742 -108634 -204676
$$ packed form
1449i3138l17025N39052L87709m20580j086369P01244J22991q79625J003272M2490
1439B1l79068J36580M37471P69769q50071m57154O92285m00125r40526k78017
1429a268835n77922Q06907O94828Q88941k71049M38820l40343j188331m02995
1420a219979L59307O95549L01872K66434j371795k30008J090541r8022L57028
1411A50927J60093l121j03808n32751J045376p40792O60027O9057p05145m0968
1401d1105k29289m86681k50151J50246M39102J93065L11868m32556n27304l37452
1391a210257J589901l32669n21595L02051J219902m44962k47644J63987M19907
1382I38621L03532j181745M83174k37302l60255m13506k1495O60718k80376r6042
$$ plain form
1372 -204676 -515420 -268579 -144839 334571 -27385 -654638 -229962 -866866 -790920 -401618
1362 -401618 410269 -21423 -275268 450838 269055 -2742 62011 136225 -412081 -190635
1352 -190635 -37494 -169747 70519 97251 419916 840779 -183579 -950027 -1018109 -142196
1342 -142196 -426269 -908322 -1133681 -343724 311035 417252 84876 -197756 748369 386450
1332 386450 831441 984897 567871 -404861 -334118 -400733 -8422 -225395 526979 -18992
1322 -18992 -16521 -71913 379785 80321 190567 -489621 -92957 -154152 -539267 -307160 67176
1311 67176 -518053 -1013424 -536053 -269655 109704 803789 229160 243332 410084 344835
1301 344835 45679 -110588 -245472 -273966 -483571 -734929 -233009 -1082091 -1158265 -645291
$$ packed form
1372b04676l10744K46841J23740M79410l61956o27253M24676o36904P5946L89302
1362d01618Q11887m31692k53845P26106j81783k71797O4753P4214n48306K21446
1352a90635J53141j32253K40266K6732L22665M20863j024358p66448o8082Q75913
1342a42196k84073m82053k25359P89957O54759J06217l32376k82632R46125l61919
1332C86450M44991J53456m17026r72732P0743o6615L92311k16973P52374n45971
1322a8992K471n5392M51698k99464J10246o80188L96664o1195l85115K32107L74336
1311F7176n85229m95371M77371K66398L79359O94085n74629J4172J66752o5249
1301C44835k99156j56267j34884k8494k09605k51358N01920q49082p6174N12974
$$ plain form
1291 -645291 -403954 -410050 -370012 -480064 2921 1177843 324525 -542007 -288262 -30375
1281 -30375 -228689 -159437 512165 -1136125 -453191 -605272 -119547 -462472 163571 -432908
1271 -432908 -28224 -101289 -165299 27021 -345109 -433888 -370014 -444579 122486 489467 330500
1260 330500 -361018 -544642 -1116461 -279669 -372100 -821342 -349464 -662289 -79767 97827
1250 97827 796827 398351 91744 485017 662900 320352 439271 38090 -85549 -177576
1240 -177576 652885 185914 71529 752300 800004 432172 444456 507795 8822 -308011
1230 -308011 -465443 -771432 -872995 -605061 -544958 -988263 -1376723 -947645 -1056829 -1642834
1220 -1642834 -1383819 -793096 -448651 131190 731863 -180513 -4281 -21985 -280864 -429672
$$ packed form
1291f45291K41337o096M0038j10052M82985J174922q53318q66532K53745K57887
1281c0375j98314O9252O71602j648290O82934j52081M85725l42925O26043n96479
1271d32908M04684p3065o4010J92320l72130q8779O3874p4565N67065L66981j58967
1260C30500o91518j83624n71819Q36792r2431m49242M71878l12825N82522J77594
1250I7827O99000l98476l06607L93273J77883l42548J18919m01181j23639r2027
1240a77576Q30461m66971j14385O80771M7704l67832J2284O3339m98973l16833
1230c08011j57432l05989j01563K67934O0103m43305l88460M29078j09184n86005
1220a642834K59015N90723L44445N79841O00673r12376J76232j7704k58879j48808
$$ plain form
1210 -429672 -510344 248300 318188 515664 -57399 -727133 -140126 580002 -305185 -589848
1200 -589848 -729090 245115 549622 -155965 -484947 -686592 -627550 -430793 -587925 -817483
1190 -817483 -518724 -883787 -673140 -251916 -264938 -502839 -7711 180339 -981208 -406604
1180 -406604 545292 607722 729338 151549 731957 326519 -13207 508756 300628 264746
1170 264746 412727 822637 72325 -293423 72668 -64497 -180677 -801956 -1056902 -788081
1160 -788081 -672202 -371959 -458802 -279986 -284437 -234226 228775 -26114 498115 234350
1150 234350 -46921 -19428 -582050 -598702 -637102 -820306 84248 -284639 -58298 39690
1140 39690 -36182 41794 -140244 -316389 -131417 595335 110771 -651668 -330057 103935
$$ packed form
1210d29672q0672P58644O9888J97476n73063o69734N87007P20128q85187k84663
1200e89848j39242R74205L04507p05587l28982k01645N9042J96757j57132k29558
1190h17483K98759l65063K10647M21224j3022k37901M95128J88050j161547N74604
1180d06604R51896O2430J21616n77789N80408m05438l39726N21963k08128l5882
1170B64746J47981M09910p50312l65748L66091j37165j16180o21279k54946K68821
1160g88081J15879L00243q6843J78816m451N0211M63001k54889N24229k63765
1150B34350k81271K7493n62622j6652l8400j83204R04554l68887K26341R7988
1140C9690p5872P7976j82038j76145J84972P26752m84564p62439L21611M33992
$$ plain form
1130 103935 -168868 673397 314545 -95708 229403 -496254 -104241 354608 299530 35013
1120 35013 46267 60770 -618122 -601381 35000 555740 111280 -224816 242437 1136094
1110 1136094 856164 37928 127875 134459 429122 696466 -614115 -1161870 -860485 -1066932
1100 -1066932 -215569 511856 1235665 1436543 396295 164187 -632983 -851744 -469409
1091 -469409 -395671 -723178 -651892 -1061444 -942101 -930973 -1050109 -1096650 -903016 -341440
1081 -341440 -567927 332072 -253456 -594701 -414807 -41312 -156276 115696 139751 -622320
1071 -622320 -187518 491948 461674 -532 -126090 -84528 417302 121527 184638 149696
1061 149696 239090 -131204 -515979 -240806 218183 -258725 -489082 -260331 -34817 260657
$$ packed form
1130A03935k72803Q42265l58852m10253L25111p25657L92013M58849n5078k64517
1120C5013J1254J4503o78892J6741O36381N20740m44460l36096M67253Q93657
1110A136094k79930q18236Q9947O584K94663K67344j310581n47755L01385k06447
1100a066932Q51363P27425P23809K00878j040248k32108p97170k18761L82335
1091d69409P3738l27507P1286m09552J19343J1128j19136m6541J93634N61576
1081c41440k26487Q99999n85528l41245J79894L73495j14964K71972K4055p62071
1071f22320M34802O79466l0274m62206j25558M1562N01830k95775O3111l4942
1061A49696Q9394l70294l84775K75173M58989m76908k30357K28751K25514K95474
$$ plain form
1051 260657 549567 398470 367976 968194 860551 275583 -232320 -320094 -285147 -130840
1041 -130840 -120361 113179 241770 292595 144564 241389 85244 18663 189051 582537
1031 582537 293355 -54033 136370 184324 449895 231901 -58244 76000 -349092 -166338
1021 -166338 499721 1064462 616934 745021 794687 161059 -612598 -51371 -512477 -674195
1011 -674195 -184563 118430 129781 -266105 -788352 -587251 -564522 -800808 -315360 -108524
1001 -108524 12983 -733990 -612599 144734 -226298 -376393 254739 580852 1030138 1014234
991 1014234 409942 833563 1749306 716605 -30946 -232740 152227 355635 60528 291068
981 291068 214595 -125621 510895 9869 -90822 29667 -105601 30737 -59900 -1048176
$$ packed form
1051B60657K88910j51097l0494O00218j07643n84968n07903q7774L4947J54307
1041a30840J0479K33540J28591N0825j48031R6825j56145o6581J70388L93486
1031E82537k89182l47388J90403M7954K65571k17994k90145J34244m25092J82754
1021a66338O66059N64741m47528J28087M9666o33628p73657N61227m61106j61718
1011f74195M89632L02993J1351l95886n22247K01101K2729k36286M85448K06836
1001a08524J21507p46973J21391P57333l71032j50095O31132L26113M49286j5904
991A014234o04292M23621R15743j032701p47551k01794L84967K03408k95107K30540
981B91068p6473l40216O36516n01026j00691J20489j35268J36338r0637r88276
$$ plain form
971 -1048176 -54531 232498 24332 -306357 -576919 -533785 -687145 81077 92067 -648237
961 -648237 -430566 -167509 618967 468322 -542308 -811413 289557 583656 -269298 -1070075
951 -1070075 -996020 -424502 159485 71369 73750 386037 -272536 -858935 -386165 142329
941 142329 284348 -20766 -644072 522047 670646 503458 -189898 406385 693223 374927
931 374927 804046 183976 319855 499367 376915 484363 -187371 -407897 -646230 -86994
921 -86994 198941 604006 148987 -656834 -867577 -557351 -22833 -10088 -286626 -670435
911 -670435 -347280 -356347 -868395 -1153990 -704169 148479 -359508 -772760 -451846 -365436
901 -365436 -454182 32915 157778 -378672 -351134 -716523 134463 -107048 -274048 1147047
$$ packed form
971a048176R93645K87029k08166l30689k70562M3134j53360P68222J0990p40304
961f48237K17671K63057P86476j50645j010630k69105J100970K94099q52954q00777
951a070075P4055N71518N83987q8116K381L12287o58573n86399M72770N28494
941A42329J42019l05114o23306J166119J48599j67188o93356N96283K86838l18296
931C74927M29119o20070J35879J79512j22452J07448o71734k20526k38333N59236
921h6994K85935M05065m55019q05821k10743L10226N34518J2745k76538l83809
911f70435L23155r067n12048k85595M49821Q52648n07987m13252L20914Q6410
901c65436q8746M87097J24863n36450K7538l65389Q50986k41511j67000J421095
$$ plain form
891 1147047 1020127 -677713 -835804 -646931 -1280855 -1185743 -1003081 -753447 2878 370308
881 370308 -470574 -154916 130090 962973 719363 114144 -299965 314785 24189 227233
871 227233 147711 -300405 337272 -508208 -260700 -453654 -667685 377974 267106 -198863
861 -198863 360366 789517 561084 1076121 864812 -41495 -232491 -381644 -503279 360338
851 360338 368475 -590525 -208555 716514 1142354 -227406 -746996 -57572 -329609 -321831
841 -321831 111912 -193272 -354452 44565 512061 756019 1145845 901114 429959 737250
831 737250 375927 514589 1519952 657628 155485 886325 270583 663093 -580323 -694171
$$ packed form
891A147047j26920j697840j58091J88873o33924R5112J82662K49634P56325L67430
881C70308q40882L15658K85006Q32883k43610o05219m14109O14750k90596K03044
871B27233p9522m48116O37677q45480K47508j92954k14031J045659j10868m65969
861a98863N59229M29151k28433N15037k11309r06307j90996j49153j21635Q63617
851C60338Q137r59000L81970R25069M25840j369760n19590O89424k72037P778
841c21831M33743l05184j61180L99017M67496K43958L89826k44731m71155L07291
831G37250l61323J38662J005363q62324n02143P30840o15742L92510j243416j13848
$$ [...]
##END NTUPLES=NMR SPECTRUM
##END=
