##TITLE=1H_CA-9208-5
 CDCl3
 8 sc, 
 1.11.2023
##JCAMPDX= 6.0         $$ Bruker NMR JCAMP-DX V2.0
##DATA TYPE= NMR SPECTRUM
##DATA CLASS= NTUPLES
##ORIGIN= UXNMR, Bruker Analytische Messtechnik GmbH
##OWNER= root
$$ XWIN-NMR		Version 3.5
$$ Wed Nov  1 14:06:03 2023 Russian Standard Time (UT+4h)  she@DPX200
##.OBSERVE FREQUENCY= 200.13135
##.OBSERVE NUCLEUS= ^1H
##.ACQUISITION MODE= SIMULTANEOUS
##.ACQUISITION SCHEME= undefined
##.AVERAGES= 8
##.DIGITISER RES= 18
##SPECTROMETER/DATA SYSTEM= spect
##.PULSE SEQUENCE= zg30
##.SOLVENT NAME= DMSO
##.SHIFT REFERENCE= (INTERNAL, DMSO, 0, 15.7337)
##AUDIT TRAIL= $$ (NUMBER, WHEN, WHO, WHERE, WHAT)
$$ ##TITLE= Audit trail, XWIN-NMR		Version 3.5
$$ ##JCAMPDX= 5.01
$$ ##ORIGIN= Bruker BioSpin GmbH
$$ ##OWNER= she
$$ F:/spectra/data/she/nmr/H-F/1/pdata/1/auditp.txt
$$ ##AUDIT TRAIL=  $$ (NUMBER, WHEN, WHO, WHERE, WHAT)
(   1,<2023-11-01 14:04:52.09 +0400>,<she>,<DPX200>,
      <created by zg, POWCHK disabled, PULCHK disabled
       configuration hash MD5:
       00 E9 B6 7A A2 85 ED C7 34 08 36 98 17 FE 4E 26
       data hash MD5: 16K
       7D C2 72 4D AF FD 1B 39 37 C8 DB D0 33 94 9A 2B>)
(   2,<2023-11-01 14:04:55.53 +0400>,<she>,<DPX200>,
      <Start of raw data processing
       efp BC_mod = 2 LB = 0.24 FT_mod = 6 PKNL = 1 PHC0 = -23867.56 PHC1 = 2.252709 SI = 16K 
       data hash MD5: 16K
       64 A3 9D F2 A3 F5 6D 4B 15 63 B9 B1 9D ED 59 6C>)
(   3,<2023-11-01 14:05:12.71 +0400>,<she>,<DPX200>,
      <pk PHC0 = -2.389234 PHC1 = 2.6 
       data hash MD5: 16K
       5A D4 3A CC CA 2E AD 26 7B 8A 57 94 65 81 30 35>)
(   4,<2023-11-01 14:05:16.57 +0400>,<she>,<DPX200>,
      <abs ABSG = 5 
       data hash MD5: 16K
       A4 B0 E2 19 FA F2 8D 0C F3 28 08 88 9F 54 B6 69>)
(   5,<2023-11-01 14:05:37.95 +0400>,<she>,<DPX200>,
      <abs ABSG = 5 
       data hash MD5: 16K
       92 C3 51 CB AD F2 83 BD D6 04 AF B7 8B E6 46 0F>)
$$ ##END=
$$ 
$$ hash MD5
$$ 8A A6 55 CB 28 A1 49 FD 4F E4 62 EC C7 7B E3 83
##$RELAX= 
##$RELAX= 
##$RELAX= 
##$RELAX= 
##$RELAX= 
##$RELAX= 
$$ Bruker specific parameters
$$ --------------------------
##$DU= <F:/spectra>
##$EXPNO= 1
##$NAME= <H-F>
##$PROCNO= 1
##$TYPE= <nmr>
##$USER= <she>
##$AMP= (0..31)
100 100 100 100 100 100 100 100 100 100 100 100 100 100 100 100 100 100 
100 100 100 100 100 100 100 100 100 100 100 100 100 100 
##$AQSEQ= 0
##$AQ_mod= 1
##$AUNM= <au_zg>
##$AUTOPOS= <>
##$BF1= 200.13
##$BF2= 200.13
##$BF3= 200.13
##$BF4= 200.13
##$BF5= 200.13
##$BF6= 200.13
##$BF7= 200.13
##$BF8= 200.13
##$BYTORDA= 1
##$CFDGTYP= 0
##$CFRGTYP= 5
##$CHEMSTR= <none>
##$CNST= (0..31)
1 1 145 1 1 1 1 1 1 1 1 1 1 1 1 1 1 1 1 1 1 1 1 1 1 1 1 1 1 1 1 1 
##$CPDPRG= <>
##$CPDPRG1= <>
##$CPDPRG2= <>
##$CPDPRG3= <>
##$CPDPRG4= <mlev>
##$CPDPRG5= <mlev>
##$CPDPRG6= <mlev>
##$CPDPRG7= <mlev>
##$CPDPRG8= <mlev>
##$CPDPRGB= <>
##$CPDPRGT= <>
##$D= (0..31)
0 1.2 0 0 0 0 0 0 0 0.06 0 0.03 0 0 0 0 0.0002 0 0 0 0 0 0 0 0 0 0 0 0 
0 0 0 
##$DATE= 1698833091
##$DBL= (0..7)
$$ [...]
##$SUBNAM3= <"">
##$SUBNAM4= <"">
##$SUBNAM5= <"">
##$SUBNAM6= <"">
##$SUBNAM7= <"">
##$SUBNAM8= <"">
##$SUBNAM9= <"">
##$SW= 18.05172834244
##$SWIBOX= (0..15)
0 0 2 0 0 0 0 0 0 0 0 0 0 0 0 0 
##$SW_h= 3612.71676300578
##$TD= 16384
##$TD0= 1
##$TE= 0
##$TE2= 300
##$TE3= 300
##$TEG= 300
##$TL= (0..7)
0 120 120 120 120 120 120 120 
##$TP= (0..7)
150 150 150 150 150 150 150 150 
##$TP07= 0
##$TPNAME0= <>
##$TPNAME1= <>
##$TPNAME2= <>
##$TPNAME3= <>
##$TPNAME4= <>
##$TPNAME5= <>
##$TPNAME6= <>
##$TPNAME7= <>
##$TPOAL= (0..7)
0.5 0.5 0.5 0.5 0.5 0.5 0.5 0.5 
##$TPOFFS= (0..7)
0 0 0 0 0 0 0 0 
##$TUNHIN= 0
##$TUNHOUT= 0
##$TUNXOUT= 0
##$USERA1= <user>
##$USERA2= <user>
##$USERA3= <user>
##$USERA4= <user>
##$USERA5= <user>
##$V9= 5
##$VALIST= <valist>
##$VCLIST= <CCCCCCCCCCCCCCC>
##$VD= 0
##$VDLIST= <DDDDDDDDDDDDDDD>
##$VPLIST= <PPPPPPPPPPPPPPP>
##$VTLIST= <TTTTTTTTTTTTTTT>
##$WBST= 1024
##$WBSW= 4
##$XGAIN= (0..3)
0 0 0 0 
##$XL= 0
##$YL= 0
##$YMAX_a= 171354
##$YMIN_a= -224716
##$ZGOPTNS= <>
##$ZL1= 120
##$ZL2= 120
##$ZL3= 120
##$ZL4= 120
##$ABSF1= 15.73367
##$ABSF2= -2.318179
##$ABSG= 5
##$ABSL= 3
##$ALPHA= 0
##$AQORDER= 0
##$ASSFAC= 0
##$ASSFACI= 0
##$ASSFACX= 0
##$ASSWID= 0
##$AUNMP= <proc_1d>
##$AZFE= 0.1
##$AZFW= 0.1
##$BCFW= 0
##$BC_mod= 2
##$BYTORDP= 0
##$COROFFS= 0
##$CY= -3
##$DATMOD= 1
##$DC= 0
##$DFILT= <>
##$DTYPP= 0
##$F1P= 0
##$F2P= 0
##$FCOR= 1
##$FTSIZE= 16384
##$FT_mod= 6
##$GAMMA= 0
##$GB= 0
##$INTBC= 1
##$INTSCL= 3.70164e-10
##$ISEN= 128
##$LB= 0.24
##$LEV0= 0
##$LPBIN= 0
##$MAXI= 10000
##$MC2= 0
##$MEAN= 0
##$ME_mod= 0
##$MI= 1.114404
##$NCOEF= 0
##$NC_proc= -9
##$NLEV= 6
##$NOISF1= 3.799351
##$NOISF2= 2.8
##$NSP= 0
##$NTH_PI= 0
##$NZP= 0
##$OFFSET= 15.73367
##$PC= 1
##$PHC0= -23869.95
##$PHC1= 4.852709
##$PH_mod= 1
##$PKNL= yes
##$PPARMOD= 0
##$PSCAL= 0
##$PSIGN= 0
##$REVERSE= no
##$SF= 200.1300075792
##$SI= 16384
##$SIGF1= 3
##$SIGF2= 2
##$SINO= 5.538805
##$SIOLD= 16384
##$SREGLST= <1H.CDCl3>
##$SSB= 0
##$STSI= 16384
##$STSR= 0
##$SW_p= 3612.71676300578
##$SYMM= 0
##$S_DEV= 0
##$TDeff= 16384
##$TDoff= 0
##$TI= <>
##$TILT= no
##$TM1= 0
##$TM2= 0
##$TOPLEV= 0
##$USERP1= <user>
##$USERP2= <user>
##$USERP3= <user>
##$USERP4= <user>
##$USERP5= <user>
##$WDW= 1
##$XDIM= 16384
##$YMAX_p= 364229757
##$YMIN_p= -2643443
$$ End of Bruker specific parameters
$$ ---------------------------------
##NTUPLES= NMR SPECTRUM
##VAR_NAME=  FREQUENCY,     SPECTRUM/REAL,   SPECTRUM/IMAG
##SYMBOL=    X,             R,               I
##VAR_TYPE=  INDEPENDENT,   DEPENDENT,       DEPENDENT
##VAR_FORM=  AFFN,          ASDF,            ASDF
##VAR_DIM=   16384,         16384,           16384
##UNITS=     HZ,            ARBITRARY UNITS, ARBITRARY UNITS
##FACTOR=    0.220516191357247, 1,           1
##FIRST=     3148.77954331518, 0,            0
##LAST=      -463.937219690603, 0,           0
##MIN=       -463.937219690603, -2643443,    0
##MAX=       3148.77954331518, 364229757,    0
$$ Real data points
##PAGE= N=1
##DATA TABLE= (X++(R..R)), XYDATA
$$ [...]
9275 458554 311943 566682 1125301 803065 757149 1001684 188501 -410544 239967 242557
9265 242557 88793 259850 251819 -29840 307055 621042 1880650 441611 359092 1623956
9255 1623956 2724159 1112030 606161 1111372 736198 169704 319866 1038141 1245816
9246 1245816 1227570 789200 648365 -357505 170214 351897 484844 1055177 1356284 397043
9236 397043 1189662 716854 178313 119363 -702745 -340256 1139181 1057298 234795 934447
9226 934447 780103 221271 719992 1157074 325836 393817 498812 593726 618336 166146
9216 166146 630353 646540 1306419 1474914 426124 -408126 -932872 -681944 586693 1182004
9206 1182004 1784449 1879192 2210740 1189824 1386573 962286 955456 1127725 883468 757192
9196 757192 665920 1657569 1360306 -337303 -292425 427328 1581661 1928269 1079119 947039
9186 947039 616987 330824 1118051 1387326 850173 942146 1457556 1695798 2241204 1908403
9176 1908403 1823486 1839593 1885229 3262563 3096827 2571618 3074135 2227470 1578168 1499375
9166 1499375 1715557 1584539 1637569 2113909 1628886 1597759 -112734 479432 936520 921067
9156 921067 995453 140808 -186094 1093652 453046 83368 -1120034 -522212 275973 84760
9146 84760 -634016 -138894 53436 -261188 701179 1221247 1945862 1533561 1416367 1944233
9136 1944233 1900675 350591 1834960 522682 -501770 1351050 1599270 2179030 1373914
9127 1373914 802260 1270218 1686308 1367757 715765 660191 -22290 -401418 448010 251568
9117 251568 515025 967120 1040895 746202 157976 -26610 19822 270728 -170456 316488
9107 316488 1104052 713512 511124 616274 1674340 892774 1659139 1699687 1627718 1611027
9097 1611027 258071 846007 1330892 1072663 869687 1279344 945026 1446724 522955
9088 522955 1055334 1614502 807028 592195 1328458 1721941 1285437 2394376 2105078 1533970
9078 1533970 1644771 1443461 2008617 1970005 2196216 776253 833841 1905667 1312041 1956990
9068 1956990 2654239 2602079 2073537 1098116 1411305 1764764 2145790 745610 1560909 1391769
9058 1391769 1056290 1174052 1802060 2492631 1643561 610477 2395587 2971646 2500021
9049 2500021 1699172 1241155 1408554 288606 1215135 1720066 2069106 1918638 1709305
9040 1709305 1739367 1503186 1627155 1425072 510483 290558 1068046 1883541 2086059 1369386
9030 1369386 1202706 2260960 1660763 2077338 2116297 1985866 2262850 2092211 944808
9021 944808 1450197 2111734 2438135 1618235 1628824 1827704 1617804 1997306 1005638 791671
9011 791671 2349106 2533357 3166995 2246486 1064449 842435 733054 705814 1528245 1133781
9001 1133781 2034730 2579316 1734356 1425458 499381 1170026 3032412 2275714 1563198
8992 1563198 1699334 1851251 1795532 1965919 2719656 2593298 2914525 1846625 1525004 1833282
8982 1833282 2595959 2936919 2393116 2156302 2827918 2564048 2271297 1777787 1129021 1725169
8972 1725169 3031056 2553945 3131791 3225640 3101637 2951439 2458574 3229107 2948898 2728042
8962 2728042 2587643 2278800 2345801 3100287 2570758 2512251 2347315 2168412 2753354 3161398
8952 3161398 2409190 1983468 2423163 1784882 2354235 2540274 2523489 2615197 2793054 2299999
8942 2299999 2929961 2377866 2485705 3399012 3269591 2725871 2317557 2443361 2381062 2447967
8932 2447967 2267944 3630680 4071412 3519605 2535883 2269180 2787009 2865478 3379631 3472866
8922 3472866 3618401 3962811 3605263 3636164 3584660 3698215 3892545 3101339 3466431 3925667
8912 3925667 3478271 3600706 3526374 3281707 4948039 4594920 4523350 4301331 4773560 4185680
8902 4185680 4940688 4608008 3680425 3377305 3449926 3075193 2887171 3815771 4167995 4894526
8892 4894526 4715126 4381165 3537031 4075325 4552275 4733883 4648234 5613231 6054165 5734512
8882 5734512 5173445 4998711 4304443 4245983 3950525 4710337 3846743 4342451 4472844 4431294
8872 4431294 4941000 4629154 3540417 3875201 4753862 5680722 6310543 6127476 6868149
8863 6868149 6453666 6957844 6044035 5280986 5760179 4824114 4916129 6167657 6487710 7057150
8853 7057150 5979013 5053432 5867053 6893092 6623882 6689143 7449244 7218931 7720694
8844 7720694 7033212 7114897 8538814 7519964 7175795 6707064 6279767 7032726 7510651
8835 7510651 7812079 6918587 6181051 5985723 6187882 6213372 7066313 7691949 7494258 7887341
8825 7887341 8625452 9264696 9559152 9069105 7300995 6810441 7107293 7473343 7935475
8816 7935475 8666920 8802549 8850899 9596473 9740129 8425132 7928324 8973702 9944999
8807 9944999 10841179 10701867 10105168 9762537 9709876 10514214 10853912 10338654 9648445 9003575
8797 9003575 9580352 9266653 9787629 9279967 9950626 9314563 9884053 10609997 10948923 10427298
8787 10427298 9945047 10752939 10704417 11329144 11317860 10978055 10517872 11558136 11749795 12716519
8777 12716519 12466941 11914964 11964595 12435134 12916578 13733252 13924233 14107544 14311695 14271783
8767 14271783 14352336 14606690 14250299 15149424 16360628 16371728 15526457 15289267 16857736
8758 16857736 18486792 18866218 18240476 17759993 18807201 19145704 19301467 19552690 19637378
8749 19637378 19352084 18941749 18289330 18966266 20251761 21313818 20719701 20819947 21628013
8740 21628013 22676210 23618947 24160208 26007264 25774992 27323504 28647608 29294536 29955409
8731 29955409 30178402 32128182 32912843 34395001 35810390 37245529 38843689 39996430
8723 39996430 41636375 42326459 42938361 44000514 45746780 46717789 48531515 50692451 52384608
8714 52384608 56270762 60299354 64127503 69342058 75219202 82971888 90759075 100257300
8706 100257300 110488418 124507287 142171765 167158329 200111543 241452296 280022353
8699 280022353 287621774 266039687 228614516 189230940 161382296 140192809 123046988
8692 123046988 110001454 100544410 91852264 85687611 81187868 77667114 74607115 71790966
8684 71790966 69622937 67545903 65765720 63746270 61578247 59941980 59084945 56933727
8676 56933727 56831534 55991228 55532417 56250877 55889574 56236248 56548858 57023728 56797008
8667 56797008 56847055 57711240 56363672 55517744 54443273 53462079 52394813 50865311 50230787
8658 50230787 49154610 49817169 50050246 49824447 50082455 49587723 49625179 50601727 52306483
8649 52306483 52199098 51345276 50094295 49408358 48430537 46731401 46011199 45870063 45318707
8640 45318707 45418337 44870099 43905699 43724195 42617566 42558576 43771317 43409071 44626777
8631 44626777 47285053 48531864 49658283 50837344 50132802 48198716 47250712 46552561 44348356
8622 44348356 43127370 42259953 40957060 40030872 39130901 39758919 41523356 41977265 41120794
8613 41120794 41383610 42450214 45077128 47174677 47529264 48004125 47667574 47129711 47022672
8604 47022672 44279348 41803740 40486406 38840759 37620235 37014552 37452401 35668939
8596 35668939 34758484 35516655 35603669 36428842 38637636 37929503 37380931 37222583 36131412
8587 36131412 36520457 36142748 35224194 34350199 33866485 31639504 30832748 29877539 28704539
8578 28704539 28374996 28152140 30223902 28894675 27532872 27628172 27009677 27298682 27037846
8569 27037846 28069189 27314314 27013282 27450408 27224914 27201254 26248823 27328010 27686872
8560 27686872 27777371 26524093 25894988 25919440 25187462 25133739 25779183 26441338 25653379 26401496
8550 26401496 27502187 27280417 26961747 27387580 26726695 27084567 27857958 27731726 27324292
8541 27324292 26951510 27402381 28625616 28432267 28468558 29030671 30018615 30086240 30243140 30508413
8531 30508413 31779161 31878857 32043637 33565785 35228869 37114168 37969993 40098978 41972043
8522 41972043 43237062 45315120 47857582 49780231 50737808 51892161 53684094 55041730
8514 55041730 56568310 58118033 58705614 58996754 60409069 62246110 63047852 64138114 63389287
8505 63389287 62780035 62693186 62609416 61707555 59705149 59318395 57409815 56564161 56093097
8496 56093097 55429852 54512983 53411458 53196565 52774411 52170693 51498246 52440568 52931323
8487 52931323 54126096 54749137 55855144 58084640 59740218 61472489 62910111 64296692
8479 64296692 65853177 67011071 68296036 70733230 71156700 72320928 74250619 75015676
8471 75015676 75654440 77844549 77531668 76874542 76454814 76353368 76289479 75726200 73082730
8462 73082730 71732409 70321840 67410323 66712860 64942860 62206547 60562406 59381271
8454 59381271 58139673 55797390 54011524 53463461 52248230 50913378 50594657 50273030 49513203
8445 49513203 49549486 49544843 49552800 49187027 49053607 48703032 48776109 49489717 49409713 48294230
8435 48294230 46772862 46212620 45936653 44088676 43451046 43352591 42484556 43405030 44093802
8426 44093802 42732518 41246884 41155345 39745338 38114930 36645402 35939628 35842866 34258220
8417 34258220 33325878 32556236 31927638 31930205 31652116 31721747 32428132 31689656 31248597 30874100
8407 30874100 31336053 31985312 32642074 32853021 34406826 34286560 34566488 36057122 36458550
8398 36458550 37860896 38304059 39535191 40266120 42671669 44655749 45302255 47858853 48908691
8389 48908691 48608514 49012481 49601645 49892281 49671350 50215006 50215540 49619701 51057920 52006872
8379 52006872 51696377 52366040 51582606 49988525 48895859 48471707 49436734 49594376 49173298
8370 49173298 48723634 48707062 49631333 48401099 47780349 48713072 48467728 49142042 49113551 49747896
8360 49747896 50178461 51435818 53860868 55673423 56926446 57782956 59463182 60669621
8352 60669621 62092319 64082901 65588432 67107509 68555298 67543605 66923107 66268847
8344 66268847 65758431 66725719 66757884 67202616 67564937 68010477 67678171 66944750 65595638
8335 65595638 64789825 62277428 61132744 60839092 59231375 59146071 59295996 58574068 56969752
8326 56969752 54631574 52403835 51205668 50013926 48566411 47765908 48262337 48225905 48742633
8317 48742633 49440308 47956113 46933267 45865368 45360539 45467211 45715764 44924498 44303664
8308 44303664 44886967 44123212 42653744 41571920 40793352 41108009 40824992 40809342 41051591
8299 41051591 40422771 40092286 39740483 38778616 37061296 35529853 34858257 34237923 32548780
8290 32548780 31188165 30745015 31975398 31511310 30228046 28778008 27878421 26880343 26710459
8281 26710459 25046054 24386413 25003972 25392760 23267710 23064278 22890277 21945962 20422657
8272 20422657 20719451 19932309 18232352 17399467 16856093 16253968 16789320 17500029 15018340
8263 15018340 14850819 14530906 13733501 13941118 13163839 13009664 13450461 12065202 12511430
8254 12511430 12939498 12538877 12054880 11136029 10587160 10604336 9497867 9705247 9437730
8245 9437730 9360091 9252259 8590727 8573751 9706195 9261457 8283272 8169515 8029239 7541706
8235 7541706 7490646 8589492 9301228 9380944 8616034 7838063 7905975 7466482 8498974 8892671
8225 8892671 9837819 9750844 8574696 8186727 7721607 6721642 7178382 7473062 6700623 6682815
8215 6682815 6905534 6843647 6368391 6128688 6127130 5891609 5344367 5721188 6107944 6719560
8205 6719560 5734086 5959888 5883897 6990297 6247046 4349345 4583019 4479417 3955850
8196 3955850 3847143 3254581 3556173 3062692 7195199 9797731 6723172 6407281 6551317
8187 6551317 6998725 6139516 6706641 6985773 7429734 6703344 6187639 5203182 4647931 5646334
8177 5646334 5643844 5012034 4680679 4481936 4053741 3897213 4555919 5186862 5236139 4338502
8167 4338502 3506734 3788373 3182102 3198234 3984625 4674772 4857602 4426108 4746311 4251050
8157 4251050 3640848 3194770 3037087 3478998 3266562 3227071 2781423 4160242 4450565 3932022
8147 3932022 4192004 4768908 4267853 3565764 3109223 3290146 2428180 3091677 4329503
8138 4329503 5065897 5307347 4965459 4107712 3315045 3957833 2998635 4270048 4448345
8129 4448345 4082365 3909057 3116940 3508504 3198993 3428201 4026066 3631172 3614167 2936334
8119 2936334 4038480 3791701 3275338 2333504 2704411 3094311 3168746 3467793 2762122 2669877
8109 2669877 2682456 3561978 3757146 4103488 4021850 3566079 3298650 3735643 3334971 3012455
8099 3012455 2496738 2040013 2026492 2740911 3275104 3059944 3695738 2974468 1363577 2410162
8089 2410162 2956461 2462536 2286456 1994085 2967085 3134547 2155314 1948416 1613735 2453506
8079 2453506 2619024 3222950 2229877 1809500 2075295 1798872 2203755 1914139 1358049 1308392
8069 1308392 2161212 1983347 1691225 1443673 551819 1379117 2538575 1546941 1424096
8060 1424096 2082705 1843747 1950710 1906114 1871976 1862882 1593391 951685 2460168 2677332
8050 2677332 2116532 2448429 1437001 1698448 1992748 515250 -406270 475688 1104222
8041 1104222 1731998 527828 874929 1686526 1140886 1191417 410820 24188 356975 348454
8031 348454 154270 -337116 322441 539495 419522 565307 531188 947232 802990 1081622
8021 1081622 855930 1703091 1164152 2157369 2515650 1250781 588835 491641 670609 1974835
8011 1974835 2569002 1983442 2117748 1602418 1309296 1066757 1775600 1687978 1355270 1763536
8001 1763536 1001928 796195 1495778 1767157 1867584 1396222 1981725 978611 1351635
7992 1351635 1760979 2441025 1716003 1787811 626695 1713342 1422388 1264790 1297793 1295409
7982 1295409 884801 515054 93206 314093 1142333 1397821 1064668 1598256 1873270 2222753
7972 2222753 2617950 1195716 1003527 1057940 2161967 2119600 1410968 1064254 1234232 1062563
7962 1062563 1493492 984395 2082485 1947135 1088749 1461812 1666184 1459912 848132
7953 848132 525736 1171683 1525071 1804586 1997549 436565 -106702 -79206 -141631 636516
7943 636516 481468 1301879 1156242 1267619 1309631 1474524 1549839 1182460 559350 372791
7933 372791 218500 799766 373463 769949 503524 676159 1257608 754307 645403 1121987
7923 1121987 174954 630741 1706271 1277784 557801 -44261 270635 1024709 971533 874570
7913 874570 315577 741978 782626 1643782 1952217 1634164 2115454 2030117 -157832 -658322
7903 -658322 13837 -535906 -371851 -466728 -136195 -153032 155014 424353 690230 85038
7893 85038 579841 -290486 -239650 282325 401422 811263 1305402 1590470 1597275 1873473
7883 1873473 1231644 810374 1356041 821816 165116 -196330 314626 1666656 1047047
7874 1047047 -536247 -604549 -216354 295502 1161406 -19556 -572473 778137 161267
7865 161267 549950 378435 97015 389616 -281653 740230 691604 -633905 -342470 -955347
7855 -955347 -1069742 -1001646 -427473 -86283 235024 -144339 -207868 423340 756966 1539933
7845 1539933 1554149 1195119 748992 442241 784426 405905 791501 833868 -49985 -80457
7835 -80457 180472 189152 -74314 -173329 485221 341731 -321325 62989 38071 -154916 191410
7824 191410 -378773 -798685 -1199687 -151376 263652 255074 -284459 -686292 -47461 7362
7814 7362 303795 -594026 295884 675991 -334911 -505409 2090294 2811166 1891497 1123989
7804 1123989 1247925 681359 -266737 -359585 -999424 -989334 -900027 -718884 204780 748483
7794 748483 297388 -408827 -217134 268206 -201783 -79121 253455 172600 377418 297439
7784 297439 309320 -318270 -211627 595988 677104 952721 638215 1612395 1017215 1089418
7774 1089418 95662 -815997 -1079943 -1294187 -412526 -816855 -368522 -273376 -214628 -237969
7764 -237969 -929079 -716525 -595833 -784625 67047 238794 287639 -1365292 -780046 141419
7754 141419 -87608 465031 467358 1094757 437015 52573 182418 407203 -232234 -40303
7744 -40303 -7667 370846 493313 -296112 -1148573 -767961 479421 402983 212726 -250188
7734 -250188 -344361 -965027 -625441 464532 -384116 -279356 376330 -268399 467260 289571
7724 289571 159084 -124557 -42183 -931291 404956 378773 -609703 -1213226 -1268346 -687069
7714 -687069 -853691 -275040 -600351 1138008 1390824 1689835 1044505 113282 748148 14042
7704 14042 -840866 -857403 -265522 385561 -593461 -638350 -110179 86631 -174802 129503
7694 129503 -1007080 -1386546 -116287 -952408 -454622 -550472 -776277 -59166 360889 223910
7684 223910 -152674 -529282 35535 -1072382 -765402 -290516 -273404 -763747 -991027 -1551758
7674 -1551758 -215481 302404 215151 -336860 294249 698401 809926 32911 -526075 -1146159
7664 -1146159 -2063957 -1450769 -1078206 197081 242641 171510 40279 767267 245108 39818
7654 39818 -1094687 -1232179 348310 1007356 751928 579408 689185 684907 -531430 -148174
7644 -148174 340597 -239153 -487780 -839787 -578201 -141131 -569824 834580 1307382 315008
7634 315008 191488 676709 -286903 -33042 -1148331 -2287096 -2643443 -2262492 -2212769 -2069650
7624 -2069650 -732711 -368663 505824 164269 -722718 -277680 -889868 -815145 -595020 -801721
7614 -801721 -511020 -425678 -937286 -1040974 -1215324 -452112 -983276 -1192643 -293221 -268872
7604 -268872 -1469544 -1238794 -185357 200857 -455045 -30838 -333687 -1329322 -1080822
7595 -1080822 -788844 -956006 -1002446 -630298 -376054 -285851 -1055753 -758011 -316758 -1199539
7585 -1199539 -1468397 -436294 -915511 -708124 -612643 512472 -404662 -1097651 -1465923
7576 -1465923 -1765946 -1506851 -1616573 -492200 522834 -371897 427141 640044 -619601
7567 -619601 -1028255 -1459254 -783122 -1203731 -748657 -921294 -716641 -317045 -939948 -480292
7557 -480292 82674 239306 -9859 482901 -157253 199946 -452982 -831661 -1275985 -503428
7547 -503428 -590417 -588712 -587375 -592133 -723795 -808670 -226701 -1203606 -1301981 -204133 -537829
7536 -537829 -972931 -1520138 -594686 -116567 -114499 190375 33365 40436 -430270 158424
7526 158424 -411981 -355571 -712156 -369809 -345706 165959 -9857 263161 183966 -806415
7516 -806415 -467812 -336820 785072 152264 730683 436531 -666653 262 94898 -322978
7506 -322978 381984 439733 -409155 -743082 -690273 -1000636 -240451 172570 466147 599134
7496 599134 -158437 -334160 -77291 1325509 552869 -1632 -84599 -395796 -72461 -405537
7486 -405537 -505891 -98968 -24838 59948 -2654 199879 -143864 -1427406 -2016227 -1254391
7476 -1254391 138943 -209860 -807304 -952488 321786 456996 -320936 -502156 -765057
7467 -765057 -54041 354173 708619 -34412 487695 1262555 359714 -929300 -906770 -396766
7457 -396766 668027 1606929 1498647 301386 360604 309036 985878 1359373 1381792 1152146
7447 1152146 1578638 1683375 743548 -325741 -508489 -221091 -805422 -233632 25030
7438 25030 -260286 197087 146520 29465 332610 579565 354312 -314896 961254 216214
7428 216214 313502 1316672 942635 -142510 -762688 506722 -482610 -758940 -631882
7419 -631882 147671 -334657 -656192 -134958 -776268 -1151763 -323610 -17776 1336268 330746
7409 330746 31369 437320 294751 206724 -176765 450717 -950985 -377389 423750 272134
7399 272134 -268522 699364 675358 49463 -553257 -769669 -726776 45061 133373 106888
7389 106888 940194 1101640 837211 141557 -97236 431776 674883 263466 113888 470218
7379 470218 999799 707781 -21731 62854 759158 681322 323717 -62037 217195 1094950
7369 1094950 1020006 416689 652364 150655 -752228 -287941 675408 1422136 1151189 884577
7359 884577 1612554 493806 -480682 -317862 -208266 584092 494178 1034407 703307 1039015
7349 1039015 1419307 1309029 808049 525434 387912 31318 -614852 -973691 -722893 -155391
7339 -155391 587653 388451 -422053 -165867 906730 926237 586199 -243415 -473902 744087
7329 744087 395117 197735 290616 560617 763442 1108396 683230 -28193 -424937 -1079225
7319 -1079225 -338274 -149730 -694213 -73189 140057 -436526 -906680 -534027 19121 -164746
7309 -164746 -174679 269898 -401537 -286814 407989 1844827 1943145 1002182 585839 183559
7299 183559 1204285 2040942 1411478 657515 299661 225385 350516 1536456 2639783
7290 2639783 1952182 2393297 2311436 892076 85709 27932 439294 325892 -38954 399194
7280 399194 413181 685728 556448 735170 2174722 1997749 496158 442518 369692 219688
7270 219688 190281 889544 912232 1410071 574269 410514 774384 1405130 1057365 1233756
7260 1233756 1400477 1785456 881913 584322 93096 -112002 534071 817371 740103 1145159
7250 1145159 814453 456818 1268657 1422844 1191668 246592 -221536 121565 54920 713404
7240 713404 168425 -511360 102300 -300292 330657 -214235 203480 70440 -109009 326121
7230 326121 982159 878159 735540 1242713 1151038 1054242 1002647 141857 1858807 1454504
7220 1454504 1245151 778567 435722 1186980 2127190 1531448 557869 956067 362272 551393
7210 551393 847712 162937 -126460 -207912 82153 477614 -693104 309364 877637 1423458
7200 1423458 1588851 1377871 566512 97018 -254838 -510642 216670 8573 18535 -205329
7190 -205329 711050 893551 266189 10397 -337701 459917 359697 -213542 738257 714970
7180 714970 -6388 701265 601572 506872 1513905 657552 -42791 174028 7270 -88481
7170 -88481 -414025 -542103 -673132 -115051 244979 -385770 805621 1130350 1018737 -300352
7160 -300352 237051 551658 599019 1519241 911028 1151876 110086 41637 216778 452622
7150 452622 458104 463509 609086 -829340 -1675423 -615182 382265 85335 -974650 -445313
7140 -445313 -458182 124692 34486 -713696 -755673 -615069 -303488 -338624 -420966 387389 1160959
7129 1160959 425839 507746 -164641 428484 1078121 -5166 281241 635052 172223 -451371
7119 -451371 423246 660005 -575764 -473032 -183172 -605509 -1547439 -1356500 -834833 -2567
7109 -2567 -612689 -943243 -773116 -873387 -1298244 -805932 -503301 -53617 -93611 -357617
7099 -357617 757363 1349426 705317 -302012 -440442 -1271922 -1202092 -1265343 -308508 -504750
7089 -504750 -1223536 -1432906 -1247864 -710352 653876 728414 365188 601881 469392 182987
7079 182987 343158 444342 -165798 -674192 -407205 -936127 -200225 -286280 173242 898782
7069 898782 -311576 -695931 23247 419167 67299 43431 409837 -88159 12774 767131
7059 767131 585098 -931472 -731825 121481 309409 884888 -42312 -127440 -1345434 -534344
7049 -534344 610619 -125606 -788277 -1240969 -729121 -210704 -77225 -334976 -417596 375822
7039 375822 -156934 665802 -296096 -514031 -594787 -161402 -251062 -313802 -256269 -618867
7029 -618867 -709111 -603416 611187 894506 372709 7573 -1014929 -430425 -569342 21327
7019 21327 500361 -661041 -449002 -143517 -187247 -985087 92960 763345 1545688 1292241
7009 1292241 42317 110896 923242 500237 -1090235 -2187926 -446124 384214 -184644
7000 -184644 -443299 22597 706989 531854 -440731 -457795 119213 32093 264131 701161
6990 701161 276444 -35022 -295464 -248915 249217 323538 -63929 430523 75404 -966861
6980 -966861 -249072 667573 646344 315651 521975 1446539 618976 -209827 -298859 -208079
6970 -208079 825225 879098 -110419 -1197659 -357211 196818 108217 459404 60186 -90139
6960 -90139 858193 506797 -119628 -588111 -1781765 -1000159 722468 1253405 549923 -69771
6950 -69771 54699 496960 -570605 -676668 -1002644 -1018446 328338 127618 -318508 -1013573
6940 -1013573 483124 854002 499372 1053310 751927 483442 1014284 794840 358392
6931 358392 522427 430459 476382 323003 -486277 -396842 -181107 119291 859378 683850
6921 683850 109582 109026 1384076 1180419 2100520 1314178 967874 2334189 2444445 737491
6911 737491 -25167 764670 840855 1305046 -16858 655440 970132 308046 835996 1677811
6901 1677811 1657585 21870 706779 372625 426392 929998 1143391 495483 163740 732207
6891 732207 977436 1673570 1659073 1389310 1128582 2169881 2655016 1866550 1626780 2585498
6881 2585498 2720996 1963803 1743296 981168 446022 634390 600059 710288 522832 458117
6871 458117 797389 414646 -353086 -572149 44457 1337176 1083176 663590 103882 95846
6861 95846 993549 662955 18842 409553 648204 912556 -616530 469003 566719 272557
6851 272557 856135 548280 -747917 251829 243708 -299074 -365865 -443979 -22639 494315
6841 494315 412054 179493 424214 291227 914541 1225518 658613 147746 -731943 -634863
6831 -634863 956520 439362 1219315 -72598 -270785 -437888 376737 1126268 752372
6822 752372 589551 -115761 67308 258475 187838 538435 458715 -473212 -1345612 -698011
6812 -698011 -690621 -806464 -987778 -1529227 -1030204 -130009 -824890 -749797 -984167 -1039619
6802 -1039619 -759951 -264527 -96323 -1166646 -266412 319299 222633 51902 134902 521755
6792 521755 57390 -829772 349964 578356 -627097 260413 -25689 245354 873439
6783 873439 845839 -450062 -106684 686059 657315 302181 447605 1469807 1519811 1278689
6773 1278689 1988447 659374 -165724 136783 340132 1389177 350356 149391 4770
6764 4770 1140064 1236571 1181362 1803675 1801085 2154690 1866532 2516624 2231832 933009
6754 933009 1480090 1195497 490393 1146587 1465642 1462408 1126330 710316 893317 459080
6744 459080 80351 630343 1528265 932799 321782 681828 1099008 1115475 1432630 790283
6734 790283 1394309 1311164 540209 764929 695710 304015 1005922 2076821 1627224 1766483
6724 1766483 1818901 786664 1083825 2430381 2705903 2304732 1707718 1502650 977787
6715 977787 1084712 2731331 2681832 2811456 1908731 1778143 1309217 1100363 713394 1174056
6705 1174056 1531855 1354483 2254182 2226937 2089176 1749962 1719258 2008323 1337765 1339774
6695 1339774 912358 548473 822762 1106218 1480908 1219122 576062 915964 1662465 1484428
6685 1484428 1470056 704503 1280844 1851717 2139709 2749098 2771797 1193477 196792 494550
6675 494550 996498 1392672 1601168 1489164 2041072 2394731 3032792 1703902 1809278 2239353
6665 2239353 2177025 1082611 1600124 1885842 1110376 -381451 725854 1027628 1162798
6656 1162798 2089401 1440920 1954622 2562887 2358654 1585297 1997468 1806010 1553950 1923053
6646 1923053 1951527 2148329 2871789 1734187 2078499 2622445 2873807 727295 609908
6637 609908 1378402 1482188 1098845 1516300 1674694 1294417 2506355 2702987 2874085 2956427
6627 2956427 2718553 2208633 2669265 2751979 1876799 553392 660689 798471 1241589 664965
6617 664965 828580 1371206 1308240 -28925 29566 322686 524660 1086965 1319047 1776098
6607 1776098 918075 1340753 42884 452606 1204233 1312753 2027987 741342 1265331
6598 1265331 1020666 428902 1619635 2246126 2310960 1187792 1698966 2951418 2072132
6589 2072132 2054259 2178893 1333606 1842301 3196968 3582730 2510032 2446222 1967434 2019618
6579 2019618 1927652 1519178 1309029 1676450 1451449 1519829 1056930 748581 1673051 1292828
6569 1292828 1653095 2384354 2512030 1396132 1591436 1604082 1279927 1437753 1074516 1890232
6559 1890232 2614596 3170922 2536031 2421246 2131355 3263295 3009126 2502899 1678606
6550 1678606 1172590 1623953 1862220 2574374 2285022 2065793 2533623 2646802 3235759 3310224
6540 3310224 2978265 2072786 1937171 2221318 1695488 2389912 2845136 3686294 2163045
6531 2163045 2187572 3094763 3866155 3527570 3810778 3017759 1431152 2542375 4004802
6522 4004802 3425621 3126408 2952993 2531330 2140279 2352097 1885317 1673305 2722684
6513 2722684 2964387 3396985 3077563 2212130 2343127 3164098 3577687 2840079 3153872 2656595
6503 2656595 2710789 3676890 3163763 3848950 3928318 3318318 2431983 2230700 2205833 2073265
6493 2073265 2625350 3150915 2189759 2615142 3094718 3398422 3085947 3935180 3309613 2416593
6483 2416593 1847645 2208694 2392146 2048607 2202686 1950322 1835896 2192218 1901115 2208569
6473 2208569 2306424 2111618 2187833 2139214 2440506 1950970 2402027 2586730 3270993 2568367
6463 2568367 1891677 1821427 2675029 2899131 3278949 3040793 2703345 1886545 1860474 1357707
6453 1357707 1310073 1194405 2103688 1991396 1588685 2119589 2039288 1556491 1690337 3318196
6443 3318196 3643103 3388370 2948796 2959807 3335645 3403976 2868735 2673154 2681648 2895614
6433 2895614 3563613 3745771 3226958 2053043 1747055 1967283 2042304 1933096 1651918 855746
6423 855746 1472611 2109708 2102816 2061045 1704157 1818388 2853072 4841468 3346270 3269151
6413 3269151 3867570 2730637 2571644 2515326 2459435 2411594 2359748 1792899 1799334 2563786
6403 2563786 2921905 2784191 3182282 4056189 3383924 3338392 2709891 2073599 2686957 2087183
6393 2087183 2581366 3182856 3445079 2283995 2347498 2307342 3247410 4022853 2463805 2813297
6383 2813297 1766159 1939965 2639590 2847407 2802574 3146981 3514848 3567649 2612054 1888991
6373 1888991 2884650 3754801 4226206 3786052 3521837 3818283 4355771 5078925 4294519 3832582
6363 3832582 3982568 3583347 3324785 4369704 3804523 3428669 4763406 4753966 3551561
6354 3551561 4536777 4568658 4481827 4246411 4841900 5330986 5495513 4092627 4111526 4428522
6344 4428522 3589831 3617312 3949449 4817073 4836646 5158969 5362200 5496989 4869420 5816072
6334 5816072 5555771 5432029 5061837 5545322 5617428 4761073 5877742 5778431 5276811 5447554
6324 5447554 5539309 6760946 6765971 5847853 6084878 6736315 6885278 6740675 6543954 7024903
6314 7024903 6916370 7074804 6187984 5574706 5731710 5945407 6029923 5757670 5775438 6089713
6304 6089713 6211064 5772942 6236099 7860883 7261895 5713159 5945778 6103431 4775240
6295 4775240 5321923 5712658 5235107 5385694 5253720 4397523 5716552 5062114 4255458
6286 4255458 5638593 5440188 6380750 5997489 5873101 5331969 4560154 3504233 3954981
6277 3954981 4359229 5334733 5448399 4052734 4113873 5084078 5548527 6183269 5352045 5466283
6267 5466283 5840513 5334635 5375775 6006188 5984418 5882604 6242510 5511213 5464154 4789852
6257 4789852 5801392 6536901 6037554 5522823 5654951 6463386 7796517 6481146 7299995
6248 7299995 7303530 6702886 5661205 5460750 6169737 5940041 6305811 4612854 4536289 4707967
6238 4707967 4400561 5069565 6008919 6068799 5908172 5922042 6365456 5593577 5847669 5811267
6228 5811267 4733604 5270037 5627574 6129633 5795983 4648726 4899400 5520073 4743999
6219 4743999 4811044 5651654 5090427 5338098 6220960 6750217 6284516 6594568 7079089 7103192
6209 7103192 6758814 6751350 6896622 6595854 6440004 5636326 7032520 7517013 6875579 8093660
6199 8093660 9704045 9550198 8965012 9578431 10239619 10788825 12489437 13591189 14330597
6190 14330597 14730325 14346751 15258796 15703816 14886146 12767198 11841347 11789962 11155471
6181 11155471 10291008 10076706 8813227 8642014 9471227 8714629 8047681 8165917 8446202
6172 8446202 8163443 8422571 8050966 8018038 8257006 8648803 9849956 8940013 8685541 9042015
6162 9042015 8637928 8394123 8857827 8644894 8414339 8932610 8376431 8507216 9393072 9567144
6152 9567144 8154498 8092608 8865411 9401125 10071722 9839021 9537778 9782553 10266181 9309862
6142 9309862 9962744 11275184 10262304 9619512 10638085 9661591 9294091 9886131 10515576
6133 10515576 10355022 11056429 11836185 11133589 12019575 11922100 11789821 11803939 12333376 12884617
6123 12884617 12152910 13002670 14099286 15738594 15237035 14460006 14721041 14858049 15370533
6114 15370533 15097277 15357206 14767638 14627642 15402972 16842196 16595223 15698096 15045725
6105 15045725 15516356 15448283 14839338 15472654 15654140 14892318 15941411 17304383 17034511
6096 17034511 16819520 17566774 17861836 18192613 18905731 18764521 18891780 19573557 20595631
6087 20595631 20864407 20774325 20565180 20655689 21350215 20388270 19995493 20103968 20281087 19841899
6077 19841899 19733874 19959053 19846452 19149348 19584637 19298762 18583287 19604712 19659802
6068 19659802 19922304 19433208 19994864 19759854 20018337 20604986 21160248 21390868 21950453
6059 21950453 22907900 23273885 24138978 24283936 23924284 23347475 23802519 22697175 22652373
6050 22652373 22239042 21819154 21199698 21162213 20400844 20432810 21129974 20681947 21763630 20814766
6040 20814766 20363989 19980929 19761588 19522694 19451559 20185667 20745858 20317153 20645112 20321902
6030 20321902 20241614 19824457 20130137 20984695 20868369 20753343 20533081 21092345 20736591 21356349
6020 21356349 20422297 20867878 21358968 20888004 21192766 21514548 21347080 20448352 19679089
6011 19679089 19352058 19601261 20002453 20056559 19368977 19569247 19216162 19454182 19273044 19333644
6001 19333644 19441758 19572166 18219640 17066106 16448573 17160890 18525628 18419147 19146651
5992 19146651 19596636 18959785 19162302 18994146 19295974 20266414 19201407 19024703 19582185
5983 19582185 19530075 18916447 18825881 20137239 20446076 20031039 18869267 18700274 19436337
5974 19436337 20031546 20113665 19505160 19981963 18706822 18535886 18941549 19275296 19898739
5965 19898739 20119189 20005306 20103800 19746729 19396506 19655775 20647961 20114694 19158171 17793653
5955 17793653 18096574 18892318 19554703 19938443 19870902 19587854 19527039 19628740 20106200 21369827
5945 21369827 20720638 20928447 20839111 21187261 21867359 22201815 22260201 21881993 21600759 21843629
5935 21843629 21990502 21281647 20830119 21777254 21133072 21736650 20783247 21270324 21981624
5926 21981624 22697615 22708369 22472616 21692550 21612058 21817270 21358193 21461016 21962815 21936561
5916 21936561 21798725 21814083 22042145 22553192 22403007 22845291 22685427 22320875 22034142 22094349
5906 22094349 22220462 23646431 24313864 23599418 22900695 23827104 24216730 23725899 22991306
5897 22991306 23251924 22811436 21790956 21692471 22438677 21718947 21333308 21717012 22945522
5888 22945522 23278603 23232440 22830247 22402344 22892874 22800235 24404159 26092387 25338201
5879 25338201 25343646 25478317 26438903 26579794 26722968 27315279 27896525 30172902 31594250
5870 31594250 33351965 35343652 36962115 38959098 39907873 41423430 41645973 42396534 41742747
5861 41742747 40025381 38983378 38367566 36442323 34515291 33673940 32915361 32677284 32063252
5852 32063252 32128748 31870585 31496441 30901866 30122062 29744722 30045072 31316657 32209179
5843 32209179 32243764 33604347 34010448 35603826 36881856 36563385 35636957 36533254 36436652
5834 36436652 35417829 35232834 34357206 32808805 31175346 31524927 30668736 29939807 29322255
5825 29322255 29039978 29029484 27504022 27981605 28383227 29375186 29346727 29999234 30182144 31479529
5815 31479529 33017920 32834338 33123405 34224670 35474304 35406157 35385512 36188488 35840140
5806 35840140 36167429 35799320 34981504 33889440 33389965 34281569 35057735 34569040 33711212
5797 33711212 34755934 35382134 37152297 38643322 38526917 38630535 39114938 39850493 41002635
5788 41002635 42334734 43401059 43824129 44215793 45221725 46218771 46188236 46351027 45706794
5779 45706794 45351917 44573192 42770310 41806356 41583377 39739901 38352641 38201683 38342045
5770 38342045 38301182 37119997 37676389 37624394 36861962 38119171 38121088 38043044 39093253 39436523
5760 39436523 39286257 39122171 39850936 40386545 40375826 40161887 39712314 40421218 40449751 40361301
5750 40361301 40937906 41736333 40859098 40600810 41864401 42312014 42067287 42743821 41926514
5741 41926514 42522483 43011846 42996360 43093046 42316226 42637361 42508985 41781910 40824929 42079032
5731 42079032 43447160 43623641 43911924 43560954 43976085 44462075 45535919 45574819 45621322
5722 45621322 46671821 46718287 46718794 47489057 49358515 51050120 52786021 54627181 54547960
5713 54547960 55027244 56707902 58973957 60334165 61049295 62504065 62917158 63731947 63966836
5704 63966836 64354663 64183526 64267872 62762206 62322024 62197649 61144076 60718377 60002187
5695 60002187 59169824 59074334 59030298 59050835 59392660 59668260 61763492 63265201 63619186 64840682
5685 64840682 66714777 68819613 70386896 70698632 71224643 71538488 69786040 68783316 65965402
5676 65965402 63026993 60741556 57575672 54632470 52081153 50342685 48323778 46227925
5668 46227925 45300977 43619499 42575687 41956459 41281299 40845529 40038859 38620802 38073296
5659 38073296 38740824 38313709 38205479 38661261 38183704 38392070 37535338 37644784 38011668
5650 38011668 38777288 39601840 39432520 38889339 39343516 39934664 38928440 38959415 39440390
5641 39440390 39812525 40030351 39828263 40186273 41333197 41595060 40020088 39643765 39588579
5632 39588579 39137610 39925094 39651968 39562393 39416788 40612251 39860454 40566809 39825045
5623 39825045 38897923 39631516 41113112 41829724 42423339 43020664 43799465 43318871 42482911
5614 42482911 43073883 42845725 43397277 43860648 44299842 44459023 45452687 45704915 45561715
5605 45561715 44191205 42370741 42324110 42000310 41089247 39614288 38732610 37485865 37524235
5596 37524235 36126848 36218614 36130571 35509112 34877862 34735096 33414510 33684952 34077549
5587 34077549 33923987 33264862 33001201 33438465 31713141 32146505 32685276 32975519 32818337
5578 32818337 32442315 32146946 33458771 34234323 34998628 36570591 37678593 39141654 40230122
5569 40230122 39493386 40118955 40368960 40408245 38797514 36842015 36488095 36194535 35527067
5560 35527067 35766616 34963063 34526364 34267355 34465254 34287724 34055700 34019375 36576309
5551 36576309 38317142 38931554 39316998 40214675 40185585 39843404 40312491 41073509 40035644
5542 40035644 39903781 39612934 38692224 38699983 37576348 38442948 38209788 38047391 38648894 38692598
5532 38692598 38099087 38251238 38166257 37341480 37247320 38119232 39187002 39091687 38649390 39080284
5522 39080284 39286568 39653939 38355425 38067347 38221002 37353223 37030430 37680164 36881920
5513 36881920 35865318 35172425 35183939 35104030 35329892 35621755 35860262 35691011 36212623 36228731
5503 36228731 35390132 35748393 35436018 34950393 34947508 35280369 35631615 36319307 36310995 36681845
5493 36681845 36157628 35293040 35348256 35971365 36461595 37611430 38535139 39851266 40198131
5484 40198131 39627043 40107028 40657599 41357905 41610882 42311295 43062177 44112813 45208061
5475 45208061 46405922 46618684 48085971 48798175 49534213 49995787 49786411 49917043 50191691
5466 50191691 49646393 50112709 51259456 50286789 49453139 49053938 48390201 47764646 47513676
5457 47513676 47993214 48771865 48395878 48716825 48550311 48803438 49652385 50668951 50285960
5448 50285960 50639655 51273100 52156372 52862830 52592303 52326598 52707485 52996488 53964951
5439 53964951 53947395 54030778 54027894 54841697 56142003 57220365 59223572 60191889 61243150
5430 61243150 62190470 64880409 65848004 66105019 69642518 71971263 73734865 76958191 79607907
5421 79607907 83786708 88203893 92740448 96953514 101016960 105171226 110568849 114409653
5413 114409653 118575272 123129754 127034736 130258971 132999338 134895137 137046212 139246168
5405 139246168 140923811 141307387 143173625 143902736 145426751 146873311 147009034 147742686 148311230
5396 148311230 149687244 149120460 149276757 148445872 147622191 146722938 145721330 144113266 141685478
5387 141685478 137137960 133982692 129883616 124828212 120450188 116866920 112582999 108891454
5379 108891454 104886969 102225819 99592516 95608476 93480592 92351827 90315980 88146273
5371 88146273 86574683 84663758 83458780 82177441 81031983 77806177 75690134 75068913
5363 75068913 74218278 72208241 70252622 68688153 67150693 65438979 64106591 62009048
5355 62009048 60752050 58309581 57275106 56908212 55151560 53807792 52965593 53070622 50976560
5346 50976560 50850169 51336360 51073016 49207534 49666931 49133942 49248000 49614498 49205930
5337 49205930 49625101 50429637 50425148 49741010 51136278 52975504 53368672 53202059 54025688
5328 54025688 54135616 55074104 56570383 57552200 57414752 57098454 58038669 58387729 58379129 59468049
5318 59468049 59219936 60583854 62141790 63236235 63412135 64057453 64500073 64762450 64385690
5309 64385690 64037755 64065387 64046281 62802723 60897959 59783815 58836986 56595548 55096964
5300 55096964 53625374 51643056 50924814 49492496 48094741 47505839 46234922 44558231
5292 44558231 42912702 42472739 42742928 41973167 41592865 40541408 40861485 41208727 41744335
5283 41744335 41590761 42398278 43177200 43098792 43099055 42256796 40702019 38362789 36802093 37035545
5273 37035545 36200928 35927226 35971302 35089589 35489052 35339684 34147980 33609696 32794767
5264 32794767 33226819 33079459 32492113 33916094 34077497 33856708 34342207 34804890 34461875
5255 34461875 33906321 34081819 34526439 35383954 35817083 35683566 35419590 35452526 35383161 35143611
5245 35143611 35016767 34566497 35011770 33355917 31816659 32381207 32237073 31443586 30360452
5236 30360452 29665987 28303984 27636017 27542361 27418640 27028041 26521757 26322528 25901152
5227 25901152 25028906 24726874 24960730 24866679 24432530 24570447 24842357 24170474 23414631 22666576
5217 22666576 22077509 22430300 22123323 22271546 22748707 22585805 23226889 22511126 22384008
5208 22384008 21788421 22595514 21800179 21221014 21529313 21108997 20790721 21007466 20176319
5199 20176319 20188977 20120507 19429978 20098745 19464247 19468774 19768632 20560035 20820393 19927662
5189 19927662 19727844 19187716 18872654 19579031 19656145 19270895 18191030 17170565 17628014
5180 17628014 18242280 18156714 17479460 16459111 16211158 17190433 16776558 16756094 17437142 17327957
5170 17327957 17613212 16998720 16056436 16280723 15149851 14935921 16715715 17538677 17364812
5161 17364812 17336870 17657423 17567040 18080229 17993024 16818174 16920286 17107594 16189911 15533172
5151 15533172 14896760 15465873 15023650 15785578 16067678 16685852 16655737 16839933 16233062 16046546
5141 16046546 17404490 17354581 17312254 16817665 16512264 16428912 16836317 17123067 16017716 15318346
5131 15318346 15740409 16845726 16879750 16646500 16170484 16113948 16446454 16562639 16385574 17042404
5121 17042404 17503484 17438530 16941844 17068393 16972657 17331385 17042759 16577174 18052218 17610601
5111 17610601 17354790 17469704 17573302 17172515 17748643 17386496 17832065 17413520 17800598
5102 17800598 18181505 18510278 19344953 18054803 18697935 19249256 19525565 19343175 18363057
5093 18363057 18101568 19141193 19437065 19328925 18842341 18463754 18524657 18792321 18503229
5084 18503229 17167091 17607488 18010779 18480528 17342971 17467037 18848351 19392306 17889389
5075 17889389 18497625 19130153 17896470 18617205 18667733 19582764 19391717 19554219 19799667
5066 19799667 19977485 20255156 19965368 19015308 18992369 20075476 20346997 19519329 20156059
5057 20156059 21221766 21191489 20213455 20067744 20485212 21432371 20219777 19711768 20575006
5048 20575006 20685226 20964110 20738602 19904691 19648340 20156062 20152656 21081932 20548962 20690786
5038 20690786 20490509 21088981 21867044 22030465 22156960 22902869 22787922 23438365 23839173
5029 23839173 23310852 22312343 22153367 22291978 22524617 22608062 22394676 21945601 20987139 20684630
5019 20684630 21560015 21811581 21628199 21501628 22141506 22297172 22037564 21542616 22135600
5010 22135600 21988698 22683942 23271829 22250286 22299018 21861808 22537838 23475895 23217249
5001 23217249 23860555 24697910 23974585 23471937 22549146 22642771 22964372 23187722 23576313 24270769
4991 24270769 24085640 22955769 22623963 23184942 23763893 23618088 23114564 23609379 24099537
4982 24099537 24230321 24081269 23172806 22844386 23128019 22778350 23245498 23946783 23639888
4973 23639888 23181551 22312458 22394613 23525417 23555378 24108079 25275336 25157351 23424313
4964 23424313 24109350 24720673 25097336 25170051 25490562 25432922 24986298 24531925 25205201 25174466
4954 25174466 24645250 25090784 25845317 25594967 24765766 24375939 25140674 25472680 25527672 25950999
4944 25950999 25114387 26910728 28430341 27626680 27625642 26909466 26704467 26850048 27404600
4935 27404600 27631739 28230193 27695478 27531370 27124467 26432824 27080668 27487257 27557987 27184819
4925 27184819 27380506 26018924 26168778 26001645 27202008 27361711 27317746 26832643 27178951
4916 27178951 27289881 27106720 28019654 28108743 27950706 28429567 27823915 27097761 27919650 28493730
4906 28493730 29557602 28569163 27031202 27293782 28298136 27590908 28517986 29171329 28509696
4897 28509696 28890374 28890711 28473186 29083759 29905580 30597226 30487743 30070811 30658185 30993446
4887 30993446 31311604 29822892 30023090 30833903 31413739 32383787 32712434 32783193 33047745
4878 33047745 32268823 33106014 34652535 33998089 35136948 35427138 34287707 33870672 34284562
4869 34284562 34790254 34866750 35763981 37898481 37945728 37243738 37810669 37932774 38893469 38277463
4859 38277463 39060499 38222762 37292523 36716769 37306658 38394339 38123652 38609318 38841990
4850 38841990 38533875 38303835 38769510 38595558 39636692 40194897 41585123 41858674 41315066
4841 41315066 42194926 42457418 41909457 42470971 43911022 44166980 45826637 45745687 46416142
4832 46416142 47003031 46477972 46754426 46223521 47254900 47411636 48175010 48346289 48460083
4823 48460083 49137121 49202457 49773297 51274183 51522188 52379814 51947100 52815259 54518546
4814 54518546 56055922 56994551 56660232 56909951 57418923 58559266 59895716 60778446 61174222
4805 61174222 62506700 62994649 64079123 63601584 63866521 64583870 65911032 67228830 66591468
4796 66591468 67465541 68915459 69519019 68809687 70546309 71946284 72387842 73280529 74502992
4787 74502992 74153729 74423361 75795925 76565083 78315998 78119085 78926355 79507335 79909826
4778 79909826 80591101 82353286 84074374 83893655 84611178 87070706 89371317 90868106 92667470
4769 92667470 93886555 96573890 98264257 100219907 102308025 104329210 105792400 107089955
4761 107089955 109299092 110479983 112483750 114459672 116110311 116805034 118461585 120259365
4753 120259365 121635591 122335203 123724138 125893537 128111508 131070727 133192898 134413006
4745 134413006 134808040 135593989 138055447 139935027 140887259 141573470 143476817 145889986 147704151
4736 147704151 150017489 151762896 153553107 154453148 155783803 158896834 160500884 160114823
4728 160114823 161933703 162889398 164104485 165671274 166300048 167907069 169511076 170636102
4720 170636102 172100755 175827515 177421025 178166518 178832990 181782797 184123820 186446863
4712 186446863 188778648 190007284 191317043 193123360 195570867 197337932 198929316 201135699
4704 201135699 202519104 203462202 205119133 206991138 207623995 207754467 208523626 207358999 207600244
4695 207600244 207015970 207823973 208421275 208418386 209836144 210559509 210286303 211439898 212957994
4686 212957994 214387823 215708651 216701757 216346204 216887963 217824673 217693563 217362374 217017159
4677 217017159 216247704 214080978 212827315 212009479 210549520 207600768 205674927 203902691
4669 203902691 201171211 199536697 196629389 194030623 191807657 189947433 188128336 184819059
4661 184819059 182393944 181254958 178132450 176057530 174835061 173739373 173077443 172611878
4653 172611878 173479090 173283502 174545516 174858445 175594729 175453587 174528417 173676152 173068924
4644 173068924 171483012 170099837 168676508 166822438 164901933 164906812 164002003 161785597 160499220
4635 160499220 158789263 157852711 154756558 154090925 154333202 152869810 152136722 152053450 151680858
4626 151680858 152142519 152124528 152150745 151947728 151729518 151655898 151162146 150467838 149597490 149282505
4616 149282505 147386793 145303102 143248871 140686411 138701484 136437443 133876013 131131246
4608 131131246 129996115 129549384 129100324 128543722 128224454 128739711 128275562 127793443 128367233
4599 128367233 128697649 127613191 126594629 125377335 125244543 124287469 124234174 124740655 125033444
4590 125033444 124841177 124631927 125228238 125077172 125679175 125923024 126154272 127323384 126032705
4581 126032705 123060109 120565028 119770453 118767800 117175795 116398914 115555039 114478974
4573 114478974 112994065 112543158 111990092 111049674 109340318 108747547 107263835 105946205 105423255
4564 105423255 104643594 104281308 103851853 102976319 102827844 102954371 100905964 99346720 98697963
4555 98697963 98820321 98225774 98093061 97726504 96485087 95619433 95176352 94509649 93103967
4546 93103967 91363422 89731791 88776236 87654922 86424577 86300265 85289670 86299911
4538 86299911 85645419 84358111 84843741 85250997 86123813 86199619 86738317 87809318 88633034
4529 88633034 89905520 92210253 92420732 93376784 94086316 94299694 94352126 95213245 95713426
4520 95713426 95868519 96556472 96809474 95870773 94498860 91332521 89028909 88281972 87415206
4511 87415206 85812753 83563947 82790033 81471755 80876344 80212930 79255690 80906178 81742154
4502 81742154 82543246 82640177 83024142 84017197 84706623 85274741 87393910 87935500 88672082
4493 88672082 90031430 89838383 91022941 93285963 94054409 96424789 98540003 99028451 98248533
4484 98248533 96768746 95281811 92591428 91905767 90326312 90151365 89573072 89584096 87878862
4475 87878862 87061001 86271951 86182469 86173328 86741380 88582828 89073927 89886789 90674708 91613055
4465 91613055 93203328 95219998 97110590 99571738 102341449 104982662 106882708 109538182
4457 109538182 112167330 115514807 118761164 121364919 122307727 124130094 125815565 127656486
4449 127656486 131467646 133127823 136272847 140765546 145232882 150630349 156682894 165098682
4441 165098682 173302877 182844409 194369947 207467451 223680884 241839978 262342887
4434 262342887 283999004 305206160 323200204 338962698 350124357 357508714 361823169
4427 361823169 364229757 363436924 359225460 350849731 339050004 325466540 314039738 303327708
4419 303327708 294063281 286656342 279964357 273465576 268051304 262355043 255478847 249664631
4411 249664631 244330465 239624311 235608583 233562733 232803545 231906112 230677901 230151277
4403 230151277 230551081 231752586 231247784 230783797 231150054 231186102 230032181 226264846 219164065
4394 219164065 210454804 200851155 190697767 178327423 167661540 157792853 149570983 140789376
4386 140789376 133053954 126466154 120766998 117186053 112616028 108130463 105149839 102181251
4378 102181251 99173885 95368808 93164502 91698135 90749155 89678087 87315137 84962633
4370 84962633 84768221 84051880 82737206 81142596 80604616 80470171 79074795 78106577 76726156
4361 76726156 75323225 75026229 74571397 72729482 72663367 71150440 69660568 67893962 66777263
4352 66777263 64789890 63538582 62532685 61174755 60916384 60817240 60096153 59094325 58920259
4343 58920259 58337758 58041231 57977275 57870793 56870146 55098185 54400846 54170055 53513948
4334 53513948 52945087 51433123 50940522 50232853 50424713 50454808 50628883 50670192 50976933 51191409
4324 51191409 50077086 50458622 50607799 49158533 47110821 46585918 46413961 46378684 46314749
4315 46314749 45438506 44603573 43370779 43409028 45109791 46037927 45633306 44332610 45043756
4306 45043756 44753726 45883856 45991939 45712688 45693482 45567404 46331163 45538381 45531734 44981145
4296 44981145 45809355 46337110 46106323 47030735 46848637 47279542 46824068 45919536 44687594
4287 44687594 44163230 43087529 41460547 39902115 39607095 39277478 37934926 36751065 36201412
4278 36201412 36002472 35963974 35373438 35024426 35296548 35519461 35253939 35034642 34226463 33861146
4268 33861146 35202321 35233839 35689216 36014418 35297800 35193936 35854171 35310871 36089483
4259 36089483 36622658 36642855 36402580 36297892 36156545 36205237 35876287 35112971 33618940 32231484
4249 32231484 32513429 31877810 31940773 31954973 31590736 30854851 31524292 32846328 32319368 32351361
4239 32351361 31870407 32024667 31227143 30261191 30249007 29867405 30635496 30843810 30493569 29947511
4229 29947511 30237223 30790602 30259959 30349852 30949486 30114139 29384225 29117336 28331446 28144846
4219 28144846 27673215 27956372 27072487 28488248 29022378 28600371 28742799 29391198 29057367
4210 29057367 29482377 28967816 29285629 30441748 30773036 30729717 30516032 31030579 31044793 30050052
4200 30050052 30342023 30413790 29215809 28118108 28142220 28800014 27719503 27545620 26664717
4191 26664717 26294246 25440669 25637657 25576911 25538789 25837936 26292310 26209855 26117927 25216220
4181 25216220 25733761 25906922 24894020 24305972 24632593 25069132 23552520 24906252 24811460
4172 24811460 23284841 23002162 23825479 24960724 25764622 25739656 26169991 26737750 26503841
4163 26503841 27382776 27378128 28195518 29512263 30499287 30796319 30839667 30406689 31789089 32704341
4153 32704341 34030673 34874380 35450505 36652465 37276439 39013142 42170948 45355201 49733267
4144 49733267 52742282 56495863 57865951 56803282 53601741 50595447 47528437 43477320
4136 43477320 40611769 38154657 36325715 35519746 34701323 33832270 32285693 31978748 31847322
4127 31847322 31288529 31143627 29907114 30037984 29216303 29201752 29546227 29837513 28821212
4118 28821212 29301340 29582014 29403039 29672181 30705665 29800122 29388771 30190343 30699685
4109 30699685 30090608 30018700 30522532 30794584 30032687 30798103 30893219 29519976 29715691 30368879
4099 30368879 30104605 30206515 31391123 32259483 32232157 31810683 32147429 32629791 33342197
4090 33342197 33779235 32072198 32612064 34863477 35524566 36392286 37076229 37548114 38596271
4081 38596271 38351739 37862002 38759768 39565230 40626346 40787442 41567445 41449003 41445236 41936726
4071 41936726 42810032 43753999 42763296 43120477 43578766 42846065 43281655 43737781 44073670
4062 44073670 44079487 44781889 45527446 45606983 46211868 45619885 46262626 46998566 47163320 47243117
4052 47243117 47121577 46888503 47115102 48119812 48942841 50786517 51277144 52180502 53497466
4043 53497466 54494824 54553474 55212655 56453988 57121357 56957506 57936027 58541367 58854548
4034 58854548 59452745 60392811 61093443 60938384 61053904 61323729 62488219 64268882 64467487
4025 64467487 64874841 66076387 66210259 67221919 67878639 69352990 70150495 71405724 72765666
4016 72765666 73387473 75676969 76955422 79293721 80611546 81952959 82534965 84658324
4008 84658324 87299705 88169203 89651360 91366408 93563185 95399118 96427350 97423932
4000 97423932 101321295 103122362 105605639 106725942 107801426 108863761 111466582 113300745
3992 113300745 114067204 116634199 118139680 118496760 119817822 119723407 120942051 122469319 122769381
3983 122769381 123255693 122938722 122232651 121599891 121527191 120763277 121327788 120466308 119545237
3974 119545237 119193643 118229393 117574427 117183038 115907407 113523812 112293643 112276053 111021959
3965 111021959 109748020 108438187 107599045 105838763 104758454 102882831 101204736 99754397
3957 99754397 97850775 97148899 96293927 96526972 95596259 93807349 92439422 90934271 89808092
3948 89808092 88944233 88717634 87663592 87791935 87919179 86890140 85254061 85479262 85519930
3939 85519930 87031439 88088829 88122285 88116878 88564160 88619788 88930361 89519781 89812865 90960322
3929 90960322 91687768 92891072 94468730 95118235 96353035 97098969 97219723 97251014 95999382
3920 95999382 97671897 97680208 98382741 98175807 97364726 98606588 98238814 98719558 98470417
3911 98470417 99413626 99200687 97967111 98178091 98141410 97831915 97618347 96912243 95105392
3902 95105392 93775370 92077913 91814295 91501025 90678363 88112221 87497020 87202515 85433526
3893 85433526 84181789 82696928 81147425 79300024 78216003 78007679 76470378 74672831
3885 74672831 73392371 71648443 69395348 69078490 68797005 67583738 65123517 64028175
3877 64028175 63178537 62227664 62107705 60711194 58769214 58533025 57828121 57052460 57090027
3868 57090027 55779427 55450683 54163854 52920677 51998718 52022812 52041298 50328530 50102095
3859 50102095 49331412 48523199 48162688 48254476 47381779 46862744 46108414 45433803 45792256 45440208
3849 45440208 45262845 43893813 43440253 44244191 44458472 45033635 45609567 45259800 44486786
3840 44486786 42777277 43481436 43393295 43313754 43614379 41818338 41310440 40765959 40015673
3831 40015673 39054435 39457291 39827581 38598623 39165579 39505938 39758073 39458848 37792061
3822 37792061 37981290 38319736 38004461 38479232 37848074 37260044 37378637 38000540 38225021
3813 38225021 37995602 37662597 37559612 37504793 38012516 37301057 37140152 37354726 36580004 37356579
3803 37356579 37083085 36536256 36754889 37647416 37018617 36616044 37506546 36988557 36301628
3794 36301628 36607143 36324480 35649413 36769193 36437144 36589464 37162034 36064643 34767959
3785 34767959 34636300 34046478 34683072 35929850 35661578 34897336 34563759 34831457 35808287
3776 35808287 35189753 34982188 34839803 35757253 34718689 33871504 35093434 35503379 35113309
3767 35113309 34415895 34768382 35447328 35886586 35925535 35400084 36166567 35921218 34697013
3758 34697013 34767971 35218654 35627513 35575302 35527678 35398444 35577020 36016381 36185544 35148547
3748 35148547 34982215 35738795 35546689 35798389 36330179 35910610 36702687 36085718 35994993 36205406
3738 36205406 35847848 35845639 36095176 36801249 37506393 37059689 37891694 37665085 36887363 36321210
3728 36321210 37605021 38307701 38969142 39744583 39164259 39560054 39858370 40534531 40260794
3719 40260794 39105019 40414428 41772090 42769653 42973513 42597827 42198779 42572039 44531480
3710 44531480 44341032 44493342 44987265 45212733 46592694 47290812 47208106 46979004 47878944
3701 47878944 48989751 49446604 50793790 51003405 51047781 51306754 52930222 54989061 55273697
3692 55273697 56824308 57635460 59408068 60622147 61870961 63318175 63725397 64684821 65392920
3683 65392920 65440945 65660496 65612565 65530063 65679988 66608129 67539883 67962885 69437313 70355649
3673 70355649 70929536 72152604 73951491 74889433 74965770 76572365 77843303 78987327 81126276
3664 81126276 83893519 85563517 86393483 88949275 91105900 91512493 93563070 93841213 95172736
3655 95172736 96544183 97371386 98772521 98938453 99548510 100187454 101618320 102533003 103900426
3646 103900426 105078077 107211278 109183284 110590064 111445164 113328651 114379982 116569895
3638 116569895 118008625 119770630 121751273 122671412 124075285 125642391 127382878 129830031
3630 129830031 131554791 133956055 134918322 136614542 139564080 141911229 143356032 145629391
3622 145629391 148356611 151742259 154384175 157538823 160432500 162965715 165587282 168931529
3614 168931529 171862308 175472848 178489431 181777412 186486188 189486502 192912103 197091439
3606 197091439 201052602 204686623 209147896 213313419 217923592 221272562 225698164 229679985
3598 229679985 233054848 237309036 240471795 243630265 247637965 251181745 255186800 258381895
3590 258381895 261535722 265175179 270233563 273092839 276444854 279538235 283160544 285160720
3582 285160720 287608107 290484585 291274243 292125696 292892581 294587600 295432448 296707976 298272210
3573 298272210 299377363 300224227 302421172 303911302 305218643 308571997 311563607 314437567
3565 314437567 317407597 320606164 324210091 326283705 330038162 332754547 336002698 338184420
3557 338184420 339710489 341525832 341456217 341624547 341236576 340601080 339665090 339180725 339948910
3548 339948910 340234566 338990034 338760521 338449844 338097438 336416399 333266356 329147371 324608249
3539 324608249 319142515 313195066 307689082 303109277 297716653 292236648 288003210 283753261
3531 283753261 279333104 274035419 270350641 266929091 263309237 259179544 256327410 252470452
3523 252470452 248428650 244397189 241089514 237076995 233386567 230815655 227224344 223600085
3515 223600085 220555314 217962391 213749746 210817695 208037720 204595680 200881343 198636096
3507 198636096 195089399 193116474 190082599 187695607 184916772 183460915 181954551 179922259
3499 179922259 178041284 176162250 173858911 171649569 169856784 168226588 167090234 165300383
3491 165300383 164299393 163059286 162268763 161881410 160611526 160043320 159939539 158867020 159438951
3482 159438951 159360115 159043426 160009499 160627064 162349509 164027887 165308185 167129527 168388967
3473 168388967 169981313 171301296 174001034 176286230 178408651 180901456 183618580 186124742
3465 186124742 188841419 191109264 194209409 196683447 199181400 201768931 203027736 204673817
3457 204673817 206150693 205831744 206439892 206164648 205132434 203484751 203580084 202959739 200115093
3448 200115093 197412279 195061041 192110256 188858703 185440184 180819809 177063675 173867975
3440 173867975 169439000 164744177 159772777 155951869 151508021 146068125 142186237 138508917
3432 138508917 134010378 129854793 126089613 122674916 119545658 116364993 114474079 112010252
3424 112010252 108950613 106621120 104936450 102784073 101669373 100768802 100227058 99440448
3416 99440448 98998789 97796157 96921902 97724447 96898535 96092748 96055614 95168569 94080252
3407 94080252 92665551 91371867 90194686 89569502 89451629 89674173 88829458 88441769 88449210
3398 88449210 87209627 87890367 86532439 85153751 82855972 80596518 79553452 78219410
3390 78219410 76661849 74425186 73610482 72493306 70657575 68770494 68553148 67900409 67073959
3381 67073959 65799966 64056823 63703889 63724113 62730258 62186864 61538398 60865542 60191036
3372 60191036 60538677 60147216 59556705 60459154 61275921 62881273 63318087 63089052 64040171
3363 64040171 64890226 64846684 66198192 67648152 68713721 69848432 69163531 70115465 71468640
3354 71468640 71450435 71205576 71550062 72629955 72946758 72887159 72765226 72809353 72649723 72459542
3344 72459542 71797780 70901502 71006921 70116092 68564131 69394744 68955411 66056503 65260720
3335 65260720 65149535 65227967 65262177 64485742 62640650 60964352 60216919 58710049 57788662
3326 57788662 57095553 56797332 57404836 56401377 55967752 54478543 53473469 53151254 53364474
3317 53364474 53138850 53206853 52345131 50717445 50862414 51541080 50821022 49853235 49811580 49296920
3307 49296920 49510225 50046437 49953628 50891555 51119673 50868493 50893696 50216375 50024066 50247449
3297 50247449 50898922 50084011 51419600 51987800 51272453 51662586 52106476 52212062 52356904
3288 52356904 51955160 52542562 52930310 53809411 53189012 54071027 54491574 55536381 56683837
3279 56683837 56890153 56712197 58503363 59368029 60266123 61490290 61694848 62586042 63512485
3270 63512485 64611449 65156376 66914874 68746384 69663810 68968998 69488058 71575588 71731861
3261 71731861 71397289 72846528 73875953 75214983 76682420 78128578 79718004 82080286
3253 82080286 83905133 86604394 89441815 93458571 96199280 98764498 102760937 106459305
3245 106459305 108461133 111611338 114407507 115793661 116022473 114697453 113705482 113055446
3237 113055446 111105505 108742254 106868069 105551386 102889526 100835957 99488505 97331955
3229 97331955 95729820 93275345 89661166 87324602 85389589 80765113 78582655 75750782
3221 75750782 72691759 70440033 67278091 64136371 62126566 59993263 57846039 57382609
3213 57382609 55113155 53651780 52012528 50203946 50239820 49323632 48624194 48697433 46365182
3204 46365182 45355565 45262735 45372756 45130244 45007648 45732284 44364678 44124849 42927361
3195 42927361 42078551 41902915 41208286 40135624 38855214 37617997 38149602 39101482 38840056
3186 38840056 38432103 37273215 36641402 35632470 35604412 34771879 33421358 32956289 32251821
3177 32251821 32399409 32618296 31191065 31454424 31385935 30700448 30799720 29895477 30411658 31223590
3167 31223590 32080030 32340984 32415672 32502193 31851536 32333089 33095819 34992467 35526715 34540590
3157 34540590 33994191 34995723 36128534 36184405 36503552 36426267 35504223 33241078 31767231
3148 31767231 31118167 31037575 30648061 30090570 30015413 30353670 29164669 28309823 28470414 28565182
3138 28565182 28852625 28354677 28426463 30310470 30241998 30518058 31255608 33030223 33663336
3129 33663336 33525591 33581271 33196572 33634126 33073619 33375850 33820172 33154345 32899333 33095088
3119 33095088 33006846 31482234 30154897 29707558 29079709 29663659 29345354 29230117 28607980
3110 28607980 28016060 28539527 27822730 28701484 29100953 29000457 28741970 27963491 28564765
3101 28564765 28946513 28237944 27869774 27531177 28127862 28212527 28186378 27210799 25881524 25050432
3091 25050432 25626757 25942975 25004461 25623918 24879102 24890078 23850955 23843392 24319068 24708415
3081 24708415 25055842 24329452 24884567 25023034 25397141 25151626 24507867 24405689 24091848
3072 24091848 24309818 24956876 25277736 25545302 25646542 25603890 24953753 24765793 24245438 23385591
3062 23385591 23787597 23826066 23821976 23788831 23804652 24170154 24284801 24195948 24510911 24463456 25513271
3051 25513271 24636914 25015603 25032033 26147099 26411882 26328102 26208546 26164604 27215077 27781085
3041 27781085 28032221 27820409 27955973 27335664 26862371 26076784 27022171 28257452 28813395
3032 28813395 28975591 29641157 29659233 29034933 28151122 28657246 29329269 28482971 28100627 27713590
3022 27713590 27573934 27255364 27004490 26874327 27599593 27270764 27559237 28578886 28810245
3013 28810245 28338449 27395102 27536220 28645727 29535662 30773622 30952701 31490426 31562378
3004 31562378 31382022 32236235 31897983 32613679 33619400 33316002 33922351 34819371 34841562
2995 34841562 35538387 35642970 35044177 34825819 35668108 35460744 35778826 35836338 36480313 37646537
2985 37646537 38072053 38977305 41175937 42680740 44826784 46757613 48362809 50946514
2977 50946514 54700809 59247908 64640670 69310046 74453692 78998021 81739547 83590150
2969 83590150 82665369 79572352 75878885 72296634 67941714 63556804 60531259 58161194
2961 58161194 55895182 55192296 54140802 53432214 53219959 53745497 55096895 55523267 54774242
2952 54774242 55622534 57205913 58399471 62046427 65688059 69948116 75259962 81104530
2944 81104530 88098793 97154064 107890761 118617903 129575415 140123268 144634351 141936191
2936 141936191 134251925 123540581 113744982 104648194 95835072 90328779 85491002 80613924
2928 80613924 76671048 73401814 69644124 66756279 65467842 64003617 62055931 60636842
2920 60636842 59827372 59952691 60426146 61153382 62700207 64209240 67496236 68911500 71565551
2911 71565551 74871510 77420349 81292516 85491312 89997627 92364301 92814543 91938866
2903 91938866 89887492 86917780 82106866 77636415 74757304 72537572 67842544 63594283
2895 63594283 60705822 57408076 53691675 50501872 48796237 47172592 44309606 43382118
2887 43382118 43591425 42222611 41347864 41341556 42360841 42354269 41555551 40601171 41280522 41098779
2877 41098779 39486803 38769471 39237784 38433534 37956333 37619055 37270282 36668056 35244173
2868 35244173 34370751 34958884 35403852 34636535 34348353 33187589 33032591 32299824 30361115
2859 30361115 28767428 27946569 26814220 26628111 26584524 25773015 25864854 26268237 26440057
2850 26440057 26810895 26424158 26880600 25764528 25013256 23728607 23642432 23449825 22423070
2841 22423070 22816475 22679055 22666264 22159017 22200649 20830644 21331056 22860955 23396864
2832 23396864 24817007 25753431 27030112 27867324 29053030 29787380 29977493 29355138 28718494
2823 28718494 27410642 26329299 25217641 23121929 22802332 21583647 20478052 20346070
2815 20346070 19999773 19289513 18585235 18604322 17967788 18276580 18417862 17906965 17728317 18647571
2805 18647571 19758626 20226744 21286592 22027682 24423167 25972668 27969154 30458609
2797 30458609 33272194 36171196 38024003 39191198 39594595 37773865 35134531 32413281
2789 32413281 29000322 26405055 23955551 22084431 20693412 18598333 16848197 15948580
2781 15948580 16738239 15924120 14431682 14336420 14590134 14124115 13413066 13596203 14286039
2772 14286039 15108806 15025166 15083385 15722529 17053030 16997884 16151569 17519318 19141839
2763 19141839 19547475 19700253 20124352 19982866 18735936 17504008 16218876 14629547 13413285
2754 13413285 12254651 11447413 10417243 10268406 10180256 9827924 8590981 7806463 8352925
2745 8352925 7138105 7707468 7609611 6746654 6109453 5641260 5684454 5973248 5946793 6483707
2735 6483707 5397844 4214940 4851712 5172819 4690568 4147124 4519634 4204246 5428141
2726 5428141 5434640 4000623 4247514 3886473 2521978 3425851 3846646 4785101 4666448 3025943
2716 3025943 2891081 3744158 4029228 3008072 2462823 2831868 2889846 2639222 2462729 3123093
2706 3123093 3788447 3528307 3418450 2982810 3662504 3039585 3103253 2813266 3028399 3865594
2696 3865594 3454450 3673164 3038799 1965252 2030998 2380732 2278375 2206060 2560872 2290540
2686 2290540 2004238 2975759 2654749 2755846 2106230 1808039 2204106 1941006 1840383 1397004
2676 1397004 1695473 1384097 1969093 2211733 1953076 2445381 1988034 2405255 2705100 1624224
2666 1624224 1112613 1239425 1049426 778870 1150333 1001042 276938 1122227 1276020 1078448
2656 1078448 1585699 1113231 1611414 2280088 1853503 2386771 2476319 2626570 3008711 2298654
2646 2298654 1687550 2354798 2180084 1918227 2620417 1712331 1434679 1012782 1350590 1554195
2636 1554195 1452650 1448045 906161 1385882 1360574 617894 1334884 2514085 2983242 2918699
2626 2918699 1997155 2672112 3069626 2261907 1423321 1844246 2567161 2580598 1757216 2648390
2616 2648390 1384960 1670542 1642693 1395097 712871 -7749 1647648 1680997 1830788 2321030
2606 2321030 2793739 2616692 2059404 1596698 1746929 1980228 1091730 1149089 1867691 1452036
2596 1452036 1790817 2349342 1785798 824770 2793273 2696352 2146915 488151 624816
2587 624816 1112548 993875 1447497 1343845 1530630 1909040 1399904 1186033 490705 426658
2577 426658 1325296 1192135 961940 1139903 399600 166860 1581028 1969051 2252361 1747753
2567 1747753 1482590 490101 35776 933691 1676044 1029778 1373659 2257518 1461099 1952243
2557 1952243 784293 681287 89028 699632 2323039 1467718 831941 1029720 543404
2548 543404 1660117 1661613 488999 -100537 -843480 -175807 280880 609410 849954 631648
2538 631648 315214 343679 43857 87177 484147 550904 702152 567782 1575888 1918775
2528 1918775 766890 964435 1882344 757025 -163069 1036622 1280948 930859 -160945
2519 -160945 132500 181529 190518 -524378 -642397 -720381 -270065 -98541 106332 -220908
2509 -220908 477100 1524248 1276300 585931 888912 786140 773305 624082 1094330 92728
2499 92728 -384048 711526 536716 183685 499220 828574 741315 747966 651589 1265501
2489 1265501 1714605 1567401 1028564 524664 58848 -329608 492524 898049 559073 165673
2479 165673 -426553 -359865 -313931 -257998 -476329 290022 700059 146027 -188579 -760811
2469 -760811 -1053130 -80294 779141 885173 1415890 915501 -474919 479181 555230 1009481
2459 1009481 518144 86451 622793 1512839 1650591 138912 -515044 204436 266661 127972
2449 127972 141903 10587 -39362 614830 392368 -1150643 -1325273 -1268523 -347764 -410003
2439 -410003 -833677 -894229 39192 17188 561592 1088931 1165922 1673423 1361389 1104944
2429 1104944 -22115 761608 845376 1294504 1020958 -23257 -7767 -860921 116647 78470
2419 78470 339128 834474 721721 -242872 -391271 -222041 519951 524070 561701 289907
2409 289907 -468620 166901 -399982 -757198 -122883 123013 225952 388695 196229 207583
2399 207583 -517638 -344877 325178 -886501 -858253 206560 541023 81447 466061 1284318
2389 1284318 774511 1016911 315105 253982 137420 209144 1105435 687793 877742 553260
2379 553260 545781 898706 459264 611614 137676 801955 1328581 2592539 1723639 1567342
2369 1567342 1476127 1274623 747384 1238372 1426176 1531072 1586079 1359962 1203617 600259
2359 600259 420549 487569 891737 299250 135919 65373 -548195 -128612 -49605 211605
2349 211605 506987 575602 -493955 -360727 -568065 -297055 850463 726470 897962 1619387
2339 1619387 1454480 390127 647320 751935 825959 857529 609119 713568 1238755 357907
2329 357907 -851083 -600772 -139274 -702507 -223545 -66174 -591685 -1659 445571 -260333
2319 -260333 -680474 -377926 -886629 -642526 -967470 -1335823 -542728 -348478 -288512 -172367
2309 -172367 -119090 -885930 486123 453799 153574 -250088 -1320357 -614605 -646097 -2048130
2299 -2048130 -1570669 -767979 378721 1275713 1192383 922332 769296 130220 463981 435652
2289 435652 -648878 -135385 -774204 -1529333 -983942 -845451 228555 21494 609554
2280 609554 -818497 -291068 -255060 230055 322071 -235993 -154124 1346142 1401981 -51650
2270 -51650 -325733 -174479 433696 752918 964322 844686 1062334 819057 356939 -515783
2260 -515783 -176401 628569 816334 76838 137130 1228797 557072 687845 1284489 1371995
2250 1371995 464119 595385 1231094 148807 51914 131600 946522 475883 309023 -341635
2240 -341635 520854 1347531 1191226 1033787 1931460 2134438 1269979 1115412 1929721 2124553
2230 2124553 1482654 1272736 2200517 1951296 2011583 2075980 2038640 1429590 782960 856550
2220 856550 1047232 1945232 1027249 1046979 1494832 2590719 2483815 1765447 1158360 1072180
2210 1072180 630796 374659 1266575 1477412 1721329 715646 976127 790022 1306811
2201 1306811 2457265 2580895 1889821 1797406 1056673 1742473 1649185 2570927 1953131 1532052
2191 1532052 1678401 2022786 2254200 3036426 2309613 2719207 2377033 2901668 3876089 4236170
2181 4236170 5571267 4053502 3056690 3312517 3808678 3639863 4154337 3919124 4788930
2172 4788930 5669852 5975115 4710464 5135870 5107237 5338801 4872876 5096346 5898620 6265087
2162 6265087 6831391 7067343 6789378 7150474 6883799 7352535 7529678 6639680 7394543 7821471
2152 7821471 8188334 8627864 8554739 8632302 7499101 7857700 8857275 9231285 10105774 10975423
2142 10975423 10603917 11116499 11810321 11828670 12767586 13123134 14291710 15069986 15494678
2133 15494678 15997039 16548862 17203264 18990011 20742397 21693811 23170784 24466412 24541112
2124 24541112 26145479 28261027 30555907 33367080 37072138 40427484 42393605 45211796
2116 45211796 49595968 54814849 61222003 67655476 75364453 86092779 99774150 116784266
2108 116784266 140639430 172414572 212760150 250098946 255495422 233420710 195157429
2101 195157429 157663884 130815054 108359931 92561003 79682546 68510618 60620808
2094 60620808 55156310 49785311 45760052 43466295 40631432 38198260 36184566 32951370
2086 32951370 30416132 28563590 26563313 24125836 22663800 21452554 19969764 18667884
2078 18667884 17760943 17468324 17205845 16677449 16440873 15958823 15543983 14198144 12993050
2069 12993050 12902214 11952932 11259868 10768998 9634264 9284744 10303076 9827844 9017657
2060 9017657 7713775 8238963 8807992 7765896 7786172 7001856 6760657 6026666 7050472
2051 7050472 6540112 5619545 6061730 4857127 5572511 4789222 5373933 5120853 5211288 5410045
2041 5410045 5785730 4829026 4311975 4605579 4555852 5514352 5272856 5063908 4219206 4695200
2031 4695200 4383896 4078972 4499493 4644451 3102553 2644620 3093978 2808734 3730279
2022 3730279 3545512 2834442 2920129 3525810 1952296 2310828 3193104 2121558 2427349
2013 2427349 1877262 2203160 2418755 2538963 2430495 1543907 2278683 2007106 2218184 2468018
2003 2468018 1255039 1572250 1390085 1419897 2386809 2152344 1991401 1679524 1984849 2594950
1993 2594950 1736758 1809874 1854988 1218138 1085514 1384642 1639891 1419596 1257926 585851
1983 585851 561379 1197971 1237450 1339573 1398432 1587801 569023 25656 -307352 146499
1973 146499 -190957 -426525 240852 -97747 -365847 804948 1438278 1201517 893077 1554393
1963 1554393 1970557 1516528 1317328 1057376 -689143 542958 1790594 1855721 1667979
1954 1667979 690256 744062 260095 836626 636173 -112017 469810 1645057 1407713 1307989
1944 1307989 1547055 977718 81007 -150875 1430357 1280149 410093 1073323 921752
1935 921752 1002652 625261 39033 -1195371 -481501 -504385 -1576021 -854244 42778 106635
1925 106635 204864 405484 602930 1514841 1569186 1441682 -819612 -746261 340834 -365447
1915 -365447 505551 1326225 1045978 130776 -308970 -1180723 -5606 665848 532535 826779
1905 826779 942799 828908 766159 470265 1322477 1099521 1062801 728767 186605 -115112
1895 -115112 -146331 609997 293142 308091 378627 341066 -302038 -279879 -962584 674083
1885 674083 698638 592501 1060023 660674 172654 168217 994830 433433 -234375 1196667
1875 1196667 1241346 670131 399096 1108372 822269 607533 273090 482123 386244 137539
1865 137539 558545 743820 1151424 194388 865877 264919 87236 366906 1685236 1966809
1855 1966809 1097054 174795 -335275 -179531 105566 534224 -247809 -1148517 -142666
1846 -142666 137510 234204 623147 89710 909462 964354 -18990 555799 888137 200270
1836 200270 513266 1023088 655823 679211 161143 186148 -253134 -628597 17022 463720
1826 463720 477280 -861632 -1333832 -837050 -518780 241932 329293 564814 1051 -295527
1816 -295527 -217372 1077866 826835 30074 -391733 -1146128 40416 -107014 51630 -7138
1806 -7138 -370176 -339849 -965651 -891601 -1083085 -628892 -96509 800345 744965 935271 657025
1795 657025 -336097 -654918 218380 84768 -861696 480508 300841 129981 484649 303828
1785 303828 735067 929281 1309580 535199 -774919 -976337 -1565241 -426572 -24741
1776 -24741 -110241 394564 28241 -123842 -631143 253506 368460 326274 837509 -87030
1766 -87030 19967 -409180 -1313109 -1493197 -562244 -489633 -523261 -473927 -339632 294974
1756 294974 -4058 9058 -267646 -252744 193479 817553 317260 -80865 903479 -222480
1746 -222480 -88981 -212673 -266532 -744337 -358647 -569016 -1222508 -459073 -190653 -521806
1736 -521806 -207529 -369574 602365 -207966 -1031317 -1216623 -228891 703894 -86778 -626212
1726 -626212 -591297 -107148 554096 742005 234053 783677 158187 346619 -553022 -523791
1716 -523791 -382767 656582 1481580 834196 -528480 -656928 656677 30739 -609052
1707 -609052 -429572 -807363 -106107 -784158 -1003270 -625911 365083 -335371 -1482809 -805663
1697 -805663 -378821 -891825 -907294 216111 -233459 -416552 184781 459894 946139 739393
1687 739393 553559 182885 -555867 -574458 -219254 415921 797302 310986 98065 -328362
1677 -328362 -111020 434612 -291567 -144226 -224733 -343723 -448742 -357318 -515053 -468167
1667 -468167 -1128106 -197857 238268 44467 263326 -19375 -63964 -223632 -686856 159750
1657 159750 -927841 -1250513 -1056641 -679925 -123385 -239735 -315521 468011 1393676 921418
1647 921418 -279021 -447552 -368763 -213991 -5777 -255538 679563 -211101 -664575 -1386814
1637 -1386814 -1176280 -253019 -311698 -722357 -227309 289112 -452756 -891660 -302920 -165663
1627 -165663 31531 736881 428361 397966 326276 -262474 -622032 -298078 -123600 339572
1617 339572 976174 517004 -388291 -1156088 -992810 -260273 -577258 -912965 -779617 -539993
1607 -539993 890459 485764 17173 -354267 -123073 -306987 -622578 -477621 498459 792610
1597 792610 1005530 325639 -942253 -944770 -860665 -1116285 -668365 -507382 -569414 -276587
1587 -276587 -89723 138122 144985 -56481 -823 125501 1088887 986320 48322 -764254
1577 -764254 -1449904 -1443185 -858043 594866 495450 1084815 423377 -139636 172160 -139901
1567 -139901 328984 1134442 899204 373315 635473 176678 720176 84422 -173517 -245313
1557 -245313 -349073 -248582 -399036 -408318 113371 718336 439094 447732 -754874 -827282
1547 -827282 -374442 -503906 -374560 -550259 285334 -13149 -532131 28727 -389625 -569811
1537 -569811 236918 455716 -391555 152839 -81223 -551719 88654 -1109345 -1240909 -569654
1527 -569654 -1023881 -709582 -945042 -472825 -381066 486543 110803 200575 226020 -369002
1517 -369002 -791607 -778948 -1178043 -527603 641711 -206433 -102322 -155246 55132 -343332
1507 -343332 -347670 -214294 207158 -359901 -446212 57409 -799102 529483 1695441 1106002
1497 1106002 -538398 -905659 -530777 -1163898 -1192844 -619481 -808619 -1034777 -605337 -509812
1487 -509812 -96731 -479693 -1052962 -973670 -542213 719540 44381 154384 329890 215764
1477 215764 658002 918370 1344784 1624885 778730 94688 -44128 465044 3214 314749
1467 314749 -227053 -509337 -526323 -429925 179207 503911 -237398 -501731 -1024483 -1911584
1457 -1911584 -1624068 -1184256 -658203 -801352 -109004 -610701 -301795 -174934 -241108 -538293
1447 -538293 -908316 -503323 -182626 -523740 -258692 -470738 -917645 9198 387667 -489308
1437 -489308 -164104 -1282805 -1251418 -894031 -1085651 -115580 -55284 141997 -347492 -87796
1427 -87796 474014 -409217 -690670 -570494 -593145 -790136 -356005 195018 7354 -937876
1417 -937876 -9909 690635 752843 5302 180275 -78497 -1088396 -713587 -435786 590521
1407 590521 25505 56695 122703 -181545 165460 172214 -391664 -533964 144548 379817
1397 379817 -258720 -108410 14973 -63634 -95872 -708312 -760054 -313422 153024 171128
1387 171128 -372547 -1139438 -455385 -1171076 -1216783 -551898 -747830 -468505 -361013 -168623
1377 -168623 -573895 -129676 443210 802851 937138 -919110 -233296 914277 724712
1368 724712 253400 111885 -362712 -967046 -1395162 -608707 -1035091 -1242092 -1359678 -933884
1358 -933884 -614130 -1276854 -1098475 -408901 670460 -80436 -461782 -1085101 -875571 -297565
1348 -297565 -191925 -950739 -1403605 -1413178 189819 -310377 -706488 -1024123 -1247496 -1031065
1338 -1031065 -472041 -137135 576052 465849 -76603 359575 757839 1270664 25006
1329 25006 -127376 -800186 -153469 -343357 -857136 -524606 -964139 -374557 587092 -282274
1319 -282274 11479 342391 453036 -101693 -465715 534856 -119221 -804819 -602624 223681
1309 223681 315127 -834620 -636848 -326527 -499762 -470843 -1482936 -805391 -192309 -774290
1299 -774290 -1885693 -319508 198997 -715906 -724321 -334014 -390600 99809 -363747 -1129535
1289 -1129535 -857282 -970250 -740781 -1542043 -1164005 -288532 -803435 -309683 -625410 -1083737
1279 -1083737 -800626 -483947 -18884 -965043 -633066 -308024 -1264388 -1428758 -396818
1270 -396818 -604490 -170011 102174 353560 83623 253678 53369 127158 1016271 -43612
1260 -43612 117502 1277250 1027649 -223793 -318873 -554186 -332409 -46865 727865 499026
1250 499026 -258421 -208433 1752211 1271467 1055947 -179609 -275976 55913 -441291 -414006
1240 -414006 -871567 -289765 44280 -401076 304874 -54472 134900 723491 187064 527839
1230 527839 -162401 30290 -206125 254670 87347 -43694 -330744 -271109 -255224 -428542
1220 -428542 -716010 -607048 -630698 -129198 -320737 -24014 310173 485030 337251 -336650
1210 -336650 -718517 -188095 265427 436719 -423843 -1722310 -184297 -107622 7566 -19339
1200 -19339 -127219 1282580 1114553 166321 -268529 -749711 -1151823 -813457 -645163 -1088607
1190 -1088607 -1102850 -475935 -1453388 -856847 639 121752 188674 -928708 -820931 -865783
1180 -865783 -666102 256321 355306 -19366 268180 198231 -286830 -477905 539294 188288
1170 188288 -164845 276214 43806 724433 742387 1301923 549650 218238 428186 164458
1160 164458 874809 1148473 540324 32436 -406344 -93834 -60759 636515 631545 310908
1150 310908 -86332 -96970 161678 -663505 -1172986 -639036 -450441 -430265 -68232 -1223154
1140 -1223154 -1192994 282546 -320592 -479808 69707 -703846 -1581730 -923621 -245819 4538
1130 4538 474578 -75366 -562654 -816028 -131146 279614 380311 359642 403340 697955
1120 697955 -296876 -1994202 -226311 565743 -315104 372793 1156836 806893 -52811
1111 -52811 -1012117 -918112 -577171 -377396 -81467 -376151 49567 394898 124933 -74284
1101 -74284 -283124 -263066 103530 354922 156318 -445750 -897109 -70139 225773 437665
1091 437665 -337363 -377005 -455328 -58224 430828 -187807 -155602 256793 794281 -330183
1081 -330183 -570487 -1291353 -715496 -814137 105696 741280 189327 215583 1204681 1003364
1071 1003364 932080 1163489 1042599 1052533 -254669 167766 192080 886572 -356509 -721274
1061 -721274 174614 -23783 112937 621673 118940 -803550 -641910 861222 339365 -537781
1051 -537781 -824099 -1075428 -635289 467900 43641 -568286 750595 1660575 1451440
1042 1451440 1046944 251149 37663 -68082 -95316 -556519 -211523 -547134 -785351 930214
1032 930214 648934 -144004 -385537 244166 1445101 2467874 1388250 389534 637183
1023 637183 -333562 -408784 530866 218172 -436627 185491 -211150 -586746 -241431 235613
1013 235613 342623 43789 770885 183715 811441 1016833 -123208 -13903 365395 -304164
1003 -304164 -438769 628351 933272 -718274 -36786 -678996 -1007381 -98975 -744485
994 -744485 -797134 -246930 -696535 -334287 -484518 -1031387 -670090 -164332 -143873 -341588
984 -341588 -366550 463320 913186 958306 1063724 633714 -42331 -328595 -953614 -1009362
974 -1009362 -771806 -404695 602300 496027 1060883 -39350 -430630 -731320 -1464909
965 -1464909 -1455202 -149183 164270 -645691 849581 326255 -111809 212487 -583377 -305683
955 -305683 -1182814 -1407165 -1789277 -222691 -354393 -647119 -106502 -518698 374823 875563
945 875563 -252481 -13217 -218335 -547681 -133713 174392 825265 380932 -905442 -919504
935 -919504 -416117 -282542 -77858 -978641 -628973 -504295 -341469 -801423 -277783 49086
925 49086 16900 -554121 -107623 -77506 -548518 -926299 350429 900694 223225 316157
915 316157 -680204 -266170 -229759 415301 558577 -463320 -1016446 -88123 -347626 -522570
905 -522570 -331899 -177925 641477 806880 799343 663155 501099 -250086 350927 499530
895 499530 -73207 143983 769223 403567 371614 484878 50307 387013 351165 897278
885 897278 692740 -381095 426352 567161 101604 -622664 -1183151 -322430 -397023 -523983
875 -523983 363320 -325044 -378551 -121842 73891 -87135 -301753 -34110 -358033 -559326
865 -559326 -31815 -56322 -1185868 -889070 355269 -491213 -272380 388018 -530930 -412953
855 -412953 -180247 -419229 669680 530701 73503 108842 306435 409121 369625 353582
845 353582 358431 389264 342269 -123969 -988082 -605155 -601303 1004731 702520 270394 118749
834 118749 -535030 -506900 -479020 3778 247743 -597990 -145755 -104989 385903 973236
824 973236 570626 674947 64052 59414 -247810 -545425 -486717 -815579 -250680 -87874
814 -87874 670034 1128644 594308 479398 -180364 -625522 -369808 -354741 -516129 -900276
804 -900276 -646147 -705216 -301832 -1102999 50239 914817 797086 532649 723632 391838
794 391838 161888 522577 379894 599718 -345622 240495 526064 888911 381026 -255017
784 -255017 302114 217068 132589 625347 -239790 -117395 -66570 374882 -35848 -148876
774 -148876 -212077 -392917 -1366952 -1000304 328000 -433755 167368 88673 -280757 -1170180
764 -1170180 -685751 -547313 -799689 3174 673560 413138 823159 1438526 215932 -447210
754 -447210 151094 230659 -80385 -990463 -480809 -300947 241183 982242 -193724 481159
744 481159 -65863 537133 -19940 -1114 -30604 -501783 -635350 -601682 59930 476597
734 476597 -334191 -118445 -900428 -368610 -632485 107812 1186711 -324946 -444556 -89753
724 -89753 1370084 922199 729472 960271 867956 561888 -117599 -207480 -353330 155513
714 155513 328818 992283 1558440 952314 463991 -766225 -1058376 -1334639 32514 112261
704 112261 -10348 389404 908975 993085 726525 925089 129657 -111313 268192 504275
694 504275 -337775 -650508 21418 245870 877435 334197 1102013 951652 654791 225090
684 225090 -636151 -967902 -301452 32628 640947 438182 423479 1270855 196192 597495
674 597495 -36808 -957593 -951820 -53150 422691 374357 764724 1788774 974335 -595273
664 -595273 -1277292 -1476035 -1383785 -1724635 -376523 -643167 445677 1443316 1178977 837661
654 837661 1090721 1082731 69464 191047 672632 450471 240311 446963 -403202 -566373
644 -566373 137445 37360 -1562480 -650060 398820 845413 908193 832210 160275 -256043
634 -256043 649410 847653 268401 -121360 870615 1072689 -288179 -449975 -336724 -248705
624 -248705 -400948 -101562 -78207 1134723 195679 -397339 -406508 -557144 95674 295762
614 295762 -610676 -994459 -322302 25224 326700 150018 901890 1291355 956714 721483
604 721483 39019 -59161 -144459 16447 249460 -692658 -820269 90075 659288 1168901
594 1168901 775012 876418 661044 724880 767721 449257 321632 579127 996149 847593
584 847593 625042 226417 339900 565006 -336167 -675638 -96698 -790189 -1156379 -997521
574 -997521 -259958 -1067091 -238668 548554 324142 -418691 412554 -594073 -532580 -439151
564 -439151 -325740 -330914 -396904 -404696 -315158 -743684 -1294552 -431776 -25365 -330558 -191308
553 -191308 199452 376845 444263 298131 324289 507315 150457 352591 -181711 -515986
543 -515986 -612047 -2143294 -1370676 -982767 -519498 -1172290 -988741 -772130 75485 509392
533 509392 770820 482618 648372 359656 377073 1277979 54015 75769 439451 1085247
523 1085247 1556440 2018860 1491800 1371185 519400 1027733 167527 -150060 1034390 14763
513 14763 -518546 -492961 -395767 -452083 -227667 -128238 -140796 -319589 310155 -107131 423130
502 423130 1147959 150316 -151006 76821 472484 481182 185218 612459 788222 -437738
492 -437738 62135 230555 -206151 -24614 24903 -79665 -195041 -459916 -653526 -268422
482 -268422 -213407 -374052 -227642 55848 -273208 235701 466823 457090 240118 -832191
472 -832191 -736279 296704 810824 1043937 962694 481257 49342 889182 1083537 788948
462 788948 601147 -728687 -1483218 -547335 2500 134084 -354150 -155284 771591 820084
452 820084 -113004 -93994 377975 556968 1934327 1541363 61037 -322380 285615 639601
442 639601 -295023 -221860 -501688 -429034 -776723 -38637 114575 -666431 -419684 567892
432 567892 -361446 -350950 548716 -32937 -866774 180597 483556 -18705 806948 444709
422 444709 -82301 -262267 -403438 362603 437383 136697 120663 -33303 -175431 311033
412 311033 253575 -873989 -1277890 310168 522828 205238 -498642 -1184937 -508081 45282
402 45282 501892 1057042 1690518 2146575 1759151 821239 766488 632766 495481 166680
392 166680 1304739 941602 454416 307754 186301 -419061 -1273434 -571017 -990495 -273107
382 -273107 -67223 428879 671086 795522 1085797 539021 -361189 -1166520 -59492 -77541
372 -77541 336774 841096 290092 -715725 -499174 393948 861705 258728 -169164 -360315
362 -360315 -47931 981879 752911 -629200 -595942 -342888 634466 884909 -471920 -1044657
352 -1044657 -387284 231187 1275604 766711 1084395 931696 907700 913024 1033684 291724
342 291724 -155937 410013 886760 543675 1871287 2050554 1924744 614527 -495617
333 -495617 294960 483204 -442494 844881 932937 -596862 -400545 -103368 788979 1050677
323 1050677 -355354 -996438 -115921 701180 605627 997664 1257009 373104 593141 312123
313 312123 -100957 -245557 593299 218800 600201 197003 -726 675544 155835 -280295
303 -280295 14258 296781 474139 -12708 623671 752930 131636 519060 1134074 465246
293 465246 517772 266725 875416 1611808 1158834 680019 91331 -808194 -266577 262482
283 262482 208852 481739 661575 689200 -76735 648133 992128 -510144 -1011858 -254331
273 -254331 -202652 674252 934439 -148272 -40153 321603 169117 -106078 -14118 -186146
263 -186146 150232 -94229 -512159 -619107 -406582 -64223 482265 157643 -467766 307680
253 307680 1031103 1185238 1129887 -318941 -217564 -180811 171876 -88854 170334 540263
243 540263 853850 152819 -153940 -344125 -615089 210495 698758 504169 571228 553214
233 553214 234395 253590 -290646 -714284 441584 481709 480145 1370022 819826 410671
223 410671 505594 829269 801825 -455110 -233724 356477 -110483 645400 642973 -723762
213 -723762 -151406 48551 434331 599237 370359 769043 -253020 -73223 516076 1188609
203 1188609 804376 1279884 1119624 1101375 556912 -256333 428230 774536 767823 1304539
193 1304539 893535 684591 876688 336436 -410490 -59710 -189819 1109275 454307 -1018302
183 -1018302 -284650 622174 1155447 748532 1037559 850874 1030704 392247 449072 908784
173 908784 241369 571569 -327084 -187439 -612833 -278259 -64739 -475698 -524775 172124
163 172124 683853 -183918 -114502 1302473 1200941 864286 308043 -77097 -481912 -482316
153 -482316 340067 6855 -385252 -411811 448546 -208181 -1278566 -708741 -419390 -726474
143 -726474 466733 589480 304764 82564 70098 298071 230653 672597 921742 199182
133 199182 -53620 101725 569009 502717 261912 454635 370383 -154154 -75390 -21475 -163425
122 -163425 728215 391022 737083 -36416 -12490 471545 1105014 860219 613302 242296
112 242296 5951 965231 1091811 740642 635999 787565 525594 934502 991724 577845
102 577845 458139 -347073 -509949 -162338 160784 743101 36249 -293227 433322 791827
92 791827 157514 269444 323869 -155866 -218205 59363 76833 604022 1267926 1362019 466758
81 466758 56033 653784 860965 695244 574095 658472 101757 -831049 384776 702539
71 702539 189776 330654 542627 36742 295267 1208063 609777 17436 -353404 -1014035
61 -1014035 -608290 33595 4467 304865 11663 409114 552564 758376 981838 -24051
51 -24051 340415 547049 590632 748832 327040 584966 -19811 -670298 -54592 319376
41 319376 526719 701541 -35498 -216025 1061152 15616 -351101 345076 692785 106872
31 106872 -82112 -204369 -72367 -470787 291199 736300 275118 370504 461207 151896
21 151896 -481177 -53736 230841 624686 252710 230099 804867 89765 9876 281623
11 281623 -388802 421300 225405 82842 708923 283691 9377 821112 1238797 524481
1 524481 540496
0 540496
$$ Imaginary data points
##PAGE= N=2
##DATA TABLE= (X++(I..I)), XYDATA
16383 -6776589 -6663848 -6234836 -5948043 -5752608 -5929259 -6014508 -6058746 -5354135 -5677260 -6003260
16373 -6003260 -5417858 -5697960 -5773397 -4912695 -5094227 -4625038 -5122170 -5365434 -5221283 -4974778
16363 -4974778 -5042117 -4528367 -4389920 -4984922 -4863422 -4002327 -4361780 -4235622 -4188386 -3238757
16353 -3238757 -3022497 -3041962 -2577089 -2491870 -2815596 -3455233 -3194564 -3198278 -2763786 -3283686
16343 -3283686 -2938917 -2725874 -2932066 -2672092 -1736518 -1859051 -2724249 -2844909 -2399628
16334 -2399628 -2153244 -731024 -1506972 -1562158 -1275620 -2020125 -1890343 -2342842 -2544633
16325 -2544633 -1934248 -2198042 -1698638 -1337628 -894150 -402924 -801847 -763267 -76948 68265
16315 68265 -301673 -1233820 -892989 -498990 -723330 -1016364 -809490 -377117 196735 544780
16305 544780 265076 341956 229144 623852 1333759 1568665 510741 851480 1503278 1421210
16295 1421210 1039315 1280911 1627480 835094 1282131 1799581 1217067 1828823 1638126
16286 1638126 671132 1077344 1347306 1221842 2131731 1789001 1750183 2550102 2193738 2901737
16276 2901737 2476860 2218849 2559083 2559716 2007620 2770834 3274560 2586750 2616599 4009543
16266 4009543 3849696 3424636 3465835 2529093 2147432 1772012 2640627 3840779 3292082
16257 3292082 3445801 4377926 4341116 4369841 3433982 3483085 3523600 3889293 3824070 4481883
16247 4481883 4634849 4585962 3436588 3511303 4124823 3732206 3951754 4148902 3958141 4063850
16237 4063850 4310610 4661078 5062012 5077534 5130173 4852289 5125922 6128118 4984549
16228 4984549 4519976 5270325 5870035 5049490 5581046 4899438 4272453 4950429 5254325
16219 5254325 5268327 5225858 6041985 5651591 5488377 6384692 5905404 6020161 6597803 5335015
16209 5335015 5761799 6604473 6500923 6453648 6234587 6066059 5947250 6704820 5982486 5682768
16199 5682768 6529712 6376932 6203832 6308374 6530595 6162763 5212148 5353558 5519200
16190 5519200 6200750 6622787 7377386 8048681 7337621 6540502 6496453 7088378 6628346 6569426
16180 6569426 6915071 6664327 6846519 8009940 6924545 6486163 7286444 7219744 7168588
16171 7168588 6585918 6720426 6206529 6627419 7029113 6566848 7766624 7751835 7254992
16162 7254992 8001233 7539464 6723917 6538249 6460173 7364597 7037496 7094632 7219783 7256067
16152 7256067 7720024 7520966 7729038 7688431 6713978 6956745 7147603 8246460 8306579 8835005
16142 8835005 8066120 7000855 6551020 5965594 7190722 7903471 7184773 7592084 7757182
16133 7757182 7382105 7038376 7701319 7465307 8581884 9044103 8916483 8650195 7459197
16124 7459197 6925808 7721237 7095175 7497391 7560954 7560204 7507335 6977496 7149361 7113328
16114 7113328 7662660 7881800 7491652 8042156 7876848 8460787 8907779 8662282 7756118
16105 7756118 7978506 8578726 8629507 8076301 7741221 8290217 7256874 7737059 8051242
16096 8051242 8024180 7576087 7663066 8204095 7656588 7032822 7376270 7546524 7165728 6976815
16086 6976815 7888882 7348192 7359709 7045997 7349045 8654090 8199786 7221858 6943574
16077 6943574 6305259 7349593 8107771 8222356 7269583 8131787 8401286 8689269 8487556
16068 8487556 8091580 7652277 7607853 7730608 7258689 7970361 7918516 7776232 8958447 8190643
16058 8190643 7275161 7776784 7918878 8654524 8423915 7568790 7797982 7807292 7395438 7768897
16048 7768897 7625281 7825007 7971327 7678147 7501815 7895390 8264083 7931995 8690520
16039 8690520 8302780 7406759 7546353 7650591 7790671 8561925 8908657 9429644 9000100
16030 9000100 8144314 7993863 7668461 7867601 8031666 8166802 7809055 8498686 9032867
16021 9032867 8269521 8996229 8031782 7394906 8406007 8155964 8282700 8147788 7879523
16012 7879523 8389608 8539016 9160550 8454981 8477130 8966451 8469757 8424573 7826624 7153877
16002 7153877 8472626 8514908 7994899 8277791 8798569 7897912 7631447 7332910 7267249 7531662
15992 7531662 7738295 8221803 7606394 7508351 8644203 8534751 7720957 8256161 8174641 8253719
15982 8253719 7845186 7763742 8192271 8094062 8075120 9407677 8606084 8199040 8191987 7670124
15972 7670124 7222785 7484248 7956023 8688979 8078969 7576542 8367470 8814559 7411707
$$ [...]
##END NTUPLES=NMR SPECTRUM
##END=
