##TITLE=1H_CA-9208-4
 CDCl3
 8 sc, 
 1.11.2023
##JCAMPDX= 6.0         $$ Bruker NMR JCAMP-DX V2.0
##DATA TYPE= NMR SPECTRUM
##DATA CLASS= NTUPLES
##ORIGIN= UXNMR, Bruker Analytische Messtechnik GmbH
##OWNER= root
$$ XWIN-NMR		Version 3.5
$$ Wed Nov  1 14:10:57 2023 Russian Standard Time (UT+4h)  she@DPX200
##.OBSERVE FREQUENCY= 200.13135
##.OBSERVE NUCLEUS= ^1H
##.ACQUISITION MODE= SIMULTANEOUS
##.ACQUISITION SCHEME= undefined
##.AVERAGES= 8
##.DIGITISER RES= 18
##SPECTROMETER/DATA SYSTEM= spect
##.PULSE SEQUENCE= zg30
##.SOLVENT NAME= DMSO
##.SHIFT REFERENCE= (INTERNAL, DMSO, 0, 15.7326)
##AUDIT TRAIL= $$ (NUMBER, WHEN, WHO, WHERE, WHAT)
$$ ##TITLE= Audit trail, XWIN-NMR		Version 3.5
$$ ##JCAMPDX= 5.01
$$ ##ORIGIN= Bruker BioSpin GmbH
$$ ##OWNER= she
$$ F:/spectra/data/she/nmr/H-F/1/pdata/1/auditp.txt
$$ ##AUDIT TRAIL=  $$ (NUMBER, WHEN, WHO, WHERE, WHAT)
(   1,<2023-11-01 14:09:46.32 +0400>,<she>,<DPX200>,
      <created by zg, POWCHK disabled, PULCHK disabled
       configuration hash MD5:
       00 E9 B6 7A A2 85 ED C7 34 08 36 98 17 FE 4E 26
       data hash MD5: 16K
       47 EF 1E 20 DD 0C E2 1A 3E FE B1 55 37 66 E2 6B>)
(   2,<2023-11-01 14:09:48.57 +0400>,<she>,<DPX200>,
      <Start of raw data processing
       efp BC_mod = 2 LB = 0.24 FT_mod = 6 PKNL = 1 PHC0 = -23869.95 PHC1 = 4.852709 SI = 16K 
       data hash MD5: 16K
       65 FE 05 31 5A D2 BF AF 16 2D 01 5F F0 A8 BF E4>)
(   3,<2023-11-01 14:10:06.70 +0400>,<she>,<DPX200>,
      <pk PHC0 = -1.718288 PHC1 = 1.8 
       data hash MD5: 16K
       45 EF 25 88 67 63 5A 48 10 4E 59 98 D5 AA AA 1E>)
(   4,<2023-11-01 14:10:10.85 +0400>,<she>,<DPX200>,
      <abs ABSG = 5 
       data hash MD5: 16K
       62 65 E4 CB 63 56 FC 71 AF 69 5F 52 F5 70 51 AE>)
$$ ##END=
$$ 
$$ hash MD5
$$ 87 16 36 85 57 9D CC 15 21 06 C8 9F 23 A4 84 BA
##$RELAX= 
##$RELAX= 
##$RELAX= 
##$RELAX= 
##$RELAX= 
##$RELAX= 
$$ Bruker specific parameters
$$ --------------------------
##$DU= <F:/spectra>
##$EXPNO= 1
##$NAME= <H-F>
##$PROCNO= 1
##$TYPE= <nmr>
##$USER= <she>
##$AMP= (0..31)
100 100 100 100 100 100 100 100 100 100 100 100 100 100 100 100 100 100 
100 100 100 100 100 100 100 100 100 100 100 100 100 100 
##$AQSEQ= 0
##$AQ_mod= 1
##$AUNM= <au_zg>
##$AUTOPOS= <>
##$BF1= 200.13
##$BF2= 200.13
##$BF3= 200.13
##$BF4= 200.13
##$BF5= 200.13
##$BF6= 200.13
##$BF7= 200.13
##$BF8= 200.13
##$BYTORDA= 1
##$CFDGTYP= 0
##$CFRGTYP= 5
##$CHEMSTR= <none>
##$CNST= (0..31)
1 1 145 1 1 1 1 1 1 1 1 1 1 1 1 1 1 1 1 1 1 1 1 1 1 1 1 1 1 1 1 1 
##$CPDPRG= <>
##$CPDPRG1= <>
##$CPDPRG2= <>
##$CPDPRG3= <>
##$CPDPRG4= <mlev>
##$CPDPRG5= <mlev>
##$CPDPRG6= <mlev>
##$CPDPRG7= <mlev>
##$CPDPRG8= <mlev>
##$CPDPRGB= <>
##$CPDPRGT= <>
##$D= (0..31)
0 1.2 0 0 0 0 0 0 0 0.06 0 0.03 0 0 0 0 0.0002 0 0 0 0 0 0 0 0 0 0 0 0 
0 0 0 
##$DATE= 1698833385
##$DBL= (0..7)
120 120 120 120 120 120 120 120 
##$DBP= (0..7)
150 150 150 150 150 150 150 150 
##$DBP07= 0
##$DBPNAM0= <>
##$DBPNAM1= <>
##$DBPNAM2= <>
##$DBPNAM3= <>
##$DBPNAM4= <>
$$ [...]
##$SUBNAM3= <"">
##$SUBNAM4= <"">
##$SUBNAM5= <"">
##$SUBNAM6= <"">
##$SUBNAM7= <"">
##$SUBNAM8= <"">
##$SUBNAM9= <"">
##$SW= 18.05172834244
##$SWIBOX= (0..15)
0 0 2 0 0 0 0 0 0 0 0 0 0 0 0 0 
##$SW_h= 3612.71676300578
##$TD= 16384
##$TD0= 1
##$TE= 0
##$TE2= 300
##$TE3= 300
##$TEG= 300
##$TL= (0..7)
0 120 120 120 120 120 120 120 
##$TP= (0..7)
150 150 150 150 150 150 150 150 
##$TP07= 0
##$TPNAME0= <>
##$TPNAME1= <>
##$TPNAME2= <>
##$TPNAME3= <>
##$TPNAME4= <>
##$TPNAME5= <>
##$TPNAME6= <>
##$TPNAME7= <>
##$TPOAL= (0..7)
0.5 0.5 0.5 0.5 0.5 0.5 0.5 0.5 
##$TPOFFS= (0..7)
0 0 0 0 0 0 0 0 
##$TUNHIN= 0
##$TUNHOUT= 0
##$TUNXOUT= 0
##$USERA1= <user>
##$USERA2= <user>
##$USERA3= <user>
##$USERA4= <user>
##$USERA5= <user>
##$V9= 5
##$VALIST= <valist>
##$VCLIST= <CCCCCCCCCCCCCCC>
##$VD= 0
##$VDLIST= <DDDDDDDDDDDDDDD>
##$VPLIST= <PPPPPPPPPPPPPPP>
##$VTLIST= <TTTTTTTTTTTTTTT>
##$WBST= 1024
##$WBSW= 4
##$XGAIN= (0..3)
0 0 0 0 
##$XL= 0
##$YL= 0
##$YMAX_a= 393243
##$YMIN_a= -497908
##$ZGOPTNS= <>
##$ZL1= 120
##$ZL2= 120
##$ZL3= 120
##$ZL4= 120
##$ABSF1= 15.73367
##$ABSF2= -2.318179
##$ABSG= 5
##$ABSL= 3
##$ALPHA= 0
##$AQORDER= 0
##$ASSFAC= 0
##$ASSFACI= 0
##$ASSFACX= 0
##$ASSWID= 0
##$AUNMP= <proc_1d>
##$AZFE= 0.1
##$AZFW= 0.1
##$BCFW= 0
##$BC_mod= 2
##$BYTORDP= 0
##$COROFFS= 0
##$CY= -3
##$DATMOD= 1
##$DC= 0
##$DFILT= <>
##$DTYPP= 0
##$F1P= 0
##$F2P= 0
##$FCOR= 1
##$FTSIZE= 16384
##$FT_mod= 6
##$GAMMA= 0
##$GB= 0
##$INTBC= 1
##$INTSCL= 3.70164e-10
##$ISEN= 128
##$LB= 0.24
##$LEV0= 0
##$LPBIN= 0
##$MAXI= 10000
##$MC2= 0
##$MEAN= 0
##$ME_mod= 0
##$MI= 1.114404
##$NCOEF= 0
##$NC_proc= -7
##$NLEV= 6
##$NOISF1= 3.799351
##$NOISF2= 2.8
##$NSP= 0
##$NTH_PI= 0
##$NZP= 0
##$OFFSET= 15.73257
##$PC= 1
##$PHC0= -23871.67
##$PHC1= 6.652709
##$PH_mod= 1
##$PKNL= yes
##$PPARMOD= 0
##$PSCAL= 0
##$PSIGN= 0
##$REVERSE= no
##$SF= 200.130007800231
##$SI= 16384
##$SIGF1= 3
##$SIGF2= 2
##$SINO= 5.538805
##$SIOLD= 16384
##$SREGLST= <1H.CDCl3>
##$SSB= 0
##$STSI= 16384
##$STSR= 0
##$SW_p= 3612.71676300578
##$SYMM= 0
##$S_DEV= 0
##$TDeff= 16384
##$TDoff= 0
##$TI= <>
##$TILT= no
##$TM1= 0
##$TM2= 0
##$TOPLEV= 0
##$USERP1= <user>
##$USERP2= <user>
##$USERP3= <user>
##$USERP4= <user>
##$USERP5= <user>
##$WDW= 1
##$XDIM= 16384
##$YMAX_p= 387313267
##$YMIN_p= -769613
$$ End of Bruker specific parameters
$$ ---------------------------------
##NTUPLES= NMR SPECTRUM
##VAR_NAME=  FREQUENCY,     SPECTRUM/REAL,   SPECTRUM/IMAG
##SYMBOL=    X,             R,               I
##VAR_TYPE=  INDEPENDENT,   DEPENDENT,       DEPENDENT
##VAR_FORM=  AFFN,          ASDF,            ASDF
##VAR_DIM=   16384,         16384,           16384
##UNITS=     HZ,            ARBITRARY UNITS, ARBITRARY UNITS
##FACTOR=    0.220516191357247, 1,           1
##FIRST=     3148.55929568177, 0,            0
##LAST=      -464.157467324006, 0,           0
##MIN=       -464.157467324006, -769613,     0
##MAX=       3148.55929568177, 387313267,    0
$$ Real data points
##PAGE= N=1
##DATA TABLE= (X++(R..R)), XYDATA
$$ [...]
8514 45721942 44778493 43921567 44252513 45506551 47107982 48791749 50530172 51114164 50574598
8505 50574598 48968610 45910190 42453337 38892167 35862724 33578012 31925196 30562069
8497 30562069 29494564 28432442 27742203 27461879 27252550 27132674 27362883 27630542 27885993
8488 27885993 28385972 28676815 28807264 29359718 30055811 31066463 32350340 34197352 36647821
8479 36647821 39667048 43078967 46324238 48977809 50178590 50212694 49148146 47096297
8471 47096297 45506139 44708688 44823439 45533331 47163758 48778341 50115004 50460693 49405364
8462 49405364 47218222 44032784 40268587 36821406 33845997 31380427 28921013 27291702
8454 27291702 25810304 24347959 23328510 22490848 21424594 20390724 19889830 19520227 19124271
8445 19124271 18726314 18188379 17758034 17681338 17047419 16457349 15964593 15757489 15551717 15512725
8435 15512725 15482166 15210276 14978961 14980728 14774963 14467464 14440730 14038179 13887902 14044345
8425 14044345 13737935 13824458 13704943 13683410 13852095 13992797 14334463 14544939 14767125 14926134
8415 14926134 15025975 15135154 15227945 15393186 16005128 16155431 16527377 17274318 17858815 18789071
8405 18789071 19629174 20462618 21441522 22768948 24315823 26264574 28512765 30608344 32564889
8396 32564889 33238591 32826264 31787080 30386447 29472104 28785358 28796480 29337607 30493448
8387 30493448 31886325 33238845 33442302 32842565 31613036 29744350 28263765 26905902
8379 26905902 25955990 25260351 24850834 24923567 24710115 24388926 24372218 24485874 24525828 24332702
8369 24332702 24689853 25197745 25679055 26473640 27334625 28183569 29369655 30947109 32587496
8360 32587496 35063162 37957622 41346650 44889217 47691250 49072850 49129332 47845497
8352 47845497 45870275 43870279 42507021 41913466 42197987 43541156 45213115 46340699
8344 46340699 46943143 46393825 44385102 41523140 38357193 35679027 33202734 31045702
8336 31045702 29413984 27980517 27004431 26066597 25395782 24620275 23936207 23048438 22455693
8327 22455693 21979554 21555357 21364972 21173996 21233409 21566158 21965610 22152193 23084852 23677687
8317 23677687 24954106 26580118 27977262 28434775 27958357 26718164 25189987 23940833
8309 23940833 23144055 22839805 22691417 23055803 23893822 24605292 25035084 24636472 23207292
8300 23207292 21571806 19887157 18066078 16818386 15843504 14897717 13996049 13506502 13074589
8291 13074589 12532948 11849124 11454303 11194219 10678917 9936698 9695961 9414142 8831102
8282 8831102 8867598 8700754 8366334 8115638 7955852 7480758 7355735 7233607 7047807 6790606
8272 6790606 6428722 6427196 6339807 6024858 5944646 5882858 5538032 5532019 5414427 5039228 4982801
8261 4982801 4872427 4924444 5006638 4956500 4880936 4752945 4564611 4309254 4307486 4359241 4263102
8250 4263102 4441350 4394949 4098803 4118609 4151330 3787653 3737595 3883423 3654597 3336380
8240 3336380 3556274 3716741 3626095 3647818 3214046 3262224 3017429 3119302 3229079 3306145
8230 3306145 3155231 2874010 2865918 3038431 3097516 2985875 3302207 3321661 3154731 2855681
8220 2855681 2945950 2776828 2664865 2547673 2305115 2264140 2233600 2464444 2302337 2206075
8210 2206075 2180348 2013921 2101581 2343180 2461816 2362095 2238145 2076465 2086890 2131780
8200 2131780 2049871 1922641 2039317 2232641 2154297 1988704 2208958 1960974 2892287 2839941
8190 2839941 1970890 1807449 1655439 1924013 1877642 1840772 1673804 1719901 1646226 1759603
8180 1759603 1660211 1638216 1615419 1751458 1819097 1706605 1704243 1589498 1556896 1491533 1387005
8169 1387005 1662214 1663849 1486276 1392172 1516069 1653844 1543574 1697779 1571054 1540556
8159 1540556 1764799 1697124 1587837 1450554 1295750 1366053 1650712 1664863 1582343 1471135
8149 1471135 1407716 1602902 1679961 1579199 1591152 1717226 1802320 1758839 1377103 1366411 1299969
8138 1299969 1336237 1568887 1541414 1375754 1046870 1187775 1473986 1501644 1301700 1175741
8128 1175741 1242397 1232295 1404172 1294474 1361569 1342172 1159703 1067829 971627 942495 1210545
8117 1210545 1283318 1092044 1029509 1133753 1015402 1092503 1059026 1011075 899683 1023441
8107 1023441 1214672 1103513 986844 1193425 1192128 1205467 1457049 1256433 1348649 1420585
8097 1420585 1185700 1232359 1143271 886630 691643 546056 901127 943161 815958 700235
8087 700235 816736 1012199 959243 1112474 1043410 1041748 977842 811172 843476 814926 811362
8076 811362 867601 797472 669453 522384 662448 623319 445920 680274 744301 961930
8066 961930 879379 916747 884636 899203 789101 813494 952148 1014080 707201 854892 1106027
8055 1106027 978778 670605 459958 545125 672723 576820 538188 752016 919296 530703
8045 530703 423762 434129 589367 813582 591537 531233 471803 407281 729956 907841
8035 907841 768154 659432 579093 982422 794371 713952 566407 773509 684302 625275
8025 625275 612614 631940 730361 575298 420972 274909 582192 593122 652506 518472 495389
8014 495389 500304 447366 443457 461003 487602 459117 602766 590225 551734 575176 773899 771116
8002 771116 560583 456223 380247 792115 710613 644872 615916 530768 805757 671525 516098
7991 516098 459529 827660 685726 334363 305803 589459 528131 427140 600716 658693
7981 658693 675287 598699 701356 744992 562733 464844 650415 437938 505330 350055 454684
7970 454684 566410 584648 564686 523613 458750 370761 468395 276925 251930 259597 522742
7959 522742 404197 515973 599899 318581 246507 600265 632477 536353 279709 174232
7949 174232 245728 399152 650277 712081 655144 363083 350378 214921 405671 490583 337928
7938 337928 267247 419656 477772 512470 786294 634660 585294 621689 472998 297472 273718
7927 273718 433558 617842 235974 443377 430977 503191 559754 268387 180317 242960 475801
7916 475801 283511 240834 235487 206785 211108 61665 -188616 95704 80821 241849 274273
7905 274273 140531 -62959 -6753 -1420 65115 253046 -22691 240789 31862 162048
7895 162048 36003 -13415 52755 218261 439502 163903 28290 18056 588 107437
7885 107437 85887 -39273 620 74734 91408 -21075 23350 258758 160367 -174296 86273
7874 86273 68605 -58373 -2948 122930 61169 181824 -19942 57042 -16494 22077 -96869
7863 -96869 11509 117792 -17245 200308 307482 334490 302847 169042 189173 128555 139174
7852 139174 152321 281671 189930 195602 55381 -53488 50240 43683 880 -95968 -200857
7841 -200857 -268670 80290 76197 34262 -57015 23712 -125071 139728 69174 -28077 335851
7830 335851 290934 110101 -68747 -79800 -66158 45950 133959 390827 162950 -96482
7820 -96482 157775 125230 244877 390335 349454 344051 73251 96505 185847 108212 154836
7809 154836 368536 464102 141433 354071 377392 256572 87993 135526 250539 218527
7799 218527 123715 190857 -66482 -160137 -56837 -3821 12890 39451 16074 76369 9983
7788 9983 39460 -117914 -99238 -141169 -88683 142160 -24158 209022 108391 137927 17185
7777 17185 -141576 -43558 -95980 -183857 -54708 -2034 342007 244277 2645 509046 394393
7766 394393 302816 309277 293125 242100 216631 53758 265437 277710 114688 186134 206334
7755 206334 120562 254372 294175 375755 317358 299215 424557 155623 100116 299532 47709
7744 47709 -101864 18371 -56601 129615 -117632 -181785 4942 107218 181221 -26787
7734 -26787 -188394 -4899 42539 117767 150204 -106417 -192425 38369 -92148 188602 181253
7723 181253 129561 115310 -85484 60438 230992 -31154 -18954 -29635 -16654 -12910 7923
7712 7923 41331 -159801 -54827 232144 84856 124428 -100094 -265813 -185603 -193554 -299362
7701 -299362 -74096 -106008 -113549 -100286 -38169 68258 250644 252338 91117 192436 102916
7690 102916 -40301 -448074 -312600 -72862 48228 73806 -142019 -40753 70048 41347
7680 41347 185067 309221 265727 60960 -29261 3203 -65521 -44412 177962 315056 260528
7669 260528 141522 176064 104536 -153369 -71180 -117213 36397 -20941 -188048 -8185 235340
7658 235340 304023 104890 -144029 -41284 26716 -104082 191035 -33023 -199299 -406808
7648 -406808 -284696 -185121 -184843 -178423 120967 124427 58404 68807 18855 -224282 -157997 117701
7636 117701 159934 100549 169140 238390 -59320 -225729 -361865 -414821 -13053 143947 -105671
7625 -105671 -53203 10470 -129317 -273329 -1330 5812 -73256 -141906 -152280 4190 -273940
7614 -273940 -342586 -205922 -56246 -290549 -355971 -329247 -15105 -113829 48417 57572 170441
7603 170441 209205 91263 102764 112520 85589 -31732 95801 77448 106097 13170 -86369
7592 -86369 -138973 -200420 50151 140999 -6512 112223 7184 51702 294891 38540 -63986
7581 -63986 240816 165947 -136169 -778 -96461 -289506 -216947 -81529 92944 -283372
7571 -283372 -217493 -158121 -146304 -130156 -65807 167522 59212 -49953 187185 385282 8375
7560 8375 -253703 28570 143838 -79339 -210414 -202966 -188062 232214 232214 100299 198151 241798
7548 241798 117501 55822 2967 -6062 86515 64815 -51280 -112147 -153860 -12885 76864
7537 76864 276933 107326 -25349 -47061 -74921 142304 -39662 -121058 -112466 -226255 -37441
7526 -37441 -120635 -175923 -44062 216723 -6114 44318 179637 283619 21635 21576 271647
7515 271647 199136 2578 -5966 15240 216571 329081 357360 172701 139159 442403 541557
7504 541557 412641 244601 100949 38071 10728 -178260 27010 96900 133144 -9389
7494 -9389 -125691 -15088 103477 119081 58899 -25944 149283 -20804 -135693 -20584 239739
7483 239739 19149 -104847 -218587 -248970 -53008 -66680 -96636 -80084 163127 11676
7473 11676 -110318 26098 114545 273293 161093 75049 119847 108884 72167 94554 -152130
7462 -152130 -2333 -18663 -180851 75121 491476 372569 188427 182556 94757 353237
7452 353237 265799 12396 6668 46726 -28437 -83198 10284 180487 159490 123293 161237
7441 161237 238163 170292 134067 271606 239584 172331 180099 225673 428302 347941 354930 307051
7429 307051 255047 113220 -55818 -190893 -302909 -88561 4673 163913 176297 113823
7419 113823 -55389 -60917 131973 163843 -60188 62772 320660 312586 231338 166331 22772
7408 22772 366133 222468 107071 41921 116573 108546 194416 126161 -14629 152374 204624
7397 204624 241756 291618 328971 303311 302001 153976 -77681 -39968 -62189 -144827 -139995 24835
7385 24835 126977 75547 205115 109188 -189282 -65166 71037 208320 -32287 -317045
7375 -317045 40086 258425 364564 194430 168001 223892 272498 96886 31656 77167 164970
7364 164970 316510 388176 135480 47380 -31109 -47006 17003 209390 330811 286484 160182
7353 160182 192712 34908 -24574 133429 75808 254313 305109 192118 32118 -58900 242412
7342 242412 261236 347266 257909 226960 -61637 -109978 449 81208 189687 466629 413678
7331 413678 210757 99358 154700 68900 123024 269570 248080 -35410 -216304 7135
7321 7135 303558 354651 151003 35337 -319030 -290302 -102663 93513 -154714 23770
7311 23770 230109 402009 268603 218300 66719 86771 -396 -274026 -200243 34902 300741
7300 300741 285456 171074 2334 115442 55301 -11601 42836 11852 223620 -10195 -109442
7289 -109442 -103507 -204897 27924 101669 56629 68778 186121 645266 486361 86836 235518
7278 235518 35217 128081 82549 -45166 -127353 81611 -83119 40383 207999 -41884
7268 -41884 -129131 47602 102668 116661 172210 253461 39050 -45703 62718 36019 142098
7257 142098 -101954 -75477 77757 128481 193475 199013 261268 331812 387115 99028 -62295
7246 -62295 133966 353115 497220 394430 255173 192025 153793 290507 276097 98973
7236 98973 273230 400569 299593 128674 12337 274368 353673 216182 409024 253786
7226 253786 -137134 -269207 -215865 40795 260015 102570 261261 187867 360461 261669
7216 261669 230670 198896 130167 328543 570185 777561 642431 457802 595998 589435 718513
7205 718513 673656 552030 587340 377363 308411 531449 360019 258228 204857 107914 125797
7194 125797 356984 337157 324527 368937 275410 70212 -31364 211056 104243 52120 110465
7183 110465 142180 236757 164700 -45685 13352 115186 49558 56677 142706 24919 34453
7172 34453 95647 -82531 6564 -15416 -71989 120635 113691 -26279 192009 6106 -178513
7161 -178513 -189160 -133694 -157966 -17570 -10481 -132696 -95685 171990 286576 209462 469645
7150 469645 184212 209010 -242278 -145417 -76848 109259 92158 -125379 23544 76120 87729
7139 87729 -15930 -198119 36587 -147484 -153843 252598 215497 320316 252809 -81822 2233
7128 2233 13035 46898 220392 256743 90866 60999 -63770 -53698 45809 -71672 200080
7117 200080 269103 354798 63769 -39613 16092 -125719 -78347 -20549 -65707 -128648 -49455
7106 -49455 1196 87058 -49085 147191 113211 -250937 -62041 372693 438134 395758 68931
7095 68931 20454 -25774 -8008 98073 -41443 -42432 117635 198173 28161 142186 -28173
7084 -28173 46036 -20841 38860 250208 416198 255232 162205 -99571 -200493 -251441 -366740
7073 -366740 -164147 -65474 58408 267451 261486 264578 272817 215563 149541 278369 403550
7062 403550 163346 12705 129481 150379 216465 374256 343414 391148 131034 210318 487606
7051 487606 446570 350307 236608 263899 374259 74231 246615 586843 548284 225962
7041 225962 468574 335946 207207 271857 386544 333055 198314 232217 276457 241050 81131
7030 81131 215659 183836 177679 78323 187582 377803 117353 229482 480579 426195 653740
7019 653740 653681 462753 268541 412416 162022 75565 30172 82000 434950 342447 265383
7008 265383 630416 585807 477899 576820 131238 144368 168474 165273 468870 756431 732574
6997 732574 584949 541068 510130 550143 507710 452287 188307 304787 363368 358032 533769
6986 533769 662292 603352 604357 650732 485606 406982 605366 875838 829548 864498 900694
6975 900694 704022 660799 551712 744364 873538 812869 707563 678261 567133 809763
6965 809763 945579 947238 732057 685313 663774 614031 758166 1044679 963469 904984 937404
6954 937404 947283 1039718 780863 966123 934726 751519 979785 1118885 1110497 1131117 1173806
6943 1173806 1334118 1103067 1063826 1028298 1217646 1355636 1621409 1681349 1479415 1575331
6933 1575331 1737874 1688098 1676324 1678617 1762749 1981619 2054383 2047532 2204285 2558838 2683607
6922 2683607 2638949 2690311 2831403 3181224 3588867 3653955 4438807 5043425 5685246 6544426
6912 6544426 7558751 9179633 11204150 13441509 15611618 15414679 13465330 11378620
6904 11378620 9601157 8368259 7311917 6273962 5587295 4845715 4461785 4368278 3785861
6895 3785861 3610273 3460957 3186688 2859577 2701623 2619919 2497028 2277306 2621377 3145632
6885 3145632 3064402 3019067 3407357 3483672 3626685 3466315 3559788 3696009 3622721 3637194 3572025
6874 3572025 3053075 2900987 3122602 3054315 2810613 2836098 2641428 2455261 2425918 2097509
6864 2097509 1915592 1840937 1507628 1583205 1441112 1637804 1531559 1644555 1668538 1426781
6854 1426781 1452196 1803771 2016540 1929328 1653792 1547470 1397782 1426591 1356640 1158581
6844 1158581 1284512 1288193 1047945 1214216 1490889 1447249 1332632 1142669 1036651 1067334
6834 1067334 1065272 924165 855621 825578 776805 711298 676247 587019 683988 513842 555669
6823 555669 502522 801300 548125 611232 543283 721959 729806 807760 922498 834485 513218
6812 513218 266028 310457 310622 439450 488813 676949 486061 328828 336081 245516 435000
6801 435000 433780 383433 775270 665789 392479 481402 697085 557227 297042 453922
6791 453922 370120 570434 588671 302615 348074 540887 561650 581257 685359 473908 472175
6780 472175 565330 389397 275487 415409 688004 814084 635909 669243 724493 466843
6770 466843 647697 589716 534094 602329 839296 799791 804805 722867 846838 681398 831785
6759 831785 691677 634689 809740 896823 870095 813174 813502 1019115 1141415 1123196 1279671
6748 1279671 1089948 1080476 1097451 1216471 1067692 1041991 1166078 1225129 1146336 981582 914768
6737 914768 975453 1102929 1144956 834410 1017498 1141237 1096099 1057623 1285860 1240392 1009438
6726 1009438 1095956 1157666 1207512 1340538 1617276 1556006 1539186 1561780 1268850 1395411 1307136
6715 1307136 1412002 1488042 1655062 1510544 1427183 1340453 1227869 1211070 1213233 1236935 1247800
6704 1247800 1368969 1559519 1570672 1530792 1471956 1336300 1197402 1287584 1291771 1394882 1164727
6693 1164727 1264466 1289622 961720 982898 920633 953622 908847 890679 829712 967052 1052197
6682 1052197 1024275 976300 973963 1066495 1114070 1074146 873668 716576 792187 909561 924962
6671 924962 910788 783376 840350 870062 923463 1015417 852951 797367 554361 427562 497373
6660 497373 554486 602008 385067 610849 405400 452264 561303 582301 982455 612278
6650 612278 549948 644985 476071 479382 738475 568815 517046 436686 250506 308292 185308
6639 185308 271881 336205 331203 221501 276199 396591 477986 431392 598371 769151 647412
6628 647412 799944 625789 747357 805278 418437 457502 633103 345280 627088 625798
6618 625798 524646 504221 477263 467379 482515 626197 497496 489649 589695 543019 504619
6607 504619 518518 465756 471407 869814 930047 867331 652158 868161 893468 776528 981031
6596 981031 631634 558614 709038 454993 684469 921255 523552 532594 595285 636323 608578
6585 608578 523311 572506 236961 208954 252361 475125 699069 668712 347370 345084 299845
6574 299845 34060 87534 276556 527733 468525 418289 429864 365441 139315 398798 406439
6563 406439 458446 553831 618979 699777 583448 586358 750281 626073 659622 662880 491169
6552 491169 503941 676765 511067 570043 690548 699673 694275 632838 636021 509273 375944
6541 375944 473715 329279 673929 901567 533543 510456 577400 465701 482027 621250
6531 621250 501368 747401 477947 423129 866314 590250 504967 498589 529586 610154 515555
6520 515555 583466 539919 511745 622633 614978 554249 661486 597443 674183 803314 736868
6509 736868 1035447 776622 761642 945475 940463 813454 849666 898843 725360 828424 666542
6498 666542 495845 546045 628082 692694 657688 641126 782190 675864 772678 972614 993211
6487 993211 961275 730997 663097 662794 423550 528353 662396 709665 678546 690000 639689
6476 639689 829568 968621 788931 793410 1031806 1078139 1088311 1069480 927254 971930 1341800
6465 1341800 1275845 1230176 1311394 1210645 1190735 1455499 1620555 1387537 1095319 1212366
6455 1212366 1065442 1053064 1158467 1349530 1422111 1251394 1556226 1371561 1173640 868567
6445 868567 984563 994452 1283346 1555128 1634623 1405539 1371094 1715307 1763116 2337706 2234876
6434 2234876 2095454 2037204 2071868 2030401 1985119 2013628 1992025 2011087 1901407 1690724 1777865
6423 1777865 1767657 1866016 1955285 1618653 1572952 1961600 1915266 1811785 1905516 1822782 1569119
6412 1569119 1599913 2027947 2052820 2145289 2282149 2619296 2665167 2611627 2702621 2610245 2477548
6401 2477548 2495428 2420049 2246832 2568658 2644116 2430658 2458674 2459751 2511619 2513784 2516159
6390 2516159 2200731 2210415 2148758 1945126 1770151 1945006 1950807 1915439 2082659 2270840 2333724
6379 2333724 2331913 2322540 2397112 2228841 2320108 2467155 2517837 2542600 2645545 2510029 2608302
6368 2608302 2509213 2498051 2491336 2521668 2550766 2557178 2766536 2366026 2125574 2228936 2393157
6357 2393157 2364114 2500884 2383488 2385792 2301812 2079342 1995770 2254812 2476422 2527646 2251937
6346 2251937 2186278 2475609 2417801 2374666 2362543 2448967 2662370 2651650 2648630 2608675 2817939
6335 2817939 3110393 3357466 3447754 3292820 3061868 2766845 2942411 3017857 2864204 2883928
6325 2883928 2950316 2936564 2919527 3070879 3012541 2761834 3013812 3248827 3452936 3708034
6315 3708034 3621199 4063086 3927306 3932604 3893524 3601457 3471647 3325413 3354575 3091105
6305 3091105 3136746 3336677 3190631 3256411 2989793 3135905 3108980 3049008 3026692 3241233
6295 3241233 3267718 3089520 3351464 3640964 3776965 3496293 3365588 3369056 3171609 3125294
6285 3125294 3143870 3040683 3187276 3317345 3008813 2762357 2884139 2966544 3294454 3434860
6275 3434860 3412287 3592517 3458711 3352432 3373162 3420574 3583540 3681078 3609115 3713032
6265 3713032 3876615 4008594 3885710 3701893 3794538 3787129 4036724 4102274 4206397 4050511
6255 4050511 4228509 4468714 4688790 5022831 5193428 5334669 5585011 5703561 5725667 5864993
6245 5864993 5858141 5806682 5576696 5669273 5647900 5623039 5899955 6049939 6119886 6137139 6287167
6234 6287167 6334779 6199009 6043821 6252139 6280190 6315545 6607542 6897941 7073638 7135786
6224 7135786 7369097 8011407 8381983 8530826 9085727 9862995 10475804 10991382 11505745 12007196
6214 12007196 12528439 12875985 13232068 13808347 13936378 14091736 14179988 14373263 14290759 14671798
6204 14671798 15357341 15502472 16485264 17774518 19036840 20148411 21547482 22546512 23055093
6195 23055093 22604875 21284877 19957008 18320266 16915184 15512296 14278109 13354529
6187 13354529 12597762 12038202 11696109 11263300 10763198 10564597 10564854 10393914 10405904 10709602
6177 10709602 10653087 10821783 11153997 11250730 11603114 12182806 12651673 12920458 13297092 13592153
6167 13592153 14524468 15762302 16630790 18123580 19823093 21285663 23060793 25557446
6159 25557446 27862682 29542074 30486063 30148681 29126581 27619988 25926088 24480120
6151 24480120 23322038 22439043 21858150 21550699 21540711 21515728 21741067 22240702 22319888 21908533
6141 21908533 21412917 20908568 20595868 20234307 19646958 19285048 18601815 18109396 17641678
6132 17641678 16937469 16321036 15965892 15595217 14854414 14184667 14001183 13733353 13517996
6123 13517996 13458473 13291167 13266832 13541377 13824499 14119641 14141458 14048231 14022423 13660198
6113 13660198 13387144 13025290 12595296 12587832 12541855 12535414 12459043 12195371 11963899 11608771
6103 11608771 11285852 10712259 10117626 9686665 9514741 9249201 8545926 8387433 7940784
6094 7940784 7786280 7801725 7580490 7415610 7279236 7361540 7424456 7379083 7255560 7364728
6084 7364728 7237190 6891876 6630872 6370387 6310150 6325914 6422518 6463670 6234129 5991493
6074 5991493 5667722 5638958 5666388 5711789 5582891 5369900 5501074 5704231 5608627 5528783
6064 5528783 5552058 5578504 5481189 5373336 5263250 5524245 5797531 5616501 5697537 6064108
6054 6064108 6323838 6223388 6206666 6112469 6367437 6696652 7065617 6870199 6904629 7096065
6044 7096065 7172521 7436551 7537002 7533362 7697899 8258024 8214196 8254844 8388044 8841495
6034 8841495 9339324 9803094 10352575 10825896 11078921 11448268 11728228 11761717 11521321 11405726
6024 11405726 11537661 11447643 11581341 11604394 11728403 11813936 11965904 12328055 12467782 12836611
6014 12836611 13226512 13680896 14198090 14824457 15425074 15975664 16741138 17935426 18695853
6005 18695853 19315105 20023090 20437439 20506810 20644415 20950772 21031332 21037118 21002697 20913923
5995 20913923 20691218 20472307 20208923 20076493 20039758 20209523 20546732 20883230 21240189 22078035
5985 22078035 22941746 23716583 24856045 26014291 27397063 28857945 30204079 31720117
5977 31720117 33119926 34422379 35462625 36552401 37505476 38259015 38828616 38550354 38091924
5968 38091924 37721182 37423082 37297005 37829411 38791762 40398047 42605182 45070547 48020735
5959 48020735 51152037 54202236 56543866 58471012 59355913 59465341 58944533 58227861 57054321
5950 57054321 55477708 53425173 51409926 49290468 47051207 44643019 42166135 39764836
5942 39764836 37471988 35497295 34082882 32417522 30873246 29512326 27996807 27151179
5934 27151179 25560005 24086990 23033230 22280941 21293772 20646943 19995326 19387064 18950872
5925 18950872 18710167 18476537 17876598 17339968 17397136 17033057 16981302 17043956 16790361 16992477
5915 16992477 17056547 16965018 17200128 17163209 17125916 17548496 18278777 19010919 19743000 20680919
5905 20680919 21616449 22784303 24211065 25886296 27785339 29822048 31250457 31623098
5897 31623098 30682404 29126281 27216139 24959169 23118655 21435458 20091802 18948072
5889 18948072 18111070 17215316 16512064 16263397 15865348 15463542 14985182 15027829 15022668 14994924
5879 14994924 14817393 15112829 15656922 15901487 16169393 16712876 17068082 17452048 18016449
5870 18016449 18656072 19068005 19625974 20238025 20497979 20199298 19271422 18484479 17303752
5861 17303752 15881298 15049297 14303352 13443079 12909743 12906780 12349604 11771208 11445144 11360608
5851 11360608 11213261 10707641 10603073 10391383 10301997 10407593 10116091 9926389 9820565 9829079
5841 9829079 9962271 9584429 9392399 9391182 9431664 9239279 9018865 8940902 9054487 9233341
5831 9233341 9312126 9282386 9592532 9413282 8996073 8807351 8476781 8357173 8257937 8161268
5821 8161268 8256243 8259055 7958927 8028422 8206153 8324919 8473504 8346074 8353025 8283350 8298776
5810 8298776 8239978 8111000 8090007 8161340 8350150 8197098 8344781 8295470 8297710 8265738 8478718
5799 8478718 8394379 8564964 8701728 8622264 8659063 9002964 9377522 9543909 9849727 9914360
5789 9914360 9972925 10053481 9814706 9661593 9946662 9838782 9793028 9864775 10080899 10108731
5779 10108731 10209026 10385932 10280695 10105095 10213365 10381797 10197646 10117551 10410004 10321804
5769 10321804 10532832 10710611 10884537 11160929 11206730 11212671 11430881 11548078 11477427 11522373
5759 11522373 11728519 11561123 11426405 11600340 11653564 11433962 11240918 11420854 11609465 11440235
5749 11440235 11293163 11161157 11163941 11183743 11413933 11430647 11282708 11725995 11936172 12143184
5739 12143184 12059481 12001577 12279860 12574234 12871943 13319905 13689225 14100051 14676922 14956111
5729 14956111 15489642 16308136 17287181 18523612 19664827 20974536 22067802 22948980 23480170
5720 23480170 23354118 22666344 21878452 21037589 20415450 20093734 19586506 19362616 19581490
5711 19581490 19971104 20592044 21449239 22356553 23403709 24637323 26043334 27045305 27912448
5702 27912448 28547049 28544819 28375651 28195715 28536691 28714481 28337498 27597546 26926384 25679658
5692 25679658 24174205 22895627 21957213 21135269 20465873 20088963 19998523 19959604 19857650
5683 19857650 19994950 20639778 21484756 22311928 22621238 22675019 22060219 20609776 19558657
5674 19558657 18186170 16776046 15733662 14887452 14256833 13581430 12817611 12365391 11873429
5665 11873429 11437614 11145042 10683292 10148620 9942624 9607297 9292559 8947553 8644370
5656 8644370 8646250 8566070 8424115 8170565 8094273 8101891 8021956 7998476 7967998 7975492 7656767
5645 7656767 7937848 7927480 7968471 7934865 8113930 8024452 7867485 8018487 8385350 8545965
5635 8545965 8528897 8275727 7957500 8034353 8019265 7840847 7707571 7767863 7672509 7685279 7744349
5624 7744349 7697272 7697985 7500776 7595227 7831474 7797528 7972755 8061583 7832102 7767714 7961259
5613 7961259 7970122 7999478 8437317 8540754 8153234 8174065 7948331 8012431 7966072 7785104 7520876
5602 7520876 7520100 7536327 7694343 7744424 7719688 7510146 7389165 7272579 7215922 6905025 7111743
5591 7111743 6952532 6864517 6933107 6809599 6761826 6522731 6194339 6069182 6151885 6213654
5581 6213654 6128520 6116618 5882291 5848370 5965635 6055960 6197556 6156204 6097431 6214461 6137793
5570 6137793 6302933 6303567 6024858 6203821 6122790 5870706 5923048 6058050 5934579 5814377
5560 5814377 5862508 6006883 5916074 5987315 6053020 5953374 6044810 6145139 6131056 6384780 6266339
5549 6266339 6172676 6083601 6098858 6177027 6438026 6182134 6075123 5968468 6209158 6324632
5539 6324632 6350784 6424758 6389102 6484139 6468861 6600495 6907579 6777720 6697951 6984152 6935195
5528 6935195 6801138 7003544 7283900 7217744 7362816 7495759 7893490 7930506 7999806 8376303
5518 8376303 8721693 8976018 9166247 9580271 10147919 10356619 10516658 11090604 11738418 12177642
5508 12177642 12680431 13219265 13440974 13535098 13467712 13475607 13101022 12981407 12722837 12519456
5498 12519456 12071988 11895314 11642642 11133472 11054089 10883367 10811507 10997353 10753489 10676226
5488 10676226 10695171 10526661 10504479 10617254 10621639 10755094 10708439 10925198 11391133 11688254
5478 11688254 11711941 11767526 12195598 12371793 12628027 12604212 12885061 13317461 13472279 13881132
5468 13881132 14369619 14680341 15215108 15860442 16206023 16759074 17302224 18058818 18644698
5459 18644698 19341207 20202050 20618568 21488551 22683119 23707581 24377849 25285457 26326907
5450 26326907 27195607 28168835 29266560 30164497 31144352 31827151 32358669 32294981 31750732
5441 31750732 31214056 30560633 30267028 29932053 29349077 28682424 28432773 28251931 27789422
5432 27789422 27554107 27318549 27536064 28004071 28335492 28613350 29186201 29684115 30694811
5423 30694811 31302789 32465837 33774137 34754481 36143070 37429173 38667026 40134995
5415 40134995 41821560 43694925 45169081 47101786 49453098 51797129 54509418 57477478
5407 57477478 60983456 64710913 68998127 73382057 78074264 83288402 88571529 94176921
5399 94176921 100029543 105756288 111270058 116477298 120822680 124207367 126746043 128438144
5391 128438144 129516769 129658860 129187758 127782289 124694063 120756418 116284931 111293620
5383 111293620 105933562 100396093 95020579 89781563 84517946 79356488 75039387 71077007
5375 71077007 67376649 64406674 62059235 59642547 57623075 55793387 54383808 53027165
5367 53027165 51801345 50160597 48594173 47001847 45426622 44062964 42311019 40332392
5359 40332392 38789743 36987950 35202581 33604366 32006631 30717096 29372788 28351818
5351 28351818 26969920 26120141 25196946 24933441 24312553 23926004 23504591 22830757 22269902
5342 22269902 21635889 20845950 20280555 20139925 19677205 19493834 19207982 18948464 18742198
5333 18742198 18517452 18464911 18701695 18670599 18322705 18434104 18281066 18317262 18222829 17941753
5323 17941753 17779067 17948105 17517993 17150635 17024307 16884407 16803313 16798550 17211485 17179098
5313 17179098 17455535 17689883 17861456 18098668 18418194 18666676 19002853 19138751 19394346
5304 19394346 19314455 19145202 18704101 18264803 17782036 16976132 16287037 16092041 15421299 14862001
5294 14862001 14447266 14018054 13309574 13170820 13053710 12757109 12542344 12570035 12265498 12011843
5284 12011843 12226548 12410495 12457186 12825004 13172391 14101199 15066330 14790516 14127686 12993285
5274 12993285 12243482 11660341 11434037 11206928 11040285 10828292 10770621 10929948 11092247 11098617
5264 11098617 10906357 10967827 11050527 11064965 10695073 10673944 10548535 10385345 10350369 10352127 10383106
5253 10383106 10041713 9984672 9913712 9719588 9474223 9091341 8744058 8512258 8458121 8301813
5243 8301813 8277702 8250368 8112145 8220726 7989776 7999174 7931856 8030620 7822867 7863702 8133691
5232 8133691 7992790 7965643 8123661 8299534 8382600 8421927 8463858 8611332 8910657 8838156
5222 8838156 8757716 8423612 7991130 7704629 7526147 7483800 7558945 7453961 7601837 7703508
5212 7703508 7639841 7536905 7427971 7056030 6708234 6822610 7000599 7041832 7099940 6721048
5202 6721048 6802440 6674338 6682194 6516647 6010280 5909044 5921379 6025439 5712037 5582949
5192 5582949 6021043 5803439 5519456 5447812 5222390 5587162 5306310 5405923 5509180 5498074
5182 5498074 5610181 5693422 5583922 5378992 5245985 5085049 5397148 5084666 4686088 4788163
5172 4788163 4834387 4810109 4461691 4489061 4263529 4356378 4661709 4681298 4501084 4653533
5162 4653533 4597073 4436564 4185824 4005190 4162417 4028386 4058594 3999137 4029014 4061159
5152 4061159 4105249 4157277 4350072 4316711 4226082 4243748 4120352 4131592 4037583 3962590 3917664
5141 3917664 4084240 4100392 3883939 4067016 4091844 4137317 4144844 4278953 4119824 4108427 4425828
5130 4425828 4390501 4275520 4094897 4203772 4015296 3784454 4068108 4293692 3972556 4001463
5120 4001463 4209716 4224599 4187400 3922404 3646422 3695173 3997957 3950455 3915027 4156407
5110 4156407 4154702 4318618 4258573 4236076 4312404 4493644 4549348 4557594 4548323 4701568 4618891
5099 4618891 4638406 4807528 4791561 4904587 4967102 4951997 4814495 4891453 5040508 5266369
5089 5266369 5106755 5107650 5185170 5214142 5248801 4970166 4922980 5182941 5206683 5095974 5154550
5078 5154550 5066479 5076998 5130054 5274450 5253434 5261040 5413165 5260975 5133635 5014475 5210179
5067 5210179 5322223 5540325 5737594 5753157 5789073 5775480 5840119 5777851 5723578 5788870 5840457
5056 5840457 5956123 5642661 5415493 5292026 5354457 5478061 5388998 5500133 5269766 5291698
5046 5291698 5202670 5352878 5590155 5261510 5310447 5366506 5572762 5647072 5549197 5478911 5566873
5035 5566873 5858175 6188507 6394729 6397702 6801513 6890627 6840717 6907532 6774665 6856633 7232033
5024 7232033 7429164 7480476 7364299 7386569 7405757 7283705 6959906 6691811 6685882 6849477
5014 6849477 6624385 6435076 6627875 6834843 7097612 7408421 7517743 7349264 7381789 7254779
5004 7254779 7588083 7282751 7295330 7289899 7377557 7678147 7539370 7689523 7758137 7533564
4994 7533564 7462726 7469539 7752302 8135656 8202124 8253332 8242835 8065835 8161459 8004654 7592655
4983 7592655 7622123 7805722 7646065 7687194 7849797 8005602 8156603 7940260 8035014 8317154
4973 8317154 8642873 8649294 8577369 8613948 8426120 8471027 8564974 8360022 8212680 8319325 8435125
4962 8435125 8414081 8621642 8878871 9148183 9182170 9576129 9958421 9988429 9836036 10016636
4952 10016636 9856397 9451876 9373066 9449413 9312766 9508745 9883453 10283501 10517328 10622913
4942 10622913 10908639 10882480 11124278 11416770 11475288 11328318 11148487 11075873 10732399 10456505
4932 10456505 10391879 10262258 10220412 10351894 10272676 10221022 10080065 10113182 10213148 10440275
4922 10440275 10499213 10466445 10733632 10743434 10730813 10758848 10536996 10600781 10804424 10826959 10999635
4911 10999635 11119506 11428378 11479398 11354984 10919694 10975907 11020005 10823404 10769995 10798050
4901 10798050 10786548 10786662 10943018 11245307 11518827 11770548 12160648 12485946 12735112 13065321
4891 13065321 13240050 13233339 12780810 12779319 12712290 12528547 12401393 12031087 11839695 11697415
4881 11697415 12032941 12307756 12481130 12447598 12435412 12546865 12873746 13002467 12876128 12891131
4871 12891131 13043431 13313240 13339646 13462397 13756959 13949181 14280499 14558240 14563700 14890636
4861 14890636 14987248 15194415 15619087 15571840 15642543 15665362 15835688 15752479 15782090 16144088
4851 16144088 16155897 15974026 16040937 16268650 16368457 16443455 16569102 16681792 16806068 16701188
4841 16701188 16824273 16866241 17381381 17790989 18008498 18309563 18769477 19195483 19411994 19816932
4831 19816932 19927160 20217018 20662570 20978230 21375507 21837699 22194432 22702696 23153037
4822 23153037 23553866 23732974 24397839 25138456 25764864 26322816 26884251 27778848 28133232
4813 28133232 28671374 29487862 30231798 31037464 31627721 32247933 32964298 33940105 34542077
4804 34542077 35025544 35338346 35579430 35888472 36171195 36647024 36865709 37163253 37894306
4795 37894306 38529694 39455805 40336806 41312087 42586395 43980171 45539892 47171958 49106833
4786 49106833 51031559 52944327 55017350 56732321 58410721 60446534 62545832 64662042
4778 64662042 66279228 67890327 69665464 71179438 72572915 73853187 75395004 76784909
4770 76784909 78360008 80300927 82343206 84259066 86497658 88595046 90366534 91953891
4762 91953891 93320658 94832578 96455279 97798540 99082667 100842812 102525185 104699979
4754 104699979 106629549 108838366 110893214 112666324 114516405 115943907 117065318 117973047
4746 117973047 118245318 118054879 117293445 116442822 115613082 114903896 113917165 113446539 113052978
4737 113052978 112571921 112283296 112087416 112327262 112917236 113969182 115037521 116401992 118273214
4728 118273214 120893063 123683770 127374556 131530103 136305591 141890351 147414765 152354416
4720 152354416 155997904 157940732 157534785 155656239 152823695 149843325 146918042 144196590
4712 144196590 142017526 140496044 139792828 139770827 140590768 141936052 143426279 145461001 148134368
4703 148134368 151124202 155087700 159295126 163705328 168259695 172678730 176443311 178745246
4695 178745246 179592801 178682595 175885704 171744576 166605566 161273373 155682752 150192908
4687 150192908 145163691 139625195 133992932 128365931 122383226 116460465 110735442 105460284
4679 105460284 100519711 96288074 92564209 89891177 87458569 85306010 83548300 82063404
4671 82063404 80860737 79641355 78844918 77428696 75953143 74401721 72496981 70476957
4663 70476957 68576632 66634049 64914541 63140129 61653666 60441883 58881246 57391720
4655 57391720 56103062 54751009 53326817 52125624 50915982 49839721 49058950 48710133
4647 48710133 47678074 46626266 45565235 44578804 43499884 42249579 41539023 40674576 39898239
4638 39898239 39313205 38900597 38578318 38125029 37381412 36895985 36603284 36129492 36130997 36085822
4628 36085822 35795163 35306455 35151114 35189638 35017106 34485565 34031139 33519743 32915399 32345634
4618 32345634 31261737 30723387 30084965 29387596 28616280 27957361 27425107 26893215 26418562
4609 26418562 26016966 25296205 24763312 25087694 25037010 25134549 25227370 25085239 25179147 25548719
4599 25548719 25645074 25637871 25443259 24837580 24408604 24072646 23500547 22678129 22440222 22307782
4589 22307782 21980976 21374486 21005380 20676433 20593204 20727419 20459540 20276887 20155226 20180589
4579 20180589 20388796 20067057 19944109 20130041 20102599 19883649 19945768 19739361 19601891 19264836
4569 19264836 18840952 18671193 18119999 17803097 17496412 17342605 17113468 17175287 16770294 16755550
4559 16755550 16675818 16298646 16170049 16019799 15947929 15850776 15977378 15655013 15397195 15153603
4549 15153603 15347144 15461018 15099269 15208788 15619945 15367474 15437640 15463266 15616488 15509415
4539 15509415 15273107 15334478 15430393 15664723 15447328 15260775 15176366 15476059 15605944 15763303
4529 15763303 15976736 15940917 16113616 16315514 16097892 16102005 16208821 16298953 16052562 16110231
4519 16110231 16357501 16069634 16294472 16398430 16573414 16741742 16498741 16498618 16553024 16634882
4509 16634882 16732538 16830102 17419721 17796879 17642830 17792724 18093833 18171249 18304327 18392904
4499 18392904 18628503 18873317 19170979 19610365 19917191 20464012 20751982 21135411 21508700
4490 21508700 21697469 21864303 22274236 22508884 23102537 23570540 23874572 24408014 24718691
4481 24718691 25124129 25601265 26182159 26713449 27436197 28317558 29351842 30396663 31117723
4472 31117723 32328977 33558672 34464110 34977823 35426298 35873857 36592968 37495583 38488079
4463 38488079 39429199 40234387 41229309 42351255 43564141 44957353 46630037 48187498 49818503
4454 49818503 51508992 53439876 55572065 57966762 60727353 63630740 66801675 70341737
4446 70341737 74463392 79276489 84209974 89962813 96812266 104640870 113899544 124706226
4438 124706226 137070735 151619777 168957589 188569741 208795795 227566168 242356360
4431 242356360 252464765 261247300 270546422 282348165 297047954 311754696 321580009
4424 321580009 320437167 307115080 284827950 258959451 233097338 209615742 188816956
4417 188816956 170805205 155498935 142527609 131565959 122257301 114357849 107123472
4410 107123472 100820964 94750569 89468286 84408191 79688657 75869525 72351751 69019557
4402 69019557 65836389 62770268 59676440 56951926 54642646 52242695 49731254 47630166
4394 47630166 45879035 44257473 42694666 41238448 39641995 38352222 37010080 35700214
4386 35700214 34647798 33561150 32562656 31782827 30733701 29927803 29476632 28735498 28095825
4377 28095825 27476911 26734359 26436873 26093146 25610543 25154343 24599457 24222250 24086960
4368 24086960 23893864 23294853 23107147 23123129 23037059 22824982 22631009 22750652 22209105 21366249
4358 21366249 20893122 20776354 20434875 19406843 19134375 18899833 18305532 18057265 17789679
4349 17789679 17631601 17297878 17118460 16856092 16423648 16101145 15753091 15475074 15443476 15107404
4339 15107404 15053645 14982861 14659242 14251207 13837314 13564658 13587813 13703132 13471351 13081524
4329 13081524 12555044 12573879 12731397 12648971 12390842 12292793 12143175 12134305 12274706 12381022
4319 12381022 11826489 11607089 11744411 11642973 11822219 11601516 11313415 11498960 11618429
4310 11618429 11311035 11068054 11008665 11007472 11019826 11124269 11249216 11369539 11679054 11518891
4300 11518891 11624993 12004291 12074537 12001753 11800137 11740659 11523713 11232087 10968604 10946846
4290 10946846 11056380 10864044 10793986 10773282 10802279 10930103 10988010 10796545 10537254 10574042
4280 10574042 10430057 10216082 10580351 10720051 10756459 11016996 10862801 10988893 11197251 11171370
4270 11171370 10914871 11121700 11175677 11025474 10980762 11253610 10969025 10984499 11036989 11243531
4260 11243531 11274586 11217050 11220260 11118643 11261236 11327816 11145040 10951579 10997579 10546703
4250 10546703 10545214 10555554 10635772 10737634 10560250 10584467 10826732 10511186 10518827 10717594 10789261
4239 10789261 10697081 10628260 10561143 10686076 10545299 10300541 10094376 10234478 9996800 9943767
4229 9943767 10155575 10057373 10031466 10380826 10473081 10185225 9860108 10128631 10294173 10584761
4219 10584761 10562816 10446815 10279948 10295099 10488294 10646954 10600687 10734831 10969174 11021932
4209 11021932 10949045 10844671 11118643 10818959 10767375 10731269 10764919 11017751 11135877 10916441
4199 10916441 10750742 10635976 10900936 10940517 10865316 10768325 10768425 10905961 11108179 11120802 11030794
4188 11030794 11115594 11297372 11422559 11501252 11200087 11282393 11694192 11713731 11447134 11360706
4178 11360706 11438564 11602330 11460804 11504811 11784825 11938845 12032048 12084740 12469431 12883335
4168 12883335 13156354 13505111 13993143 14715100 15393800 16165230 17049995 18242974 19884813
4159 19884813 22158848 23719386 23665885 22898723 21487943 19665151 18074146 17118699 16401227
4150 16401227 15897750 15518995 15100581 14650232 14410641 14396099 13952520 13554563 13486582 13603510
4140 13603510 13563300 13594097 13639476 13685149 13581836 13611384 13454816 13622455 13948643 14135030
4130 14135030 14316320 14491841 14617460 14920484 15264690 15462538 15659282 15525045 15278706
4121 15278706 15649534 16130315 16229323 15916474 15934773 15906403 15904032 15934016 15925509 15609851 15466119
4110 15466119 15665811 15787011 15758193 15633275 15920571 16115506 16304487 16236224 16209140 16025932
4100 16025932 16408018 16625959 16783261 16907033 16805957 16920109 17210240 17226723 17623622 17933306
4090 17933306 18264801 18628092 19059245 19185212 19326797 19615190 19858603 20190790 20734641
4081 20734641 20839000 21285689 21664684 21788033 21902003 22028995 22092776 22426671 22824704 22685835
4071 22685835 22800994 22829296 22924560 23351120 23469255 23435184 23881015 24283185 24729839 25106573
4061 25106573 25530043 26106032 26640472 27059105 27436218 27966298 28688980 29435516 30110858
4052 30110858 30884610 31753555 32276627 33132615 33732305 34361121 34821112 35413166 35929678
4043 35929678 36153933 36751781 37078785 37449606 37761889 38592510 38912405 39466215 40216716
4034 40216716 40837119 41382185 42043180 42877208 43584589 44114373 44515031 45044154 46021374
4025 46021374 46780470 47618239 48327237 49081472 49880393 50774170 51929220 52727660 53717199
4016 53717199 54688820 55966415 57343446 58561978 59559611 60622159 62095544 63623327
4008 63623327 65169082 67133979 68756925 70603309 72438657 74484129 76587511 78801078
4000 78801078 80977269 83405803 85896206 88086694 90359923 92795858 95622933 98378776
3992 98378776 100956691 103470546 105933946 108589833 111126783 113471705 115668820 117628877
3984 117628877 119735274 121653560 123380311 125019557 126500232 128077311 129688110 131323606
3976 131323606 132242757 133090993 133490674 133808043 134151835 134264988 133911734 133606653 133212059
3967 133212059 132717582 131936318 131100085 130125176 128742477 127236620 125450574 123463577 121583910
3958 121583910 119434092 116860037 114691126 112561769 110323009 108354825 106572812 104534020
3950 104534020 102514344 100112477 97874639 95952985 94059954 91745481 90144237 88414391
3942 88414391 86662917 85473537 84233842 82802799 81532064 80571977 79576497 78302789
3934 78302789 77042549 76052746 75266502 74658911 73998324 73606199 73166782 72960128 72979434
3925 72979434 72980224 73062564 72801703 72328274 71601543 70748871 70358743 69843289 69588937 68867710
3915 68867710 68605263 68282952 67986274 67475958 66900110 66154694 65304642 64380822 63530313
3906 63530313 62743015 61617101 60836787 60230845 59929472 59219818 58520157 57688237 56619196
3897 56619196 55546166 54353884 53179378 51993083 50804235 49987688 48806222 47876024
3889 47876024 47102148 46484007 45724965 44734770 44256302 43822880 42786132 42251915 41612176
3880 41612176 41425143 41346563 41223284 41135571 41106888 41258618 41692551 42158158 42795503 43671205
3870 43671205 44528581 45329641 45864161 46274861 46291442 46090113 45929658 45557748 45514539 45077858
3860 45077858 44984814 45210648 45574565 45998302 46329606 47066224 47589077 47798672 47796328 47644158
3850 47644158 47017412 46356277 45594850 44476907 43390197 42212506 40992951 40244106 39400602
3841 39400602 38709788 38075650 37627500 37263279 37043936 36379344 35625829 35067227 34582867
3832 34582867 33839565 32962388 32011290 31189738 30367628 29593404 28911025 28210716 27496110
3823 27496110 27237351 26758783 26420420 26171591 25727065 25282465 25114973 24749032 24188939
3814 24188939 23958626 23578974 23510675 23214207 22906945 22590181 22386148 22295308 21995919 21602253
3804 21602253 21368943 20984851 20975509 20810817 20450174 20507136 20278788 20211659 20146995 19810883
3794 19810883 19654192 19626232 19588502 19482295 19395082 19313883 19111768 19022437 18698277 18570050
3784 18570050 18435520 18246884 18336663 18147193 18068898 18146082 18150210 18154688 17739776 17770634 17618912
3773 17618912 17711657 17744014 17632648 17693916 17463327 17321940 17233445 17267335 17168728 17362822
3763 17362822 17077722 16879003 16839400 16987314 17052928 17191191 17389128 17202326 16841330 16823880
3753 16823880 16925541 17014464 16903240 16964507 17342582 17504303 17359830 17188524 17348182 17678039
3743 17678039 17717909 17469184 17371465 17403966 17734969 17936895 18034746 18085227 18324739 18517261
3733 18517261 18777376 18967180 19061172 19127194 18842695 19057204 19381861 19521592 19680564 19602004
3723 19602004 19709318 20095423 20209488 20137810 20207500 20448890 20782257 20953281 21168613 21268449
3713 21268449 21717145 21590796 21675664 22042674 22211279 22567330 23167304 23914573 23867773 24180739
3703 24180739 24759513 25030778 25684997 26332908 26826022 27473716 28044046 28702442 29327950
3694 29327950 30040352 30993284 32126134 33358728 34275154 35702696 37599627 39616590 41953604
3685 41953604 44169788 46530572 47860900 48356448 48080701 47339911 46471265 45721345 45576070
3676 45576070 45615267 45845861 45951547 46525638 47237610 48121166 49468744 50719189 51763247
3667 51763247 53232894 54644407 56271772 57629328 59119424 60817755 62656715 64799494
3659 64799494 67010725 69377134 71967591 74354544 76375302 77327728 77335325 77220255 76745507
3650 76745507 76241359 75789154 75730178 75438084 75441301 75631487 75951775 76192480 76825924 77583302
3640 77583302 78294613 79222117 80047325 80914333 82184423 83474857 84793101 85922980 87300788
3631 87300788 88766599 90135928 91685489 93755415 95971583 98168003 100426716 102755705
3623 102755705 105103075 108228256 111077493 114314646 117430358 120833500 124754836 128556281
3615 128556281 132571801 136681925 141173751 145457276 149777433 153693275 157489444 160989829
3607 160989829 164668083 168270527 171698617 174809891 178051085 181330554 184750230 188130942
3599 188130942 190772353 193372691 195788667 197675111 199473753 201245704 202615401 203301419
3591 203301419 203931937 204715136 205348119 206107332 206940082 207864165 209063790 210334125 211967843
3582 211967843 213256520 214851090 216204303 217431803 218715021 219903548 221144784 222266093
3574 222266093 223214612 224621039 225876871 227227679 229024803 230909164 232677883 234641106
3566 234641106 237077720 239161963 241486185 243649237 245883360 247908424 250102064 252383102
3558 252383102 254579491 256728832 259071133 261948018 265333240 269468567 274057376 279636895
3550 279636895 285986976 293553705 302195718 312084010 322956902 334352273 346204431 357358723
3542 357358723 367277059 375584075 381955337 385837162 387313267 386803985 384736617 382027941
3534 382027941 378985615 376006692 373168952 370802346 368277696 365253841 361575779 356735722
3526 356735722 350031311 341379390 330634227 318285996 304479867 289614490 274368036
3519 274368036 259710177 246289716 233737941 222480247 212193324 203136574 195110399
3512 195110399 187930203 181454990 175814858 170641001 166463591 162287020 158150056 154466828
3504 154466828 150874234 147596982 144211905 141367215 138444934 135534072 132854373 130408563
3496 130408563 128100761 125557434 122889806 120331164 117676262 115129551 112647280 109963849
3488 109963849 107241946 104262179 101439677 98189091 95484376 92704662 90250596 87636540
3480 87636540 85339179 82959693 80477825 78438176 76365707 74328373 72138803 70285380
3472 70285380 68467654 67065080 65330913 63974168 62517519 61044365 59790826 58710971
3464 58710971 57859842 56885929 56002379 55501373 54947778 54325239 53833061 53491260 53102213
3455 53102213 52764804 52412191 52146678 51730843 51359893 51300483 50760254 50342061 50127093 50042283
3445 50042283 49530948 49296192 48991031 48649978 48401368 48193026 47723395 47615888 47327006
3436 47327006 46709103 46216466 45847417 45586737 45409797 45330417 44968211 44704121 44584501 44481848
3426 44481848 44357221 44008119 43907195 43953878 44080518 44042514 44058265 44230740 44288850 44494291
3416 44494291 44876913 45184015 45764702 46703848 47582119 48988979 50922809 52464302 53378209
3407 53378209 53309826 52562998 51824617 50786043 49870563 49508121 49347903 49319253 49800431 50217086
3397 50217086 51050706 51349015 51947632 51915989 51172837 49766619 47958656 46187418 44610964
3388 44610964 43391405 42387570 41542196 40992755 40674047 40325590 40530467 40738040 41028173
3379 41028173 41503654 42118700 42980320 44160581 45646788 46948277 48116796 49780464 51948174
3370 51948174 53927645 55796971 58079233 60280762 62942655 65953581 68642446 71412557
3362 71412557 74485725 77761393 80479565 83320206 86060262 88862583 91256424 93504946
3354 93504946 95455105 97159733 98255801 98975865 99025232 98920175 98407862 97588861 96694502
3345 96694502 95021635 93375685 91493761 89523560 87552159 85227249 82843007 80184569
3337 80184569 77226821 74416864 71910552 69372592 66494002 63967152 61505445 59463431
3329 59463431 57091870 55052900 53061661 51345382 49819756 48446846 47048224 46042579
3321 46042579 45096996 44251125 43666731 42934654 42004978 41682778 40891320 39961182 39092468
3312 39092468 38608335 38390202 38129082 37842923 37479833 37442705 37349034 37290894 37068114 37049809
3302 37049809 36938091 36847594 36909947 36903662 37103516 37346202 37589588 37849755 38192964 38355326
3292 38355326 38525481 38867051 38951381 39022922 39310963 39586632 40016651 40475724 40983278 41578160
3282 41578160 41950553 42603179 43465242 44294990 44913335 46006813 47128749 48257655 49450084
3273 49450084 50800991 52199375 52986969 52885588 53156378 53774429 54332715 55057001 56125452
3264 56125452 57394829 58704519 60254868 61856493 64170844 66892070 69875649 72991697
3256 72991697 76335232 80105339 84324646 88869803 93911213 99404722 105105486 111379754
3248 111379754 117706719 124004755 129626796 133585245 135505597 134624070 131203719 125819770
3240 125819770 119414015 112769089 106015698 99634352 93868685 88624351 84022348 79881958
3232 79881958 76004958 72824952 69883587 67069452 64336104 61653990 59364233 57260639
3224 57260639 55599688 53928109 52359099 50763717 49339167 48030386 46720608 45674044
3216 45674044 44865882 43607630 42556700 41730712 40693246 40044380 39191627 38193652 37511221
3207 37511221 37180632 36388281 35582341 34880310 34162289 33369168 32990473 32276412 31588870
3198 31588870 30886260 30316081 29818303 29182713 28617457 27815032 26936163 26535690 26853112
3189 26853112 26485311 26088904 25905546 25467372 25552513 25354004 24890119 24430249 23734749 23029698
3179 23029698 22269627 21649093 21321043 20794734 20402170 20137353 19907092 19576545 19382675
3170 19382675 19025914 18725868 18630496 18482991 18444756 18209972 18086027 18224574 17761752 17541005
3160 17541005 17616537 17865824 18131036 18373766 18905534 19464981 20197364 21029737 21552315 21550816
3150 21550816 21085435 19939784 19142849 18986825 18275720 17607451 17362265 17103660 16845703
3141 16845703 16769922 17036622 16997830 17185469 17552098 17846944 17752399 17589686 17614767 17466244
3131 17466244 17508796 17686817 17430411 17312440 17243214 17149803 16902863 17158730 17201220 17504597
3121 17504597 18056357 18388405 18429393 18203757 17446474 17170460 17023893 16570699 16105928 15930812
3111 15930812 16091973 16405588 16384378 16710391 17127375 17757044 18663602 19085366 19032944 18805074
3101 18805074 18722690 18580960 18390080 18337856 17910980 17250527 16370447 15739865 14929383 14413255
3091 14413255 14264459 13513000 13329596 13250874 13148018 12883911 12790231 12832240 12917299 12833256
3081 12833256 12656283 12692190 12629057 12504903 12399510 12509031 12592064 12727020 13102142 13152131
3071 13152131 13342354 13412373 13324413 12969212 12755502 12727582 12862926 12360907 11964065 11169274
3061 11169274 10499208 10175709 10099174 9689907 9589348 9220518 8904153 8943509 9012236 8819442
3051 8819442 8414375 8508093 8401508 8059844 7925688 7984318 7699986 7616808 7436227 7400006
3041 7400006 7295038 7208948 7035032 7043378 7094722 7181543 7223742 7166160 7165927 7157565 7020276 6822833
3029 6822833 6829158 6822293 6685515 6729857 6579560 6733946 6839565 6578653 6560881 6461773 6584686
3018 6584686 6641193 6480002 6320995 6255905 6422481 6265258 6200839 6417661 6109517 6252927
3008 6252927 6323723 6574473 6564044 6470262 6592620 6562545 6410161 6271408 6210124 6460228
2998 6460228 6538454 6473429 6470935 6343716 6151538 6257484 6467639 6408148 6669190 6893388
2988 6893388 6829288 6778365 6817021 6500486 6663985 6681743 6784950 6862119 6954877 7160635 7339778
2977 7339778 7641838 7638069 7202939 7094145 7245729 7292312 7321140 7283132 7220285 7097722 6863018
2966 6863018 6944077 7091123 7137949 7181261 7179371 7016918 7238943 7404788 7369282 7453789 7443104
2955 7443104 7497396 7567945 7923774 7991837 8072844 8378624 8563253 8618324 8595201 8796330 9318581
2944 9318581 9515531 9789699 10002785 10156052 10414144 10559066 10881609 11069215 11367939 12073830
2934 12073830 12839052 12978884 13100733 13319412 13837478 14149894 14332483 14239807 14223819 14186111
2924 14186111 14276371 13967523 13851275 14033097 13952482 14016126 14387466 14580829 14741634 14988282
2914 14988282 15265233 15530963 16050901 16836774 17622552 18249680 18972641 19782221 20588160
2905 20588160 21090466 21368561 21293151 21030607 20581464 20020556 19649704 18845777 17977590 17206395
2895 17206395 16586733 16061163 15879400 15422821 15236731 15087743 15128743 14867122 14990362 15121781
2885 15121781 15288119 15624623 15821684 15922587 16149829 16016839 16324662 16556121 16699508
2876 16699508 16909986 16769349 16307875 15970094 15606025 15169952 14707412 13945379 13472071
2867 13472071 13082580 12672858 12351627 12102839 11819686 11515892 11441137 11168722 11098894 11117881
2857 11117881 10984998 10730459 10619970 10742522 10771027 10517131 10446982 10152844 9795662 9733830
2847 9733830 9538219 9117230 8725595 8744650 8427851 8027016 7796652 7495983 7217380 7027291
2837 7027291 6686793 6503241 6592060 6315200 5850418 5769786 5645484 5703555 5668507 5627139
2827 5627139 5140523 5240278 5344029 4942761 4475680 4491635 4461799 4244556 4470567 4348046
2817 4348046 4101424 4185707 4142190 3966378 3653321 3519311 3469435 3543098 3560376 3381972
2807 3381972 3400469 3483368 3476297 3340881 3213597 3141939 2942659 2841168 2589518 2599606 2721429
2796 2721429 2693445 2641434 2601009 2647245 2577765 2588870 2665651 2598770 2157254 2123669 2371870
2785 2371870 2246738 2356354 2352920 2269171 2368648 2181655 2246237 2117893 2203759 2167812 2025873
2774 2025873 1722921 1905363 2025130 1911647 1929735 1705176 1493217 1465856 1552250 1710356
2764 1710356 1591247 1658838 1804809 1687038 1775899 1768911 1571766 1799364 1721145 1387006
2754 1387006 1220630 1104582 1382763 1333785 1297142 1322520 1280103 1051151 1154653 1377049
2744 1377049 1330994 1028355 1029552 1181538 1044350 1045782 1201367 1366794 1243822 1127591
2734 1127591 1309973 1004589 785081 977746 1229825 1076513 810570 977184 1025104 947974
2724 947974 1087542 1101494 1056458 961852 904129 741658 874120 984661 1013483 756952 653976
2713 653976 906074 1047510 1011744 998974 998292 861184 1018250 1119474 857641 791634 819537
2702 819537 939174 1098507 1012493 890704 1079582 816490 761057 922602 592648 483259
2692 483259 681830 840353 835690 791613 735988 636345 724822 555745 276657 542182 387086
2681 387086 586421 554521 346649 598020 880801 621122 512407 419761 612202 812301
2671 812301 750727 735885 647513 552641 545082 603926 603852 545489 678710 659804 580282 694898
2659 694898 753063 759301 914721 556990 766794 917046 628661 478606 341048 370863
2649 370863 521022 673508 637919 439747 476553 694071 691563 627640 713699 737081 813496
2638 813496 667016 340722 163572 187748 519182 362533 388484 583221 520822 381630
2628 381630 274629 420143 294080 560850 927302 562454 575810 480404 540568 401704
2618 401704 396796 450083 426088 363873 499312 352262 211295 246738 586458 696337 511798
2607 511798 551195 488332 460635 560034 349683 191835 240270 240332 437032 184053 31116
2596 31116 181941 370237 393810 266331 262376 291375 413790 455773 214185 217753 364374
2585 364374 467578 459599 395410 654032 661102 154668 273316 511507 351427 53681 324199
2574 324199 103598 60959 238076 271153 500149 416090 161430 -95428 127701 250866
2564 250866 406046 368223 370754 354322 506846 305049 260098 175698 7999 157354 228299
2553 228299 43569 71818 384403 390657 466616 316727 232038 181169 195988 164017 154876
2542 154876 458444 386954 286624 201700 -43177 -3393 -102202 -147715 -1341 138833 222410
2531 222410 226104 356917 276372 303549 396129 140971 348042 261974 292973 67024 300270
2520 300270 281699 101904 226972 360175 463272 419950 196957 240809 197582 63751
2510 63751 82768 20150 97267 -55612 -3165 -267023 -92205 152752 288428 18338 -48567
2499 -48567 94270 250518 -63339 -218496 -277107 -176487 98781 97718 119598 116669 10902
2488 10902 317059 347524 257496 238092 135124 52444 116705 270789 348420 215961 64058
2477 64058 98935 304491 -104294 -40343 263668 155257 -21621 -87884 96291 324305
2467 324305 247280 61815 10054 45349 248167 95078 123801 180828 173134 -73391 115354
2456 115354 183003 445513 333241 -12518 95057 292564 212340 263475 224666 202062 -64825
2445 -64825 -113856 -62918 -27441 -49315 33176 268936 9784 96830 215555 190198 84742
2434 84742 59637 238951 270831 316600 408120 182692 114301 205792 53536 14383 -106904
2423 -106904 55663 -70083 -39193 304612 256232 23986 -122283 -54596 7749 -127315
2413 -127315 3531 199119 460365 234585 -13643 -14642 35737 7724 1596 116881 208440
2402 208440 120804 72412 109019 -114240 -156049 -15135 541549 397526 191660 384978
2392 384978 326122 170603 -153383 74630 -159226 -289320 -77856 169857 209724 192219
2382 192219 -112127 -268902 8769 -138295 -8598 228682 286528 142166 411686 282757
2372 282757 410730 443593 500951 423436 321279 339324 191558 -85537 37729 -331971
2362 -331971 -329662 40124 115648 111252 185471 209569 42382 190842 259040 28485 82647
2351 82647 -69637 167752 416927 225306 217414 265595 103774 150061 154495 52629 -3082
2340 -3082 -110337 67205 115106 73195 22658 21924 -6215 15355 -38852 150123 140058 89739
2328 89739 132452 118734 55296 86195 54454 184594 358541 589175 188847 111670 112167
2317 112167 90585 -29280 -26792 -43821 -77061 -50412 -85526 -360068 -350341 -130909 15530
2306 15530 48880 -114985 -53544 -62891 -58683 23997 65347 -21290 -227883 -266412 -111159 -218016
2294 -218016 -253264 22652 -16210 61506 495207 333605 239898 115797 52002 154654 147827
2283 147827 66528 -159658 -25137 275855 22907 -7739 -16451 -25020 94666 225815 160235
2272 160235 68815 21751 13411 153085 296583 223273 218133 60268 -58655 41727 204712
2261 204712 66207 13996 113674 21230 -141205 176942 92946 -29594 23902 -99095 173300
2250 173300 344383 353861 300482 126205 44620 116936 214426 236578 163450 274279 176941
2239 176941 189633 278301 161431 -43171 36652 80809 -175896 84000 137782 211797 300516
2228 300516 518849 563321 102722 293604 641194 652245 531104 168697 -63022 293101
2218 293101 214601 306056 934070 758971 400463 549879 477326 418376 355735 350429 561536
2207 561536 514865 356901 524759 711423 654263 558499 710520 661434 782515 708686 544885
2196 544885 503063 592213 811163 749276 805158 864446 841952 936345 838187 680314 500447
2185 500447 843130 1105544 1001585 993630 1023303 1093986 1072482 1138407 1244517 1144625 1059426
2174 1059426 1036384 1076924 1081230 1508973 1627135 1324879 1303648 1587639 1487492 1516541 1652608
2163 1652608 1808048 1838148 1897682 1872727 1921679 1771583 1836940 2174587 2279921 2310140 2311549
2152 2311549 2401097 2323194 2403151 2711261 2737249 2760256 2755782 2926862 3094030 2778765 2816062
2141 2816062 3039926 3630028 3501067 3434741 3696256 3731108 3963190 4331108 4389427 4633026
2131 4633026 4967301 5269374 5552090 5889358 6364471 6793514 7080047 7712088 8480585 9300005
2121 9300005 10161507 10623179 11244264 12207937 13313331 14766669 16560751 18485119 21106345
2112 21106345 24592432 28332264 33474621 40959531 50397067 61045330 67545422 63091321
2104 63091321 55009830 45966113 37235668 30956820 26010477 22275355 19044546 16609878
2096 16609878 14884904 13420320 12407446 11751892 11256173 10689515 9826062 8958615 7948099
2087 7948099 7334259 6808393 6675152 6232968 5911730 5507657 5349930 5072357 4888881 4707037
2077 4707037 4591595 3972418 3677982 3457775 3121513 3172862 3086925 2851547 2702173 2638464
2067 2638464 2511668 2462418 2314358 2243979 2130898 2167384 1991050 1904847 1713937 1873750
2057 1873750 1785057 1618386 1595435 1549805 1653674 1667220 1576819 1514831 1645012 1508827 1437421
2046 1437421 1400829 1318562 1398058 1361759 1142771 1219554 1149243 1155217 1078695 1054533 888112
2035 888112 1011193 1168997 1047179 945975 999546 1037896 889666 663664 737371 727034
2025 727034 915197 1023219 964998 843215 649177 669488 671150 659497 604453 578631 442027
2014 442027 486184 384172 461423 500894 442812 491901 641688 1052344 855868 492341 286202
2003 286202 271789 358397 210139 197245 156676 262456 351262 540400 466468 425551 427335
1992 427335 242287 157562 140173 239558 246248 307851 227468 419609 583793 313647 162537
1981 162537 382802 489276 618467 450155 403941 463976 93771 61597 398556 568359
1971 568359 362620 362493 332808 222513 288118 42822 1993 152790 25609 224135 37311
1960 37311 -51542 -47908 -60545 -45214 51033 174064 79118 278185 197652 158936 189652 319753
1948 319753 318960 57395 208916 70226 61010 111088 125083 170520 506890 436393 120606
1937 120606 256945 321417 481724 454887 252890 -79389 -49579 57690 -149136 -123404
1927 -123404 24211 32159 -69804 -172894 -51695 120793 77568 130295 15593 -72912 165306
1916 165306 160354 -84361 -28719 276052 150430 155888 266377 4645 -161699 202324 247289
1905 247289 280689 191059 66377 96839 128530 -67112 4520 204084 197686 233382 60682
1894 60682 159754 72207 -62594 -192808 -115554 -172692 -264725 -103133 240 -122233 -10712
1883 -10712 309692 104424 -140493 92649 310259 84789 -177459 82686 174309 -111128
1873 -111128 -199251 -85377 25291 -279339 -122748 -38751 66900 285084 306358 431279
1863 431279 116464 -67204 -18609 116396 249605 146026 73030 151115 218271 449581
1853 449581 299887 60301 1377 -162520 -132888 -110907 -375940 -206543 33549 73659
1843 73659 41039 145065 -16976 379179 384208 173403 258189 185795 209884 317281 170770
1832 170770 104960 171922 138343 250112 -61272 -178398 -63730 136727 -138771 -241432
1822 -241432 -18075 -39234 95468 175981 127671 -130052 -207589 177446 85809 243287 21170
1811 21170 -12108 47168 19741 -26321 -32970 42300 21302 67633 -136037 15213 182902
1800 182902 108563 80042 -66010 82060 39630 60977 230017 218781 428265 283467 132719
1789 132719 -188199 -163295 257729 135644 -16734 160739 232551 168724 13336 -141305
1779 -141305 -190360 -291718 137103 191744 -95086 -131488 -92503 -179453 -102885 -61289 27091
1768 27091 -145976 -147223 -91090 -130931 -47094 -183604 -84062 -206487 -190544 -375560 -193417
1757 -193417 -140107 -70036 -106115 -18658 77300 471380 408865 -39934 -298819 -369911 -275039
1746 -275039 -210913 -185402 -227189 -245348 -83986 -80285 -190737 -81101 74533 95258 -79112
1735 -79112 68749 -3735 16929 -94953 -185555 -223466 -365530 -328729 -55523 214467 251845
1724 251845 210142 182695 113524 -163227 -335225 20723 -24844 189516 363551 287270 -14810
1713 -14810 -16003 -57350 -288955 -120689 -14169 -173440 -117229 -241522 -355371 -253646 -76057
1702 -76057 66580 237373 327302 113110 70593 -9149 -211560 -177933 -234122 -152442 151266
1691 151266 1782 384195 406591 131627 320779 51599 -76365 -139576 -33519 2608
1681 2608 68934 -93961 -271727 -314547 -315131 59370 56817 257481 67514 -158020 -167562 -71134
1669 -71134 -104355 -222760 -77116 -44996 53787 142156 -201031 172005 198223 -82761 169406
1658 169406 162387 99176 258843 66332 44219 144418 90260 -58719 -66500 157 -21701
1647 -21701 83998 -124838 -151327 -42053 -70933 -121794 -273102 -231542 -279656 -322773 -52345
1636 -52345 32489 207628 143904 73695 67506 96119 9899 -106582 -94927 55632 -44147
1625 -44147 -167711 -118306 -104701 -127001 -305276 -244715 -216848 -32600 13301 83441 12009
1614 12009 -308981 -181340 127836 -88574 78351 251970 12468 -51032 106222 -125642
1604 -125642 56201 26363 16123 110236 -40989 46854 63002 -96343 -336855 -265857 -243092
1593 -243092 134749 205055 75846 -139787 111995 -104045 -237753 -100374 -116129 -219129
1583 -219129 -62257 -160174 -298456 -247999 -1452 38522 -72782 -33966 -50792 -116880 -132240
1572 -132240 114141 50000 30867 -193450 -185490 -193799 -276342 -230163 -191603 -41510 31924
1561 31924 243101 139111 -334334 -229575 -496160 -320916 -80371 -144881 -174214 -141824
1551 -141824 -183872 -120665 -235730 -4318 97154 27937 108118 136476 165580 52448 -182156
1540 -182156 -339128 -7507 -23095 -96240 -52493 112179 48864 -104855 -156143 -75624 -55771
1529 -55771 -37704 -206254 -343472 -268465 -141609 -304823 -421440 -39899 -17957 72619 -79760
1518 -79760 123722 235231 42439 146574 39934 127877 137853 -36519 -79801 60549 -215526
1507 -215526 -146570 -169818 -244057 -51254 138459 -33010 -174877 -148784 367500 259972
1497 259972 -111758 -222200 -266199 -266762 -10311 141611 -200132 -64466 195012 262065 272159
1486 272159 217275 197729 135742 157360 -77452 -393955 -275497 -455489 -199168 -114851 -202933
1475 -202933 -28327 -149581 -116493 -179001 -24871 77852 -142832 -135444 -77037 -3830 -81273
1464 -81273 -72455 52487 196928 298367 173168 189696 -4608 121084 121035 -63746 -307291
1453 -307291 -315459 -263924 -334070 -182790 -229928 38269 -64086 132732 136043 -65177 -86331
1442 -86331 -145074 -31989 26177 218391 115317 -99460 -175868 -85670 -296799 -389820 -236309
1431 -236309 -198158 -115759 39782 91299 104449 163814 5317 33090 249075 213509 149292
1420 149292 76059 -100096 -155582 -183534 76057 71949 -90973 -157435 -14605 99335 -309937
1409 -309937 -307471 -159474 -282029 -357705 -434329 -511275 -475370 -268808 -180263 90331 -153781
1398 -153781 64585 -34758 168538 199932 -2455 -219662 -16903 211256 -113415 -150543
1388 -150543 -987 90929 109638 235491 -27943 -95658 -92280 68580 140351 -94267 -46042
1377 -46042 73572 -99262 -170440 -82535 -61034 -115728 -243299 55884 -153604 -298503 -145340
1366 -145340 5881 -91617 -111718 10278 -153792 -119380 5254 36675 -77227 -197242
1356 -197242 -232087 -2283 278938 171607 -68994 119814 78177 -220543 -116951 303247
1346 303247 173360 144926 113001 -123009 -339835 -265763 -337244 -277908 -82029 175004 54395
1335 54395 -211512 -97144 -125470 -89712 -164590 -172900 88917 -128979 -140476 -88596 3279
1324 3279 149241 116711 79688 -105554 -242139 -6277 217327 345109 358760 175510 187014
1313 187014 -131476 -233749 -38345 -21897 15666 -21568 143036 171451 255126 155412 109367
1302 109367 52831 14004 -13731 53881 -65844 -204358 -41437 -198983 -221274 -114410 -210430
1291 -210430 11952 -14927 -106036 -168018 -17973 -156995 -61331 58935 61304 -27306 -190566
1280 -190566 -120170 20412 308976 183257 33262 182979 192104 109277 -65823 2883 -94256
1269 -94256 -37356 11650 -208055 -9617 -84731 -177799 44641 8374 -3572 220481 26091
1258 26091 -248306 -55778 53505 -254540 -41237 -7229 1768 6801 -91235 2711 51137
1247 51137 48601 48382 -147271 -327885 -325452 92857 119502 150314 213015 23357 -294019 -265010
1235 -265010 -402773 -122750 -1937 -176204 -378360 -342840 -241454 -268280 -160719 -80970
1225 -80970 79287 23899 -202868 -135968 -188894 -288637 -87923 38216 -11233 130088 108036
1214 108036 -24560 -142307 44792 148384 -94580 -292417 -326455 13556 372513 361957
1204 361957 228155 136665 -232258 -349118 -279865 64100 56649 10859 48687 -192638 -98197
1193 -98197 104398 -13468 115237 -2236 -409045 -360430 -278292 -68051 -56823 6277 292361
1182 292361 211071 209048 267903 101788 -180650 -193050 -81592 -81877 -94172 -53726 -247890
1171 -247890 -209703 -102938 -187831 -207621 -274071 -168212 108427 257830 116652 -11959
1161 -11959 -60343 -149965 -227779 -225948 -140448 -60891 57545 22491 -233806 -285841 -17474
1150 -17474 79703 97035 -179903 -203104 -35498 35998 -88996 -107718 8693 70269 -199841
1139 -199841 -267900 -152125 72359 173368 197328 -74810 -342444 -281623 -289723 -207128 -143400
1128 -143400 4497 56973 173058 264924 285250 173160 190416 367290 177980 -89609
1118 -89609 -77022 -267143 -362078 -201318 -63004 -54864 92471 111876 385027 250679 124658
1107 124658 -4970 62871 49911 5479 -53578 -176150 -398681 -155504 -138349 -235525 -131379
1096 -131379 -292635 -211303 -225493 95006 80291 253282 43243 141832 242319 -76498
1086 -76498 -432725 -194759 -15276 127012 276660 80491 108288 85684 -52097 -38269
1076 -38269 199051 98996 1367 27930 153291 158121 175528 -163554 -176469 132918 158598
1065 158598 151940 207603 243951 503467 441228 309945 166117 -74045 60470 12795 23137
1054 23137 -242008 -366029 -215195 225029 468810 338068 111695 -107242 -114620 -47420
1044 -47420 -231699 -117777 -12472 150217 -24220 -196397 -141563 -287268 -369349 -290712
1034 -290712 -380940 -366650 106411 186810 -104772 -438151 -182740 -181023 -221939 -103251 -152838
1023 -152838 -54138 95765 74015 54809 71687 65255 38190 -268543 -228467 -195503 -204641 52521
1011 52521 -21850 15305 -35735 -233863 -277614 -101406 51085 -6378 38153 96531 -29362
1000 -29362 -230440 -372791 -309666 -116456 -69129 102424 -220636 -76918 -56239 175376
990 175376 50092 -93851 -149935 81230 60884 -227451 -48589 34897 295675 359718 136096
979 136096 -49731 60519 118322 205689 -17473 101676 155960 124418 -90335 -11149 122159
968 122159 133230 26732 48393 -60999 223179 -19662 -194873 -45226 105562 119985
958 119985 135169 139986 -48966 -196613 84438 -20773 -18329 506 138984 221804 42585
947 42585 106051 41003 40819 -2731 -35251 -130249 -47745 -35001 -118124 -52256 30910 47918
935 47918 -56753 12364 101143 -149743 -158261 -110768 -89103 25024 10236 141058 148548 99147
923 99147 -1388 -42910 -33678 -215855 -9163 -240990 -56540 255761 313035 250021 267961
912 267961 391517 282204 155502 -47760 -158424 -114204 -27051 -34564 -150946 -69403 -63374
901 -63374 -162054 -68205 -10117 -101726 -277225 133266 303481 -8796 162661 241778 190794
890 190794 149648 145327 -32558 29304 -89564 -189486 -168488 -235231 -115466 -129639 24739
879 24739 -116807 -92259 35319 -52624 87644 15644 -26739 -3122 24790 122587 122813 134066
867 134066 74675 27645 53238 48088 106136 -35454 -41951 -8332 -45102 -41315 -42554 -69226
855 -69226 -184166 61548 243207 20095 151114 -74901 -49894 -81013 71207 153018 -140173
844 -140173 -78657 33735 -147525 -152782 -203455 151843 81473 -209115 -197213 -154529 210094
833 210094 95387 218519 195306 -79892 -185577 -167991 -47032 -196049 -352047 -245984
823 -245984 130090 238762 232785 189665 340803 117763 -72764 -156624 -156102 -140677 141287
812 141287 297819 100435 -2842 -265264 -203619 -22974 99515 -400704 -161673 -122275
802 -122275 -23675 -279995 -417424 -257064 -91838 126997 232401 18173 -106904 176003
792 176003 -53773 -156575 144431 144666 123485 35594 34009 20748 26062 -17868 38401 175575
780 175575 196132 142720 30432 -44470 61003 -157405 -44843 116686 310314 -17587
770 -17587 -210900 51171 -26729 1928 -107525 44464 46879 149117 219350 232330 191713
759 191713 124502 91725 2291 -79608 -60832 -215549 53379 140967 2418 -64582 -39475
748 -39475 -49266 160407 448987 547409 392294 286494 179281 82397 121564 5301 -28342
737 -28342 137617 262833 183142 141532 103266 93436 -11741 -63924 -169566 -21720 -41528
726 -41528 31924 92093 107803 75609 -179840 -127562 121893 49092 139827 194065 197288 432216
714 432216 373358 133524 -214984 -487408 -508036 -160054 -435930 -304790 34506 204924
704 204924 105580 2860 30765 82890 221524 -43171 -13732 -70700 -136813 -338344 -113432
693 -113432 13163 80724 47692 -122025 -209795 -76833 210754 159973 80869 -245486 -286921
682 -286921 -272008 -20818 90433 -136719 -241380 -263700 -120418 30953 7448 -112360
672 -112360 -132935 -20930 -160483 -101436 -60392 -193930 -209774 -157086 -35899 -23632 50698
661 50698 70514 130083 137611 -66947 -135027 118368 258478 39897 -83965 -5071 -94553
650 -94553 -68501 -241118 -126439 27235 -119489 -47802 144032 92780 -146622 -70140 263843
639 263843 -113234 -319854 -242174 -143362 -129152 -271533 -105008 240408 195840 133858 10527
628 10527 -171576 -195809 -205501 -21551 -145707 101877 133436 123986 26474 -69672 -15565 -73331
616 -73331 -45101 12305 -130425 -324020 -403937 -184075 -270709 19722 24580 -35723 95473
605 95473 88257 22863 -222143 3554 32118 70160 51736 177747 341298 159832 215149
594 215149 159998 134448 89316 112560 224346 160518 62018 26941 -148494 -121269 59012
583 59012 240892 52152 282597 223918 81022 -44303 -95398 -8085 36040 -45511 -74137
572 -74137 246592 324069 212064 142929 185989 98423 62553 89429 249202 181153 20754
561 20754 239979 81729 -92304 228630 50233 -109355 118739 307802 149071 136668
551 136668 150791 15381 -170126 -106525 -18795 28795 99515 253182 -553 -327448 -218734
540 -218734 61920 -43937 -87568 -80397 147102 158524 -262703 -327197 -143265 -53859 -9353
529 -9353 -284100 -165357 -186767 -85569 210788 297643 96628 162426 -137593 -114185 132951
518 132951 -45503 -28321 -67379 -34120 -106535 -329437 2810 12044 43004 130487 183143
507 183143 208389 36192 -5108 -39257 104007 181615 314180 19534 -61346 75008 143982
496 143982 78580 -39387 -55014 -32948 72407 67572 -179956 -197686 -131058 -76921 28926
485 28926 143018 -35285 -77562 -84659 272285 572005 456615 -32484 -50537 29076 172752
474 172752 -35683 -185778 -88868 96372 82055 -56095 29573 -111431 -190169 -192837 -45938
463 -45938 -48578 -123246 -75045 131183 -44109 -79584 13764 -218387 -32118 199274 -136367
452 -136367 -16837 -24457 -172930 -214845 -91447 -379196 -386746 -145332 181507 360076 444526
441 444526 105703 -126426 -248715 -129957 139112 26176 -93908 -172844 269865 353189
431 353189 379014 194225 117974 133891 91188 106917 214155 28554 -113156 -174818 -139826
420 -139826 -88095 157131 191194 251288 410184 410189 263570 396651 331029 187661 -38060
409 -38060 -245620 -229479 -145243 -172050 51099 29098 -91477 131434 150091 134484 155414
398 155414 224706 361476 212610 -5590 89597 -72477 -104262 -105384 -44882 223842 289338
387 289338 292254 86339 -133217 -167472 -6205 10558 -49465 226320 219609 134765 211036
376 211036 293381 324790 14163 -102441 53266 -198755 -291745 -141275 -92929 63380 189712
365 189712 -863 -214737 96763 4870 -56894 55777 133450 122506 -164853 61006 145009
354 145009 -105008 61281 138469 51941 51632 65747 155896 -34479 -107768 50289 202340
343 202340 -109241 140491 -111261 -415826 -436591 -83094 175130 68929 8582 -117438
333 -117438 32277 191239 83622 -104762 14735 177984 56872 -142904 -152242 140574
323 140574 229099 46253 225048 23912 70859 -99223 -185528 66020 -161556 -256578 9346
312 9346 41508 71531 13355 -309861 -64506 -27040 -202408 -71356 234863 406514 365413
301 365413 -98625 -51193 71017 172116 258109 236664 172599 -102364 -163532 -218346 -18477
290 -18477 -16244 -210784 -189662 -64854 -14194 -50758 5498 276119 107427 -108955 -34826
279 -34826 -102200 -2836 76820 225663 -12533 -41331 -55534 185023 320203 300107 372228
268 372228 191305 301618 390095 58387 -39996 -102661 -123911 -118416 -43258 163227 102419
257 102419 117671 99874 162235 199000 210075 150506 393253 509303 354529 46381 44888
246 44888 18447 47023 144656 -37498 -74009 -161656 -204938 -75412 -89653 20464 245684
235 245684 226485 106767 155428 148660 37781 -134370 48484 -41333 -30451 167790 108074
224 108074 55965 213108 -240172 -371347 -374391 -205756 87620 253620 143225 -65062
214 -65062 -183872 -212489 -338785 -325827 28445 134939 146356 21397 -42100 -142089 -212855
203 -212855 -120288 -260266 -21400 108111 -55363 186381 58472 -94256 123727 199803
193 199803 122253 183195 94841 101523 209070 152028 92177 188528 -38836 -10318 -76080 63696
181 63696 236513 134309 -38308 180061 105947 -142363 43647 -17967 -171091 13675
171 13675 14961 -179412 -40321 -52200 -51643 -66950 19947 23788 21412 59462 59140 -94744 -298723
158 -298723 -71058 15400 309084 127185 208749 58325 -203431 -197041 -115004 -16868 34408
147 34408 215262 217364 192261 75415 -99030 76266 133630 -21714 270949 164147 78089
136 78089 154209 172997 127838 116465 30872 28497 20497 124765 112716 -41329 31234 91995
124 91995 -599 -137258 18738 41354 95276 178114 37599 91794 -58039 -154745 -88614
113 -88614 -12623 109699 188611 108368 130443 -65193 -13726 131154 117113 104529 185424
102 185424 121842 110370 91985 -174922 -167979 -127721 210689 336372 153457 65770 222774
91 222774 248169 11364 -92882 -188894 -52553 -149746 -77632 -108924 -218520 -50458 -74600
80 -74600 -58922 -64586 60141 104768 41675 -34228 -44030 123401 135323 111362 177754 27363
68 27363 10758 -71301 87742 201716 126299 45794 97947 336259 351288 260561 163675 -18283
56 -18283 -66151 99114 79387 -43772 105229 132205 -66059 -78943 4273 -208170 -175655
45 -175655 -40816 15928 33753 -140771 87553 773 -135052 -118282 20108 72077 1151
34 1151 82582 234509 30730 139998 147107 -6735 -52348 -135665 -112643 -57244 118875 -59691
22 -59691 46911 188333 294969 -84407 14545 110373 97828 134014 171880 91101 4570
11 4570 -37402 -81078 9279 136443 194896 -8250 -85122 -87098 -65890 133741 216363
0 216363
$$ Imaginary data points
##PAGE= N=2
##DATA TABLE= (X++(I..I)), XYDATA
16383 -3651275 -3566695 -3449014 -3336928 -3371606 -3471817 -3236099 -3086137 -3039951 -3036913 -3055083
16373 -3055083 -3026088 -3033962 -3054886 -2808236 -2744952 -2541604 -2535317 -2565403 -2479942 -2660742 -2454045
16362 -2454045 -2388761 -2331705 -2340465 -2255454 -2137458 -2037565 -1881666 -1891069 -2084656 -1959707 -1644851
16351 -1644851 -1625859 -1850508 -1823358 -1523850 -1581253 -1552386 -1430294 -1460264 -1425343 -1462826 -1664620
16340 -1664620 -1482550 -1261190 -1249902 -1079709 -1030377 -1131216 -1232606 -1074208 -888386 -917372
16330 -917372 -855264 -692251 -641924 -789864 -666047 -759563 -665105 -530494 -575004 -497126 -449581
16319 -449581 -305283 -433297 -268492 -356958 -440377 -260126 -373862 -285147 -184990 -113921
16309 -113921 -51104 -23513 -44473 37460 97031 114723 206740 241179 230355 391336 606303
16298 606303 566169 487164 466044 722273 880234 947889 653435 787612 970762 1007902
16288 1007902 1169713 1116128 1040809 1134048 1103040 1117791 1029246 1212547 1328877 1268448 1313627
16277 1313627 1290388 1393631 1506621 1484784 1406820 1263650 1153026 1280918 1230589 1601381
16267 1601381 1728892 1889927 1887515 1610795 1783260 1952217 1905374 1844622 1909999 2032281
16257 2032281 2015238 2057691 1956821 2058850 2226823 2334216 2485211 2382169 2422930 2485020
16247 2485020 2309705 2367983 2241598 2312657 2408786 2311060 2599120 2400090 2280750 2341680
16237 2341680 2340740 2456347 2463082 2493980 2615882 2637573 2614278 2675216 2749403 2806709 2945790
16226 2945790 2880286 2586167 2487204 2640171 2755666 2925183 2835054 2725578 2839998 3063736
16216 3063736 3003349 3153648 3390894 3254869 3091801 3027440 3004714 2936757 3151855 3184894
16206 3184894 3146679 3234576 3227679 3283576 3174068 3153252 3209115 3149909 3307930 3430276 3373392
16195 3373392 3530351 3544027 3555339 3555345 3606859 3462159 3420248 3610568 3633021 3792763 3656547
16184 3656547 3736379 3654647 3443016 3396559 3647816 3806336 3714356 3871451 3948975 3872132
16174 3872132 3754032 3688056 3566742 3503951 3710506 3748602 3645750 3807119 3754893 3770526
16164 3770526 3700486 3679728 3876702 4000487 4054599 3917711 3828071 3773852 3986086 4050837
16154 4050837 4084911 4030504 4054123 4215249 3956568 3963322 4008405 3984523 3938980 3776838 4017821
16143 4017821 4107192 4022130 3960698 4021398 4219459 4048349 3966844 3943557 3966643 4054510 3957021
16132 3957021 3859865 4141293 4012243 3967913 4105669 4173324 4296857 4104549 4119013 4131518
16122 4131518 4258148 4219039 4268529 4156199 4210103 4323340 4138846 4006694 4040092 4196012
16112 4196012 4310026 4252774 4210294 4225944 4446735 4393055 4289703 4438765 4425703 4279761
16102 4279761 4467006 4494213 4396981 4287135 4370254 4474320 4311672 4363341 4288667 4287210 4268244
16091 4268244 4287247 4209814 4189031 4182928 4290896 4292150 4095923 4107977 4221734 4172504 4211666
16080 4211666 4281055 4214218 4348727 4398576 4425796 4377035 4339063 4482291 4437402 4450991 4454128
16069 4454128 4261042 4252464 4288008 4436474 4409374 4311884 4181690 4257386 4459995 4434787 4205947
16058 4205947 4049209 4126396 4176242 4141159 4148101 4319636 4366066 4424011 4632101 4721233 4702554
16047 4702554 4399632 4382113 4326696 4486271 4611599 4690769 4553223 4253837 4147862 4256476
16037 4256476 4292528 4395629 4659727 4341692 4472033 4537913 4581717 4568087 4550082 4515876
16027 4515876 4589608 4517982 4520226 4250260 4280632 4337512 4290972 4352688 4460138 4457080 4396559
16016 4396559 4514123 4230503 4152043 4308880 4449590 4505031 4542642 4666462 4715494 4470234
16006 4470234 4728922 4795353 4309058 4253007 4198993 4557160 4748275 4463404 4338306 4493292
15996 4493292 4415012 4485582 4677618 4486952 4211327 4498036 4534715 4454168 4334482 4376440
15986 4376440 4361812 4245902 4636810 4377509 4448469 4501624 4550122 4765909 4650270 4695987
15976 4695987 4662890 4469552 4240374 4278634 4396555 4774572 4765222 4731458 4567876 4409891
15966 4409891 4326240 4157289 4187190 4402091 4556008 4494317 4166683 4586267 4533748 4535222
15956 4535222 4781443 4527251 4543696 4505389 4553044 4683752 4677940 4502285 4607748 4541435
15946 4541435 4380801 4461783 4435382 4509759 4363887 4450900 4665429 4482476 4701096 4324051
15936 4324051 4296361 4418236 4360909 4311966 4456086 4338013 4305675 4430504 4365490 4308320
15926 4308320 4446404 4552817 4419317 4351364 4441744 4453251 4498938 4569170 4456568 4342715
15916 4342715 4239004 4162561 4400336 4401959 4511064 4315286 4518616 4293298 4199326 4376650
15906 4376650 4445991 4330301 4286097 4196445 4163168 4430773 4614091 4488386 4552341 4387111
15896 4387111 4437049 4585091 4393073 4699917 4511215 4423783 4718559 4506308 4442142 4655697
15886 4655697 4586587 4500689 4427438 4272875 4308840 4584909 4495794 4425446 4394442 4503777 4541115
15875 4541115 4512559 4559712 4530389 4325886 4218569 4193506 4196573 4238300 4096818 4246337 4353946
15864 4353946 4411209 4217274 4172303 4309743 4114243 4317483 4403830 4457180 4417295 4545443
15854 4545443 4588849 4715971 4770887 4700281 4628715 4738093 4652631 4476721 4379295 4349061 4504338
15843 4504338 4792271 4721456 4595328 4524687 4430987 4305548 4321136 4438963 4235623 4596243
15833 4596243 4572988 4501642 4509841 4399196 4625577 4372774 4411954 4531445 4504680 4627155
15823 4627155 4643001 4449495 4373048 4669092 4722554 4664810 4500040 4351070 4394741 4441258
15813 4441258 4397459 4443882 4556070 4587603 4740161 4712639 4729475 4607189 4596849 4555564 4513066
15802 4513066 4592428 4864713 4538651 4476802 4578276 4606640 4555044 4440853 4497973 4492375 4659056
15791 4659056 4615680 4336718 4380568 4406436 4643354 4758052 4705121 4709561 4508213 4556045 4539005
15780 4539005 4256672 4138337 4315022 4405526 4396023 4339062 4362821 4465388 4333512 4238129
15770 4238129 4381424 4594385 4602598 4526165 4317015 4412303 4950910 4695198 4470461 4614450
15760 4614450 4479785 4428441 4279026 4420937 4633892 4666511 4590357 4860620 4822639 4494649
15750 4494649 4394583 4420537 4533633 4255260 4591216 4607685 4426426 4618388 4688544 4446610
15740 4446610 4442851 4298553 4312495 4376442 4485853 4635174 4698925 4823064 4548232 4561775
15730 4561775 4392903 4597237 4824129 4542890 4575125 4804054 4957884 4902606 4885795 4971520
15720 4971520 4797271 4420114 4252374 4242301 4439116 4493888 4491739 4580468 4826779 4687702
15710 4687702 4571076 4492234 4511289 4371452 4531956 4528670 4565918 4502470 4622744 4435504
15700 4435504 4407298 4559855 4274033 4504894 4748694 4485722 4605343 4421843 4404739 4733698
15690 4733698 4701481 4613107 4470298 4402124 4441471 4343516 4234822 4533382 4576755 4641262 4476838
15679 4476838 4383235 4402346 4477624 4369178 4521517 4491929 4400446 4560821 4545380 4656045
15669 4656045 4522535 4411734 4477989 4433012 4595969 4615104 4790876 5001119 4727416 4587120
15659 4587120 4529192 4673347 4771829 4936031 4626315 4443031 4483568 4673232 4760877 4483486
15649 4483486 4499982 4559490 4793236 4888550 4730547 4665722 4469765 4308341 4181348 4400172
15639 4400172 4546987 4870926 5086963 4791383 4696829 4697700 4479546 4355103 4853973 4907712
15629 4907712 4902326 4977081 4867867 4746409 4898284 4605914 4593236 4570745 4582532 4643795 4646701
15618 4646701 4706606 4530567 4424747 4650598 4826228 5037735 4626583 4514225 4650501 4559691
15608 4559691 4627889 4459626 4470356 4652773 4756396 4769783 4779493 4789376 4751697 4634349 4821969
15597 4821969 4785250 4596283 4595396 4816043 4861456 4891867 4947570 4900399 4851496 4873557 4788923
15586 4788923 4554250 4596875 4522657 4774228 4657431 4406611 4664705 4865817 4427866 4369722
15576 4369722 4501685 4429838 4664547 4699455 4658444 4862077 4779503 4409089 4282864 4480456
15566 4480456 4392786 4489867 4506461 4524927 4685311 4748090 4652279 4697871 4741817 4664576 4475780
15555 4475780 4467545 4795569 4682954 4665205 4847503 4620732 4519159 4568198 4553689 4711778
15545 4711778 4701087 4632292 4407360 4443578 4366995 4449198 4704616 4666778 4616924 4549903 4497546
15534 4497546 4424259 4486609 4654924 4730325 4923931 4742905 4603319 4583254 4599198 4683090
15524 4683090 4569392 4534067 4489014 4637038 4688900 4784803 4730264 4754705 4559182 4743593
15514 4743593 4917755 4932858 5125095 4908275 4801197 4539036 4434361 4483820 4750613 4666425
15504 4666425 4893522 4755625 4669286 4670105 4849993 5036829 5094643 4932829 4876944 4786343 4815127
15493 4815127 4795896 4637730 4475749 4653891 4552820 4540953 4337682 4418277 4660629 4654168
15483 4654168 4602845 4442572 4325697 4411483 4562478 4540458 4673030 4718126 4464065 4806053
15473 4806053 4893491 4628063 4543627 4370906 4530631 4851611 4867065 4635535 4416129 4409636
15463 4409636 4729227 4689079 4779540 4908417 4870154 4761061 4856448 5011207 4994890 4950603
15453 4950603 4979865 5019207 4651162 4450814 4528647 4294138 4560062 4385413 4560226 4477579
15443 4477579 4628757 4673013 4479005 4462606 4608590 4499500 4467596 4683800 4732783 4740368
15433 4740368 4597054 4291431 4443273 4695914 4680083 4916746 4934205 4578920 4533742 4782300
15423 4782300 5000779 4799824 4579171 4344471 4567911 4844106 4799722 5000615 4799313 4746679
15413 4746679 4646909 4661309 4662358 4869639 4876468 4780253 4906898 4856135 4816723 4738506 4713386
15402 4713386 4923154 4697439 4523504 4752947 4803047 4643008 4804778 4739548 4681795 4748286
15392 4748286 4715517 4983117 4632692 4483470 4485866 4623214 4884150 4797623 4812077 4646501
15382 4646501 4649587 4851371 4916037 4669858 4723973 4931244 4768243 4665390 4746736 4571874
15372 4571874 4576794 4898601 4643241 4801090 4871586 4924386 4808697 4621281 4484962 4616070
15362 4616070 4636918 4856278 4915716 4845282 4936965 4920589 4841610 4671311 4771026 5006878 4665557
15351 4665557 4336933 4440439 4652271 4784375 4596571 4595436 4684280 4516756 4721094 4698467
15341 4698467 4454371 4638383 4635941 4717365 4656770 4650180 4443058 4789290 5028640 4846087
15331 4846087 4564099 4726638 4828181 4692066 4727465 4667959 4660612 4668560 4589005 4587724 4739821
15320 4739821 4960046 4936002 4851426 4666839 4722101 4739584 4678054 4804850 4727132 4790235 4562279
15309 4562279 4604701 4641526 4532409 4712494 4624178 4780271 4759602 4760503 4781068 4796533 4656142
15298 4656142 4713124 4541835 4930158 4931960 4851988 5033431 4694150 4735985 4723067 4567168
15288 4567168 4624052 4730761 4651632 4774233 4738028 4767770 5016608 4871679 4559914 4611749
15278 4611749 4512862 4772375 5020722 4953979 4906779 4915775 4674708 4556617 4695388 4711922
15268 4711922 5017776 4832707 4536002 4566563 4708067 4804203 4741784 4911436 5037466 5140909
15258 5140909 5076439 4927171 4760259 4617266 4697502 4948285 4566731 4613476 4659841 4681286
15248 4681286 4856820 4624166 4840456 4721399 4483241 4609659 4888952 4871399 4942191 5025610
15238 5025610 4751084 4770883 4666112 4733762 4812437 4733998 4753778 4929609 4986944 5003871 4795254
15227 4795254 4599885 4721793 4776637 4780061 4725307 4700227 4648203 4846809 4792340 4811633 4824113
15216 4824113 4598458 4665979 4546174 4652185 4665184 4355713 4539804 4713132 4720748 4652372
15206 4652372 4675766 4928830 4861930 4820010 4916370 4866399 4988701 4796644 4582128 4614696
15196 4614696 4604138 4892582 4874692 5084490 5020157 4883499 4778071 4966076 4851598 4563471
15186 4563471 4854178 5016728 4902472 4770522 4816153 4722253 4750395 4779375 4579660 4366292
15176 4366292 4443437 4543141 4760698 4811085 4688641 4669505 4798927 4806976 4936478 4903807 4710006
15165 4710006 4714674 5079121 4917732 4668213 4924931 5044114 4954114 4797396 4843186 4605033
15155 4605033 4805591 5056730 5038919 5073317 5019505 4982761 4805866 4963566 5004931 5017313
15145 5017313 4876774 4929981 4897601 4872919 5024416 4933961 4832634 4772683 4571172 4817451
15135 4817451 4978224 4719087 4768139 5066833 4865964 4543169 4662968 4811137 4754641 4930888
15125 4930888 4797807 4879909 4878850 4685612 4679335 4727680 4730334 4750969 4866398 4859378 4685095
15114 4685095 4550299 4777741 4772900 4663609 4766776 4743883 4597971 4524830 4627149 4739041
15104 4739041 4766122 4973815 4956322 4766191 4834373 4893399 4801674 4851647 4716368 4826081
15094 4826081 4912267 4962323 4742709 4680175 4662367 4819747 4952240 4980549 4875253 4891055
15084 4891055 4937069 4891642 4638240 4883599 4861749 4893669 4900825 4935772 4889141 4958088 5023482
15073 5023482 5148883 5005661 4892101 4869143 4582163 4779959 4997033 4753120 4833697 4797113
15063 4797113 4767597 4896861 4889298 4660061 4772874 4823529 4814389 4985905 4858944 4974249
15053 4974249 5080185 5110797 4747461 4723045 4913926 4927085 4936089 4887054 5003135 5021558 4831597
15042 4831597 4965320 5065609 5113361 5004669 5106905 5362012 5305293 4889140 4723471 4875033
15032 4875033 4946754 4852241 4949071 4785457 4941066 4871008 4921795 4610796 4471345 4593363
15022 4593363 4775185 4706141 4687795 4583418 4553439 4641231 4618775 4478226 4651270 4681272
15012 4681272 4619768 4689104 4981511 4621047 4661282 4808500 4943620 5036874 4735674 4943899
15002 4943899 4794437 4676065 4537475 4682932 4795218 4774042 5168241 5122207 4971335 4941071
14992 4941071 4801668 4801970 4685624 4709394 4879390 4847525 4737973 4943232 4821017 4898883
14982 4898883 4631515 4824669 4814501 5010986 5174091 5075535 4937792 4892540 4932556 5001385
14972 5001385 5018110 4907112 4915697 4852292 4936797 4706258 4746746 4851323 4841778 4546616 4636863
14961 4636863 4768036 4657713 4572766 4855428 5125143 5078514 5028349 4931880 5060618 4867830
14951 4867830 5100502 5055436 4878747 4966241 5066742 5214696 5003974 5106828 5186704 4957536
14941 4957536 4852660 4982796 5251330 5196522 5149950 5023751 4942106 5153430 4993616 4740917
14931 4740917 4574275 4841650 5098173 5156494 5079055 5112401 5246740 5070540 5010558 5057351
14921 5057351 4859616 4769367 4956430 4918459 4762236 4754610 4831470 4726005 4839071 4775003
14911 4775003 4937876 4972573 4973071 4963696 4900689 5088325 4972770 5096890 4972396 4826409 4792321
14900 4792321 4744849 4890096 4921837 4786524 4919452 4938481 4925639 5011885 5049958 5335419
14890 5335419 5162497 5214857 5121353 5134279 5035832 5090296 5056049 5212278 5197581 4973493 4939802
14879 4939802 4904398 5108309 5076099 4885520 4922926 4734273 4945290 4931110 4884209 5144366
14869 5144366 5030125 4992366 5012732 5061335 5039173 5203542 5107127 4925845 4986331 5014978 5076291
14858 5076291 5157186 5175486 5139131 4992303 4887633 4627832 4759835 5109465 5191099 5362406
14848 5362406 5569574 5553242 5412919 5226949 5133687 5026106 5081831 5008308 5093158 5061677
14838 5061677 4994976 5027926 5070225 5112397 5199389 5212600 5026679 4784608 4939265 5030500 5058353
14827 5058353 5117480 5009899 4930581 5038660 5100641 5229294 5354014 5079168 5239746 5197006
14817 5197006 5034869 4904558 4728836 4736935 4791333 5038468 5074397 4984791 4805026 4922345
14807 4922345 4788012 5216118 5254199 5085291 5272072 5254876 5356949 5573586 5540973 5358818
14797 5358818 5083132 4934671 5020098 4807229 4874238 5078739 4967007 5104042 5299478 5047715
14787 5047715 5006874 4960275 4997680 4886824 4833355 5018451 4717377 4829867 5047737 4855125
14777 4855125 4855185 5085171 4916716 4790672 5068972 5105628 5001655 4997928 5220634 5150903 5137850
14766 5137850 5123238 5136412 5324984 5008384 4961553 5049008 5068749 4798207 4905303 4882600
14756 4882600 4794726 5089896 5119319 5211820 5291583 5011042 4823263 5207557 5235521 5303915
14746 5303915 5216079 5089181 5095002 5032358 5032301 5023844 5084188 5035522 5023803 5168388 4970810 5097629
14734 5097629 5094205 5026438 5021658 4994774 4820824 4804891 4746310 4596823 4659836 4975676 4987411
14723 4987411 4920707 4946920 4884551 4916038 4862280 5013416 4900417 4859904 4982820 4946160 5134669
14712 5134669 5016729 5094361 4956975 5000987 5006786 5138591 5176241 5061835 5069000 4967307 4871322
14701 4871322 4904117 5057675 5358295 5466670 5056872 4834534 4940820 5369182 5314678 5166835
$$ [...]
##END NTUPLES=NMR SPECTRUM
##END=
