##TITLE=1H_CA-9208-0
 CDCl3
 8 sc, 
 30.10.2023
##JCAMPDX= 6.0         $$ Bruker NMR JCAMP-DX V2.0
##DATA TYPE= NMR SPECTRUM
##DATA CLASS= NTUPLES
##ORIGIN= UXNMR, Bruker Analytische Messtechnik GmbH
##OWNER= root
$$ XWIN-NMR		Version 3.5
$$ Mon Oct 30 16:38:29 2023 Russian Standard Time (UT+4h)  she@DPX200
##.OBSERVE FREQUENCY= 200.13135
##.OBSERVE NUCLEUS= ^1H
##.ACQUISITION MODE= SIMULTANEOUS
##.ACQUISITION SCHEME= undefined
##.AVERAGES= 8
##.DIGITISER RES= 18
##SPECTROMETER/DATA SYSTEM= spect
##.PULSE SEQUENCE= zg30
##.SOLVENT NAME= D2O
##.SHIFT REFERENCE= (INTERNAL, D2O, 0, 15.7502)
##AUDIT TRAIL= $$ (NUMBER, WHEN, WHO, WHERE, WHAT)
$$ ##TITLE= Audit trail, XWIN-NMR		Version 3.5
$$ ##JCAMPDX= 5.01
$$ ##ORIGIN= Bruker BioSpin GmbH
$$ ##OWNER= she
$$ F:/spectra/data/she/nmr/H-F/1/pdata/1/auditp.txt
$$ ##AUDIT TRAIL=  $$ (NUMBER, WHEN, WHO, WHERE, WHAT)
(   1,<2023-10-30 16:37:28.14 +0400>,<she>,<DPX200>,
      <created by zg, POWCHK disabled, PULCHK disabled
       configuration hash MD5:
       00 E9 B6 7A A2 85 ED C7 34 08 36 98 17 FE 4E 26
       data hash MD5: 16K
       EE 3B 0E FC C2 AA 37 33 E1 B4 49 83 0D BD 4F 69>)
(   2,<2023-10-30 16:37:30.75 +0400>,<she>,<DPX200>,
      <Start of raw data processing
       efp BC_mod = 2 LB = 0.24 FT_mod = 6 PKNL = 1 PHC0 = -23867.35 PHC1 = 11.05271 SI = 16K 
       data hash MD5: 16K
       9F 62 8B 95 13 18 A9 47 09 3A C7 ED 13 01 EF 83>)
(   3,<2023-10-30 16:37:41.73 +0400>,<she>,<DPX200>,
      <pk PHC0 = 0.8049405 PHC1 = 0 
       data hash MD5: 16K
       FB 8F D9 80 31 E7 BC B8 A4 6C 38 B3 28 2C A2 89>)
(   4,<2023-10-30 16:37:44.93 +0400>,<she>,<DPX200>,
      <abs ABSG = 5 
       data hash MD5: 16K
       0A E6 86 C2 73 30 A1 EF D6 D6 6E C4 86 94 15 98>)
(   5,<2023-10-30 16:38:09.51 +0400>,<she>,<DPX200>,
      <abs ABSG = 5 
       data hash MD5: 16K
       74 00 1D 91 68 37 F5 F3 A6 00 57 84 BC C4 AB 2F>)
$$ ##END=
$$ 
$$ hash MD5
$$ 4D 1D 6C 79 82 29 76 FE B7 1F 08 FB 2A E2 13 8D
##$RELAX= 
##$RELAX= 
##$RELAX= 
##$RELAX= 
##$RELAX= 
##$RELAX= 
$$ Bruker specific parameters
$$ --------------------------
##$DU= <F:/spectra>
##$EXPNO= 1
##$NAME= <H-F>
##$PROCNO= 1
##$TYPE= <nmr>
##$USER= <she>
##$AMP= (0..31)
100 100 100 100 100 100 100 100 100 100 100 100 100 100 100 100 100 100 
100 100 100 100 100 100 100 100 100 100 100 100 100 100 
##$AQSEQ= 0
##$AQ_mod= 1
##$AUNM= <au_zg>
##$AUTOPOS= <>
##$BF1= 200.13
##$BF2= 200.13
##$BF3= 200.13
##$BF4= 200.13
##$BF5= 200.13
##$BF6= 200.13
##$BF7= 200.13
##$BF8= 200.13
##$BYTORDA= 1
##$CFDGTYP= 0
##$CFRGTYP= 5
##$CHEMSTR= <none>
##$CNST= (0..31)
1 1 145 1 1 1 1 1 1 1 1 1 1 1 1 1 1 1 1 1 1 1 1 1 1 1 1 1 1 1 1 1 
##$CPDPRG= <>
##$CPDPRG1= <>
##$CPDPRG2= <>
##$CPDPRG3= <>
##$CPDPRG4= <mlev>
##$CPDPRG5= <mlev>
##$CPDPRG6= <mlev>
##$CPDPRG7= <mlev>
##$CPDPRG8= <mlev>
##$CPDPRGB= <>
##$CPDPRGT= <>
##$D= (0..31)
0 1.2 0 0 0 0 0 0 0 0.06 0 0.03 0 0 0 0 0.0002 0 0 0 0 0 0 0 0 0 0 0 0 
0 0 0 
##$DATE= 1698669447
##$DBL= (0..7)
$$ [...]
##$SUBNAM3= <"">
##$SUBNAM4= <"">
##$SUBNAM5= <"">
##$SUBNAM6= <"">
##$SUBNAM7= <"">
##$SUBNAM8= <"">
##$SUBNAM9= <"">
##$SW= 18.05172834244
##$SWIBOX= (0..15)
0 0 2 0 0 0 0 0 0 0 0 0 0 0 0 0 
##$SW_h= 3612.71676300578
##$TD= 16384
##$TD0= 1
##$TE= 0
##$TE2= 300
##$TE3= 300
##$TEG= 300
##$TL= (0..7)
0 120 120 120 120 120 120 120 
##$TP= (0..7)
150 150 150 150 150 150 150 150 
##$TP07= 0
##$TPNAME0= <>
##$TPNAME1= <>
##$TPNAME2= <>
##$TPNAME3= <>
##$TPNAME4= <>
##$TPNAME5= <>
##$TPNAME6= <>
##$TPNAME7= <>
##$TPOAL= (0..7)
0.5 0.5 0.5 0.5 0.5 0.5 0.5 0.5 
##$TPOFFS= (0..7)
0 0 0 0 0 0 0 0 
##$TUNHIN= 0
##$TUNHOUT= 0
##$TUNXOUT= 0
##$USERA1= <user>
##$USERA2= <user>
##$USERA3= <user>
##$USERA4= <user>
##$USERA5= <user>
##$V9= 5
##$VALIST= <valist>
##$VCLIST= <CCCCCCCCCCCCCCC>
##$VD= 0
##$VDLIST= <DDDDDDDDDDDDDDD>
##$VPLIST= <PPPPPPPPPPPPPPP>
##$VTLIST= <TTTTTTTTTTTTTTT>
##$WBST= 1024
##$WBSW= 4
##$XGAIN= (0..3)
0 0 0 0 
##$XL= 0
##$YL= 0
##$YMAX_a= 268483
##$YMIN_a= -349383
##$ZGOPTNS= <>
##$ZL1= 120
##$ZL2= 120
##$ZL3= 120
##$ZL4= 120
##$ABSF1= 15.75019
##$ABSF2= -2.30166
##$ABSG= 5
##$ABSL= 3
##$ALPHA= 0
##$AQORDER= 0
##$ASSFAC= 0
##$ASSFACI= 0
##$ASSFACX= 0
##$ASSWID= 0
##$AUNMP= <proc_1d>
##$AZFE= 0.1
##$AZFW= 0.1
##$BCFW= 0
##$BC_mod= 2
##$BYTORDP= 0
##$COROFFS= 0
##$CY= -3
##$DATMOD= 1
##$DC= 0
##$DFILT= <>
##$DTYPP= 0
##$F1P= 0
##$F2P= 0
##$FCOR= 1
##$FTSIZE= 16384
##$FT_mod= 6
##$GAMMA= 0
##$GB= 0
##$INTBC= 1
##$INTSCL= 3.70164e-10
##$ISEN= 128
##$LB= 0.24
##$LEV0= 0
##$LPBIN= 0
##$MAXI= 10000
##$MC2= 0
##$MEAN= 0
##$ME_mod= 0
##$MI= 1.114404
##$NCOEF= 0
##$NC_proc= -8
##$NLEV= 6
##$NOISF1= 3.799351
##$NOISF2= 2.8
##$NSP= 0
##$NTH_PI= 0
##$NZP= 0
##$OFFSET= 15.75019
##$PC= 1
##$PHC0= -23866.54
##$PHC1= 11.05271
##$PH_mod= 1
##$PKNL= yes
##$PPARMOD= 0
##$PSCAL= 0
##$PSIGN= 0
##$REVERSE= no
##$SF= 200.130004271901
##$SI= 16384
##$SIGF1= 3
##$SIGF2= 2
##$SINO= 5.538805
##$SIOLD= 16384
##$SREGLST= <1H.CDCl3>
##$SSB= 0
##$STSI= 16384
##$STSR= 0
##$SW_p= 3612.71676300578
##$SYMM= 0
##$S_DEV= 0
##$TDeff= 16384
##$TDoff= 0
##$TI= <>
##$TILT= no
##$TM1= 0
##$TM2= 0
##$TOPLEV= 0
##$USERP1= <user>
##$USERP2= <user>
##$USERP3= <user>
##$USERP4= <user>
##$USERP5= <user>
##$WDW= 1
##$XDIM= 16384
##$YMAX_p= 283988083
##$YMIN_p= -1499296
$$ End of Bruker specific parameters
$$ ---------------------------------
##NTUPLES= NMR SPECTRUM
##VAR_NAME=  FREQUENCY,     SPECTRUM/REAL,   SPECTRUM/IMAG
##SYMBOL=    X,             R,               I
##VAR_TYPE=  INDEPENDENT,   DEPENDENT,       DEPENDENT
##VAR_FORM=  AFFN,          ASDF,            ASDF
##VAR_DIM=   16384,         16384,           16384
##UNITS=     HZ,            ARBITRARY UNITS, ARBITRARY UNITS
##FACTOR=    0.220516191357247, 1,           1
##FIRST=     3152.0855481926, 0,             0
##LAST=      -460.631214813181, 0,           0
##MIN=       -460.631214813181, -1499296,    0
##MAX=       3152.0855481926, 283988083,     0
$$ Real data points
##PAGE= N=1
##DATA TABLE= (X++(R..R)), XYDATA
$$ [...]
6241A4092258r4757l261p9097l64337m53910K96321J78843r34690l68567l21178
$$ 14092258 13997501 13994240 13915143 13550806 13096896 13393217 13572060 12637370 12268803 11947625
6231A1947625r3142L7693n9414l34002l02410J90638O08421k44088p26714K48859
$$ 11947625 11854483 11892176 11832762 11498760 11196350 11386988 11995409 11751321 11024607 11273466
6221A1273466J28180L3606n3639l69632J92570J81983n06237j53780R5939k6830
$$ 11273466 11401646 11435252 11381613 11011981 11204551 11386534 10880297 10726517 10822456 10795626
6211A0795626m66994N69981K68367m81851o04622k04081K29558k06699p4779j84236
$$ 10795626 10328632 10898613 11166980 10685129 10080507 9876426 10105984 9899285 9824506 9640270
6201I640270j94107P0441K69679K33553O92399m04820l86469j35421L56186K76745
$$ 9640270 9446163 9516604 9786283 10019836 10712235 10307415 9920946 9785525 10141711 10418456
6191A0418456J5073k46875m60601J38366k29723j30643l20584L6184K74268j69703
$$ 10418456 10433529 10186654 9726053 9864419 9634696 9504053 9183469 9219653 9493921 9324218
6181I324218Q27557O97404K26550l85330K2142L7406J87236O0839k87456L2023
$$ 9324218 10151775 10849179 11075729 10690399 10712541 10749947 10937183 10998022 10710566 10742589
6171A0742589l70031m84530K53120j22507j88886k7775j2176O69465J52549p74686
$$ 10742589 10372558 9888028 10141148 10018641 9829755 9801980 9789804 10459269 10611818 9837132
6161I837132J80096L65506k28377j82163k82172m7797k93998k9166m58106K03268
$$ 9837132 10017228 10382734 10154357 9972194 9690022 9642225 9348227 9319061 8860955 9064223
6151I064223L13163l22819j43599j59614k38771J46067Q14606l4904k48279J88442
$$ 9064223 9377386 9054567 8910968 8751354 8512583 8658650 9473256 9438352 9190073 9378515
6141I378515l76313l7155m04323j16710p29350P06712j44874l27847l79788j80867
$$ 9378515 9002202 8965047 8560724 8444014 7714664 8421376 8276502 7948655 7568867 7388000
6131G388000O2885L62804R058J97802o98775L36829J05752N17173j38091o03008
$$ 7388000 7450885 7813689 7822747 8020549 7321774 7658603 7764355 8281528 8143437 7540429
6121G540429j53772r3664K36832r1755R9490L795N39590p46720N58144J40134
$$ 7540429 7386657 7292993 7529825 7438070 7537560 7541355 8080945 7334225 7892369 8032503
6111H032503M4543j14125K10223o63295m68954N18674M72154m38740m82828j22125
$$ 8032503 8077046 7962921 8173144 7509849 7040895 7559569 8031723 7592983 7110155 6988030
6101F988030P97760p2746p7529M16815m70697k44667M08024q22055j01815j92447
$$ 6988030 7785790 7713044 7635515 8052330 7581633 7336966 7744990 6922935 6821120 6628673
6091F628673L47170M75905J058485o9022o17533j0228o47585K32200N46371L2542
$$ 6628673 6975843 7451748 8510233 8441211 7823678 7813450 7165865 7398065 7944436 7976978
6081G976978j81135M17990l35089K71350P10196o94697Q2894k61499o15943J02806
$$ 7976978 7795843 8213833 7878744 8150094 8860290 8165593 8248487 7986988 7371045 7473851
6071G473851O18636j37513p1150j97117J03323J96373j99259J1546M93921n54086
$$ 7473851 8092487 7954974 7883824 7686707 7790030 7986403 7787144 7798690 8292611 7738525
6061G738525l98148n38637K62206j69296n9940N00447J783Q70694l49876K58961
$$ 7738525 7340377 6801740 7063946 6894650 6834710 7335157 7336940 8207634 7857758 8116719
6051H116719N55389N4533k7850m19829k76707k60368l23837O75138L14690K03223
$$ 8116719 8672108 8726641 8698791 8278962 8002255 7741887 7418050 8093188 8407878 8611101
6041H611101l60706o7378K66885J39214K39457n43809k12707R54003k70472k78830
$$ 8611101 8250395 8183017 8449902 8589116 8828573 8284764 8072057 9026060 8755588 8476758
6031H476758l88658J69530J33740j37948J23672J44402k77865N6305L06099M45020
$$ 8476758 8088100 8257630 8391370 8253422 8377094 8521496 8243631 8299936 8606035 9051055
6021I051055m05458J24878m0087l53159j30360j84651J60178K87885Q1500k28981
$$ 9051055 8645597 8770475 8730388 8377229 8246869 8062218 8222396 8510281 8591781 8362800
6011H362800k96274L81718Q200p3127j84681J28291K98010k25929J09042M87743
$$ 8362800 8066526 8448244 8456444 8383317 8198636 8326927 8624937 8399008 8508050 8995793
6001H995793J62954l5399l12461k24395R4098K821l42041N27589J64522p09626
$$ 8995793 9158747 9123348 8810887 8586492 8680590 8683411 8341370 8868959 9033481 8323855
5991H323855N05206n82999q36977N43152J43424P31916L34773j13561r7744N69056
$$ 8323855 8829061 8246062 7409085 7952237 8095661 8827577 9162350 9048789 8951045 9520101
5981I520101K33359n63341j78633M36046J96025K15824j93052k4078K92665k72094
$$ 9520101 9753460 9190119 9011486 9447532 9643557 9859381 9666329 9642251 9934916 9662822
5971I662822m0244J59136L01478J81297K036j48625k07934J54040j52988l55017
$$ 9662822 9622578 9781714 10083192 10264489 10266525 10117900 9909966 10064006 9911018 9556001
5961I556001Q91673L07428o48549O8377P43086J26564l05362l50061L88277M00933
$$ 9556001 10447674 10755102 10106553 10174930 10918016 11044580 10739218 10389157 10777434 11178367
5951A1178367K14624K13920J16545r609j49725m75965J1432K65025p88392O2544
$$ 11178367 11392991 11606911 11723456 11713847 11564122 11088157 11099589 11364614 10576222 10638766
5941A0638766R09264j51825m52463j77326Q957j75626P16603Q5908L31819p14598
$$ 10638766 11548030 11396205 10943742 10766416 10775373 10599747 11316350 11402258 11734077 11019479
5931A1019479M7560k19728j75624O8979l06516j38122j4543j9651N03107j65103
$$ 11019479 11067039 10847311 10671687 10740666 10434150 10296028 10281485 10261834 10764941 10599838
5921A0599838L22967K28834m1265l60934j16355N3369K78475J75931O29561K7377
$$ 10599838 10922805 11151639 11110374 10749440 10633085 10686454 10964929 11140860 11770421 11797798
5911A1797798l46583J39248j44878R583K19321m39762Q59357J61698M7131O62632
$$ 11797798 11451215 11590463 11445585 11455168 11674489 11234727 12094084 12255782 12302913 12965545
5901A2965545j36501K0892L46744J92401m83994O69779L47432J11518p51146l42092
$$ 12965545 12829044 12849936 13196680 13389081 12905087 13574866 13922298 14033816 13282670 12940578
5891A2940578k18747m7437k94083L76021M8690K68788k87307p8231o0430l79766
$$ 12940578 12721831 12674394 12380311 12756332 12805022 13073810 12786503 12708272 12647842 12268076
5881A2268076j43554R3597L78110K46027M37907l29955M87635k53974m72550J88235
$$ 12268076 12124522 12218119 12596229 12842256 13280163 12950208 13437843 13183869 12711319 12899554
5871A2899554r4150Q33254k1190n97560J85425k90629j9371J73357o41035Q23994
$$ 12899554 12805404 13638658 13617468 13019908 13205333 12914704 12895333 13068690 12427655 13251649
5861A3251649k46783J51743L29654J08439l15169J36750M19714N3693j55715o9187
$$ 13251649 13004866 13156609 13486263 13594702 13279533 13416283 13835997 13889690 13733975 13664788
5851A3664788M44068j27796K4489N01849O46034j80726M68064J08953m71169R26731
$$ 13664788 14108856 13981060 14005549 14507398 15153432 14972706 15440770 15549723 15078554 16005285
5841A6005285k26758l14727j07566N82625k75383J71134l72808l74282J41160
$$ 16005285 15778527 15463800 15356234 15938859 15663476 15834610 15461802 15087520 15228680
5832A5228680M04531K75680m18843R26093J63687n08420m9047l12272J62057K68003
$$ 15228680 15633211 15908891 15490048 16416141 16579828 16071408 16022361 15710089 15872146 16140149
5822A6140149O41500K52675j47670n70885J77909r3663j18811O46671K48520K92894
$$ 16140149 16781649 17034324 16886654 16315769 16493678 16400015 16281204 16927875 17176395 17469289
5812A7469289j96203N15285l1654m92438L10870J09610j53734j56527p27872q9003
$$ 17469289 17273086 17788371 17756717 17264279 17575149 17684759 17531025 17374498 16646626 16557623
5802A6557623N10328Q19527N0580l83339N3762K48955M9039J066203l94531J17339
$$ 16557623 17067951 17887478 17938058 17554719 17608481 17857436 17906475 18972678 18578147 18695486
5792A8695486M4580K61180j83006L14793J14856L3421j575P93428r513j13526
$$ 18695486 18740066 19001246 18818240 19133033 19247889 19281310 19279735 20073163 20063650 19950124
5782A9950124o8400J65624O22062L80311k89281j40627Q4447L97259j06328o63491
$$ 19950124 19881724 20047348 20669410 21049721 20760440 20619813 20704260 21101519 20995191 20331700
5772B0331700L42603j18497J65069l78874J080168k22649j36549k76818n59023
$$ 20331700 20674303 20555806 20720875 20342001 21422169 21199520 21062971 20786153 20227130
5763B0227130m30401J50594l24513k21694L9259M69590p932J12390L85386m32538
$$ 20227130 19796729 19947323 19622810 19401116 19440375 19909965 19902033 20014423 20399809 19967271
5753A9967271K94171P07330K88569k863k82291J38363J25443m16634P10333O07915
$$ 19967271 20261442 20968772 21257341 21254478 20972187 21110550 21235993 20819359 21529692 22137607
5743B2137607K90008K54479L42733J34676j89876j010186j82187o26453l74683
$$ 22137607 22427615 22682094 23024827 23159503 22969627 21959441 21777254 21150801 20776118
5734B0776118P02404o314l05251k78861L99577j85015j98439M73991M85509K28749
$$ 20776118 21478522 21472208 21166957 20888096 21287673 21102658 20904219 21378210 21863719 22092468
5724B2092468Q7422N83228K41673M7670j2455O67000P39080M40705m38447L6194
$$ 22092468 22179890 22763118 23004791 23052461 23040006 23707006 24446086 24886791 24448344 24484538
5714B4484538K96098Q48811K80436n00177l64349J07425j36144p64722j86772
$$ 24484538 24780636 25629447 25909883 25409706 25045357 25152782 25016638 24251916 24065144
5705B4065144K50323J43349j27718K66814N62696R8750M45929m84388j02169k5780
$$ 24065144 24315467 24458816 24331098 24597912 25160608 25259358 25705287 25220899 25118730 25092950
5695B5092950J65394O05196M30249J02318j61906J06185m79293Q3006O45164o28228
$$ 25092950 25258344 25863540 26293789 26396107 26234201 26340386 25861093 25944099 26589263 25961035
5685B5961035q38244P44140j79976j69361j55739l07214K24639j06007k36783
$$ 25961035 25122791 25866931 25686955 25517594 25361855 25054641 25279280 25173273 24936490
5676B4936490o2949j93859M00509n52075j72729O20021j43157k81601L88532L39102
$$ 24936490 24873541 24679682 25080191 24528116 24355387 24975408 24832251 24550650 24939182 25278284
5666B5278284m8095o29906q40148m22470l8693o23588O90105M61888M47803p10461
$$ 25278284 25230189 24600283 23760135 23337665 23298972 22675384 23365489 23827377 24275180 23564719
5656B3564719l77173P8346q03216K07518K22534o01347m22039j82053k12597O05089
$$ 23564719 23187546 23265892 22462676 22670194 22892728 22291381 21869342 21687289 21474692 22079781
5646B2079781m76725p79394L80698N02936J4897o59196l94537q34367J02218M38782
$$ 22079781 21603056 20823662 21204360 21707296 21722193 21062997 20668460 19834093 19936311 20375093
5636B0375093l00914k54767N59796k00790l64695m4829M35924M56858N8165L7302
$$ 20375093 20074179 19819412 20379208 20178418 19813723 19768894 20204818 20661676 20719841 20757143
5626B0757143L91418K17064j82563j5235J31019K24789j01712L75004J6764P89957
$$ 20757143 21148561 21365625 21183062 21167827 21298846 21523635 21421923 21796927 21813691 22603648
5616B2603648R41063J238762P77222P68550P08911O95637J4411l19931j100502
$$ 22603648 23544711 24783473 25560695 26329245 27038156 27733793 27748204 27428273 26327771
5607B6327771j282730j273214j725493n84195n05720n14838m73294K34739l17064
$$ 26327771 25045041 23771827 22046334 21462139 20956419 20441581 19968287 20203026 19885962
5598A9885962q4484l09632L26436j07429p65592M12160L69643l5581l3683p134
$$ 19885962 19801478 19491846 19818282 19710853 18945261 19357421 19727064 19691483 19657800 19650666
5588A9650666L49955J184772O65455J49250J88349J723049N14293J190633J497098
$$ 19650666 20000621 21185393 21850848 22000098 22188447 23911496 24425789 25616422 27113520
5579B7113520R57627N91761k05546r24674k403050j923716j330928j068699m02408
$$ 27113520 28071147 28662908 28457362 27532688 25129638 23205922 21874994 20806295 20403887
5570B0403887k28291n31200m02094j69244k37260r6280k82784j67898M7081K99830
$$ 20403887 20175596 19644396 19242302 19073058 18835798 18739518 18456734 18288836 18335917 18635747
5560A8635747q8180p00596Q9366R46639J24717N02268K11058J88993P59962R43777
$$ 18635747 18547567 17846971 17936337 18882976 19007693 19509961 19721019 19910012 20669974 21613751
5550B1613751M53727J408271J401040N33233O2377N7251l854j087302j191808
$$ 21613751 22067478 23475749 24876789 25410022 25472399 25529650 25525796 24438494 23246686
5541B3246686j705125p6475j9689o08752L25579m2849j67901l09339K80676M31426
$$ 23246686 21541561 21465086 21445397 20836645 21162224 21119375 20951474 20642135 20922811 21354237
5531B1354237l2672J79505k370k70110j76120K98211k8825J89326j70568n8266
$$ 21354237 21321565 21501070 21498700 21228590 21052470 21350681 21321856 21511182 21340614 21282348
5521B1282348J446315Q09170O19405l85940J120055J068374q756R04753J607151
$$ 21282348 22728663 23537833 24157238 23771298 24891353 25959727 25950971 26855724 28462875
5512B8462875J34503L69569K21075K04079j31735o9935R2545o85497J80157m87160
$$ 28462875 28597378 28966947 29188022 29392101 29260366 29190431 29282976 28597479 28777636 28290476
5502B8290476L2994m66038o07266k49858m69072o45714p4630j076500r87562K4139
$$ 28290476 28323470 27857432 27250166 27000308 26531236 25885522 25810892 24734392 23746830 23770969
5492B3770969j28497n23628m15736M04922K41136n851M25990j98800j74010o49146
$$ 23770969 23642472 23118844 22703108 23108030 23349166 23343315 23769305 23570505 23396495 22747349
5482B2747349J70395O346K25154n0097J54371J26463M86886K91065P97901j80487
$$ 22747349 22917744 22924090 23149244 23099147 23253518 23379981 23866867 24157932 24955833 24775346
5472B4775346L60051O66520j36227M87246J75805N28091N20649O71856J014159
$$ 24775346 25135397 25801917 25665690 26152936 26328741 26856832 27377481 28049337 29063496
5463B9063496R70295O7225O46667R65399R63011P94990O80479J251272J031301
$$ 29063496 30033791 30101016 30747683 31713082 32676093 33471083 34151562 35402834 36434135
5454C6434135J703503Q16618P44229J041602M78767Q70968J285802O52555K65698
$$ 36434135 38137638 38954256 39698485 40740087 41218854 42089822 43375624 44028179 44293877
5445D4293877J91916r24623m86005p2221j414180p37189n61150o21094m72593
$$ 44293877 44485793 43561170 43075165 43002944 41588764 40851575 40290425 39669331 39196738
5436C9196738o76614j59174r36014n37773J35924K57272J07830o97530o34642
$$ 39196738 38520124 38360950 37424936 36887163 37023087 37280359 37388189 36690659 36056017
5427C6056017k295k9687M34089j06133k62599l01497L25229L9080L20764O26741
$$ 36056017 36053722 36024035 36458124 36351991 36089392 35787895 36113124 36152204 36472968 37099709
5417C7099709K38261O85965N01155P03182R70409P64628J130173Q02369J209298
$$ 37099709 37337970 38023935 38525090 39228272 40198681 40963309 42093482 42895851 44105149
5408D4105149R60906Q47115J885122J210808K163676J288693J326226K186314
$$ 44105149 45066055 45913170 47798292 49009100 51172776 52461469 53787695 55974009
5400E5974009Q74829J406971K392227J688119N23406J266787J775766J759816
$$ 55974009 56848838 58255809 60648036 62336155 62859561 64126348 65902114 67661930
5392F7661930J509686J374913J710714N72863N81525R07525P13026Q62818P57811
$$ 67661930 69171616 70546529 72257243 72830106 73411631 74319156 75032182 75895000 76652811
5383G6652811j16525j95395l4349p36263j259868j034170j170723j676896j089215
$$ 76652811 76536286 76340891 76306542 75570279 74310411 73276241 72105518 70428622 69339407
5374F9339407j305102j547358j742918j737796j981305r99501j339421q32584
$$ 69339407 68034305 66486947 64744029 63006233 61024928 60025427 58686006 57853422
5366E7853422j242875j346898n95665o02512j032472n82545m43753j36682l91565
$$ 57853422 56610547 55263649 54667984 54065472 53033000 52450455 52006702 51870020 51478455
5357E1478455j54831j333216q58561q02910q73327q86291r37389n06153o12754
$$ 51478455 51323624 49990408 49131847 48328937 47455610 46569319 45631930 45125777 44513023
5348D4513023L69314r9578o13217p38700j40893q00176o18601k69682j75448m16235
$$ 44513023 44882337 44782759 44169542 43430842 43289949 42489773 41871172 41601490 41426042 41009807
5338D1009807Q6612L96753K33515L95694L93676J036739K66302K08764J604946
$$ 41009807 41096419 41493172 41726687 42122381 42516057 43552796 43819098 44027862 45632808
5329D5632808J331807J278990R11138O25871N61269N00297k33028q42038n10961
$$ 45632808 46964615 48243605 49154743 49780614 50341883 50842180 50609152 49767114 49256153
5320D9256153m57350p68856o6741K27806L23978K72490P71001L94184K47279R42022
$$ 49256153 48798803 48029947 47963206 48191012 48514990 48787480 49558481 49952665 50199944 51141966
5310E1141966J153212Q15183P37836J694154Q87562J532539J549476J00624O49192
$$ 51141966 52295178 53110361 53848197 55542351 56429913 57962452 59511928 59612552 60261744
5301F0261744k4138M76614M28764q26433Q9476L84818l71678J50867o48546j836817
$$ 60261744 60237606 60714220 61142984 60316551 60406027 60790845 60419167 60570034 59921488 58084671
5291E8084671j020541j219569j367248k068249k421958j457334j063061j346784
$$ 58084671 57064130 55844561 54477313 52409064 49987106 48529772 47466711 46119927
5283D6119927r54461r32616n21600m23475q21795K91064j71577L28315Q23029
$$ 46119927 45165466 44232850 43711250 43287775 42465980 42757044 42585467 42913782 43736811
5274D3736811O54606j98984K13739L21111L25291m06278p40497l80761j052474
$$ 43736811 44391417 44192433 44406172 44727283 45052574 44646296 43905799 43525038 42472564
5265D2472564j255775p87491k33956m63852J08339q0712l29491m8303m55434r1935
$$ 42472564 41216789 40429298 40195342 39731490 39839829 39759117 39429626 39381323 38925889 38833954
5255C8833954O5102k069N78479N76013R03908q8980L49199J288696M47422J071174
$$ 38833954 38899056 38896987 39475466 40051479 40955387 40866407 41215606 42504302 42951724 44022898
5245D4022898R59056Q88973R79385J694296J332689O33194K68690J74891q3980
$$ 44022898 44981954 45870927 46850312 48544608 49877297 50510491 50779181 50954072 50870092
5236E0870092r09244j558333j868592k203556j480534j257985j670441j020357
$$ 50870092 49960848 48402515 46533923 44330367 42849833 41591848 39921407 38901050
5228C8901050j881164p33214m74239j014784j135457r60773J43019j71392j261750
$$ 38901050 37019886 36286672 35812433 34797649 33662192 32701419 32844438 32673046 31411296
5219C1411296k52527n93887k16877M70076L2922p57821m3369L33294M62919n1692
$$ 31411296 31158769 30564882 30348005 30818081 30851003 30093182 30049813 30383107 30846026 30794334
5209C0794334j68051J434918Q91950j60244n19884j43168l29939r29655l32173
$$ 30794334 30626283 32061201 32953151 32792907 32273023 32129855 31799916 30870261 30538088
5200C0538088k42359o39171j346066r37665N54023n66887k98716N72888M0815
$$ 30538088 30295729 29656558 28310492 27372827 27926850 27359963 27061247 27634135 27674950
5191B7674950k73498N7234j67812J50877k51345m48827j2892M33525R16038M14829
$$ 27674950 27401452 27458686 27290874 27441751 27190406 26741579 26728687 27162212 28078250 28493079
5181B8493079L3600N60209R20741O59905m96943q4531J052934K68332m57194j84820
$$ 28493079 28526679 29086888 30007629 30667534 30170591 30086060 31138994 31407326 30950132 30765312
5171C0765312M42320m26065j303534n85446q9793k94136p136j14945j067392q63312
$$ 30765312 31207632 30781567 29478033 28892587 28802794 28508658 28501522 28386577 27319185 26455873
5161B6455873O3086o18112J52707k16188m94052J90507l24828J87303K81216j72800
$$ 26455873 26518959 25900847 26053554 25837366 25343314 25533821 25208993 25396296 25677512 25504712
5151B5504712p16823j27761l47442m83626J87545M14458k3885J04368M3511M02918
$$ 25504712 24787889 24660128 24312686 23829060 24016605 24431063 24407178 24511546 24555057 24957975
5141B4957975j06778o96074m32156k30478p1067M53186J007275M1719m20249n56318
$$ 24957975 24851197 24155123 23722967 23492489 23421422 23874608 24881883 24923602 24503353 23947035
5131B3947035j32368L20959R76782n90863o85065o41467O96501N00336m04751
$$ 23947035 23814667 24135626 25112408 24521545 23836480 23195013 23891514 24391850 23987099
5122B3987099P38500j12682l9529J66533J083857P98786N36484P48268J164596
$$ 23987099 24725599 24612917 24573388 24739921 25823778 26622564 27159048 27907316 29071912
5113B9071912L01188Q74686J033908J249048Q57661l30164Q77861K38377K16585
$$ 29071912 29373100 30247786 31281694 32530742 33388403 33058239 33936100 34174477 34391062
5104C4391062L1174q98026j075468n13659n7801n11471j024890K3835j98693m88610
$$ 34391062 34422236 33524210 32448742 31935083 31877282 31365811 30340921 30364756 30166063 29677453
5094B9677453l44706L54136k04293k03063l74120l63916n82038P7986J31810k30234
$$ 29677453 29332747 29686883 29482590 29279527 28905407 28541491 27959453 28037439 28169249 27939015
5084B7939015l03388J57957M09702J79286M31568P17816M85754K06603N71766
$$ 27939015 27635627 27793584 28203286 28382572 28814140 29531956 30017710 30224313 30796079
5075C0796079N00594Q60462J208319J677921J161513J021096J892732K191887
$$ 30796079 31296673 32157135 33365454 35043375 36204888 37225984 39118716 41310603
5067D1310603K656624K573830K211567J786488K062226J793328P6512j224145
$$ 41310603 43967227 46541057 48752624 50539112 52601338 54394666 54471178 53247033
5059E3247033j406003j884601k367523k256946k319101j830009j618083j632321
$$ 53247033 51841030 49956429 47588906 45331960 43012859 41182850 39564767 37932446
5051C7932446j532906q92011q22692m99704r08660n55568K08698Q8970L18174
$$ 37932446 36399540 35507529 34684837 34185133 33276473 32720905 32929603 33018573 33336747
5042C3336747Q88634l88910Q11235J027676J558461J224452J121797J060361J188960
$$ 33336747 34225381 33836471 34647706 35675382 37233843 38458295 39580092 40640453 41829413
5033D1829413R25801O65811J045769Q50273m12227j777358j720926j236781j748935
$$ 41829413 42755214 43421025 44466794 45317067 44904840 43127482 41406556 40169775 38420840
5024C8420840q74720k56748j45002j00018j04073K30754J1440M82182m07590L71330
$$ 38420840 37546120 37289372 37144370 37044352 36940279 37171033 37182473 37664655 37257065 37628395
5014C7628395P52123J029646N34828P17977R20295Q55712R66156j007J687568
$$ 37628395 38380518 39410164 39944992 40662969 41583264 42438976 43405132 43404125 45091693
5005D5091693J088363L19194L03401k25354l42757j269866o03022n86965o25714
$$ 45091693 46180056 46499250 46802651 46577297 46234540 44964674 44361652 43774687 43148973
4996D3148973j275588k282410k005978k511872j886032n70045m83969o11684q93385
$$ 43148973 41873385 39590975 37584997 35073125 33187093 32617048 32133079 31521395 30628010
4987C0628010l07009j51391l36373M02981M70254k90804L80550J084040o1886
$$ 30628010 30321001 30169610 29833237 30236218 30706472 30415668 30796218 31880258 31818372
4978C1818372J142624J067363J102765J881014J391321J784954M74412l8220q48643
$$ 31818372 32960996 34028359 35131124 37012138 38403459 40188413 40662825 40624605 39775962
4969C9775962j870404j376738j228640j186342p63970k67727j652357j216109
$$ 39775962 37905558 36528820 35300180 34113838 33349868 33082141 31429784 30213675
4961C0213675p82079o98716k3804n79500p13301m17271k88442K76346L92906L0193
$$ 30213675 29431596 28732880 28709076 28129576 27416275 26999004 26710562 26986908 27379814 27410007
4951B7410007L79244M7736O461j04518N44245r8833N63927N47909J14350J046790
$$ 27410007 27789251 27836987 27843448 27738930 28283175 28184342 28748269 29296178 29410528 30457318
4941C0457318P73988J050146L72333j84946m50974m58956o88740j169365j15734
$$ 30457318 31231306 32281452 32653785 32468839 32017865 31558909 30870169 29700804 29585070
4932B9585070o89454n06027r2882o04306o95439r4210k29807J25253J78152K06664
$$ 29585070 28895616 28389589 28296707 27692401 26996962 26902752 26672945 26798198 26976350 27183014
4922B7183014M6863N3132m97395L75827P01330N18359J59038N25890O72576Q51486
$$ 27183014 27229877 27283009 26785614 27161441 27862771 28381130 28540168 29066058 29738634 30590120
4912C0590120P80697J098450O61921L32012L57093k34537J98846O70094J96421
$$ 30590120 31370817 32469267 33131188 33463200 33820293 33585756 33784602 34454696 34651117
4903C4651117m65640l60172J52858j10712m82535l79785m95933o31849j62971
$$ 34651117 34185477 33825305 33978163 33867451 33384916 33005131 32509198 31877349 31714378
4894C1714378q57604J27892L76252q75359K71270J039249J11549k79862Q40287
$$ 31714378 30856774 30984666 31360918 30485559 30756829 31796078 31907627 31627765 32468052
4885C2468052P48075K67825P46190J092823P88516J101737N07092J055597K67765
$$ 32468052 33216127 33483952 34230142 35322965 36111481 37213218 37720310 38775907 39043672
4876C9043672p2121j27974o91364l95302q93674j98356j10177J45207O0473r29934
$$ 39043672 38971551 38843577 38152213 37756911 36863237 36664881 36554704 36699911 36760384 35830450
4866C5830450k76758j40267m93656m2356n3806k64243Q545k49691l17800N2108
$$ 35830450 35553692 35413425 34919769 34877413 34823607 34559364 34567909 34318218 34000418 34052526
4856C4052526M28196K92663O67138N53360R34845M30760N53846O52956J150627
$$ 34052526 34480722 34773385 35440523 35993883 36928728 37359488 37913334 38566290 39716917
4847C9716917J224708O61474o2198o5214k33068k25538M07230N84982n55701o26466
$$ 39716917 40941625 41603099 41540901 41475687 41242619 41017081 41424311 42009293 41453592 40827126
4837D0827126k71652J073819O3296m58128j9033L21576p43267M74328K83771L44425
$$ 40827126 40555474 41629293 41692589 41234461 41215428 41537004 40793737 41268065 41551836 41896261
4827D1896261l66317P98311J477815Q26815P34925J44259R30955P97620J240455
$$ 41896261 41529944 42328255 43806070 44632885 45367810 45512069 46443024 47240644 48481099
4818D8481099L33694K66717R20180N41646N59458L60618j55979j62283M14871
$$ 48481099 48814793 49081510 50001690 50543336 51102794 51463412 51307433 51145150 51560021
4809E1560021P72930O91451J156863L84667J382761J304679J207040K17244O46619
$$ 51560021 52332951 53024402 54181265 54565932 55948693 57253372 58460412 58677656 59324275
4800E9324275l45637J98758L90662R50881O38787Q4213Q38712N95092M38633O24762
$$ 59324275 58978638 59177396 59568058 60518939 61157726 61241939 62080651 62675743 63114376 63739138
4790F3739138M88294J357758J497242J251353R06991M0227N27458j12932J52533
$$ 63739138 64227432 65585190 67082432 68333785 69240776 69281003 69808461 69695529 69848062
4781F9848062P73804l75977J83488Q90145P92430J165491J453529J284873R36185
$$ 69848062 70621866 70245889 70429377 71319522 72111952 73277443 74730972 76015845 76952030
4772G6952030J369629R93713O52319Q00990K82403O28181M70112J57418Q64153
$$ 76952030 78321659 79315372 79967691 80768681 81051084 81679265 82149377 82306795 83170948
4763H3170948P95052J027831K225491J969910J376192K844666L544488L620908
$$ 83170948 83966000 84993831 87219322 89189232 90565424 93410090 96954578 100575486
4755A00575486K883291K590225K918780L543346K491947K259302K426831K009478
$$ 100575486 103458777 106049002 108967782 112511128 115003075 117262377 119689208 121698686
4747A21698686J691196J346658J598604J949852J323151L68354P82573K3206J06080
$$ 121698686 123389882 124736540 126335144 128284996 129608147 129976501 130759074 130782280 130888360
4738A30888360K22797M6587j17621r73406j517220K8675K55630Q1419l60012J004187
$$ 130888360 131111157 131157744 131040123 130066717 128549497 128578172 128833802 128915221 128555209 129559396
4728A29559396J334816Q61513R39134M38899Q32035R79629J238416K49430o04644
$$ 129559396 130894212 131755725 132694859 133133758 133965793 134945422 136183838 136433268 135828624
4719A35828624j332018j110122k127836k793270j443789j683295k119913j622894
$$ 135828624 134496606 133386484 131258648 128465378 127021589 125338294 123218381 121595487
4711A21595487j769894n63769p85646j579237k85230k10313j034376n17200r6884
$$ 121595487 119825593 119261824 118476178 116896941 116611711 116401398 115367022 114849822 114752938
4702A14752938p36382q40955k22488l07720q58265n5877j903O4513K03763J063873
$$ 114752938 114016556 113175601 112953113 112645393 111787128 111731251 111729348 111793861 111997624 113061497
4692A13061497N66082L96481M9434M02270k09822K46042m27235j608395p80219
$$ 113061497 113627579 114024060 114073494 114475764 114265942 114511984 114084749 112476354 111696135
4683A11696135j355408k503495k308238j571045j369832j190487j377205j270474
$$ 111696135 110340727 107837232 105528994 103957949 102588117 101397630 100020425 98749951
4675I8749951r61353r96604j498217p03409j383076m32703j484809j283555j230007
$$ 98749951 97788598 96791994 95293777 94590368 93207292 92774589 91289780 90006225 88776218
4666H8776218j248314q32399m09092q59706p69469p61145q50431j61054p98851
$$ 88776218 87527904 86695505 86286413 85426707 84657238 83896093 83045662 82884608 82085757
4657H2085757n0075l29801p15238r81936p17441k10863r49454j792446l28377
$$ 82085757 82035682 81705881 80990643 80008707 79291266 79080403 78130949 76338503 76010126
4648G6010126k7996j041959q21455o97755n14747l76698L35265r03043q13467
$$ 76010126 75982130 74940171 74118716 73420961 72906214 72529516 72864781 71961738 71148271
4639G1148271j151407j025756j014713q44759l01333m15480o55489k24372k99197
$$ 71148271 69996864 68971108 67956395 67111636 66810303 66394823 65739334 65514962 65215765
4630F5215765j376069k66833o1387m60546L18730L66025j81344j0257N86830n86170
$$ 65215765 63839696 63572863 63511476 63050930 63369660 63735685 63554341 63544084 64130914 63544744
4620F3544744N693J86508L23566J044442P97181P96111K58889Q24923J181070
$$ 63544744 63550437 63736945 64060511 65104953 65902134 66698245 66957134 67782057 68963127
4611F8963127J110567Q24604O9797j341370j183230r32142j105263k007849j126530
$$ 68963127 70073694 70898298 70968095 69626725 68443495 67511353 66406090 64398241 63271711
4602F3271711j097559m89010j38003l54084n95345n00987o6361n5690m7826K24263
$$ 63271711 62174152 61685142 61547139 61193055 60597710 60096723 60030362 59974672 59926846 60151109
4592F0151109o975k09381K10532K07806j06241J011515R85724R8386R10626R76611
$$ 60151109 60144134 59934753 60145285 60353091 60246850 61258365 62244089 62342475 63253101 64229712
4582F4229712L54141K93500N64364J021332L00740q51481n74361j091985j950063
$$ 64229712 64583853 64877353 65441717 66463049 66763789 65912308 65337947 64245962 62295899
4573F2295899r98988j346912j752930j111778j237073q18536j439155o69082n08657
$$ 62295899 61296911 59949999 58197069 57085291 55848218 55029682 53590527 52921445 52412788
4564E2412788n2403N4232k58827m3284K24396M63523j25333J1452J37548J32427
$$ 52412788 52360385 52414617 52155790 52112506 52336902 52800425 52675092 52686544 52824092 52956519
4554E2956519l16382M24964P46152J51657K57493J88466R81614J24388N13021
$$ 52956519 52640137 53065101 53811253 53962910 54220403 54408869 55390483 55514871 56027892
4545E6027892J50557n34584j48877o61522j221767j351723j372916j250358m21329
$$ 56027892 56178449 55643865 55494988 54833466 53611699 52259976 50887060 49636702 49215373
4536D9215373j236483j010402p97381o88534p20998r52264p73583r43168k76442
$$ 49215373 47978890 46968488 46171107 45482573 44761575 43809311 43035728 42092560 41816118
4527D1816118O4135l59272m01108N83887j22814J12696n63258k09719N11425Q20998
$$ 41816118 41880253 41520981 41119873 41703760 41580946 41693642 41130384 40920665 41432090 42253088
4517D2253088P50066K56194L65773L12750P67941L1348L12564m86546p31309r28787
$$ 42253088 43003154 43259348 43625121 43937871 44705812 44737160 45049724 44563178 43831869 42903082
4507D2903082k64797q37929o85370j184734l92652l29851p18085k57415l31099
$$ 42903082 42638285 41800356 41114986 39930252 39537600 39207749 38489664 38232249 37901150
4498C7901150n74662j57021L22637O9918J54329j65012P89074q6512J97173j56241
$$ 37901150 37326488 37169467 37492104 37562022 37716351 37551339 38340413 38253901 38451074 38294833
4488C8294833J28693J50752N31827L56559K86825O4043N38358J212354j05716
$$ 38294833 38423526 38574278 39106105 39462664 39749489 39813532 40351890 41564244 41458528
4479D1458528Q80985M14448n19300k45478j1050N16182j85809p3698K77032m44533
$$ 41458528 42339513 42753961 42234661 41989183 41978133 42494315 42308506 42234808 42511840 42067307
4469D2067307M04155P0708m22815J170903R20741K54450P56335M02972R41892
$$ 42067307 42471462 42542170 42119355 43290258 44210999 44465449 45221784 45624756 46566648
4460D6566648J266095M11625J115535J094302R18275J547770J363422J857276
$$ 46566648 47832743 48244368 49359903 50454205 51372480 52920250 54283672 56140948
4452E6140948J533017J339250K200604K019796J908779K409754K478382L491943
$$ 56140948 57673965 59013215 61213819 63233615 65142394 67552148 70030530 73522473
4444G3522473K693745L288280L301167M019852N184344N580651O425547O612496
$$ 73522473 76216218 79504498 82805665 86825517 92009861 97590512 104016059 110628555
4436A10628555P462137P796212Q684659Q683908P780106O429086N329320M925350
$$ 110628555 118090692 125886904 134571563 143255471 151035577 157464663 162793983 167719333
4428A67719333M542508M597348N092055O609351P708746R723798R546891Q193890
$$ 167719333 172261841 176859189 181951244 188560595 196269341 205993139 215540030 223733920
4420B23733920N458048J9991n010653p844364q453977r279438q605678q106722
$$ 223733920 229191968 229211959 224201306 216356942 207902965 198623527 190017849 181911127
4412A81911127p249348o645165p808594p493418p604195p345026o939018o802807
$$ 181911127 174661779 168016614 160208020 152714602 145110407 137765381 130826363 124023556
4404A24023556n889004n694736m895989m274401m082023l680814l014640k746188
$$ 124023556 118134552 112439816 107543827 103269426 99187403 95506589 92491949 89745761
4396H9745761k433171j751864j974994k234010j743720j451636j709398j506220
$$ 89745761 87312590 85560726 83585732 81351722 79608002 78156366 76446968 74940748
4388G4940748j944348k800007k749393l276120k843747k041060k449383k518132
$$ 74940748 72996400 70196393 67447000 64170880 61327133 59286073 56836690 54318558
4380E4318558k336106j821198r07114j078712r46404j583363q04751j345079j154081
$$ 54318558 51982452 50161254 49254140 48175428 47229024 45645661 44840910 43495831 42341750
4371D2341750q60421j093541m34521n48303p2146l38662j531528l52489k35062
$$ 42341750 41481329 40387788 39953267 39404964 39332818 38994156 37462628 37110139 36875077
4362C6875077k43208q18000k34689J65157n44935j33410L90511p47754o41800
$$ 36875077 36631869 35813869 35579180 35744337 35199402 35065992 35456503 34708749 34066949
4353C4066949m503L94253M626q82503n80347l30225l34498n29254k53967J4052
$$ 34066949 34062446 34456699 34461325 33578822 32998475 32668250 32333752 31804498 31550531 31564583
4343C1564583r17303l14938l52279K85986l44727q34871M97986L58138M28762
$$ 31564583 30647280 30332342 29980063 30266049 29921322 29086451 29584437 29942575 30371337
4334C0371337l05689N71268J040957N96659J116974J332844P32892O74938R90431
$$ 30371337 30065648 30636916 31677873 32274532 33391506 34724350 35457242 36132180 37122611
4325C7122611L26592J39369M21523p05114j192214j503550j072141k242627j573951
$$ 37122611 37449203 37588572 38010095 37304981 36112767 34609217 33537076 31294449 29720498
4316B9720498j188419r38493n08960j191520j221216n92770l93915j070825o57712
$$ 29720498 28532079 27593586 27084626 25893106 24671890 24079120 23685205 22614380 21956668
4307B1956668m84718r43306l41622R2844k49698o19996J18465n11796l44229k96806
$$ 21956668 21471950 20528644 20187022 20279866 20030168 19410172 19528637 19016841 18672612 18375806
4297A8375806K35400p564m52444j70929Q9953j1778l64035q8612J54129l93914
$$ 18375806 18611206 18603642 18151198 17980269 18070222 18058444 17694409 17605797 17759926 17366012
4287A7366012k75291J70620J72279J70273L2991p27764l41117M24539m7403m42791
$$ 17366012 17090721 17261341 17433620 17603893 17636884 16909120 16568003 16992542 16945139 16502348
4277A6502348p22817J15488k75770K49297J64796p32350p87669o27748k20438
$$ 16502348 15779531 15895019 15619249 15868546 16033342 15300992 14513323 13885575 13665137
4268A3665137K55974J68938K12967L99795l6357J77684k7632O22683r41247k48525
$$ 13665137 13921111 14090049 14303016 14702811 14666454 14844138 14816506 15439189 14497942 14249417
4258A4249417k87571o6269J02788j38205l92973J78905K36065L31333K58622k30327
$$ 14249417 13961846 13895577 13998365 13860160 13467187 13646092 13882157 14213490 14472112 14241785
4248A4241785l17697K16786L5559n59302L26038l48042p53751M36459J90763M07548
$$ 14241785 13924088 14140874 14176433 13617131 13943169 13595127 12841376 13277835 13468598 13876146
4238A3876146Q4893k07583L64608l23395J50293o61244M15310j26412R1948K12255
$$ 13876146 13961039 13753456 14118064 13794669 13944962 13283718 13699028 13572616 13664564 13876819
4228A3876819K26769l28520k03904m78230l14304P01101k82398p50287L18907
$$ 13876819 14103588 13775068 13571164 13092934 12778630 13479731 13197333 12447046 12765953
4219A2765953J04059K44921J49845R3168l4390o02315M75275M00579p01629J73103
$$ 12765953 12870012 13114933 13264778 13357946 13323556 12721241 13196516 13597095 12895466 13068569
4209A3068569l61169k51392P99678l94686M4489J04071l85727M75262K69554N0553
$$ 13068569 12707400 12456008 13255686 12861000 12905489 13009560 12623833 13099095 13368649 13419202
4199A3419202r6372K6019R5924M90104L97080J66279l15180j24653k5462m17656
$$ 13419202 13322830 13348849 13444773 13934877 14331957 14498236 14183056 14058403 14032941 13615285
4189A3615285j76984M45105j91849L47424O13152L03291n16880M4447O4128r96190
$$ 13615285 13438301 13883406 13691557 14038981 14652133 14955424 14438544 14482991 14547119 13550929
4179A3550929K02565K34810J23372K68435l01163K42694P04488L6301M99829J94198
$$ 13550929 13753494 13988304 14111676 14380111 14078948 14321642 15026130 15062431 15562260 15756458
4169A5756458l10781l01829j29847K0263J33855M36004N37970j36265K58509P05434
$$ 15756458 15445677 15143848 15014001 15034264 15168119 15604123 16142093 16005828 16264337 16969771
4159A6969771L94251Q4053J39903J435743M24008Q9258J125067J396999J680876
$$ 16969771 17364022 17448075 17587978 19023721 19447729 19536987 20662054 22059053 23739929
4150B3739929R20911J495695J650271K385034K731930J673198l7426j748534j934165
$$ 23739929 24660840 26156535 27806806 30191840 32923770 34596968 34559542 32811008 30876843
4141C0876843k272500k219360q64210j120337j226193J22827N58172J033535j09405
$$ 30876843 28604343 26384983 25520773 24400436 23174243 23297070 23855242 24888777 24779372
4132B4779372K60241N43465L57971N32650K09010k89645r14078m75596p94259
$$ 24779372 25039613 25583078 25941049 26473699 26682709 26393064 25478986 25003390 24209131
4123B4209131k52364k94722k49702l9542k48276j70704l24552L84883N13836l72351
$$ 24209131 23956767 23662045 23412343 23372801 23124525 22953821 22629269 23014152 23527988 23155637
4113B3155637j38758R33727K6454k87741P41553N82743k43628J57412O41653K17015
$$ 23155637 23016879 23950606 23977060 23689319 24430872 25013615 24769987 24927399 25569052 25786067
4103B5786067P5158m09127k18395R53785J075106O54466j31489o485O70091P19612
$$ 25786067 25861225 25452098 25233703 26187488 27262594 27917060 27785571 27779086 28449177 29168789
4093B9168789N98332P8770Q48714P87325O59437J291892J073445O07998J545797
$$ 29168789 29767121 29845891 30694605 31481930 32141367 33433259 34506704 35114702 36660499
4084C6660499J124755J78604J457300J814970J450339J839792J100569J419181
$$ 36660499 37785254 37963858 39421158 41236128 42686467 44526259 45626828 47046009
4076D7046009J335776J899503J692850K344644K007087J495362J903688J708036
$$ 47046009 48381785 50281288 51974138 54318782 56325869 57821231 59724919 61432955
4068F1432955J383892L084177L071787J577048K601410J773292J372073K690238
$$ 61432955 62816847 65901024 68972811 70549859 73151269 74924561 76296634 78986872
4060G8986872J974368J763809K079358K172456J679991K090670K632720J688564
$$ 78986872 80961240 82725049 84804407 86976863 88656854 90747524 93380244 95068808
4052I5068808N45268K165299K573805J450159J747928J073024J969547J219239
$$ 95068808 95614076 97779375 100353180 101803339 103551267 104624291 106593838 107813077
4044A07813077P83268P50676J533245J113310P76145Q06287N9972O81603N28064
$$ 107813077 108596345 109347021 110880266 111993576 112769721 113576008 113635980 114317583 114845647
4035A14845647L90046m11355O77281Q5425l22155l7687M25353L85352m28468p16475
$$ 114845647 115235693 114824338 115501619 115587044 115264889 115227202 115652555 116037907 115609439 114892964
4025A14892964q14364k30882l79280j215320o47313l12275j059455q11560j095679
$$ 114892964 114078600 113847718 113468438 112253118 111605805 111293530 110234075 109422515 108326836
4016A08326836j93949P369r73549j119016j109849j170969k83124k55767j65390
$$ 108326836 108132887 108140256 107166707 106047691 104937842 103766873 103483749 103227982 103062592
4007A03062592j164659j318531r94338p88486n00843o05961l51510j209817o86980
$$ 103062592 101897933 100579402 99585064 98796578 98295735 97689774 97338264 96128447 95441467
3998I5441467r03076j20394o83533j332356n39364l25463p57031r36364n85933
$$ 95441467 94538391 94417997 93734464 92402108 91862744 91537281 90780250 89843886 89257953
3989H9257953k39860k50701r21694p66678j015006j083906n26194k93282j049195
$$ 89257953 89018093 88767392 87845698 87079020 86064014 84980108 84453914 84160632 83111437
3980H3111437L1143m74967K41994j26846p88162j550418n07513q01084j10067
$$ 83111437 83142580 82667613 82909607 82782761 81994599 80444181 79936668 79135584 79025517
3971G9025517j147752j106828p49449n13174l32056l47794p16873n68744j061820
$$ 79025517 77877765 76770937 76021488 75508314 75176258 74828464 74111591 73542847 72481027
3962G2481027k89586l9137j133021r02403j654j44984m58160m11448j57563J62406
$$ 72481027 72191441 72152304 71019283 70116880 70115226 69970242 69512082 69100634 68943071 69105477
3952F9105477k43953J60799k73347J62821k74640n90647M3413k69959K02683M50467
$$ 69105477 68861524 69022323 68748976 68911797 68637157 68046510 68089923 67819964 68022647 68473114
3942F8473114L90542Q22748j21618L99558M50587J144604N45262M88355k8827
$$ 68473114 68863656 69686404 69564786 69964344 70414931 71559535 72104797 72593152 72564325
3933G2564325n29871J147475M71970N19693j5730J30792N54593k60988K23589
$$ 72564325 72034454 73181929 73653899 74173592 74157862 74288654 74843247 74582259 74805848
3924G4805848P07716J72949R5382j58261p01979n87918r18144Q174q59143k01821
$$ 74805848 75513564 75686513 75781895 75623634 74921655 74333737 73415593 73423767 72564624 72362803
3914G2362803p51080k86600p03709j6863j81680l13589k27412o76469N3309m62026
$$ 72362803 71611723 71325123 70621414 70604551 70422871 70109282 69881870 69205401 69258710 68796684
3904F8796684j45435L10542k15862j49429M8931M1349J26227R00366M65227J474825
$$ 68796684 68651249 68961791 68745929 68596500 68645431 68686780 68813007 69713373 70178600 71653425
3894G1653425Q35608J14103J424514J913242K021669J835362J546496J444702
$$ 71653425 72489033 72603136 74027650 75940892 77962561 79797923 81344419 82789121
3886H2789121J286547J818556J683773J670154K003465J424277Q89007J820451
$$ 82789121 84075668 85894224 87577997 89248151 91251616 92675893 93564900 95385351
3878I5385351J376060J044946K113283J586746R33313Q55189M29823Q07365j9486
$$ 95385351 96761411 97806357 99919640 101506386 102439699 103294888 103724711 104532076 104512590
3869A04512590K12648j75574m54839q02911q42432m90592r45105o40791j108384
$$ 104512590 104725238 104549664 104094825 103291914 102449482 101958890 101013785 100372994 99264610
3860I9264610n24483j269161j968268j151473j484490j903341j756684j862701
$$ 99264610 98740127 97470966 95502698 94351225 92866735 90963394 89206710 87344009
3852H7344009j367495k473873j105531j700568j077694j081311j120182N14972
$$ 87344009 85976514 83502641 82397110 80696542 79618848 78537537 77417355 77932327
3844G7932327K26279O22273M22835M71954Q94887J339777J125155J420611J934427
$$ 77932327 78158606 78780879 79203714 79675668 80570555 81910332 83035487 84456098 86390525
3835H6390525M48202J015827J425290R20592J144688k32474J142742J342525L54268
$$ 86390525 86838727 87854554 89279844 90200436 91345124 91112650 92255392 93597917 93952185
3826I3952185M93594M29948O96531N83874Q35633O73552j98236l25538j724776
$$ 93952185 94445779 94875727 95572258 96156132 96991765 97665317 97467081 97141543 95416767
3817I5416767j495849j191762k344135j690213j803178k067650k354215j843174
$$ 95416767 93920918 92729156 90385021 88694808 86891630 84823980 82469765 80626591
3809H0626591j559623j587006k498228k229864j614897k091777k089771j651448
$$ 80626591 79066968 77479962 74981734 72751870 71136973 69045196 66955425 65303977
3801F5303977j966567j718469j720953k103474j485852j316436j149775j007949
$$ 65303977 63337410 61618941 59897988 57794514 56308662 54992226 53842451 52834502
3793E2834502j102541k15659L63178P6145p05615n21566L10228O50595R7165O22125
$$ 52834502 51731961 51516302 51879480 51955625 51250010 50728444 51038672 51689267 51786432 52408557
3783E2408557O97626N04176l18527O64881K79274j20191k30782N7467K02524N2149
$$ 52408557 53106183 53610359 53291832 53956713 54235987 54115796 53885014 53942481 54145005 54197154
3773E4197154M34518k4905J00436m24264j68563N10132m9169o77795q43289q30812
$$ 54197154 54631672 54606767 54707203 54282939 54114376 54624508 54575339 53897544 53054255 52223443
3763E2223443j048949p31597r00614o68534l72393j196139o98238m10437j450560
$$ 52223443 51174494 50442897 49542283 48873749 48501356 47305217 46606979 46196542 44745982
3754D4745982n43202k04550j095774r08288m85106r46768r62114q17471o51470
$$ 44745982 44202780 43998230 42902456 41994168 41509062 40562294 39600180 38782709 38131239
3745C8131239q16164p8829p95881m92030k84525k42443J64659j28536j87160j5187
$$ 38131239 37315075 37236246 36440365 35948335 35663810 35421367 35586026 35457490 35270330 35255143
3735C5255143j30756j085070L33605j7647Q42797L39522o75821J56327j42917
$$ 35255143 35124387 34039317 34372922 34355275 35198072 35537594 34861773 35018100 34875183
3726C4875183j84825M29584L81367J27222J25104Q02967P82727L08235P5624J86619
$$ 34875183 34690358 35119942 35501309 35628531 35753635 36556602 37339329 37647564 37723188 37909807
3716C7909807M17250P92554K63548Q84427J477574M22267l88273J534293Q09377
$$ 37909807 38327057 39119611 39383159 40267586 41745160 42167427 41779154 43313447 44122824
3707D4122824J052572J440109J445731J000959J381809J670466J911223K146188
$$ 44122824 45175396 46615505 48061236 49062195 50444004 52114470 54025693 56171881
3699E6171881K765483K355127L065450K877056L138075L861328L702889M483681
$$ 56171881 58937364 61292491 64357941 67234997 70373072 74234400 77937289 82420970
3691H2420970M187322M416020N628102M624697M444641M032213K954330L286602
$$ 82420970 86608292 91024312 96652414 101277111 105721752 109753965 112708295 115994897
3683A15994897K118939J316702Q68726Q49465P62010R11652P11260P07107K53127
$$ 115994897 118113836 119430538 120299264 121148729 121910739 122822391 123533651 124240758 124493885
3674A24493885M67423K57398j079893j600653r40692j614123l126042l081137
$$ 124493885 124961308 125218706 124138813 122538160 121597468 119983345 116857303 113776166
3666A13776166l171356l722535k346814k971086l528553k331958j683798j881738
$$ 113776166 110604810 106882275 104535461 101564375 98035822 95703864 94020066 92138328
3658I2138328j552844r41538j029728l39030m59603q71376R29293R89746N57809
$$ 92138328 90585484 89643946 88614218 88275188 87815585 86944209 87873502 88863248 89421057
3649H9421057R26410N84287R21409J073805J751180J689166Q65131J663866J857196
$$ 89421057 90347467 90931754 91853163 92926968 94678148 96367314 97232445 98896311 100753507
3640A00753507J023351J255956K017891J956366J362347K182122K262096J683382
$$ 100753507 101776858 103032814 105050705 107007071 108369418 110551540 112813636 114497018
3632A14497018K032762J600646K658759K646698J971707K664780K453821K809349
$$ 114497018 116529780 118130426 120789185 123435883 125407590 128072370 130526191 133335540
3624A33335540K897113K703937K132224J713833K458967K923222L087182L095899
$$ 133335540 136232653 138936590 141068814 142782647 145241614 148164836 151252018 154347917
3616A54347917K608608K755275L712757L003635L963381L369596L980889M928849
$$ 154347917 156956525 159711800 163424557 166428192 170391573 173761169 177742058 182670907
3608A82670907M374081N322892N112186N342937O186673N902756O333337N038586
$$ 182670907 187044988 192367880 197480066 202823003 209009676 214912432 221245769 226284355
3600B26284355N510969N472138M309921L829224L817939M131554L246870L769723
$$ 226284355 231795324 237267462 241577383 245406607 249224546 253356100 256602970 260372693
3592B60372693L630642M242354L952019L760420L198065K382362J401607J047921
$$ 260372693 264003335 268245689 272197708 275958128 279156193 281538555 282940162 283988083
3584B83988083q08947j586633k315031l216081k820541l612879k887868l257135
$$ 283988083 283179136 281592503 279277472 276061391 273240850 269627971 266740103 263482968
3576B63482968l027158l302709k609076k394250k763181l683807m711639n076664
$$ 263482968 260455810 257153101 254544025 252149775 249386594 245702787 240991148 235914484
3568B35914484m918823n396683n313032n770748n044946m374998m456698m503338
$$ 235914484 230995661 225598978 220285946 214515198 209470252 205095254 200638556 196135218
3560A96135218l467283l685041m007189k870956k793759l251725k627046k606649
$$ 196135218 192667935 188982894 184975705 182104749 179310990 176059265 173432219 170825570
3552A70825570k631683k636783k961370j652472j784100j342683j385055j537474
$$ 170825570 168193887 165557104 162595734 160943262 159159162 157816479 156431424 154893950
3544A54893950q11974j109125j128012j058610j088673j042348j152210r80773
$$ 154893950 154081976 152972851 151844839 150786229 149697556 148655208 147502998 146522225
3536A46522225j178261r52701p39835p41287j190276r28402o35804p30347p95219
$$ 146522225 145343964 144391263 143651428 142910141 141719865 140791463 140155659 139425312 138630093
3527A38630093j226137o09739n65153o83200q66185j497074q42173j250714j418750
$$ 138630093 137403956 136794217 136229064 135545864 134679679 133182605 132340432 131089718 129670968
3518A29670968k129433j204021j466070j277394k024561k193240l106967k658467
$$ 129670968 127541535 126337514 124871444 123594050 121569489 119376249 116269282 113610815
3510A13610815k324251j214760k344783j967161j458884k839969k426797j527462
$$ 113610815 111286564 110071804 107727021 105759860 104300976 101461007 99034210 97506748
3502I7506748j110553j880003j777134k004069k244073j101490j146126k353220
$$ 97506748 96396195 94516192 92739058 90734989 88490916 87389426 86243300 83890080
3494H3890080j749870j082780j531946j397851q16184j138221j064306r09459
$$ 83890080 82140210 81057430 79525484 78127633 77311449 76173228 75108922 74199463
3486G4199463j311023o42257j318722p83326M12531o01670l31192j084792J82256
$$ 74199463 72888440 72246183 70927461 70144135 70556666 69954996 69623804 68539012 68721268
3477F8721268p47338o85323j101820j716588o41757L86338r58015m68145J91267
$$ 68721268 67973930 67288607 66186787 64470199 63828442 64214780 63256765 62788620 62979887
3468F2979887n84509l39889O48243l82446p24218r43301l79606O6410k27257K8346
$$ 62979887 62395378 62055489 62703732 62321286 61597068 60653767 60274161 60340571 60113314 60141660
3458F0141660p45693j11059n86047m86000K01191k89236q54368N39658Q8434L50711
$$ 60141660 59395967 59284908 58698861 58212861 58414052 58124816 57270448 57810106 57898540 58249251
3448E8249251J01251Q21954N91849L60536L43510Q07805K80272P54141J069505
$$ 58249251 58350502 59172456 59764305 60124841 60468351 61276156 61556428 62310569 63380074
3439F3380074J022302J475683K41565k43639k84902o84961r99353j295728n69766
$$ 63380074 64402376 65878059 66119624 65875985 65591083 64906122 63906769 62611041 62041275
3430F2041275j177624j235592O6732j820312o49858l75965j477768q66646l638
$$ 62041275 60863651 59628059 59694791 57874479 57224621 56848656 55370888 54504242 54500604
3421E4500604r49599o94629j89552K52967o62497p48870n2933l11846O66322O54188
$$ 54500604 53551005 52856376 52666824 52919791 52257294 51508424 51455491 51143645 51809967 52464155
3411E2464155O46520J369304J063962J766302J050448J119609J615523R99735
$$ 52464155 53110675 54479979 55543941 57310243 58360691 59480300 61095823 62095558
3403F2095558K87379j393704k149193k150232l073808j386761j749256j617334
$$ 62095558 62382937 60989233 58840040 56689808 53616000 52229239 50479983 48862649
3395D8862649j696462j599443q72776j207767j033996p19962l84783m90203j69814
$$ 48862649 47166187 45566744 44693968 43486201 42452205 41732243 41347460 40857257 40687443
3386D0687443q26547Q84619l01478j006278K12920N74976m0694m54085k44561
$$ 40687443 39860896 40745515 40444037 39437759 39650679 40225655 40184961 39730876 39486315
3377C9486315K35192L17322l3361K34620J70091P59277J39769n18771j139605
$$ 39486315 39721507 40038829 40005468 40240088 40410179 41169456 41309225 40790454 39650849
3368C9650849r08582p20051j515993q63468q43043p97728j59422l52605p09366
$$ 39650849 38742267 38022216 36506223 35642755 34799712 34001984 33842562 33489957 32780591
3359C2780591l82136m02360N25530J8296l46255q5072R38769L62578K14907R87669
$$ 32780591 32398455 31996095 32521625 32539921 32193666 32108594 33047363 33409941 33624848 34612517
3349C4612517L91378K36503k10110k4014K93738M27922J00613N52732J89597P65294
$$ 34612517 35003895 35240398 35030288 35006274 35300012 35727934 35828547 36381279 36570876 37336170
3339C7336170L58688q0462L75291M59156n41352q94704K50453n02435k28308M49501
$$ 37336170 37694858 37614396 37989687 38448843 37907491 37012787 37263240 36760805 36532497 36981998
3329C6981998l38705k74395q18565o44451l49972j016682j69475M93392j234999
$$ 36981998 36643293 36368898 35550333 34905882 34555910 33539228 33369753 33863145 32628146
3320C2628146m68999k53430o63655l71635o63774k65086l96852J18673K22162
$$ 32628146 32159147 31905717 31242062 30870427 30206653 29941567 29544715 29663388 29885550
3311B9885550n47387q92006N47748k64785J84050K68953K94084K44832K01140
$$ 29885550 29338163 28446157 28993905 28729120 28913170 29182123 29476207 29721039 29922179
3302B9922179m92045m50237P05225R71549j47670m18915N02681O03187J44076
$$ 29922179 29430134 28979897 29685122 30656671 30509001 30090086 30592767 31195954 31340030
3293C1340030R62398J095379O21001J486214J767192J210846J997333K644638
$$ 31340030 32302428 33397807 34018808 35505022 37272214 38483060 40480393 43125031
3285D3125031J826427R96854p18846j739048k615999k222217q46716o96885l42784
$$ 43125031 44951458 45948312 45229466 43490418 40874419 38652202 37805486 37108601 36765817
3276C6765817l94788l68341m04729l65845J7319K19191O40138k24112L95747Q86479
$$ 36765817 36371029 36002688 35597959 35232114 35249433 35468624 36108762 35884650 36280397 37166876
3266C7166876P75119Q07778O53777J318707J331559J830214J586888K244546K353872
$$ 37166876 37941995 38749773 39403550 40722257 42053816 43884030 45470918 47715464 50069336
3257E0069336L354669L350468L705097M543921M827069J827644k048219l308613
$$ 50069336 53424005 56774473 60479570 65023491 69850560 71678204 69629985 66321372
3249F6321372l732208l490178k511788j076413p51908M02196j8232J505996J062331
$$ 66321372 62589164 59098986 56587198 55510785 54758877 55161073 55142841 56648837 57711168
3240E7711168J259860J392836J316784K226690J845301K323061K817206L148924
$$ 57711168 58971028 60363864 61680648 63907338 65752639 68075700 70892906 74041830
3232G4041830K656171K082983K706226K604799K147736K153884K382687J355473
$$ 74041830 76698001 78780984 81487210 84092009 86239745 88393629 90776316 92131789
3224I2131789J652668J707772K331432K626233K387635K28849j773807l579449
$$ 92131789 93784457 95492229 97823661 100449894 102837529 103066378 101292571 97713122
3216I7713122m682361m661416m974161l885035k694865k203948k215401j748572
$$ 97713122 93030761 88369345 83395184 79510149 76815284 74611336 72395935 70647363
3208G0647363j764844r15138n37531j170964m55875o94686k62957J45473j27089
$$ 70647363 68882519 67967381 67429850 66258886 65803011 65108325 64845368 64990841 64863752
3199F4863752J4657P73272J722931J757765K896429L758818L500777M632929N089301
$$ 64863752 64878409 65651681 67374612 69132377 72028806 75787624 79288401 83921330 89010631
3190H9010631N021943N179717O361678O193396M208351Q45089k147714m960918
$$ 89010631 94032574 99212291 105573969 111767365 115975716 116820805 114673091 109712173
3182A09712173o312565m783635l919347k592716k798118q90397N50459Q92063
$$ 109712173 103399608 98615973 94696626 92103910 89305792 88415395 88965854 89857917
3174H9857917J815208J404420m93206l057173m987705n023923l928401k832218
$$ 89857917 91673125 93077545 92584339 89527166 84539461 79515538 75587137 72754919
3166G2754919k280352j108693j016129K44737K06917L32772J755585J691803J726803
$$ 72754919 70474567 69365874 68349745 68594482 68801399 69134171 70889756 72581559 74308362
3157G4308362K389371K952689K778160K422941J529088M43088K93809q27224j134578
$$ 74308362 76697733 79650422 82428582 84851523 86380611 86823699 87117508 86290284 85155706
3148H5155706j61595M65873J129949K203560K543442M948780N893574N831168
$$ 85155706 84994111 85459984 86589933 88793493 91336935 96285715 102179289 108010457
3140A08010457M259067k128725p501767r544408q738625p193311o222314m169090
$$ 108010457 112269524 110140799 102639032 93094624 84355999 77162688 70940374 66771284
3132F6771284k572952k262566j326257n74533k30743q91049o25712q77254m73317
$$ 66771284 64198332 61935766 60609509 60034976 59804233 58913184 58287472 57410218 56936901
3123E6936901k02465O64094R89388R65868P02024P37230k30224K22865L16853
$$ 56936901 56734436 57398530 58387918 59353786 60055810 60793040 60562816 60785681 61102534
3114F1102534O05293J025122J246146K746142K487853L204687L536916J767502
$$ 61102534 61707827 62732949 63979095 66725237 69213090 72417777 75954693 77722195
3106G7722195j721729k627725m250525l104182k040247j868112j947711j929834
$$ 77722195 76000466 73372741 69122216 66018034 63977787 62109675 60161964 58232130
3098E8232130j206382n50309m76050r25926r05188j009501p41550j093163l69605
$$ 58232130 57025748 56475439 55999389 55073463 54168275 53158774 52417224 51324061 50954456
3089E0954456j052241l52101j36540m2949o52971p02937n98666p96204o72725
$$ 50954456 49902215 49550114 49413574 49370625 48717654 48014717 47416051 46619847 45947122
3080D5947122n25045l6799N64613O35597P29941J087416J148891J702429J632473
$$ 45947122 45422077 45385278 45949891 46585488 47315429 48402845 49551736 51254165 52886638
3071E2886638J432562J284956l33905o66030j923911k114804j385285q78693q20327
$$ 52886638 54319200 55604156 55270251 54604221 52680310 50565506 49180221 48301528 47481201
3062D7481201j034534o95101j143031q13210n02524L06339K84588L37491p36554
$$ 47481201 46446667 45751566 44608535 43795325 43292801 43599140 43883728 44221219 43484665
3053D3484665M41002m6033j6901j71609o4663N013K58861O57219Q75042J681041
$$ 43484665 43925667 43879634 43862733 43691124 43626461 43631474 43890335 44547554 45422596 47103637
3043D7103637P81603J167738K079851J776182J096204J325717J009249J421344
$$ 47103637 47885240 49052978 51132829 52909011 54005215 55330932 56340181 57761525
3035E7761525J349233J224623J744123K483080L514943L769957L924401M608718
$$ 57761525 59110758 60335381 62079504 64562584 68077527 71847484 75771885 80380603
3027H0380603N169314N844652M389900M059620K261578j024855j748677l774556
$$ 80380603 85549917 91394569 95784469 99844089 102105667 101080812 99332135 95557579
3019I5557579m630564m719372m055655l973236k882863k179263j622813q04340
$$ 95557579 90927015 86207643 82151988 78178752 75295889 73116626 71493813 70689473
3011G0689473n30567K9815K87342L99383J082493R27100J451521K625446L061267
$$ 70689473 70158906 70188721 70476063 70875446 71957939 72885039 74336560 76962006 80023273
3002H0023273L950747M580412N357948O631487P668552Q572157J0168178J0611565
$$ 80023273 83974020 88554432 93912380 100543867 108212419 116784576 126952754 137564319
2994A37564319J0891892J1642116J0336407O990396J370034l728452p777109j1288762
$$ 137564319 148456211 160098327 170434734 177425130 178795164 175066712 167289603 156000841
2986A56000841j1319370j0251649r186211q274741o196971n440790n194963m593580
$$ 156000841 144681471 134429822 125243611 116968870 110771899 105331109 100136146 95542566
2978I5542566l147827l011025k475079j714027k002769j982329k5454l11214N3267
$$ 95542566 92394739 89383714 86908635 85194608 83191839 81209510 81184056 80872842 80926109
2969H0926109O77622J363837K016920K849806L853454M025686M626031M721154
$$ 80926109 81603731 82967568 84984488 87834294 91687748 95713434 100339465 105060619
2961A05060619N346651M947662L382723K886681J077366j311748k391078l439444
$$ 105060619 110407270 115354932 118737655 121624336 122701702 121389954 118998876 115559432
2953A15559432l771984k758388k729031k582201k091347k454982l031636m145311
$$ 115559432 111787448 109029060 106300029 103717828 101626481 99171499 96139863 91994552
2945I1994552l834858m071622l390556k997105k343206l040570l904791l074489
$$ 91994552 88159694 84088072 80697516 77700411 75357205 72316635 68411844 65337355
2937F5337355k918152k600482k059717j085265n30609j41515L1169j75236Q55907
$$ 65337355 62419203 59818721 57759004 56673739 56143130 56001615 56032784 55857548 56713455
2928E6713455L69558M63671K7013o54307j202430j035979m99941n85976K10239
$$ 56713455 57083013 57546684 57573697 56919390 55716960 54680981 54181040 53595064 53805303
2919E3805303L95564R16337O61209J25821N61506Q55560m0662q37587j627794
$$ 53805303 54200867 55117204 55778413 55904234 56465740 57321300 57280638 56443051 54815257
2910E4815257k026542n19195j594962j866049j880767j792088o39752j254731
$$ 54815257 52788715 52269520 50674558 48808509 46927742 45135654 44495902 43241171
2902D3241171j503703j058343j070763j077057l21423m89072p22710r44284m20326
$$ 43241171 41737468 40679125 39608362 38531305 38209882 37720810 36998100 36053816 35633490
2893C5633490n52142o64765r31175j241665l02887j018568p76088j021970j235513
$$ 35633490 35081348 34416583 33485408 32243743 31940856 30922288 30146200 29124230 27888717
2884B7888717p11985p93526n95183j039469n22103l96652q78009j109787n51896
$$ 27888717 27176732 26383206 25788023 24748554 24226451 23829799 22951790 21842003 21290107
2875B1290107L80346J87132J35680l31790q34324L94540M46568l57017j9944M69690
$$ 21290107 21670453 21857585 21993265 21661475 20827151 21221691 21668259 21311242 21291298 21760988
2865B1760988k87596k51955M39594j02556k96389m44300l16260n97636m99829
$$ 21760988 21473392 21221437 21661031 21558475 21262086 20817786 20501526 19903890 19404061
2856A9404061J32238l16677o64477l60593k97597l16205j21816m85613J62313
$$ 19404061 19536299 19219622 18555145 18194552 17896955 17580750 17458934 16973321 17135634
2847A7135634n75606o13678L87042n50845l55003m09264m05191N8809J32962o32534
$$ 17135634 16560028 15946350 16333392 15782547 15427544 15018280 14613089 14671898 14804860 14172326
2837A4172326J17033q6905k73470l46150j12490J15807l97336q81107K37006K970
$$ 14172326 14289359 14202454 13928984 13582834 13470344 13586151 13188815 12307708 12544714 12547684
2827A2547684l04361k77676m61870J42504Q95821k98446n48370m41587l86156
$$ 12547684 12243323 11965647 11503777 11646281 12542102 12243656 11695286 11253699 10867543
2818A0867543J20798m47418K7209m35221L68119M13888l61201j19683q53836p6932
$$ 10867543 10988341 10540923 10568132 10132911 10501030 10914918 10553717 10434034 9580198 9503266
2808I503266l07294j85500m49541k67983M33534j39934j89600R518k7912m07448
$$ 9503266 9195972 9010472 8560931 8292948 8726482 8586548 8396948 8406466 8378554 7971106
2798G971106l95358p41354N50845Q19266o29302n84356O0203j52462K43219l90835
$$ 7971106 7575748 6834394 7385239 8204505 7575203 6990847 7051050 6898588 7141807 6750972
2788F750972P37768O41351j8605n03860K37194K51656l4087L17294j2283K64859
$$ 6750972 7488740 8130091 8111486 7607626 7844820 8096476 8062389 8379683 8367400 8632259
2778H632259M1021o38856o05081o73238L84338l27492k45691o91689N442o1344
$$ 8632259 8673280 8034424 7429343 6756105 7140443 6812951 6567260 5875571 5881013 5819669
2768E819669J28435n5998L08717l71034n18578k03923n72304K68145l56590J8035
$$ 5819669 5948104 5892106 6200823 5829789 5311211 5107288 4534984 4803129 4446539 4464574
2758D464574M61387J22757J0081k04018n6663O15806J83388o53927L8401J29697
$$ 4464574 4925961 5048718 5058799 4854781 4798118 5413924 5597312 4943385 4981786 5111483
2748E111483P21465J4402l08655r2413j13825k90773j62579J96088k92117k47817
$$ 5111483 5832948 5847350 5538695 5446282 5332457 5041684 4879105 5075193 4783076 4535259
2738D535259m65328L34943P0620m51899K6374j26968n25012O88641j31400l12032
$$ 4535259 4069931 4404874 4475494 4023595 4049969 3923001 3397989 4086630 3955230 3643198
2728C643198J97079L21683M4367N6590j27475l77459n98463K43893k2224J56648
$$ 3643198 3840277 4161960 4206327 4262917 4135442 3757983 3159520 3403413 3381189 3537837
2718C537837J27312n36307j70813r9177K73955L80828k06086R98914k06405J39624
$$ 3537837 3665149 3128842 2958029 2858852 3132807 3513635 3307549 4306463 4100058 4239682
2708D239682K23630j14284o1455l74727K7755j55661J62042K00821L18k91o80578
$$ 4239682 4463312 4349028 4287573 3912846 3940601 3784940 3946982 4147803 4148121 4147830 3467252
2697C467252n60665L74747J09078n8652M50363q0304l15616n31448N11481M99979
$$ 3467252 2906587 3281334 3390412 3331760 3782123 3701819 3386203 2854755 3366236 3866215
2687C866215N76236o35143n7854p47641N56208M83532j55254k371m73845N74250
$$ 3866215 4442451 3807308 3749454 3001813 3558021 4041553 3886299 3883928 3410083 3984333
2677C984333K61941K48217l60903l40689K47523R35206j42067L4000K25639L33395
$$ 3984333 4246274 4494491 4133588 3792899 4040422 4975628 4833561 4867561 5093200 5426595
2667E426595o41796l35625l32434O14865K78684J15573L70127l04341k36439L05392
$$ 5426595 4784799 4449174 4116740 4731605 5010289 5125862 5495989 5191648 4955209 5260601
2657E260601m75808l23072l35R04610l37750p6043P04387J92324m8279P0201j12313
$$ 5260601 4784793 4461721 4461386 5365996 5028246 4952203 5656590 5848914 5800635 5870836 5758523
2646E758523L52158J70134n25106J54591K48822M68940Q84429Q73416o0634m6327
$$ 5758523 6110681 6280815 5755709 5910300 6159122 6628062 7512491 8385907 8325273 8278946
2636H278946M19714N59866Q74749K09598M6122q44974q59700J092042J56542m33048
$$ 8278946 8698660 9258526 10133275 10342873 10388995 9544021 8684321 9776363 9932905 9499857
2626I499857M11887N75417n11066J26786J08917l96195R71831P10907J04548M94150
$$ 9499857 9911744 10487161 9976095 10102881 10211798 9815603 10787434 11498341 11602889 12097039
2616A2097039k96642M57302P22327P7546k48724M42770N89242Q11466N20435O78390
$$ 12097039 11800397 12257699 12980026 13057572 12808848 13251618 13840860 14652326 15172761 15851151
2606A5851151J62587K64049K16248K59038J25856K34232L10341O69237o8557n09460
$$ 15851151 16013738 16277787 16494035 16753073 16878929 17113161 17423502 18092739 18024182 17514722
2596A7514722K82536m13759k89735R4338O24490j62037m53412L25569n47697J06620
$$ 17514722 17797258 17383499 17093764 17188102 17812592 17650555 17197143 17522712 16975015 17081635
2586A7081635K82582k74160Q8007L62771M65135L88016L2569P07728N71246j4311
$$ 17081635 17364217 17090057 17178064 17540835 18005970 18393986 18426555 19134283 19705529 19691218
2576A9691218Q04383M55606J497111P25679Q45733J11585j097440j166409K47722
$$ 19691218 20495601 20951207 22448318 23173997 24019730 24131315 23033875 21867466 22115188
2567B2115188j36393o36205o57404j024135j36864n2000r40479J08590q43304
$$ 22115188 21978795 21342590 20685186 19661051 19524187 19472187 18531708 18640298 17796994
2558A7796994l01128l5115j2271P2676P3223J7658n12501R3930j52414Q7331m46812
$$ 17796994 17495866 17460751 17448480 17521156 17594379 17612037 17099536 17193466 17041052 17128383 16681571
2547A6681571n90439p41933k577N31033k11992K78501j89116N17966K05934J69746
$$ 16681571 16091132 15349199 15346622 15877655 15665663 15944164 15755048 16273014 16478948 16648694
2537A6648694N76093M96891M04065p36661p34184q06392j323171k86551J16831
$$ 16648694 17224787 17721678 18125743 17389082 16654898 15848506 14525335 14238784 14355615
2528A4355615p66254p13481q39646o48990k13729j59572k54146r09675R2038l6446
$$ 14355615 13589361 12875880 12036234 11387244 11173515 11013943 10759797 9850122 9942160 9905714
2518I905714m06319K80256p52403O8387K2913k51189o56609l85352j86450j46479
$$ 9905714 9499395 9779651 9027248 9095635 9118548 8867359 8210750 7825398 7638948 7492469
2508G492469l33067J94730K89174K74183p92451n4435M4600L56619l00404k82082
$$ 7492469 7159402 7354132 7643306 7917489 7125038 7070603 7115203 7471822 7171418 6889336
2498F889336j0400p46694L76894q31892n87008k87900L45o6805o12025J65931
$$ 6889336 6878936 6132242 6509136 5677244 5090236 4802336 4802681 4735876 4123851 4289782
2488D289782K57436n59660r93908N38648J78104q5323n35446J75461J37529J70269
$$ 4289782 4547218 3987558 2993650 3532298 3710402 3625079 3089633 3265094 3402623 3572892
2478C572892j46443n44598L41356l90216L42879o18263m0265m41803K38598Q2869
$$ 3572892 3426449 2881851 3223207 2832991 3175870 2557607 2517342 2075539 2314137 2397006
2468B397006l12733P97818k18465p3340J31225m34238q7122k15445J88896K81913
$$ 2397006 2084273 2882091 2663626 2590286 2721511 2287273 2200151 1984706 2173602 2455515
2458B455515k04077N1431m20080k01221O27183L53853m03092L8497p6059l00578
$$ 2455515 2251438 2302869 1882789 1681568 2308751 2662604 2259512 2298009 2221950 1921372
2448A921372l94081Q06617K15304m5977o97930m53570m06253Q94363k60917l81619
$$ 1921372 1527291 2333908 2549212 2503235 1805305 1351735 945482 1839845 1578928 1197309
2438A197309P21253M23284K51723l91776q22856l72991Q5680M94040N75735J519
$$ 1197309 1918562 2341846 2593569 2201793 1378937 1005946 1091626 1585666 2161401 2162920
2428B162920o16419P8472k11754q7386N65130p7415J27412l1437n17241r72475
$$ 2162920 1546501 1624973 1413219 1325833 1890963 1813548 1940960 1909523 1392282 419807
2418D19807L78094J18287j6475j3647N3367o1932P69799l28804o33605K73860
$$ 419807 797901 916188 899713 886066 939433 877501 1647300 1318496 684891 958751
2408I58751J53938k89154J40556J13969L62014n44253o81710J69217K08806L74443
$$ 958751 1112689 823535 964091 1078060 1440074 895821 214111 383328 592134 966577
2398I66577L70302m97906q7630L12794m30519J40234R6248o4811K15478J1058
$$ 966577 1336879 838973 751343 1064137 633618 773852 870100 805289 1020767 1031825
2388A031825M13030l33198q867k99965J23573l84951m43278M04809L49944Q3372
$$ 1031825 1444855 1111657 1102790 802825 926398 541447 98169 502978 852922 936294
2378I36294k15335O61152K15762l01035o82521P4782N97400k58714K73748j27151
$$ 936294 720959 1382111 1597873 1296838 614317 689099 1286499 1027785 1301533 1174382
2368A174382o31531m8095J117552k38479L08730K39667k3981l36140p21803Q78081
$$ 1174382 542851 494756 1612308 1373829 1682559 1922226 1898245 1562105 840302 1718383
2358A718383K89726n90724k77156N66225N81337m94054m0910P7780m13477K11807
$$ 1718383 2008109 1417385 1140229 1706454 2287791 1793737 1752827 1830607 1417130 1628937
2348A628937J21280k79961n0490L4029q19874J63085O16392L11777j99323p8891
$$ 1628937 1750217 1470256 1419766 1453795 633921 797006 1413398 1725175 1525852 1446961
2338A446961j90063o44690N1157J65800j88187P07915n97425K68040N478L78002
$$ 1446961 1256898 612208 663365 829165 640978 1348893 751468 1019508 1024986 1402988
2328A402988L67062J6567k04773k58890l5023m9508k06273K7278K81986m8371
$$ 1402988 1770050 1786617 1581844 1322954 1287931 1238423 1032150 1059428 1341414 1293043
2318A293043k06430j79508j39164J26648m23471j65042L58459L10264K15527m73985
$$ 1293043 1086613 907105 767941 894589 471118 306076 664535 974799 1190326 716341
2308G16341R4566q1292m17849K45122P37635j08756l48006j5717J15456l47746
$$ 716341 810907 729615 311766 556888 1294523 1185767 837761 822044 937500 589754
2298E89754K26709Q5134k97952L92613Q94121j12403K0482r513k68752N50030
$$ 589754 816463 901597 603645 996258 1890379 1777976 1798458 1788945 1520193 2070223
2288B070223M3918j14216q35666k82050K82923j76081r9927L34237M88006l32097
$$ 2070223 2114141 1999925 1164259 882209 1165132 989051 889124 1223361 1711367 1379270
2278A379270L10361l34815K69015j06305l16389L69396l3208j21941Q2911M36991
$$ 1379270 1689631 1354816 1623831 1517526 1201137 1570533 1537325 1415384 1498295 1935286
2268A935286n12481n90323k784L50905n34412m11215L04430R830K83108j2650
$$ 1935286 1422805 832482 829698 1180603 646191 234976 539406 549236 832344 819694
2258H19694q6013Q55317j1600q8146J52426l75993m42361n89038J22847P40332
$$ 819694 733681 1588998 1577398 1489252 1641678 1265685 823324 234286 357133 1097465
2248A097465J27100k96078J19690K12690J33304j60437n66445J92562M9279j42009
$$ 1097465 1224565 928487 1048177 1260867 1394171 1233734 667289 859851 909130 767121
2238G67121j58409N42840O29306l35427k40781J35285L97511l52632p509n8936
$$ 767121 608712 1151552 1780858 1445431 1204650 1339935 1737446 1384814 1377305 1318369
2228A318369O99710K78704j187352R3139Q2361J41435n129n76311M67981K42738
$$ 1318369 2018079 2296783 1109431 1202570 1284931 1426366 1421237 844926 1312907 1555645
2218A555645j96659M03189J77496P9313l97083r68849J018654M20573m31671L13046
$$ 1555645 1358986 1762175 1939671 2018984 1621901 653052 1671706 2092279 1660608 1973654
2208A973654m25037K21916K70081k92494K32529J10792n23498n51924J99414k94926
$$ 1973654 1548617 1770533 2040614 1748120 1980649 2091441 1567943 1016019 1215433 920507
2198I20507J91507O01035M89914M60476j71005K63771J70118j85831k65836N18725
$$ 920507 1112014 1713049 2202963 2663439 2492434 2756205 2926323 2740492 2474656 2993381
2188B993381q1733q22934J60711K75157K08567j41116L75151O6663n01320M18835
$$ 2993381 2911648 2088714 2249425 2524582 2733149 2592033 2967184 3033847 2532527 2951362
2178B951362K4976m1246K59995N53286j24877k93074L72780O67640l66091L11026
$$ 2951362 2976338 2935092 3195087 3748373 3623496 3330422 3703202 4370842 4004751 4315777
2168D315777L99710K06026j54259q82515K49037M69670l58174L71189N66453m66200
$$ 4315777 4715487 4921513 4767254 3884739 4133776 4603446 4245272 4616461 5182914 4716714
2158D716714k05435l74999M32288N18656J79732J36438k0596P45902j61452o94965
$$ 4716714 4511279 4136280 4568568 5087224 5266956 5403394 5382798 6128700 5967248 5272283
2148E272283J16510K76565N134L81573K61767l45719J13396j41062Q20506Q84942
$$ 5272283 5388793 5665358 5670492 6052065 6313832 5968113 6081509 5940447 6760953 7645895
2138G645895M4418k048l36105M6223J74852M53262j02658J19080J51294R04265
$$ 7645895 7690313 7688265 7352160 7398383 7573235 8026497 7923839 8042919 8194213 9098478
2128I098478N16356K23196K86276K89647P91854O79326N53079K98995Q44041J0698
$$ 9098478 9614834 9838030 10124306 10413953 11205807 11885133 12438212 12737207 13581248 13591946
2118A3591946J032539J399145N14928L17498N21855J177626P60772J519173K027102
$$ 13591946 14624485 16023630 16538558 16856056 17377911 18555537 19316309 20835482 22862584
2109B2862584Q91767J256285J821459J917382K392785K726307J404713K544109
$$ 22862584 23754351 25010636 26832095 28749477 31142262 33868569 35273282 37817391
2101C7817391L365389M585067N530438Q017553J0554321J1886064J3126171J5662670
$$ 37817391 41182780 45767847 51298285 59315838 69870159 81756223 94882394 110545064
2093A10545064J7106474K1822618K7704904K4414487J11073k1801876l0611725
$$ 110545064 127651538 149474156 177179060 201593547 201704620 179902744 149291019
2086A49291019l0066563k2552706j6601956j1984014j0186115o431086m806849
$$ 149291019 119224456 96671750 80069794 68085780 57899665 51468579 46661730
2079D6661730m226270l529002k115769j936271j930076k270832k861581k162833
$$ 46661730 42435460 38906458 36790689 34854418 32924342 30653510 27791929 25629096
2071B5629096k369405j506208j134354j859492j269222j045192j14505l08696
$$ 25629096 23259691 21753483 20619129 18759637 17490415 16445223 16330718 16022022
2063A6022022j61251j294275j226613m19569n35694q61005j83571l95007p23739
$$ 16022022 15860771 14566496 13339883 12920314 12384620 11523615 11340044 10945037 10221298
2054A0221298l94338l34900o39572N10485n34006o95137o75271M17613k83661
$$ 10221298 9826960 9492060 8852488 9362973 8828967 8133830 7458559 7876172 7592511
2045G592511q66975o34829j38092K84418j12223j81236K88560o21115p07172l30643
$$ 7592511 6725536 6090707 5952615 6237033 6124810 5943574 6232134 5611019 4903847 4573204
2035D573204L16434N9084k09430J34612K85599K5376l25280o55128j03370L60136
$$ 4573204 4889638 4948722 4739292 4873904 5159503 5184879 4859599 4204471 4101101 4461237
2025D461237j24633k5939j75407J18479n01289N19076o14422n54636M42859l31510
$$ 4461237 4336604 4310665 4135258 4253737 3752448 4271524 3657102 3102466 3545325 3213815
2015C213815j27805R39285m49966m61886m69068P6700P4935n8294J38282j94936
$$ 3213815 3086010 4025295 3575329 3113443 2644375 2721075 2796010 2737716 2875998 2681062
2005B681062j78668K71224N3634p1730L70405L8797j03490j31471l51573m23176
$$ 2681062 2502394 2773618 2827252 2755522 3125927 3164724 3061234 2929763 2578190 2155014
1995B155014l55815j19626L47970M62041k29442J44879o31569J14173l07653J92171
$$ 2155014 1799199 1679573 2027543 2489584 2260142 2405021 1773452 1887625 1579972 1772143
1985A772143K7237l52253L35038o2261L29060L7718j21435j89766j98870n50851
$$ 1772143 1799380 1447127 1782165 1719904 2048964 2086682 1965247 1775481 1576611 1025760
1975A025760M50124o7924j20090l68140J26406l8526n11721N47481L40217k24104
$$ 1025760 1475884 1407960 1287870 919730 1046136 1007610 495889 1043370 1383587 1159483
1965A159483K12488K77048k82209j96034J29730M05390j12746m80800l12777j31129
$$ 1159483 1371971 1649019 1366810 1170776 1300506 1705896 1593150 1112350 799573 668444
1955F68444L03939l39422l6749J57350K0076J62790M17695k54269P0193L5961
$$ 668444 972383 632961 596212 753562 773638 936428 1354123 1099854 1170047 1206008
1945A206008j20119M26897l9437q23855K2461J26627j09759L84127M3479J46406
$$ 1206008 1085889 1512786 1473349 649494 671955 798582 688823 1072950 1116429 1262835
1935A262835M4865o62174J3634N65643J28716m40168N5883N4977m13832K56054
$$ 1262835 1307700 645526 659160 1224803 1353519 913351 969234 1024211 610379 866433
1925H66433j66075J60237L06945j22861n60375K44002J02109k45486P30876J43547
$$ 866433 700358 860595 1167540 1044679 484304 728306 830415 584929 1315805 1459352
1915A459352o65617j53644j55854k11446R80264L85126k62852J56226j158557
$$ 1459352 793735 640091 484237 272791 1253055 1638181 1375329 1531555 372998
1906C72998L79632J5849j87930M85775o16326J010J03676o98837L23959R4092
$$ 372998 752630 768479 580549 1066324 449998 451008 554684 -144153 179806 273898
1896B73898K29821j03878k64803K0691J90347O87104K65571m47948m0667N4380
$$ 273898 503719 399841 135038 155729 346076 1033180 1298751 850803 810136 864516
1886H64516k41559j43847K60989l29013L02420O4991k57145J4294k98722O42393
$$ 864516 622957 479110 740099 411086 713506 778497 521352 535646 236924 879317
1876H79317L79437j05918j65194j24210j03936O1700l59492P5503K8360l93527
$$ 879317 1258754 1152836 987642 863432 759496 821196 461704 537207 565567 172040
1866A72040Q1094J3576L77156K36410K91131J2004l26647k69834M4284J54807
$$ 172040 253134 266710 643866 880276 1171407 1183411 856764 586930 631214 786021
1856G86021k63222N29371j89304p07036K07017L94359j98486j08955l70599k0294
$$ 786021 522799 1052170 862866 155830 362847 757206 558720 449765 79166 58872
1846E8872K57327J9058p041l43518K87399J12381L17379J91749k40302m5264M43422
$$ 58872 316199 335257 328216 -15302 272097 384478 701857 893606 653304 608040 1051462
1835A051462k76540J71634m1242j42433M58488N6631l89744k71714J59192n1610
$$ 1051462 774922 946556 905314 762881 1221369 1278000 888256 616542 775734 724124
1825G24124M69004Q093m7339Q0304O07488n13823L70506j73137L4355q28597m72872
$$ 724124 1193128 1201221 1153882 1234186 1841674 1327851 1698357 1525220 1559575 730978 258106
1814B58106O35565j24331k94169q645o65622L19155N23157l2712j29620l83m38198
$$ 258106 893671 769340 475171 466526 -199096 120059 643216 610504 480884 480501 42303
1803D2303K48726m747n61504O3047Q3931K70792Q74403j67446K72072p826l80280
$$ 42303 291029 286282 -275222 -212175 -128244 142548 1016951 849505 1121577 1113751 733471
1792G33471m16144j28283J42189k47770k86075j43949j16697L88752P41887q0667
$$ 733471 317327 189044 331233 83463 -202612 -346561 -463258 -74506 667381 586714
1782E86714k64906n06897O87621M56129n90880n94528N5011J38369K92350l4897
$$ 586714 321808 -185089 502532 958661 367781 -226747 -171736 -33367 258983 224086
1772B24086J31857j93828o6728J7764j35730r4000N44417m86945k99757J11966
$$ 224086 355943 162115 95387 113151 -22579 -116579 427838 -59107 -358864 -246898
1762b46898M31580n1595k69037q1867Q0200l7865M51757J32359j0501P8552K25104
$$ -246898 184682 133087 -135950 -217817 -137617 -175482 276275 408634 398133 476685 701789
1751G01789n94736J98096k09873l73522J99388j08599j01366K17173K5441O12356
$$ 701789 107053 305149 95276 -278246 -78858 -187457 -288823 -71650 -46209 566147
1741E66147P19640p53457n6977O043l4324n22406K17299K97713o48691O8257L75206
$$ 566147 1285787 532330 475353 481396 447072 -75334 141965 439678 -209013 -140756 234450
1730B34450l40296k5145O39287l90041m36688k09397R2083N85092p6710M28094
$$ 234450 -105846 -130991 508296 118255 -318433 -527830 -435747 149345 72635 500729
1720E00729M44695K4332m28691k76007m23008K98063K51756r7770k48479K72203
$$ 500729 945424 969756 541065 265058 -157950 140113 391869 294099 45620 317823
1710C17823N85709p10469J15975n40398J67113M14796J06080j86626O54553M1425
$$ 317823 903532 193063 309038 -231360 -64247 350549 456629 270003 924556 965981
1700I65981m63176K14068m42067K21707J15372j57535o7186k57413N46001j75640
$$ 965981 502805 716873 274806 496513 611885 454350 387164 129751 675752 500112
1690E00112k75516K64884m97786N88545Q5540n78071k23920L06924J91808o29287
$$ 500112 224596 489480 -8306 580239 665779 87708 -136212 170712 362520 -266767
1680b66767k99505N11813L80276k29973K57743J3673l60368J92527p8353l16554
$$ -266767 -566272 -54459 325817 95844 353587 367260 6892 199419 121066 -195488
1670a95488K68089m57119J43750K71271J45956j36862K47910J06902l40974K27148
$$ -195488 72601 -384518 -240768 30503 176459 39597 287507 394409 53435 280583
1660B80583n5428q2947k90527J15068M96456j42952n84015O9971l26063O49081
$$ 280583 225155 142208 -148319 -33251 463205 320253 -263762 -193791 -519854 129227
1650A29227L52164l60089K57573k75065K9236N80880l60262J42406o25148j62268
$$ 129227 481391 121302 378875 103810 133046 713926 353664 496070 -129078 -291346
1640b91346L00864j12455m42061J77641P9672N39521J33601K31008n21551k70417
$$ -291346 9518 -102937 -544998 -367357 -287685 251836 385437 616445 94894 -175523
1630a75523j70532Q1664J97703J55577L06604k54436j63203O04808J12261l24521
$$ -175523 -346055 -264391 -66688 88889 395493 141057 -22146 582662 694923 370402
1620C70402K7197j2497k41401j91065L68905K22064j3852n61582j45983k01066
$$ 370402 397599 385102 143701 -47364 321541 543605 529753 -31829 -177812 -378878
1610c78878J39131L26857L65662o34789M99588k88922j73743m04443m0930K67747
$$ -378878 -239747 87110 452772 -182017 317571 28649 -145094 -549537 -590467 -322720
1600c22720P6237O84737j01597M98664l85108j53725k00469M57619M93569q55550
$$ -322720 -246483 438254 336657 835321 450213 296488 96019 553638 1047207 191657
1590A91657l60293N82074N8614J02763K99009l15878J27676J54094l25739j69661
$$ 191657 -168636 413438 472052 574815 873824 557946 685622 839716 513977 344316
1580C44316J1056j13025l47584K02666m05448K0595N34257m12589P49442L5683
$$ 344316 355372 242347 -105237 97429 -308019 -287424 246833 -165756 583686 619369
1570F19369r5205L15297j1031j55808J87652o06425l22269R1586r2329l24951
$$ 619369 524164 839461 828430 672622 860274 253849 -68420 23166 -69163 -394114
1560c94114l8281P7300N36870J41626J42053K41464j51840M69230M2404n83109
$$ -394114 -432395 -355095 181775 323401 465454 706918 555078 1024308 1066712 483603
1550D83603j91434j90186J0072K83315m78982O15979j39319L51285K393l54761
$$ 483603 292169 101983 112055 395370 -83612 532367 393048 744333 746726 391965
1540C91965j63810j73858J32967K20416L52762n31560k51306O2470K03147l6378
$$ 391965 228155 54297 187264 407680 760442 228882 -22424 40046 243193 206815
1530B06815k58287K57833j38946J19112K55531n71985J76370K23530L20917n59759
$$ 206815 -51472 206361 67415 186527 442058 -129927 46443 269973 590890 31131
1520C1131l19581k56726J40132L29717m62006M21753L07788j78550m74588J96202
$$ 31131 -288450 -545176 -405044 -75327 -537333 -115580 192208 13658 -460930 -264728
1510b64728N00286l99626k13846J60896M86229j53289j24907L61691m31472m9999
$$ -264728 235558 -164068 -377914 -217018 269211 115922 -8985 352706 -78766 -128765
1500a28765J01408J28088l37420J09180P36324k86041K17469p10312m93991O45350
$$ -128765 -27357 100731 -236689 -127509 608815 322774 540243 -170069 -664060 -18710
1490a8710M7921k955K60261J77752K51201m43718n49830J6936Q67216k1714K92478
$$ -18710 29211 26256 286517 464269 715470 271752 -278078 -261142 606074 584360 876838
1479H76838k32049l55085j13420j75990q9667J62551O9556k53355L02386l09070
$$ 876838 644789 289704 176284 294 -89373 73178 142734 -110621 191765 -117305
1469a17305j0083M80578R7722m13800J89366K30736J15586o84444l81671j2854
$$ -117305 -127388 353190 450912 37112 226478 457214 572800 -111644 -493315 -506169
1459e06169K02735L74880l14038M64149K46800m09832N28279L43404j00206k13951
$$ -506169 -303434 71446 -242592 221557 468357 58525 586804 930208 830002 616051
1449F16051m93905J507M80402q27714K20687L19186l33397J44856Q53190J87615
$$ 616051 122146 123653 604055 -223659 -2972 316214 -17183 127673 980863 1168478
1439A168478l48566p50127o9600O7420J27173N46138L83658j2726m78776m01695
$$ 1168478 819912 69785 185 67605 194778 740916 1124574 1111848 633072 231377
1429B31377q6293k22934J11889k61903J68513M99191j84093P6392M08002l9847
$$ 231377 145084 -77850 34039 -227864 -59351 439840 255747 332139 740141 700294
1419G00294j0740k77951k42865L18526J34030J11093l27687m68264j67569N20961
$$ 700294 689554 411603 168738 487264 621294 732387 404700 -63564 -231133 289828
1409B89828J96329l11430j12037M91860L32457J839k75551o13144M93232j85497
$$ 289828 486157 174727 62690 554550 887007 888846 613295 151 493383 307886
1399C07886p58049L98731J2221J88233j95739m44490M96177l90667p84974K17458
$$ 307886 -450163 -51432 -39211 149022 -46717 -491207 4970 -385697 -1170671 -953213
1389i53213O36318R1925L42826J27727k9013j82087l14066K79715j64058j19346
$$ -953213 -316895 -224970 117856 245583 216570 34483 -279583 132 -163926 -283272
1379b83272J94397L05694o44223L22366M30910l41958k24158L7082j83451k51880
$$ -283272 -88875 216819 -427404 -105038 325872 -16086 -240244 -203162 -386613 -638493
1369f38493p926M31408n01602N47180R38004n500L4170p13191j35202j58253j19143
$$ -638493 -646419 -215011 -716613 -169433 768571 763071 797241 84050 -51152 -209405 -328548
1358c28548J22582P39505k22586n15467K74257k12795J9101j25788j93018k29835
$$ -328548 -205966 533539 310953 -204514 69743 -143052 -123951 -249739 -442757 -672592
1348f72592M69480J79970L21970L2525k49183o8624K30832l11144J98594j47847
$$ -672592 -203112 -23142 298828 331353 82170 13546 244378 -66766 131828 -16019
1338a6019k48533N39624K84124M46833k28494o71885n40863N32064m29885N50088
$$ -16019 -264552 275072 559196 1006029 777535 105650 -435213 96851 -333034 217054
1328B17054K74181o79125n98412J80892L17600k63584N94115L74754j90434l09226
$$ 217054 491235 -187890 -786302 -605410 -287810 -551394 42721 417475 227041 -82185
1318h2185L65344L49487m52867O6346j65847m52972M31406K26731L6540k58625
$$ -82185 283159 632646 179779 246125 80278 -372694 58712 285443 321983 63358
1308F3358J23838l89713M0429j55322K99348j98107j33581K57195J77704l05046
$$ 63358 187196 -202517 -162088 -317410 -18062 -216169 -349750 -92555 85149 -219897
1298b19897m83602M88785O79146k60855j78625m19215k22367O21576M29785k89473
$$ -219897 -703499 -214714 464432 203577 24952 -394263 -616630 4946 434731 145258
1288A45258n30982k04853N80255J84678J11706k54937k16638N31261o95856L15089
$$ 145258 -385724 -590577 -10322 174356 286062 31125 -185513 345748 -350108 -35019
1278c5019q3152q5122J25982m30026J96415l46642j43493n9107N68305N19305
$$ -35019 -118171 -203293 -77311 -507337 -310922 -657564 -801057 -860164 -291859 227446
1268B27446l43333M28578j4389J98951l47678J87643P8850L3525L74833m9259
$$ 227446 -115887 312691 298302 497253 149575 337218 416068 449593 824426 775167
1258G75167n55821k51725o18676L62891P63913J44549p53427n87905M45897J26660
$$ 775167 219346 -32379 -651055 -288164 475749 620298 -133129 -721034 -275137 -148477
1248a48477o1473O6337k97707M89953j13205j0955J83379K2367N1387M02110o97324
$$ -148477 -209950 -143613 -441320 48633 -64572 -75527 107852 130219 181606 583716 -113608
1237a13608J63021N31559J03950k48162J16049p7477J23623l81610l53982j94173
$$ -113608 49413 580972 684922 436760 552809 475332 598955 217345 -136637 -330810
1227c30810m44844k59014O06630O03964l00525R1935l15720N17245J35282j44870
$$ -330810 -775654 -1034668 -428038 175926 -124599 -32664 -348384 168861 304143 159273
1217A59273m59103j5463K62818j55097k1670N04986L03807r0376k51398N73022
$$ 159273 -299830 -315293 -52475 -207572 -229242 275744 579551 489175 237777 810799
1207H10799M2186n5550L0306n95530m48070P26078K30248l36892k56403J71066
$$ 810799 852985 797435 827741 232211 -215859 510219 740467 403575 147172 318238
1197C18238j30496o27456k7232J01494M48472M97495R1234k21152m98371N02898
$$ 318238 187742 -439714 -466946 -365452 83020 580515 671749 450597 -47774 455124
1187D55124j72107o91377J81254n7063J00667J86302k52049L74789k22353K66290
$$ 455124 283017 -408360 -227106 -284169 -183502 2800 -249249 125540 -96813 169477
1177A69477n45528j9657K40784l11234M01979L25230j30963O12659k39150j97478
$$ 169477 -376051 -395708 -154924 -466158 -64179 261051 130088 742747 503597 306119
1167C06119p81779N7740j90776M14015J75344l45276j42695L45564M97918j82382
$$ 306119 -475660 -417920 -608696 -194681 -19337 -364613 -507308 -161744 336174 153792
1157A53792k22764l66052L93311L00365P681n8987K82565q28882k21092K50401
$$ 153792 -68972 -435024 -41713 258652 266333 207346 489911 -338971 -560063 -309662
1147c09662N90340j65241R21119J39714j249239l52399N53048j8545n44848K57365
$$ -309662 280678 115437 1036556 1176270 -72969 -425368 127680 109135 -435713 -178348
1137a78348l94825K62014J85949j99113k29787M54311M90567m96098j30039L1720
$$ -178348 -573173 -311159 -125210 -324323 -554110 -99799 390768 -105330 -235369 -203649
1127b03649K19256M4671p31914k12879K96506J37827R3880M15611j85166k48783
$$ -203649 15607 60278 -671636 -884515 -588009 -450182 -356302 59309 -125857 -374640
1117c74640K23305k71268K37828k6263l44736O28605L1509m69819p4398m763R26124
$$ -374640 -151335 -422603 -184775 -211038 -555774 72831 104340 -365479 -439877 -444640 481484
1106D81484J68701m4495m88680L01443o00555j60878M9524L86436K30646p4089
$$ 481484 650185 605690 117010 418453 -182102 -342980 -293456 92980 323626 249537
1096B49537K04826L7817j92825l38583R1504K87967M08191j6534j81334m31959
$$ 249537 454363 492180 299355 -39228 52276 340243 748434 731900 550566 118607
1086A18607m8985k02133k04710m8213Q60696j12568o99408j08311l40474Q2074
$$ 118607 69622 -132511 -337221 -385434 475262 362694 -336714 -445025 -785499 -703425
1076g03425K05845N99779n14946K04556J5267q73438l33412M86563R9807J92852
$$ -703425 -497580 102199 -412747 -208191 -192924 -1066362 -1399774 -913211 -813404 -620552
1066f20552L86794r7611j96223K99077L15299L89518o37498J9010j64179p050
$$ -620552 -233758 -331369 -527592 -228515 86784 476302 -161196 -142186 -306365 -313415
1056c13415M7884L1348n2473q5507j92442J92846N20393k67236k1732K90956o0163
$$ -313415 -265531 -234183 -286656 -372163 -564605 -371759 148634 -118602 -140334 150622 90459
1045I0459j48442O35931l28278m22438N3695p5128k3001k58222J82028K07548
$$ 90459 -57983 577948 249670 -172768 -119073 -194201 -217202 -475424 -293396 -85848
1035h5848m76119J45545J42316K35672L45427J21755p19440L01853m81152k28043
$$ -85848 -561967 -416422 -274106 -38434 306993 428748 -290692 11161 -469991 -698034
1025f98034K5192L96975M580J07504P21850M8217q58083p741k737J04034l29846
$$ -698034 -672842 -275867 -271287 -163783 558067 606284 -251799 -259540 -262277 -158243 -488089
1014d88089K45523J88251K16685K52675J59269j72300J04222p49348j08807M73037
$$ -488089 -242566 -54315 162370 415045 574314 402014 506236 -243112 -351919 121118
1004A21118l68108N56949l01200n84882m1530K67693K79891K3642j07655K86654
$$ 121118 -246990 309959 8759 -576123 -617653 -349960 -70069 -46427 -154082 132572
994A32572l0163R3585k18402K9040k95666k48498p2966L31173K9964o01528M54576
$$ 132572 102409 195994 -22408 6632 -289034 -537532 -610498 -279325 -249361 -850889 -396313
983c96313L6916k14537O24326O01695p30217J86900J03728m87868P6583M34356
$$ -396313 -359397 -573934 50392 652087 -78130 108770 212498 -275370 -198787 235569
973B35569K46091l72739l3492L01191K10648m87038K12288K86174o7874n13531
$$ 235569 481660 108921 75429 376620 587268 100230 312518 598692 530818 17287
963A7287o73594K818J27020M46597J46420L33421k22118m17889M96069M36432
$$ 17287 -656307 -653489 -526469 -79872 66548 399969 177851 -240038 256031 692463
953F92463r6839m84417Q4689k6535m99872K0425l08680k35781N00852K06681j20397
$$ 692463 595624 111207 195896 169361 -330511 -310086 -618766 -854547 -353695 -147014 -267411
942b67411k89248K52184J19796L99696j19890K95341k72349J04677k13243j40912
$$ -267411 -556659 -304475 -184679 215017 95127 390468 118119 222796 9553 -131359
932a31359r0556l10002P00050j35590N84739L41145q50209m55445j30504J7131
$$ -131359 -221915 -531917 168133 32543 617282 958427 108218 -347227 -477731 -460600
922d60600O92196j06524k02130l8100m35212m0314J32684j68574J74481K19910
$$ -460600 231596 125072 -77058 -115158 -550370 -590684 -458000 -626574 -452093 -232183
912b32183J90003K2659j09643K26707m8296k38677n2057J40593K00382K34361
$$ -232183 -42180 -19521 -129164 97543 49247 -189430 -241487 -100894 99488 333849
902C33849p8501m63670l15946N09320J00630j38031o5607j01220K54632N12807
$$ 333849 255348 -208322 -524268 -14948 85682 -52349 -117956 -219176 35456 548263
892E48263k4907n36406l83923L95028K82341m19711r4981K10690j53098J52963
$$ 548263 523356 -13050 -396973 -1945 280396 -139315 -234296 -23606 -176704 -23741
882b3741K43902k49099j69092L17021k58362L42886j45199R0027j6672l14094
$$ -23741 220161 -28938 -198030 118991 -139371 203515 58316 148343 131671 -182423
872a82423L45656l35147J66907k13644k44516M13267l31030j62792L76445O16567
$$ -182423 163233 -171914 -5007 -218651 -463167 -49900 -380930 -543722 -167277 449290
862D49290J91507n62986r6826l54767N1143L67353j16892m07937q0488L20794
$$ 449290 640797 77811 -19015 -373782 -322639 44714 -72178 -480115 -560603 -239809
852b39809K93001N8314k76277l9322k25269k72519K31328N53165O4130j82998
$$ -239809 53192 111506 -164771 -204093 -429362 -701881 -470553 82612 146742 -36256
842c6256K24268L67884m89391k70097q5922O0290j375m51252J03058N28645k78146
$$ -36256 188012 555896 66505 -203592 -289514 -229224 -230599 -681851 -578793 -50148 -328294
831c28294J92076J12993j89650k5922o2426j94044K2490L15098J2831K95567j76972
$$ -328294 -136218 -23225 -212875 -238797 -301223 -495267 -472777 -157679 -144848 150719 -26253
$$ [...]
##END NTUPLES=NMR SPECTRUM
##END=
