##TITLE=1H_CA-9207-21x
 DMSO
 8 sc, 
 21.11.2023
##JCAMPDX= 6.0         $$ Bruker NMR JCAMP-DX V2.0
##DATA TYPE= NMR SPECTRUM
##DATA CLASS= NTUPLES
##ORIGIN= UXNMR, Bruker Analytische Messtechnik GmbH
##OWNER= root
$$ XWIN-NMR		Version 3.5
$$ Tue Nov 21 16:07:37 2023 Russian Standard Time (UT+4h)  she@DPX200
##.OBSERVE FREQUENCY= 200.1313
##.OBSERVE NUCLEUS= ^1H
##.ACQUISITION MODE= SIMULTANEOUS
##.ACQUISITION SCHEME= undefined
##.AVERAGES= 8
##.DIGITISER RES= 18
##SPECTROMETER/DATA SYSTEM= spect
##.PULSE SEQUENCE= zg30
##.SOLVENT NAME= CDCl3
##.SHIFT REFERENCE= (INTERNAL, CDCl3, 0, 15.7072)
##AUDIT TRAIL= $$ (NUMBER, WHEN, WHO, WHERE, WHAT)
$$ ##TITLE= Audit trail, XWIN-NMR		Version 3.5
$$ ##JCAMPDX= 5.01
$$ ##ORIGIN= Bruker BioSpin GmbH
$$ ##OWNER= she
$$ F:/spectra/data/she/nmr/H-F/1/pdata/1/auditp.txt
$$ ##AUDIT TRAIL=  $$ (NUMBER, WHEN, WHO, WHERE, WHAT)
(   1,<2023-11-21 16:06:32.46 +0400>,<she>,<DPX200>,
      <created by zg, POWCHK disabled, PULCHK disabled
       configuration hash MD5:
       00 E9 B6 7A A2 85 ED C7 34 08 36 98 17 FE 4E 26
       data hash MD5: 16K
       8B D0 FA 37 05 1B C2 12 4F CA B1 43 E2 E9 BF 93>)
(   2,<2023-11-21 16:06:34.60 +0400>,<she>,<DPX200>,
      <Start of raw data processing
       efp BC_mod = 2 LB = 0.24 FT_mod = 6 PKNL = 1 PHC0 = -23870.47 PHC1 = 9.45269 SI = 16K 
       data hash MD5: 16K
       24 FE 03 2C B4 E2 FF A5 C2 B5 C4 8C 97 D6 03 43>)
(   3,<2023-11-21 16:07:00.31 +0400>,<she>,<DPX200>,
      <pk PHC0 = -1.063195 PHC1 = -0.3999998 
       data hash MD5: 16K
       13 04 BB 26 9A CF 31 52 D9 BF 31 0E 55 EA C2 55>)
(   4,<2023-11-21 16:07:03.60 +0400>,<she>,<DPX200>,
      <abs ABSG = 5 
       data hash MD5: 16K
       93 AF 52 A1 25 2F 18 33 3D 56 C6 D6 4D 7F 40 7A>)
$$ ##END=
$$ 
$$ hash MD5
$$ 29 29 DE 0E DB 61 3F A2 16 36 8F 70 E4 59 61 B8
##$RELAX= 
##$RELAX= 
##$RELAX= 
##$RELAX= 
##$RELAX= 
##$RELAX= 
$$ Bruker specific parameters
$$ --------------------------
##$DU= <F:/spectra>
##$EXPNO= 1
##$NAME= <H-F>
##$PROCNO= 1
##$TYPE= <nmr>
##$USER= <she>
##$AMP= (0..31)
100 100 100 100 100 100 100 100 100 100 100 100 100 100 100 100 100 100 
100 100 100 100 100 100 100 100 100 100 100 100 100 100 
##$AQSEQ= 0
##$AQ_mod= 1
##$AUNM= <au_zg>
##$AUTOPOS= <>
##$BF1= 200.13
##$BF2= 200.13
##$BF3= 200.13
##$BF4= 200.13
##$BF5= 200.13
##$BF6= 200.13
##$BF7= 200.13
##$BF8= 200.13
##$BYTORDA= 1
##$CFDGTYP= 0
##$CFRGTYP= 5
##$CHEMSTR= <none>
##$CNST= (0..31)
1 1 145 1 1 1 1 1 1 1 1 1 1 1 1 1 1 1 1 1 1 1 1 1 1 1 1 1 1 1 1 1 
##$CPDPRG= <>
##$CPDPRG1= <>
##$CPDPRG2= <>
##$CPDPRG3= <>
##$CPDPRG4= <mlev>
##$CPDPRG5= <mlev>
##$CPDPRG6= <mlev>
##$CPDPRG7= <mlev>
##$CPDPRG8= <mlev>
##$CPDPRGB= <>
##$CPDPRGT= <>
##$D= (0..31)
0 1.2 0 0 0 0 0 0 0 0.06 0 0.03 0 0 0 0 0.0002 0 0 0 0 0 0 0 0 0 0 0 0 
0 0 0 
##$DATE= 1700568391
##$DBL= (0..7)
120 120 120 120 120 120 120 120 
##$DBP= (0..7)
150 150 150 150 150 150 150 150 
##$DBP07= 0
##$DBPNAM0= <>
##$DBPNAM1= <>
##$DBPNAM2= <>
##$DBPNAM3= <>
##$DBPNAM4= <>
$$ [...]
##$SUBNAM3= <"">
##$SUBNAM4= <"">
##$SUBNAM5= <"">
##$SUBNAM6= <"">
##$SUBNAM7= <"">
##$SUBNAM8= <"">
##$SUBNAM9= <"">
##$SW= 18.0517328524113
##$SWIBOX= (0..15)
0 0 2 0 0 0 0 0 0 0 0 0 0 0 0 0 
##$SW_h= 3612.71676300578
##$TD= 16384
##$TD0= 1
##$TE= 0
##$TE2= 300
##$TE3= 300
##$TEG= 300
##$TL= (0..7)
0 120 120 120 120 120 120 120 
##$TP= (0..7)
150 150 150 150 150 150 150 150 
##$TP07= 0
##$TPNAME0= <>
##$TPNAME1= <>
##$TPNAME2= <>
##$TPNAME3= <>
##$TPNAME4= <>
##$TPNAME5= <>
##$TPNAME6= <>
##$TPNAME7= <>
##$TPOAL= (0..7)
0.5 0.5 0.5 0.5 0.5 0.5 0.5 0.5 
##$TPOFFS= (0..7)
0 0 0 0 0 0 0 0 
##$TUNHIN= 0
##$TUNHOUT= 0
##$TUNXOUT= 0
##$USERA1= <user>
##$USERA2= <user>
##$USERA3= <user>
##$USERA4= <user>
##$USERA5= <user>
##$V9= 5
##$VALIST= <valist>
##$VCLIST= <CCCCCCCCCCCCCCC>
##$VD= 0
##$VDLIST= <DDDDDDDDDDDDDDD>
##$VPLIST= <PPPPPPPPPPPPPPP>
##$VTLIST= <TTTTTTTTTTTTTTT>
##$WBST= 1024
##$WBSW= 4
##$XGAIN= (0..3)
0 0 0 0 
##$XL= 0
##$YL= 0
##$YMAX_a= 383323
##$YMIN_a= -502214
##$ZGOPTNS= <>
##$ZL1= 120
##$ZL2= 120
##$ZL3= 120
##$ZL4= 120
##$ABSF1= 15.70722
##$ABSF2= -2.344633
##$ABSG= 5
##$ABSL= 3
##$ALPHA= 0
##$AQORDER= 0
##$ASSFAC= 0
##$ASSFACI= 0
##$ASSFACX= 0
##$ASSWID= 0
##$AUNMP= <proc_1d>
##$AZFE= 0.1
##$AZFW= 0.1
##$BCFW= 0
##$BC_mod= 2
##$BYTORDP= 0
##$COROFFS= 0
##$CY= -3
##$DATMOD= 1
##$DC= 0
##$DFILT= <>
##$DTYPP= 0
##$F1P= 0
##$F2P= 0
##$FCOR= 1
##$FTSIZE= 16384
##$FT_mod= 6
##$GAMMA= 0
##$GB= 0
##$INTBC= 1
##$INTSCL= 3.70164e-10
##$ISEN= 128
##$LB= 0.24
##$LEV0= 0
##$LPBIN= 0
##$MAXI= 10000
##$MC2= 0
##$MEAN= 0
##$ME_mod= 0
##$MI= 1.114404
##$NCOEF= 0
##$NC_proc= -4
##$NLEV= 6
##$NOISF1= 3.799351
##$NOISF2= 2.8
##$NSP= 0
##$NTH_PI= 0
##$NZP= 0
##$OFFSET= 15.70722
##$PC= 1
##$PHC0= -23871.53
##$PHC1= 9.052691
##$PH_mod= 1
##$PKNL= yes
##$PPARMOD= 0
##$PSCAL= 0
##$PSIGN= 0
##$REVERSE= no
##$SF= 200.12996287216
##$SI= 16384
##$SIGF1= 3
##$SIGF2= 2
##$SINO= 5.538805
##$SIOLD= 16384
##$SREGLST= <1H.CDCl3>
##$SSB= 0
##$STSI= 16384
##$STSR= 0
##$SW_p= 3612.71676300578
##$SYMM= 0
##$S_DEV= 0
##$TDeff= 16384
##$TDoff= 0
##$TI= <>
##$TILT= no
##$TM1= 0
##$TM2= 0
##$TOPLEV= 0
##$USERP1= <user>
##$USERP2= <user>
##$USERP3= <user>
##$USERP4= <user>
##$USERP5= <user>
##$WDW= 1
##$XDIM= 16384
##$YMAX_p= 269905353
##$YMIN_p= -90734
$$ End of Bruker specific parameters
$$ ---------------------------------
##NTUPLES= NMR SPECTRUM
##VAR_NAME=  FREQUENCY,     SPECTRUM/REAL,   SPECTRUM/IMAG
##SYMBOL=    X,             R,               I
##VAR_TYPE=  INDEPENDENT,   DEPENDENT,       DEPENDENT
##VAR_FORM=  AFFN,          ASDF,            ASDF
##VAR_DIM=   16384,         16384,           16384
##UNITS=     HZ,            ARBITRARY UNITS, ARBITRARY UNITS
##FACTOR=    0.220516191357247, 1,           1
##FIRST=     3143.48537093785, 0,            0
##LAST=      -469.231392067928, 0,           0
##MIN=       -469.231392067928, -90734,      0
##MAX=       3143.48537093785, 269905353,    0
$$ Real data points
##PAGE= N=1
##DATA TABLE= (X++(R..R)), XYDATA
$$ [...]
8967G43322K2749L876M8671M2439L3231K8153K0247Q4908L4249R2271Q0095N9301
8955A293512R3047R9528J28211J32921J62468J41811J26968R0104J04440Q2031
8945B455041P1628N5007O7003N101O2935J125L5418L5895R416K936o5824m7948
8933B687733o3001p3335r5883j02374r8918j17528j04924j16807q4638q3301r2729
8922A654295n4056l0392l4362j1459o499k0120K6179m361L1585N7225N9968P3260
8910A741263P3118R4788R1388J15173J26759J06369J01409J25844Q5594K1845
8900B683550L8172K1839M5819N556J4476R663M755k7088n3928o8625q5558p7932
8888B510699j06944j29499j21771j45278j22541j39185j38546j39347j07303j01451
$$ plain form
8967 743322 766071 769947 818618 861057 894288 922441 942688 1027596 1061845 1154116 1234211 1293512
8955 1293512 1386559 1486087 1614298 1747219 1909687 2051498 2178466 2268570 2373010 2455041
8945 2455041 2526669 2581676 2648679 2653780 2716715 2717840 2753258 2789153 2798569 2801505 2735681 2687733
8933 2687733 2624732 2551397 2455514 2353140 2254222 2136694 2031770 1914963 1830325 1747024 1654295
8922 1654295 1600239 1569847 1535485 1524026 1517527 1497407 1523586 1519225 1550810 1608035 1668003 1741263
8910 1741263 1814381 1909169 2000557 2115730 2242489 2348858 2450267 2576111 2661705 2683550
8900 2683550 2721722 2743561 2789380 2794936 2809412 2819075 2823830 2796742 2742814 2674189 2588631 2510699
8888 2510699 2403755 2274256 2152485 2007207 1884666 1745481 1606935 1467588 1360285 1258834
8878A258834r6984o3065p7983m8633o4783n7300o1875k0891k7488k7098k8145
8867F84589m8898j9932j6181j5381j4245k2467K160q544O932j0367j2611j642
8855E23413l5913o670k9810j3482K225j4551P79n232k6303m8880N2177L2794l3854
8842C96693j2855J214m2712k0791K9040l0486k7550R146L8973k9980j5188K5801
8830C21305j7468p989M981j3553j6008j2411j6293P630R690l2315J3587K1326
8818B62482j4750j4542J5603J5272k8261l781P240Q543O441j1783Q360J3550l941
8805B60433k1627r340K6821J122L704k2687L044J1025k5897l139j6269m729M0106
8792B42567K7311j6976j6785K4096m165k2925m846J2317m339P76K2682Q767J5186
$$ plain form
8878 1258834 1161850 1098785 1020802 972169 907386 850086 788211 767320 739832 712734 684589
8867 684589 635691 615759 599578 584197 569952 547485 549645 541101 548033 537666 525055 523413
8855 523413 487500 480830 451020 437538 439763 425212 425991 420759 394456 345576 397753 430547 396693
8842 396693 383838 385052 342340 321549 350589 320103 292553 301699 340672 310692 295504 321305
8830 321305 303837 295848 300829 287276 271268 258857 242564 250194 259884 227569 241156 262482
8818 262482 247732 233190 248793 264065 235804 232023 239263 247806 254247 242464 250824 264374 260433
8805 260433 238806 229466 256287 257409 261113 238426 241470 252495 226598 223459 207190 202461 242567
8792 242567 269878 252902 236117 260213 256048 233123 228277 240594 236255 237031 259713 268480 283666
8779B83666L60R608m174R965j6309l158K3843Q98J0916l11K6426L31K7634j9399
8765C50296j5502K0380p105K6052J0421J2712K711N479K3469K0480K5570r826
8753D65137K3818J6735M7414M0357L3534K8636Q016M1261L0001O60L6851K9611
8741H02031O1596O1424O4299O5382N8664Q1885O6919O0752N6262N7312L5506K1701
8729A493733L6180M1645K9540K1338N684j7676m138n312J1774j9770l0153j1088
8717A551757m4174l2905J2268l9973n2534j7896o5158q480j49r354k5411K4047
8705A292038J7946l1016L3171M9902L9530P1690L9237Q3673Q5684R6355J24982
8694A903192R6064J21708R7207J00842J36565K6295K6414M8669J6463K311j3974
$$ plain form
8779 283666 284026 293634 289460 299425 283116 279958 303801 304699 315615 315304 341730 342061 369695 350296
8765 350296 334794 355174 348069 374121 384542 397254 399965 405444 428913 449393 474963 465137
8753 465137 488955 505690 553104 593461 626995 655631 663647 704908 734909 735569 772420 802031
8741 802031 863627 925051 989350 1054732 1113396 1195281 1262200 1322952 1379214 1436526 1472032 1493733
8729 1493733 1529913 1571558 1601098 1622436 1628120 1610444 1606306 1600994 1612768 1592998 1562845 1551757
8717 1551757 1507583 1474678 1486946 1446973 1394439 1376543 1311385 1302905 1302756 1293402 1267991 1292038
8705 1292038 1309984 1278968 1312139 1362041 1401571 1473261 1512498 1596171 1681855 1778210 1903192
8694 1903192 1999256 2120964 2218171 2319013 2455578 2481873 2508287 2556956 2573419 2575730 2561756
8683B561756J046N108m1917j3114o2638m8331p1801m1220p6828j20142q6630r8530
8671A906759r5007q5065j09240j13590m4531o4621p8165l3401l7237m4135j4098
8660A187669k723j4536J5922p22K2775N243L5338M1794J1499M1330N3666J2208
8648A409463M777K7357O202j0339L181j9397l2437n186l5489j7665n2214j8183
8636A260070m5314j5265m3522q1949n5790l6577o8848p6424m7180n2047n9556
8625F77598l6991m7333k7286j6319j9615j8614m0834j7938k7694k9139l4650P545
8613C68730n084j1964j4609J2382k7215j2872M792k4360J0156j0274o09k5560
8601B63513k949J1676R44j7106k643k2954k8512L070L540k9671K542j6739J8418
$$ plain form
8683 2561756 2562802 2567910 2525993 2512879 2450241 2401910 2330109 2288889 2212061 2091919 2005289 1906759
8671 1906759 1811752 1726687 1617447 1503857 1459326 1394705 1316540 1283139 1245902 1201767 1187669
8660 1187669 1184946 1170410 1186332 1185610 1208385 1213628 1248966 1290760 1302259 1343589 1397255 1409463
8648 1409463 1414240 1441597 1447799 1437460 1440641 1421244 1388807 1383621 1348132 1330467 1278253 1260070
8636 1260070 1214756 1199491 1155969 1074020 1018230 981653 912805 836381 789201 737154 677598
8625 677598 640607 593274 565988 549669 530054 511440 470606 452668 424974 395835 361185 368730
8613 368730 363646 351682 337073 349455 322240 309368 314160 289800 299956 289682 289073 263513
8601 263513 260564 272240 273184 256078 253435 230481 201969 205039 208579 178908 181450 164711 183129
8588A83129K0484p793l0748q118o924N2527k8634l1307R410K1573l0952k6118
8576A16529K3007Q815M0j3034j1096o357P622j2125K0999p13l7181J0886J270
8563A08662m75p329j4669J1961p908J8049J0542j0585r175J1867l976P500k3304
8550I1160o764J2231j099J144q58O182l0665k2603L271J7328L9120k5921Q703
8537I1229J1815j8311j4016K0411K543o020k925k4406j0236j3673Q120K5107R868
8524G9506N345k2663k7208q655J8705J0180m155k9843K273J165J6191j7602M562
8511B7801l491j1281L5615N664k9688K527J1716l3774J2632K9426j7103k0236
8499I808J7083J2445l0539M118J5378m1528J5997K1961j4907K2248J9226j9033
$$ plain form
8588 183129 203613 195820 165072 156954 150030 202557 173923 142616 152026 173599 142647 116529
8576 116529 139536 148351 148391 135357 124261 117904 125526 113401 134400 133687 96506 107392 108662
8563 108662 108187 100858 86189 98150 90242 108291 118833 108248 99073 110940 106964 114464 91160
8550 91160 84396 96627 95528 96672 95814 101996 71331 48728 51999 69327 108447 82526 91229
8537 91229 103044 84733 70717 91128 93671 87651 84726 60320 50084 36411 44531 69638 79506
8524 79506 84851 62188 34980 26325 45030 55210 51055 21212 23485 24650 40841 23239 27801
8511 27801 24310 13029 48644 54308 24620 27147 38863 5089 17721 47147 30044 9808
8499 9808 26891 39336 8797 12915 28293 -13235 2762 24723 9816 32064 51290 32257
8487C2257j4753l3445L051R327j1567m807n448K0607J6373J7179M544j7521j378
8474A4419j0279J9009m658k5889J639J3776Q050k2181M739k7867J4497L5849j0554
8461A0550j3567L15J237j1304R30K5007j0090j7684l138N592L709k333j9386K3002
8447g160J1865l1860J4785k688j5120m928K1759L660K189j1931j4355K195m257
8434c5846M651J282J287L1833J0955m891l69k7512j1902J2236n528J3961M3447
8421C3604k6350j2337Q184J7867O32l1286k041j196K5896k0273k0591q80k769
8408c1540j286k0987L858J6966O151j912R256j1207J4740K6k2485o293K5069j383
8394b1027k358J1421k0658L222l728J0024J5419K457q677o867j4241K0724n260
$$ plain form
8487 32257 17504 -15941 -12890 -3563 -15130 -19937 -25385 -4778 11595 28774 33318 15797 14419
8474 14419 4140 23149 18491 -7398 -5759 8017 16067 -6114 -1375 -29242 -14745 21104 10550
8461 10550 -3017 -2702 -1465 -12769 -11839 13168 3078 -14606 -17744 -12152 -8443 -10776 -30162 -7160
8447 -7160 4705 -27155 -12370 -15058 -30178 -35106 -13347 -9687 -7498 -19429 -33784 -31589 -35846
8434 -35846 -31195 -29913 -28626 3207 14162 9271 8902 -18610 -30512 -18276 -23804 -9843 33604
8421 33604 7254 -5083 3101 20968 21600 -9686 -11727 -12923 12973 -7300 -27891 -28771 -31540
8408 -31540 -32826 -53813 -49955 -32989 -26838 -28750 -19494 -30701 -15961 -15935 -38420 -44713 -19644 -21027
8394 -21027 -23385 -11964 -32622 -29400 -33128 -23104 -7685 -5228 -13905 -20772 -35013 -14289 -19549
8381a9549R839k2593K2596J0008j4379J9022Q139m6891j7492J8075J5960N752
8369a1513N537J838j0955J3458j1414J591K3405P139j8167q85O201J3071q645
8356A0661j1098j9500K3547J2817r148k361k6391N155j2381L512J262r826J4118
8343a9633J0873r834j3930K5989M805j6187m505j3659J1042J4058j3824k763P389
8330b0179K0353q98j9762p810N729J0126j9356p325K6683j0694l233r868m225
8317d0459J0314J1286Q839r607l0933J1261l810m982L4629j2210J4953l390k365
8304a6474P473l8263J8755L1364L426r112k802N806n00j3229L4j033P041m199
8290a1713P622N484j6732J0015l54j576j1951j159k686r926J7607j329k099K01
$$ plain form
8381 -19549 -9710 -32303 -9707 301 -14078 4944 13083 -33808 -51300 -33225 -17265 -11513
8369 -11513 -5976 -4138 -15093 -1635 -13049 -11458 11947 19086 919 34 6235 19306 10661
8356 10661 -437 -19937 3610 16427 7279 4918 -21473 -16318 -28699 -25187 -23925 -33751 -19633
8343 -19633 -8760 -18594 -32524 -6535 -1730 -17917 -22422 -36081 -25039 -10981 -24805 -27568 -20179
8330 -20179 174 -724 -20486 -28296 -22567 -12441 -31797 -39122 -12439 -23133 -26366 -36234 -40459
8317 -40459 -30145 -18859 -10020 -19627 -50560 -39299 -43109 -48091 -13462 -25672 -10719 -14109 -16474
8304 -16474 -9001 -47264 -28509 2855 6281 -2831 -5633 173 -327 -13556 -13522 -14555 -7514 -11713
8290 -11713 -4091 1393 -15339 -5324 -5678 -7254 -19205 -20364 -23050 -32976 -15369 -16698 -18797 -18596
8276a8596O627L98L457M36k4762M161j1810J4246J9572j0651O518P354Q189N096
8262A0235k6601j5145J6697K392o032j2336p842K4802O523n167j2572j4688J1310
8249b8424R574k8103q888J9341J7636n150J2946K0114k4084q400R556n544p471
8236b6897L229j4227K825K0921j8701q378J4783J8841R101n823j5298R834m253
8223a4043k8635K2565J1181o390j7613K829J9539J3175p112J1519p108l7015J2434
8210b4674L995j0420J8887q276m99O565j9903n686K3997n821j3861K9666L8006
8197C1976q995k1848k9484N859j1601j1854J8913K3494J5278j2570q996j740n475
8184a7043L25k808k853l243R625J9803l4900Q651n134m144P652j9512K680j0409
$$ plain form
8276 -18596 -11969 -11571 -8114 -7678 -32440 -28279 -40089 -25843 -6271 -16922 -10404 -3050 5139 10235
8262 10235 -16366 -31511 -14814 -12422 -18454 -30790 -38632 -13830 -7307 -12474 -25046 -39734 -28424
8249 -28424 -18850 -46953 -55841 -36500 -18864 -24014 -11068 9046 -15038 -23438 -13882 -19426 -26897
8236 -26897 -23668 -37895 -35070 -14149 -32850 -41228 -26445 -7604 1497 -4326 -19624 -9790 -14043
8223 -14043 -42678 -20113 -8932 -15322 -32935 -30106 -10567 2608 -4504 7015 -93 -37108 -24674
8210 -24674 -20679 -31099 -12212 -20488 -20987 -14422 -34325 -40011 -16014 -21835 -35696 -6030 31976
8197 31976 22981 1133 -28351 -22492 -34093 -45947 -27034 -3540 11738 -832 -9828 -11568 -17043
8184 -17043 -16718 -19526 -22379 -25622 -15997 3806 -31094 -22443 -27577 -31721 -24069 -43581 -40901 -51310
8170e1310K5660K3480j3461j3398j4286J8909o122O466J6929k75M43K390M884
8157C09j4458j563K2080J753q20j7201l674n474p78l328n96J6958L392J4875J7941
8142B9416j7205r483j3806J079j1297r831K9900P656J454k1422j9366k794K9492
8129f207p232J540P277j6458K1040p406p822j5919J0538R246K2917j6484j5999
8116b0969L205j4560j845K1954M828L166J7095k5607j9647L4602J9696k8230M7031
8103D0719j3244l1925j0299K801N483k6434j9307J9579J8499K0743J1069L420
8091B1104r075j6035J8209j4688J2494Q607m556k5535n040K8877P54J233p046
8078I303r13P55k1299R351J5726l3622r451K6378K7040k5706r555r309J985N779
$$ plain form
8170 -51310 -25650 -2170 -15631 -29029 -43315 -24406 -30528 -24062 -7133 -7408 -6965 -4575 309
8157 309 -14149 -15712 6368 8121 7301 -9900 -13574 -19048 -19826 -23154 -23750 -6792 -3400 11475 29416
8142 29416 12211 2728 -11078 -9999 -21296 -31127 -1227 6429 7883 -13539 -32905 -35699 -6207
8129 -6207 -13439 -11899 -4622 -21080 -40 -7446 -15268 -31187 -20649 -11403 11514 -4970 -20969
8116 -20969 -17764 -32324 -34169 -12215 -7387 -4221 12874 -12733 -32380 2222 21918 -6312 40719
8103 40719 27475 -4450 -14749 -11948 -6465 -32899 -52206 -32627 -14128 6615 17684 21104
8091 21104 12029 -4006 14203 -485 12009 20616 16060 -9475 -14515 14362 15116 16349 9303
8078 9303 8390 9145 -12154 -2803 12923 -20699 -30150 -3772 23268 -2438 -11993 -21302 -19317 -13538
8064a3538J2680K2691P584j2949q124r078q321L4168q602M22k6214j9212O544
8051b1949J7759o132J266J9022j0472n82K4877m0887K9006J0704j5684o837J0272
8038A0363L2207l4585L583K2974J5852l4915j2324N769J6801J154J2756q61j391
8025C7383j3663N176j290n33m751q591Q177j028j0223k0466K9215J071k1988R36
8011e75K8962k1693J505J2711j538k838m564j3373o389L687P956K8924m3346j4153
7997b4724J7000K2725Q754q409k0117O544J155J5571J2010j6644K196J160m911
7984A2310o692J2341R877J0554o950l1209l122j1580K8237J3585L832J1330m176
7971C8337j0482m080Q121J6867j0801M041K5802L017k1892J283K7349k4572k8402
$$ plain form
8064 -13538 -858 21833 29417 16468 8344 -734 -9055 25113 16511 16933 -9281 -28493 -21949
8051 -21949 -4190 -10322 -9056 9966 -506 -1088 23789 -17098 11908 22612 6928 91 10363
8038 10363 42570 7985 11568 34542 50394 15479 3155 8924 25725 26879 39635 38774 37383
8025 37383 23720 28896 27606 27073 22322 13731 21908 20880 10657 -9809 19406 20477 -1511 -575
8011 -575 28387 6694 8199 20910 19372 16534 11970 -1403 -7792 -4105 3851 32775 -10571 -24724
7997 -24724 -7724 15001 23755 15346 -4771 1773 2928 18499 30509 13865 16061 17221 12310
7984 12310 5618 17959 27836 38390 31440 231 -2891 -14471 13766 27351 31183 42513 38337
7971 38337 27855 23775 31896 48763 37962 42003 67805 70822 48930 50213 77562 52990 24588
7958B4588J6925J7005j3862j8542l404L5909l2410k7846K3972L1710n126P08K238
7945E1865j593J920k1158j3003J1729j1402J1184Q929P626k2524J0786m742K315
7932C1932K3168k7136J7220K5613n485j0809l639L343j6150K0851J0965m0366
7920B9507j4750O028K2615K650L8339k936N108j652j0303j0144J1247k3564J1067
7907F3212j6119K1716J518o221q96o815K1062j3668j7069n707L4030j5367L5135
7894I4811m998k1407p863L4385M275o732O693m1083p299L0646j502k225r055K3566
7880I2212N498K337j4766p743j752J2982J0332j2828K442J4816j3881K1926m214
7867A07361k8908q305K0645k733M847p541p669L6964j5199r532l65M2561j4346
$$ plain form
7958 24588 41513 58518 44656 26114 22710 58619 26209 -1637 22335 54045 48919 49627 51865
7945 51865 50272 52192 31034 18031 29760 18358 29542 38471 46097 23573 34359 29617 31932
7932 31932 55100 27964 45184 70797 65312 54503 50864 54207 38057 58908 69873 29507
7920 29507 14757 20785 43400 46050 84389 81453 86561 84909 74606 64462 75709 52145 63212
7907 63212 47093 68809 70327 64106 63210 56395 77457 63789 46720 41013 75043 59676 94811
7894 94811 89813 68406 60543 94928 99203 92471 99164 58081 50782 81428 79926 77701 68646 92212
7880 92212 97710 100047 85281 77538 75786 88768 99100 86272 88714 103530 89649 111575 107361
7867 107361 78453 70148 90793 88060 92907 85366 77697 114661 99462 89930 89565 132126 117780
7854A17780k4550K9701o567k1616M245J4780J8532k521j0386j161K687Q130J1991
7841A41045n238N187J3879p885n3298L1416L3227j8458O869j6615j2790N4185
7829A71524l0137J5037j000k0984K4010R605m231J719J178J04j0959O429L6455
7816A98750p00j0872j9007J2100k3548K6956K7688J2203j3390J6173k0092J1519
7804B17780j85J3137M8775l8426k2585J3928n175J4000l725k6980Q372K254O081
7791B27251L4480P300j9051j466O242J8011k1836P408M514K465J3255L672k4209
7778B58036N510J588j55M5598J308J3909J3612l6272j4256O284K0250j2355J2340
7765C15397L2743K0195L406K921R613J4911J396q430l6026K1666J2278r624r885
$$ plain form
7854 117780 93230 122931 116364 94748 98993 113773 132305 129784 119398 118237 120924 129054 141045
7841 141045 135807 140994 154873 146988 93690 125106 158333 139875 146744 130129 117339 171524
7829 171524 141387 156424 155424 134440 158450 168055 163824 165543 166721 166825 155866 162295 198750
7816 198750 198050 187178 168171 180271 156723 183679 211367 223570 210180 226353 206261 217780
7804 217780 217595 230732 279507 241081 218496 232424 227249 241249 237524 210544 218916 221170 227251
7791 227251 261731 269031 249980 248514 254756 272767 250931 258339 262853 265318 278573 282245 258036
7778 258036 263546 265134 264979 310577 311885 325794 339406 303134 288878 295162 315412 303057 315397
7765 315397 348140 368335 371741 374662 384275 399186 400582 392152 356126 377792 390070 380446 370561
7752C70561j9586N6568L2951k5327K832m275q067Q363M1041J8195J02n828j0199
7739D57331L1839K5568j6639P48J3849p321r837J1493J2111J6694K678j6968m319
7726E17227J6087k334K5461J0958j1084K9244m022o140J3644J4829o850q393O836
7713E95463O0045K878j9333k3580L6958L7951l8220r536J9220n060l993J2236
7701F65029K8544R310q44n103p378N532j4788K7461J1683j5659K1573Q979o07
7688G33732j5314l170K822J4384M116J0072J8075j0923J3671O119l2257J6118
7676G57445J583K425J3281p135M233N550j6566M425J0046J9840j6664j6775O025
7663G67713q238j2160P909k201l924L731K394Q919M1949k9181j271J5782k2402
$$ plain form
7752 370561 350975 407543 440494 415167 417999 413724 405657 414020 455061 473256 473358 467530 457331
7739 457331 489170 514738 498099 498847 512696 505375 495538 507031 519142 535836 538514 521546 517227
7726 517227 533314 530980 556441 567399 556315 585559 581537 575397 589041 603870 597020 588627 595463
7713 595463 655508 658386 639053 615473 652431 690382 652162 642626 661846 656786 652793 665029
7701 665029 693573 702883 702039 696936 689558 695090 680302 707763 719446 703787 725360 734339 733732
7688 733732 718418 715248 718070 732454 736570 746642 764717 753794 767465 773584 741327 757445
7676 757445 759028 761453 774734 767599 771832 777382 760816 765241 775287 795127 778463 761688 767713
7663 767713 759475 747315 755224 753023 749099 752830 755224 764143 806092 776911 775640 791422 769020
7650G69020o187J3135j0816r126k9237p416l423J4291L5006j5044m316j4669J0809
7637G42027l667J7047j5587p506r268l308O833J0287j4019L565k1689Q86j8585
7624F87016q24j353n363K2650J0279J0591j4876l3529J967k1737m080K0332k8948
7611F42125r47J1140j3127j2281P679j2193K699K269K134l2029R81k9581j4292
7598E54577R468J2085Q196j1008K2804n770k623l2135o494l16p951k2040J1787
7585E30580K249k3663j2774m059r631j1952k2786L6358J5377j640n136j485k2479
7572D68959j2198l802j1117J6145l2001p558j8486L4578j03k1388j0737m236P211
7559D05267k772k230L078k953o192J1120l2783P392L746l589k9216k1140J5329
$$ plain form
7650 769020 762833 775968 765152 756026 726789 719373 715950 730241 765247 750203 745887 731218 742027
7637 742027 738360 755407 739820 732314 723046 719738 726571 736858 722839 726404 704715 705601 687016
7624 687016 686192 684839 679476 702126 712405 722996 708120 674591 676558 654821 650741 671073 642125
7611 642125 641178 652318 639191 626910 634589 622396 625095 627364 629498 597469 598450 568869 554577
7598 554577 564045 576130 584326 573318 596122 590352 587729 555594 549100 548784 540833 518793 530580
7585 530580 532829 509166 496392 492333 482702 470750 447964 484322 499699 498059 492923 491438 468959
7572 468959 456761 452959 441842 457987 425986 418428 399942 434520 434417 413029 402292 398056 405267
7559 405267 402495 400265 403343 400390 394198 405318 372535 379927 383673 380084 350868 329728 345057
7546C45057j718m01j028K4170j2873j9895k0745l253L956k3393J9818M894j0456
7533C04133k1547p633J9972r231J7410j0217m2655K1220J4991k566r730N054N308
7520B84509j6047k2531O62m286J4264K63k2755j828L1998j9335M74k5521m8106
7507A71761L7296J2951O48l5770K8088L981n810o131j8433J1085J5439l837k3300
7494A87968j4253K3616Q976M891j5827j5824k851M772k9714J600J7688N256j08
7481A76190l209r645j397m697j0640K4846j907N170L527J6704j9512l1882N79
7468A44127K6073L0058k7852r105J353j7673J2697J7119n690j4959l6561j7726
7456A01861J5718J8311k688R616j6533k2030L984l322M4928r67K209j0058k0162
$$ plain form
7546 345057 343339 342938 341910 366080 353207 333312 312567 309314 313270 289877 309695 314589 304133
7533 304133 282586 274953 294925 285694 303104 292887 250232 271452 286443 283877 274147 279201 284509
7520 284509 268462 245931 246593 242307 256571 256834 234079 232251 264249 244914 245388 219867 171761
7507 171761 209057 222008 222656 186886 214974 218955 213145 207014 188581 199666 215105 211268 187968
7494 187968 173715 197331 206307 211198 195371 179547 176696 181468 151754 153354 171042 176298 176190
7481 176190 172981 163336 161939 157242 146602 171448 169541 174711 178238 194942 175430 143548 144127
7468 144127 170200 200258 172406 163301 164654 146981 159678 176797 171107 156148 119587 101861
7456 101861 117579 135890 133202 142818 126285 104255 108239 104917 149845 148878 151087 141029 120867
7443A20867R849k60J159l556j5503K804R581j3405M520l582J330k5426M073K708
7429I5159J0210j4038O797J3421J5513q319k7523K2251K8918k2381k132m368p735
7416A05773K4904j1557M030k2533J352k0910j1682J0949J8270R623p583Q198m217
7403A04617k872K0441j3088k1548j1362K4827K8610N328j6324L980K194j8710
7391A06093j8171j130q43j0272J7950Q905Q54j0120k8385J8785K6634j1751k0072
7378G8477L66k4669J8604j694P77J5580p935r678n176m76K2270J8283Q59k221
7364A03367k1425l2263J3345J270J212K2441k4012O133J6217l939J9058j7656
7352H3748j0719J1527N990k2527j1724L0178M548j8432o02L7610l1508N672p100
$$ plain form
7443 120867 130716 130456 131615 128059 112556 115360 124941 111536 116056 112474 113804 88378 92451 95159
7429 95159 105369 91331 98128 111549 127062 118743 91220 113471 142389 120008 117876 113508 105773
7416 105773 130677 119120 123150 100617 101969 81059 69377 80326 98596 108219 100636 108834 104617
7403 104617 101745 122186 109098 87550 76188 101015 129625 134953 118629 122609 124803 106093
7391 106093 87922 86792 85949 75677 93627 102532 103386 93266 64881 83666 110300 98549 78477
7378 78477 78843 54174 72778 71084 71861 87441 79506 69828 64652 64176 86446 104729 105588 103367
7364 103367 81942 49679 63024 64294 65506 87947 63935 70068 86285 82346 101404 83748
7352 83748 73029 84556 90546 68019 56295 86473 91021 72589 71987 109597 78089 83761 76661
7339G6661j6107j3137J1739J5813P446N829J3717j5034l401J0069J1254Q24K922
7326A08595p641j3875k0631k0768J3565j0964J8883J5142j7507k5336K5640J79
7314F5282p770j831M955K8461j5141k609j9399K1O160L8921J3474j9463K0240
7301A11301j9075M042q540l547J6427K4813j1324p070J042k3486q734K1300K5513
7288A22662l2707j771K5220k6221l617j8409p910R865L431K5147p281K497j4949
7275G5957j6149J8551K2768j1953j1278j3455J3518O087j7834q22K3580M267l3220
7262F0017K593O959J1837O626P158j7816L613j0449L436J4459J756j4560j5750
7249E9879j1284n438J5730P664o824N597J6152j1793r699q672R596J6136l200
$$ plain form
7339 76661 60554 47417 59156 74969 82415 88244 101961 86927 83526 93595 104849 105673 108595
7326 108595 100954 87079 66448 45680 59245 48281 67164 82306 64799 39463 65103 65282
7314 65282 57512 55681 60636 89097 73956 71347 51948 51969 58129 97050 110524 91061 111301
7301 111301 92226 96268 87728 84181 100608 125421 114097 107027 108069 84583 75849 97149 122662
7288 122662 89955 88184 113404 87183 83566 65157 57247 67112 70543 95690 88409 90906 75957
7275 75957 59808 78359 101127 89174 77896 64441 77959 84046 66212 65390 88970 93237 60017
7262 60017 62610 69569 81406 88032 95190 77374 80987 70538 73974 88433 90189 75629 59879
7249 59879 48595 43157 58887 66551 59727 65324 81476 69683 59984 51312 60908 77044 73844
7236G3844q891J2167k0783j9516R382K5642j2008o998q120k78l780R523K0215
7223G0399P096j1023k1108J2899j670J4845Q613J30k8143m94L0677L84j5506j7576
7209D9523o01j6293J6340M1090l5368j4614l267P434M94J92J0756J1566j7391
7196D9861k0367L2833K0981p839j2000q15k67L91j087j0925k4376Q35J211Q899
7182C7335K195Q469M991l537k7548K1380j1369M519J8356j640j8461K689L0299
7169F7678l602O150O317k1336j3339L320j9477Q038K7633R268j0492l447j4818
7156D1893J0625P08r55J3612m267K448o169j4661N856k0122R832J3220j1600j7556
7142B2864N800R587J4836k857p848J234j5137J9423P418N000J819k4555o486J252
$$ plain form
7236 73844 64953 77120 56337 36821 46203 71845 59837 52839 44719 44441 40661 50184 70399
7223 70399 77495 66472 45364 58263 56593 71438 80051 80181 52038 51544 82221 82605 67099 49523
7209 49523 48922 32629 48969 90059 54691 40077 36810 44244 44738 44930 55686 67252 49861
7196 49861 29494 62327 83308 75469 63469 62654 62387 62778 61691 50766 26390 27225 28436 37335
7182 37335 39530 47999 52990 49453 21905 43285 31916 36435 54791 53151 34690 37379 67678
7169 67678 64076 70226 76543 55207 41868 45188 25711 33749 61382 70650 60158 56711 41893
7156 41893 52518 53226 52271 65883 61616 64064 57895 43234 49090 28968 38800 52020 40420 22864
7142 22864 28664 38251 53087 50230 42382 43616 28479 47902 55320 60320 62139 37584 31098 32350
7128C2350K8004j2360j2939l550N131J1700q058Q299P585J899n727K859K802K0336
7114G8331o75k9845k1349K7954j0722R327p313l0106K3013K6326j4728K0474m852
7101F5835K167O669k5472j403O820K1952j520k2217M417j5162j0454L3418o160
7088E8890k3128q373K4457J4315m792j1742M737K1796L245m7268L4663j7022J2468
7075F2246J4040J993k5606l9438N641J8750K7117j7444O114O15N520l355j4828
7062D1365M343o86l9561j5120K8726K2186r304L753L362j6612J6909J629L10J3372
7048E4672R716j3989j087N668K536O380j7715O801p495J940j273J75J1144J271
7034E8744k7583J345M7010l584j5621M306O285j2452M740m526K509j4704j5357
$$ plain form
7128 32350 60354 47994 35055 31505 36636 48336 40278 48577 56162 58061 52334 55193 57995 78331
7114 78331 77656 47811 26462 54416 43694 53021 45708 15602 38615 64941 50213 70687 65835
7101 65835 68002 74671 49199 47796 54616 76568 75048 52831 57248 42086 31632 65050 58890
7088 58890 35762 27389 51846 66161 61369 49627 54364 76160 79405 32137 66800 49778 62246
7075 62246 76286 78279 52673 13235 18876 37626 64743 47299 53413 54028 59548 56193 41365
7062 41365 45708 45022 5461 -9659 19067 41253 31949 35702 39064 22452 39361 40990 41300 54672
7048 54672 64388 50399 49312 54980 57516 63896 46181 52982 45487 47427 46154 46329 57473 58744
7034 58744 31161 32506 79516 75932 60311 64617 70902 58450 63190 58664 61173 46469 31112
7021C1112J4445J118j65K4466J8806q389j9737q313L3591k365k7645j324O719
7008F2319l0614K6095J2513q81o260j2858J9306p936r357J5373j290k8183j4951
6995B3276K9764J7888j825l1401J9305J5507R4j6801j364P59m728M013J5791J7495
6981H7773p923K5053k3338j930J6079N694o307j2756k0026J0014J8825k0610K3965
6968I4513J042j4993m320k828j9255M374J1547O319j1998r718o526J0762K8543
6955H7462O459j3978j4583j0418r96O243K512J246J4629J2932R105N393m0288
6942F5718L620J7988j0856J171O192J2846j0033M910j519j5614m852j759K9645
6929I7457l4928j3570J8771K0317k0184k1096J3458L1488n116j3561Q822n248
$$ plain form
7021 31112 45557 46675 46510 70976 89782 81393 61656 53343 86934 84569 56924 55600 62319
7008 62319 31705 57800 70313 69432 63172 50314 69620 61684 52327 67700 66410 38227 23276
6995 23276 53040 70928 69103 37702 57007 72514 72608 55807 54443 55202 50474 54487 70278 87773
6981 87773 79850 104903 81565 79635 95714 101408 95101 82345 62319 72333 91158 70548 94513
6968 94513 95555 80562 76242 73414 54159 58533 70080 76399 64401 54683 48157 58919 87462
6955 87462 93921 79943 65360 54942 53946 60189 62701 63947 78576 91508 100613 106006 65718
6942 65718 69338 87326 76470 77641 83833 96679 86646 91556 90037 74423 69571 67812 97457
6929 97457 62529 48959 67730 88047 67863 46767 60225 91713 86597 73036 81858 76610
6917G6610l046k028J5414L3224l58Q77l361K638l476r686j7664j2401l472j8837
6903E4434o014q845K5854L2941j5340R879J5706J3944K417j0535K285J9012m97
6890A35241j0753j0532J6061O99p840O946k2226J4046N812O949K4012j1949k1045
6877A25421j727Q127j3087k9874j2497K4059J1142j4690j7805K1789N295P249
6865A13402r905p203Q06J1586m27m100j3534N749K5954n030m56k674j8782p789
6851H7597M2138r372r168j6650L6142j7713k1751J7085j1023j4766J4296O355
6839A03170j0280k909J6559K1040j7897n0383N572L0648j0004J471J9966k6778
6827H0175j896K2829o398R582R408k273j8644J9226n731L050o017l172K0650P840
$$ plain form
6917 76610 73564 71536 86950 120174 119816 120693 117332 119970 116494 106808 89144 76743 73271 54434
6903 54434 48420 39575 65429 98370 83030 92909 108615 122559 124976 114441 116726 135738 135241
6890 135241 124488 113956 130017 130716 122876 129822 107596 121642 127454 134403 158415 146466 125421
6877 125421 123694 131821 118734 88860 76363 100422 111564 96874 79069 100858 106153 113402
6865 113402 103497 96294 97100 108686 108259 104159 90625 96374 122328 117298 116842 114168 95386 87597
6851 87597 129735 120363 111195 94545 130687 112974 91223 108308 97285 82519 96815 103170
6839 103170 92890 89981 106540 127580 109683 59300 64872 95520 85516 86987 106953 80175
6827 80175 78279 101108 94710 104292 113700 111427 92783 112009 106278 109328 103311 100139 120789 128629
6813A28629L018l1737o746o50p695j2454K3134K1315J3675j5808l730j7967P711
6800A00695L3632k9809O332p157J4283p163j0948J5489k3570O364j4320J016L2911
6787A17755M616k5430r602m703K3786J4908j6228J3540m695r131J8842k2581k9738
6774G1339K6081L4543o248k5868j469L801K035J2716j1930k6001L536J5445M365
6761A02345J4459J6829o441k0909K317J8783J0549j8888K47K0637p276r696m506
6748A18450M047j2864N950j5131q418K004K8834J7892j2015j2107K7515P741j6019
6735A35879j0928l500o116K6360K2123j5801j3782j2330n11q682M55k836J243
6722A11574K3742r325J41J0553L967o041J2192J2672r955j1063L277O521P948
$$ plain form
6813 128629 131647 99910 93164 92514 84819 72365 95499 116814 130489 114681 110951 92984 100695
6800 100695 134327 104518 110850 103693 117976 110813 99865 115354 91784 98148 83828 84844 117755
6787 117755 122371 96941 87339 82636 106422 121330 105102 118642 113947 104816 123658 101077 71339
6774 71339 97420 131963 125715 99847 98378 102179 104214 116930 105000 78999 82535 97980 102345
6761 102345 116804 133633 127192 106283 108600 127383 137932 119044 119291 139928 132652 122956 118450
6748 118450 122497 109633 115583 100452 92034 94038 122872 140764 128749 116642 144157 151898 135879
6735 135879 124951 121451 115335 141695 163818 148017 134235 121905 121394 112712 113167 110331 111574
6722 111574 135316 125991 126132 136685 140652 134611 146803 159475 149520 138457 141734 148255 156203
6709A56203J51m304k2145J632J1213n560j371j0061J8629k4888K2096J1594l595
6696A49594j0952j1300K0233N014J8974N637Q991j6867k1820j3957J4393J6800
6684A64740p253J0489m012J6142J4678j9930r289R940l022n071O237j3629j1460
6671A48560J4773j686J8755r90k005n039K447L163l2486R192J1774R05K3971k572
6657A88762m756j2737O873P989r589l0654J9387J0113k64K4725j937q376j1110
6644A78426P117J3086j8183L956J3655L789j4135l86J7319J1799L141j489o357
6631B11738j3340P887O148J3194Q57O475m010k594Q074J9279o647k034j5567n572
6617B23888O340j6423J2336k229K978J4039j015J2644l530Q757j9642J3633j9248
$$ plain form
6709 156203 156354 152050 129905 131537 142750 137190 135819 125758 144387 119499 141595 153189 149594
6696 149594 138642 127342 147575 152589 171563 177200 186191 169324 147504 133547 147940 164740
6684 164740 157487 167976 163964 180106 194784 174854 165565 175505 172483 167412 173649 160020 148560
6671 148560 163333 161647 180402 179412 177407 172368 174815 177978 145492 154684 166458 167363 191334 188762
6657 188762 184006 171269 178142 186131 176542 145888 165275 175388 175124 199849 197912 189536 178426
6644 178426 185543 198629 180446 184402 198057 201846 187711 187325 204644 216443 219584 218095 211738
6631 211738 198398 206285 212433 225627 226484 232959 228949 226355 234429 253708 247061 245027 229460 223888
6617 223888 230228 213805 226141 223912 226890 240929 239914 252558 249028 257785 238143 251776 232528
6604B32528P328m061q0L433M193L750J809K576J7492Q688j6644J8300J3687j4243
6590B78756O836p77k2666J352n163J9173j2836j0579O06N021K0939k0247K3045
6577B83460M6809M071j8592k5753J5756j0569Q421K1664n869J138J7575k2137
6565C15974O883J5740J8470k9791L4842J7230k4124Q910J3723K2643r298j0594
6553C80608q360j5307J7663J1195J1647J5719k2928O971J1922J3311o962j6488
6541C98991P251K8732j384P167J2062o96P886o634Q902K2044K1961L0779j0527
6528E26534j0355M964J8201j3699R577K1605m002N6398m333J614Q199l933K4429
6515F35199O677l192J1878J5760K5204K2130J8254O032J9764K4981J6018J2129
$$ plain form
6604 232528 239856 235795 235715 239148 243341 247091 248900 251476 268968 277656 261012 279312 292999 278756
6590 278756 285592 284815 262149 263501 258338 277511 264675 254096 254702 259723 280662 260415 283460
6577 283460 330269 334340 315748 289995 305751 295182 303603 325267 319398 320536 338111 315974
6565 315974 322857 338597 357067 327276 362118 379348 355224 364134 377857 400500 391202 380608
6553 380608 372248 356941 374604 385799 397446 413165 390237 397208 409130 422441 415479 398991
6541 398991 406242 434974 433590 440757 452819 452123 460009 453375 462277 484321 506282 537061 526534
6528 526534 516179 521143 539344 525645 535222 556827 552825 609223 604890 606504 614703 610770 635199
6515 635199 641876 638684 650562 666322 691526 713656 731910 737942 757706 782687 798705 810834
6503H10834r12K6924N1008L4193L4350K7391J5392L6238L9248O064J5686N649
6491A102065N4363M9891K6215L6292M9349N1536Q212L6916J0538M3403L8338L8905
6479A546023O182J2836M1988M1440J7767L2082J3402j8805O151j1831O764k1683
6467A672316o82J7170O652J616j2423J0494q700l7132k1054Q811j7022j8063l2919
6454A569064k9430o002j5684j8375K622j4657m3452o269J750r948k380j402m62
6441A425375o050J4625J6565M786J4994J3163M000L0681M5812J3206K4199O3797
6429A665153P087K6481P4191M0159L9211N6768K7070L3683L6360K2645L7232O1924
6417B127964K8900K8257N6433K3279L5182K2692K3366K6327L3157J8040N293o168
$$ plain form
6503 810834 809922 836846 887854 922047 956397 983788 999180 1035418 1074666 1080730 1096416 1102065
6491 1102065 1156428 1206319 1232534 1268826 1318175 1369711 1377923 1414839 1425377 1468780 1507118 1546023
6479 1546023 1552205 1565041 1607029 1648469 1666236 1698318 1711720 1692915 1699066 1687235 1693999 1672316
6467 1672316 1671634 1688804 1695456 1697072 1684649 1695143 1686443 1649311 1628257 1637068 1620046 1601983 1569064
6454 1569064 1539634 1533632 1517948 1499573 1502195 1487538 1444086 1437817 1439567 1429619 1427239 1425837 1425375
6441 1425375 1419325 1433950 1450515 1455301 1470295 1483458 1487458 1518139 1563951 1577157 1601356 1665153
6429 1665153 1672240 1698721 1772912 1813071 1852282 1909050 1936120 1969803 2006163 2028808 2066040 2127964
6417 2127964 2156864 2185121 2241554 2264833 2300015 2322707 2346073 2372400 2405557 2423597 2428890 2422722
6405B422722l9596m581n390k0665j0874k1312k5839l9616j563n9265m0769m2217
6393B111035n6837k7394n1347m9031m6359n2320l2580o1197m6207m8479n8828
6382A580456l5049m1852m2895m8128j9906l8657j6244q241n7895o2380l4715j6663
6370A157831n956J6975j4075m8515k0904k2241L043n314j8529j6084l2549j4337
6358I79345m4637j39J4664J4364R368J883Q998j4161M569j2074l447K326L621
6345I64680j5478J5331K6270j7240j4977K0751J0401R70o915o62j4535R119J3587
6332I91302O258K5751L270J6776J4649L0049p594l258K8714J3665L5536L3136
6320A188254J7059l972K0953J5564n91J0929K2997K8011K3209L7606J8517j5560
$$ plain form
6405 2422722 2383126 2378545 2373155 2352490 2341616 2320304 2294465 2254849 2253286 2194021 2153252 2111035
6393 2111035 2054198 2026804 1975457 1926426 1880067 1827747 1795167 1733970 1687763 1639284 1580456
6382 1580456 1545407 1503555 1460660 1412532 1392626 1353969 1337725 1329484 1271589 1209209 1174494 1157831
6370 1157831 1151875 1168850 1154775 1106260 1085356 1063115 1066158 1060844 1042315 1026231 993682 979345
6358 979345 934708 934569 949233 963597 972965 974848 983846 969685 974254 962180 958733 961059 964680
6345 964680 949202 964533 990803 973563 958586 979337 989738 990708 983793 983131 968596 977715 991302
6332 991302 997560 1023311 1026581 1043357 1058006 1088055 1080461 1077203 1105917 1119582 1155118 1188254
6320 1188254 1205313 1201341 1222294 1237858 1237267 1248196 1271193 1299204 1322413 1360019 1378536 1362976
6308A362976L1520M5889J7047L4231M9299L6339K0249M4779M931N1814o69N927
6296A704332M5125L8344K4469k359J5281J4390J0924K8282K0380K085o378J9194
6284A914069L3800J0966O425L3873K9884k8226R001J8718J8996j2125K475n609
6272B032247K1649n279Q236K972p539l7555p179J0234q474l5521j9193J9707n096
6259A969209J0574N385K2570N617j455K6499M5399K3483L4574L6885L5109L2419
6247B246268J8928K0352P1827N7003N5760K8773N5963M6023J8052L8314K3162
6236B680425M5370L4244J4197L0302K0618L5428J1141J1696K4589L3598L4897
6225B976505o166p243K2792M6178L7149p84J8780L485J0756k719Q073R266J3577
$$ plain form
6308 1362976 1394496 1440385 1457432 1491663 1540962 1577301 1597550 1642329 1647260 1699074 1698405 1704332
6296 1704332 1749457 1787801 1812270 1809911 1825192 1839582 1850506 1878788 1899168 1901253 1894875 1914069
6284 1914069 1947869 1958835 1965260 1999133 2029017 2000791 2009792 2028510 2047506 2035381 2037856 2032247
6272 2032247 2053896 2048617 2056853 2059825 2052286 2014731 2007552 2017786 2009312 1973791 1954598 1974305 1969209
6259 1969209 1979783 1985168 2007738 2013355 2011900 2038399 2083798 2107281 2141855 2178740 2213849 2246268
6247 2246268 2265196 2285548 2357375 2414378 2470138 2498911 2554874 2600897 2618949 2657263 2680425
6236 2680425 2725795 2760039 2774236 2804538 2825156 2860584 2871725 2883421 2908010 2941608 2976505
6225 2976505 2970339 2963096 2985888 3032066 3069215 3068431 3087211 3090696 3101452 3098733 3106806 3116072 3129649
6212C129649N397m948K1588P977P723K1902N553j5828J1222q81P362o328J8636
6199C209024l4035K160K0253j3891m014Q221k4671l2853m774j3559j0206j507
6187C100148K5512k8786n472j907K350M814J7223M778Q129n0k6414Q860j618K0135
6173C127702L177k510m837O6403k112j5348l24m2847k4494J2765k370j2781k2538
6160C079886j3032k0822r620J8632K0098k5478l2569L9801J3252j9199L1284o568
6148C075665j4050J2867p22L5163J7205M7033O278J1833K5195m444N0611R897
6136C272531j1183M2412J9240R960K8255M1585K1535K6281K3035L7560J7370J3779
6124C542360N5511O3209M4662K4352P1056N5284L9973M8614M8497N1532O0356
$$ plain form
6212 3129649 3135046 3130098 3151686 3159663 3167386 3189288 3194841 3179013 3190235 3189354 3196716 3190388 3209024
6199 3209024 3174989 3177149 3197402 3183511 3179497 3187718 3163047 3130194 3125420 3111861 3101655 3100148
6187 3100148 3125660 3096874 3091402 3089495 3091845 3096659 3113882 3118660 3126789 3126739 3100325 3109185 3107567 3127702
6173 3127702 3130879 3128369 3123532 3189935 3187823 3172475 3172151 3129304 3104810 3117575 3115205 3102424 3079886
6160 3079886 3066854 3046032 3036412 3055044 3075142 3049664 3017095 3056896 3070148 3050949 3082233 3075665
6148 3075665 3061615 3074482 3073760 3108923 3126128 3173161 3179439 3191272 3216467 3212023 3262634 3272531
6136 3272531 3261348 3303760 3323000 3332960 3361215 3402800 3424335 3450616 3473651 3511211 3528581 3542360
6124 3542360 3597871 3661080 3705742 3730094 3801150 3856434 3896407 3945021 3993518 4045050 4105406
6113D105406O0054L8440N0601N9611M6723O2578N9841M4313K4107L2820O6164
6102D650658N427K5970L4244N8300K1861L268M8021K9106J5392J2160K4217L0569
6090D959193O217L9388J9925Q880K5852j0591j2664p713k1471m2945l8955n3040
6078D872076o8206o3842q4284j08605r0479j03883j19560r1030j03773j49350
6068C889064j01218r1643r6010j21941j28489q4624j09620r9328q7599p0876r1999
6057B805717q8255o1200o9064m8875l9582o5231m5661l0125k9794l9188k7493
6046B261249j758l0115j8907j1132Q436j602j989J1995P076K0940J5915M1520
6034B301628J2856j1956J348L3978K0108o6123l5093K426l2439p3883n5688p3710
$$ plain form
6113 4105406 4165460 4203900 4254501 4314112 4360835 4423413 4483254 4527567 4551674 4584494 4650658
6102 4650658 4656085 4682055 4716299 4774599 4796460 4799728 4847749 4876855 4892247 4904407 4928624 4959193
6090 4959193 4965410 5004798 5024723 5033603 5059455 5048864 5036200 5028487 5007016 4964071 4925116 4872076
6078 4872076 4803870 4740028 4655744 4547139 4456660 4352777 4233217 4142187 4038414 3889064
6068 3889064 3787846 3696203 3600193 3478252 3349763 3265139 3155519 3056191 2968592 2897716 2805717
6057 2805717 2717462 2656262 2587198 2538323 2498741 2433510 2387849 2357724 2327930 2288742 2261249
6046 2261249 2259491 2229376 2210469 2199337 2207773 2206171 2204182 2216177 2223253 2244193 2260108 2301628
6034 2301628 2314484 2302528 2303876 2337854 2357962 2291839 2256746 2259172 2226733 2152850 2097162 2023452
6022B023452p5299m2123m5759m8905k8972l0214n4706l4992n0985l4503n744k8039
6010A543211k4271m1084k4905M913j9431j2325J8082j380l0077j5813j8208J7047
5998A395759J1152j586O841J5960j5773o3507J4634q801m6035N517k7840n7160
5986A229161o356j2058k0454k6597q816j9496j9727k6491q728J3057m4339k5898
5974A023258k1574K17k2745j7525k5840M439Q257l8904J2254n493k977j9421m1359
5961H52587M615j2798J0105J3291j8200k9507M318j182Q374j0206k3273K391k6524
5948G73991j0749K8665j785j2018j6834k02K9770n3178K2983K3901m556J1536
5936G91524O697m575k694J951j7276k8172J4665J2726n450j890K1556K0067k5942
$$ plain form
6022 2023452 1948153 1906030 1860271 1811366 1782394 1752180 1697474 1662482 1611497 1576994 1571250 1543211
6010 1543211 1518940 1477856 1452951 1457864 1438433 1426108 1444190 1442810 1412733 1396920 1378712 1395759
5998 1395759 1406911 1405325 1412166 1428126 1412353 1348846 1363480 1354679 1308644 1314161 1286321 1229161
5986 1229161 1222805 1210747 1190293 1163696 1154880 1135384 1115657 1089166 1080438 1093495 1049156 1023258
5974 1023258 1001684 1001901 979156 961631 935791 940230 948487 909583 921837 916344 913367 893946 852587
5961 852587 857202 844404 854509 867800 849600 820093 824411 823229 831603 821397 798124 800515 773991
5948 773991 763242 791907 790122 778104 761270 761068 790838 737660 760643 784544 779988 791524
5936 791524 798221 793646 790952 792903 775627 747455 762120 774846 769396 767506 789062 809129 783187
5923G83187k7808N453n371J1568L1714j671j713O286k2489k952M38p492l377l552
5909G62221J4208J0754K3139O585j4034m125O218J4289P024M544J5594j8864j8810
5896H08743L4938j359J8603j6260k5705J6933J0515J9631J9982K6635j3690j3682
5884H85284N360m882L275M66J2364m414k1998K0728J5949K4620j4294O355j0734
5871I18079K158L1044O979M124J7908j997J4546j1739m026L3669M3275k0163p512
5858A026345J248q112J2932O399N045P482j470K5774J4892j9454k3486J8770L1816
5845A098181J0278m827j4150J3960J8117O572R143L0214N881J7853n874j5541
5833A169807r824P876m442L1179j133K4570J613N899J92j7453J8196J8223J2006
$$ plain form
5923 783187 755379 760832 755461 767029 798743 797072 795359 801645 779156 776204 776642 769150 765773 762221
5909 762221 776429 787183 810322 816907 802873 798748 804966 819255 826279 830823 846417 827553 808743
5896 808743 843681 842322 860925 844665 818960 835893 846408 866039 886021 912656 898966 885284
5884 885284 890644 885762 889037 889503 901867 897453 875455 896183 912132 936752 922458 928813 918079
5871 918079 920237 951281 958260 962384 980292 978295 992841 981102 977076 1010745 1054020 1033857 1026345
5858 1026345 1027593 1019481 1032413 1038812 1043857 1051339 1049869 1075643 1090535 1071081 1047595 1066365 1098181
5845 1098181 1108459 1103632 1089482 1103442 1121559 1128131 1137274 1167488 1173369 1191222 1185348 1169807
5833 1169807 1159983 1167859 1163417 1194596 1193463 1218033 1219646 1225545 1225737 1208284 1226480 1244703 1256709
5820A256709J3482K8576J8450N17j2738K1830K4521J567N690L5771l082J6873
5808A408166J3872R488K6666R927q03L1327K9865R104j6136N3740l524K0390J2819
5795A604901J165L8428L2436j8420m244K5191J8542L0318M119J7442j613K4772
5783A773037L7827R806j6740M8352L8103K0112K7063K1857j385L9884L2465L3760
5771B064141L5797J7099J8900L5895K3442N7810J5152J756M2424O2213J513L9293
5759B415435L5786J2320M2996J6717M1789N9165K5011L9315L9403J3483L1930
5748B773350K6500K9745L7242M7784L1675L7684L3538M5955K6615M9497K3136
5737C162721l711M1953J8920N3472J6381L4070N0928k014M5600K6297J1243l35
$$ plain form
5820 1256709 1270191 1298767 1317217 1317734 1304996 1326826 1351347 1352914 1358604 1394375 1391293 1408166
5808 1408166 1422038 1431526 1458192 1468119 1467316 1498643 1528508 1537612 1521476 1575216 1571692 1592082 1604901
5795 1604901 1606066 1644494 1676930 1658510 1654266 1679457 1697999 1728317 1732436 1749878 1748265 1773037
5783 1773037 1810864 1820670 1803930 1852282 1890385 1910497 1937560 1959417 1958032 1997916 2030381 2064141
5771 2064141 2099938 2117037 2135937 2171832 2195274 2253084 2268236 2269992 2312416 2374629 2376142 2415435
5759 2415435 2451221 2463541 2506537 2523254 2565043 2624208 2649219 2688534 2727937 2741420 2773350
5748 2773350 2799850 2829595 2866837 2914621 2946296 2983980 3017518 3063473 3090088 3139585 3162721
5737 3162721 3159010 3200963 3219883 3273355 3289736 3323806 3374734 3372720 3418320 3444617 3455860 3455525
5725C455525M6440L9333L6973K4552K7334J5125K8493K3357L4493M5316J9030
5714C795971L461K881L6113J2690J5687M1842L6367K5785O0696J4106K3465N5794
5702D124858K2080J2859N1064M8120L7936r77N2111K8470L6638K7732J7276N311
5690D463478J5055K8302N3911K2873J4981L8588J5992L2878M6632K2820M0033
5679D795543L7060L757K9903K5720M4504j6638k793n310p358j1436k8102j3953
5667D850897r283j4448O190J3115k7680k6222K7246Q425J6266K4411M6137J2462
5655D927516P454R893P46k0487L5131Q735j515O471K8155J9527K2385K3210P291
5642E074512Q499M6960O581K2850L4904P177J8342J6618L3198K3425J7123M9586
$$ plain form
5725 3455525 3501965 3541298 3578271 3602823 3630157 3645282 3673775 3697132 3731625 3776941 3795971
5714 3795971 3799432 3802313 3838426 3851116 3866803 3908645 3945012 3970797 4031493 4045599 4069064 4124858
5702 4124858 4146938 4159797 4210861 4258981 4296917 4295940 4348051 4376521 4413159 4440891 4458167 4463478
5690 4463478 4478533 4506835 4560746 4583619 4598600 4637188 4653180 4686058 4732690 4755510 4795543
5679 4795543 4832603 4836360 4866263 4891983 4936487 4919849 4917056 4911746 4904388 4892952 4864850 4850897
5667 4850897 4841614 4827166 4833356 4846471 4818791 4792569 4819815 4828240 4844506 4868917 4915054 4927516
5655 4927516 4934970 4944863 4945609 4925122 4960253 4968988 4967473 4973944 5002099 5021626 5044011 5067221 5074512
5642 5074512 5083011 5129971 5136552 5159402 5194306 5201483 5219825 5236443 5269641 5293066 5310189 5359775
5630E359775P9930O7639K9174N1349N0544L3115L1266M9028R5045M3115P8973
5619E968953Q3109N6459O3873P8020O4327O3442M9226Q6097P3114P0606J10782
5608F768008P6752Q5353R5226R3335J07080J18305J07606J15156J42944J12189
5598G821954J07646J59246J32024J01444J36199J20298J47403J70062J32806J23626
5588I152708J35834J43014J64951J29711J54841J66452J45335J53760J75269J53018
5578A0674893J75008J98744K23735J96064K05589K29043K45812K51049K76642
5569A2676579K65072K66494K40417K56019K82250K74779K58791K47916K87616
5560A5055933L11202K62293L12557L29977L02641L25233L28057L63182L71941
$$ plain form
5630 5359775 5439705 5507344 5536518 5587867 5638411 5671526 5702792 5751820 5846865 5889980 5968953
5619 5968953 6052062 6108521 6172394 6250414 6314741 6378183 6427409 6513506 6586620 6657226 6768008
5608 6768008 6844760 6930113 7025339 7118674 7225754 7344059 7451665 7566821 7709765 7821954
5598 7821954 7929600 8088846 8220870 8322314 8458513 8578811 8726214 8896276 9029082 9152708
5588 9152708 9288542 9431556 9596507 9726218 9881059 10047511 10192846 10346606 10521875 10674893
5578 10674893 10849901 11048645 11272380 11468444 11674033 11903076 12148888 12399937 12676579
5569 12676579 12941651 13208145 13448562 13704581 13986831 14261610 14520401 14768317 15055933
5560 15055933 15367135 15629428 15941985 16271962 16574603 16899836 17227893 17591075 17963016
5551A7963016L87950M26122M53148M41428M71038N19069N06889N16768N81785
5542B2267213O48861O92361O96244P55088P94596Q28091Q73224R38726J004011
5533B9498415J046817J091870J175958J296346J382690J453405J562228J641543
5525D0149272J740172J848622J927542K006746K148922K301496K433222K628707
5517E7184701K851370L116921L419181L732922M169414M628903N148572N713394
5509H9965378O421242P205669Q149567R248461J0527076J1885588J3419024J4961488
5501A71783493J6406966J7550453J8053792J7429718J4931408J0210832L538691
5494B69905353l963884j0561158j5187105j7794807j8728389j8507714j7492850
$$ plain form
5551 17963016 18350966 18777088 19230236 19671664 20142702 20661771 21168660 21685428 22267213
5542 22267213 22916074 23608435 24304679 25059767 25854363 26682454 27555678 28494404 29498415
5533 29498415 30545232 31637102 32813060 34109406 35492096 36945501 38507729 40149272
5525 40149272 41889444 43738066 45665608 47672354 49821276 52122772 54555994 57184701
5517 57184701 60036071 63152992 66572173 70305095 74474509 79103412 84251984 89965378
5509 89965378 96386620 103592289 111741856 120990317 131517393 143402981 156822005 171783493
5501 171783493 188190459 205740912 223794704 241224422 256155830 266366662 269905353
5494 269905353 265941469 255380311 240193206 222398399 203670010 185162296 167669446
5487A67669446j6010728j4293552j2631031j1010814r587826q355116p290184
5480H8490195o382202n660238n043865m462487l997260l558014l255822k957160
5472E3173147k730154k493490k309479k184769k026274j874867j752295j619395
5464C6182424j461500j384407j332969j246235j181477j102855j047804r93729
5456B6431448r30013q74835q08483q04618p03671p00639o60820o44330o10030
5447A9694009n71585n43127n39038m97902m86262m52241m17512m25028m02610
5438A5358704l78570l56062l51608l44131l38451l29829l17652k90794k83483
5429A2368124k84775k77596k88677k84092k88230k41021k53228k36837k05482
$$ plain form
5487 167669446 151658718 137365166 124734135 113723321 104135495 95780379 88490195
5480 88490195 82107993 76447755 71403890 66941403 62944143 59386129 56130307 53173147
5472 53173147 50442993 47949503 45640024 43455255 41428981 39554114 37801819 36182424
5464 36182424 34720924 33336517 32003548 30757313 29575836 28472981 27425177 26431448
5456 26431448 25501435 24626600 23818117 23013499 22309828 21609189 20948369 20304039 19694009
5447 19694009 19122424 18579297 18040259 17542357 17056095 16603854 16186342 15761314 15358704
5438 15358704 14980134 14624072 14272464 13928333 13589882 13260053 12942401 12651607 12368124
5429 12368124 12083349 11805753 11517076 11232984 10944754 10703733 10450505 10213668 10008186
5420A0008186k02447k02127k15001j94507j52338j56846j74457j46027j58967
5411H405469j72500j23610j47373j50974j34820j38815j20746j58610j54438j19707
5401F983876r3368j40730j03245j11245j04600j00494r6359r9481o6382p5860
5391E992112p1792j09176q1618o6975m2983n1880r3027n2011p0168p0259p9705
5380E202518n9965o6922j02197r0036n4339n3020n1031p7259n2700m7725m8751
5369D498573n0341r2781q2718l5928o2715l9735k9633n7311o6753k8291l8062
5358C914305o3796l9121m0911p4386p3370l5911k9066m8029m9855k8998l9897
5347C390965k5670j2006k8763n8423k2598l1301k7408k3810o016l2425k4543m048
$$ plain form
5420 10008186 9805739 9603612 9388611 9194104 9041766 8884920 8710463 8564436 8405469
5411 8405469 8232969 8109359 7961986 7811012 7676192 7537377 7416631 7258021 7103583 6983876
5401 6983876 6890508 6749778 6646533 6535288 6430688 6330194 6233835 6134354 6067972 5992112
5391 5992112 5920320 5811144 5729526 5662551 5619568 5567688 5474661 5422650 5352482 5282223 5202518
5380 5202518 5142553 5075631 4973434 4883398 4829059 4776039 4725008 4647749 4595049 4547324 4498573
5369 4498573 4448232 4355451 4272733 4236805 4174090 4134355 4104722 4047411 3980658 3952367 3914305
5358 3914305 3850509 3811388 3770477 3696091 3622721 3586810 3557744 3509715 3459860 3430862 3390965
5347 3390965 3365295 3353289 3324526 3266103 3243505 3212204 3184796 3160986 3154970 3122545 3098002 3093954
5335C093954n521j0843j3504J0159K9331o638m895M927J2353m21K151p357k1432
5322C082264k2606m872k3524J2046K7406m6317k5024K5383K0497l783J1093k903
5310C049660O1665K7043k852J7756L891K2931K5727q878j2764j2992K548o998
5298C166737K2441K7471K3040J4712O071K9038K7659J454L3790L2935J233N6247
5286C442828J4139K5218O0331M7173N1486J0190M4543M8309L8511L6866O1220
5275C880814K9420O1832M8203M3082O3496N1983L8956K8217M7099N8274K4714
5264D376090M3731K9053K8766K5251L6418M3946k1811M7058K1243J6117P998J0200
5252D664060J7498J0839L0899J1686J4678L0762m219K7637j7668l634Q211J6051
$$ plain form
5335 3093954 3088433 3077590 3064086 3074245 3103576 3096938 3092043 3096970 3109323 3108902 3111053 3103696 3082264
5322 3082264 3059658 3054786 3031262 3043308 3070714 3024397 2999373 3024756 3045253 3041470 3052563 3049660
5310 3049660 3111325 3138368 3135516 3153272 3157163 3180094 3205821 3196943 3184179 3171187 3173735 3166737
5298 3166737 3189178 3216649 3239689 3254401 3260472 3289510 3317169 3318623 3352413 3385348 3386581 3442828
5286 3442828 3456967 3482185 3542516 3589689 3641175 3651365 3695908 3744217 3782728 3819594 3880814
5275 3880814 3910234 3972066 4020269 4063351 4126847 4178830 4217786 4246003 4293102 4351376 4376090
5264 4376090 4419821 4448874 4477640 4502891 4539309 4583255 4561444 4608502 4629745 4645862 4653860 4664060
5252 4664060 4681558 4692397 4723296 4734982 4749660 4780422 4776203 4803840 4786172 4782538 4790749 4806800
5240D806800j2549l286M606j2806L322K4582J6769l9588r582m934l748q951J9911
5227D780546k4772k7792k9850k9561O116J7457j6418n978j1723k7802l8738j6619
5215D574866j9485j8721k1666k4955n1118r901k2294o6316l4733l4389l6796l0119
5203D204373k3123m6540n6045l5820l3882p4105o1314m1511k9650m8672l9256
5192C714455k8153l8677k2441k2969n3286j3740k3658r42n0212n5233j2361l6169
5180C356614k8179l7663p1871o5445l224K1123k1821k9878m2299j6776l0892m8253
5168B981436k7544K822l0944m4030k1820j1039k1227k9769j8883k8561r965j4464
5156B726012m408m0311k9693j0489k6496j5093k7143k5421j9798p461l2344m4515
$$ plain form
5240 4806800 4794251 4790965 4795571 4782765 4786087 4810669 4827438 4787850 4778268 4773334 4769586 4760635 4780546
5227 4780546 4755774 4727982 4698132 4668571 4674687 4692144 4675726 4669748 4658025 4630223 4591485 4574866
5215 4574866 4555381 4536660 4514994 4490039 4438921 4429020 4406726 4340410 4305677 4271288 4234492 4204373
5203 4204373 4181250 4134710 4078665 4042845 4008963 3934858 3873544 3832033 3802383 3753711 3714455
5192 3714455 3686302 3647625 3625184 3602215 3548929 3535189 3511531 3510589 3460377 3405144 3392783 3356614
5180 3356614 3328435 3290772 3218901 3153456 3150232 3171355 3149534 3119656 3077357 3060581 3029689 2981436
5168 2981436 2953892 2956714 2925770 2881740 2859920 2848881 2827654 2797885 2779002 2750441 2740476 2726012
5156 2726012 2721604 2681293 2651600 2641111 2614615 2599522 2572379 2546958 2527160 2519699 2487355 2442840
5144B442840O697L0755l6254n1189k239J7028j9601o841j5421l5984l6467L453
5132B296777j3869k4446o090k805Q97k2910p666l6838N009k2980l6692j6575k2009
5119B089803m8432m6737l1343J7550r285k8671j734l8809N416j0810l7422m7854
5107A811672M023j6309q724r024l3017j4286K600k2836m3971k3294k7687K4319
5095A643466j5392N145j9483M617J0924j2608L8297l9651k5508M5539j6352K5068
5083A644062j1615O877j405l4370K6530J9642l103O834J0178m891m772M0647l109
5070A691505p011J9674Q755K0279P114K016J3370L6973K111K8083M1073J1358
5058A875300K1400L8425L0380K385n31L6990L6519M9003M3575K794O9156L0110
$$ plain form
5144 2442840 2449537 2480292 2444038 2392849 2390610 2407638 2388037 2381196 2365775 2329791 2293324 2296777
5132 2296777 2282908 2258462 2252372 2249567 2250464 2227554 2219888 2183050 2188059 2165079 2128387 2111812 2089803
5119 2089803 2041371 1994634 1963291 1980841 1971556 1942885 1941151 1902342 1907758 1896948 1859526 1811672
5107 1811672 1815695 1799386 1790662 1781638 1748621 1734335 1736935 1714099 1670128 1646834 1619147 1643466
5095 1643466 1628074 1633219 1613736 1618353 1629277 1616669 1654966 1615315 1589807 1635346 1618994 1644062
5083 1644062 1632447 1639324 1637919 1603549 1630079 1649721 1646618 1653452 1663630 1658739 1653967 1694614 1691505
5070 1691505 1684494 1704168 1712923 1733202 1740316 1742332 1755702 1792675 1794786 1822869 1863942 1875300
5058 1875300 1896700 1935125 1965505 1967890 1967359 2004349 2040868 2089871 2133446 2136240 2205396 2235506
5046B235506L7289N0923R609M4207M8486O2681M8702N6648L3797O0745Q7784M4747
5034B821124P1657Q7290Q1982N3223P5475Q6532Q9791R8864P8315J21046R7248
5023C762547J27198J38110J24492J44605J43023J59058J65354J92414K22170K07956
5013E386927K24938K34434K47203L04204K68555K98652L07257L19984L70221L27441
5003H289816L29727L41059L30177L17058L22445L12686K74590K20402K39472J97363
4993A1174795J47727J16584P6215N6191N2000L1815L9049j1761p3013n6327p1826
4982A1481449q1154j04622j33050j51204j52399k39135k43052k63819k95187k61673
4972I556154l33512k99369l38871l74648l10787l29917l10187l14861l12311k98940
$$ plain form
5046 2235506 2272795 2323718 2333327 2377534 2426020 2488701 2537403 2594051 2627848 2688593 2776377 2821124
5034 2821124 2892781 2980071 3062053 3115276 3190751 3277283 3367074 3465938 3544253 3665299 3762547
5023 3762547 3889745 4027855 4152347 4296952 4439975 4599033 4764387 4956801 5178971 5386927
5013 5386927 5611865 5846299 6093502 6397706 6666261 6964913 7272170 7592154 7962375 8289816
5003 8289816 8619543 8960602 9290779 9607837 9930282 10242968 10517558 10737960 10977432 11174795
4993 11174795 11322522 11439106 11515321 11571512 11623512 11655327 11694376 11682615 11609602 11553275 11481449
4982 11481449 11400295 11295673 11162623 11011419 10859020 10619885 10376833 10113014 9817827 9556154
4972 9556154 9222642 8923273 8584402 8209754 7898967 7569050 7258863 6944002 6631691 6332751
4962F332751k41685k26271k44328k27359j97720j58711j88510j60430j52021j39745
4952D395971j33715j50414j39980j14278j13868j11960o0207q9440j04213o3218
4942C314678p2513p9524o7135o5810n3992o5694p3871n7489p5876m5313o3400
4931B594061l9001n9364l7612k2756m2938o9625m1236n3242m6547k4645j1621
4920B145474l8128m5470Q35m4022m8337m9102k1182R706m0341n6642j3725k7050
4908A772016l2760m2746j2483p820k2620m3429l4407j3252k2743l6070k6788l2205
4896A444693L931m8198n0693j6801j4505k0034o2266j2708m196l2522K60l9771
4884A147190q479J952l1215k9216l2803j5286k9208k7786j3657O899m29j7545
$$ plain form
4962 6332751 6091066 5864795 5620467 5393108 5195388 5036677 4848167 4687737 4535716 4395971
4952 4395971 4262256 4111842 3971862 3857584 3743716 3631756 3571549 3482109 3377896 3314678
4942 3314678 3242165 3162641 3095506 3029696 2975704 2910010 2836139 2778650 2702774 2657461 2594061
4931 2594061 2555060 2495696 2458084 2435328 2392390 2322765 2281529 2228287 2181740 2157095 2145474
4920 2145474 2107346 2061876 2062711 2018689 1970352 1921250 1900068 1909774 1869433 1812791 1799066 1772016
4908 1772016 1739256 1696510 1684027 1676207 1653587 1610158 1575751 1562499 1539756 1503686 1476898 1444693
4896 1444693 1448624 1400426 1349733 1332932 1318427 1298393 1236127 1223419 1219223 1186701 1186961 1147190
4884 1147190 1138711 1140663 1109448 1080232 1047429 1032143 1002935 975149 961492 968391 967962 950417
4872I50417M652R747j9597l1992j9103k2362L059L373l7312k3663k4155j8878
4860G74186k686j0909l9249q934N397j4754K253p782K114J8147j7211k2905j5743
4847F61924l2125N463k9258J0429J4509l6568M649j5J7239r361l3192j7981j5375
4834E40338Q054Q464J82l9824l731k605J6727j940j2762k0311j4073K7766K1682
4821E27967l2647n976K2608N806m9487k1359R193J2078J1341j9762M331J238q98
4808D64433j5942J5536l914R245p696m487J2243l2376K2884j889k1387o08j6158
4795D19884k1597K3260J841q317K5275K019k6470j2098m958q96q422O709J7986
4782D14216m405j5504l8777K1592L1271K1877k5818j5288j4609r423l3927j0364
$$ plain form
4872 950417 955069 964816 945219 913227 894124 871762 874821 878194 840882 817219 793064 774186
4860 774186 771500 760591 721342 712408 717805 703051 705304 697522 699636 717783 700572 677667 661924
4847 661924 629799 635262 606004 616433 630942 594374 599023 599008 616247 606886 573694 555713 540338
4834 540338 548392 556856 557038 517214 513483 510878 527605 525665 512903 492592 478519 506285 527967
4821 527967 495320 489344 511952 517758 468271 446912 456105 468183 479524 459762 464093 465331 464433
4808 464433 448491 464027 460113 469358 461662 457175 469418 437042 459926 458037 436650 436042 419884
4795 419884 398287 421547 423388 415071 440346 442365 415895 403797 398839 397943 389521 396230 414216
4782 414216 409811 394307 355530 377122 408393 430270 404452 389164 374555 365132 331205 320841
4770C20841K9477J9478m89K1939Q103N397j3991K934j4102K8652j4896L141k0093
4757C76391n414r00J184j8376k831L1043q354r39k5447O148j33M733k944L944
4743C58105K4945r127j3329k812n060J6610m6043j614N781P568l213j6427L2123
4730C47507N217j1614J1107k377J2671L5380k8176j7485K2330j1488j3752L573
4718C52893N580K1498K220p569j483p819K6769q851j2728L415J6624R791j5266
4705C85074r706L793N678M475M056j354P60K621J717J2511O196q33J4649K2128
4691D51765J397q316j9384q810K6682J7797J5997n440K531q33n912J8496j1189
4678D74781j2463N5554L0129k5418J742J1461J2776N173J9562j1418K2872K3070
$$ plain form
4770 320841 350318 369796 369307 391246 399349 404746 390755 393689 379587 408239 393343 396484 376391
4757 376391 370977 370077 371261 352885 350054 381097 372743 371804 346357 352505 352372 357105 354161 358105
4743 358105 383050 373923 360594 357782 352722 369332 323289 321675 327456 335024 331811 315384 347507
4730 347507 352724 341110 352217 349840 362511 397891 369715 352230 374560 363072 349320 352893
4718 352893 358473 379971 382191 374622 373139 365320 392089 383238 370510 373925 390549 400340 385074
4705 385074 375368 379161 384839 389314 393370 392016 392776 395397 397114 409625 415821 414988 429637 451765
4691 451765 453162 444846 425462 416652 443334 461131 477128 471688 474219 473386 467474 485970 474781
4678 474781 462318 517872 548001 522583 524325 535786 548562 553735 573297 561879 584751 607821
4666F07821N579j924M821p475K1333K1016Q607j4250j8889K4466l109L1702k730
4653F76968J8199L0535J2279O381k3910J1953R618J1206O661K3912K2662J3175
4641H19639J0676Q87J1795K9390P466M0583J5959J6582L0509K6971j2721N4936
4629A052672M6059L7324M6930L6701L0677N4468P2057M6945P3122Q3623Q4076
4618A664654O6215Q7805J16628J48506J38062J73429J69568K12821K55411K54111
4608C287210K73261K37329J81318K06059K18263K64550K87017L39297K94447K45707
4598E834458J88181J16806P7683J02301J71691J80145J79435J71928K2779j06510
4588F938897k11571k17359j83201j44635j22522j34877j75469k39752l00854l49479
$$ plain form
4666 607821 613400 611476 616297 608822 630155 651171 659778 645528 626639 651105 647996 679698 676968
4653 676968 695167 725702 737981 744362 720452 732405 742023 753229 759890 783802 806464 819639
4641 819639 830315 831202 842997 872387 879853 920436 936395 952977 983486 1010457 997736 1052672
4629 1052672 1098731 1136055 1182985 1219686 1250363 1304831 1376888 1423833 1496955 1580578 1664654
4618 1664654 1730869 1818674 1935302 2083808 2221870 2395299 2564867 2777688 3033099 3287210
4608 3287210 3560471 3797800 3979118 4185177 4403440 4667990 4955007 5294304 5588751 5834458
4598 5834458 6022639 6139445 6217128 6319429 6491120 6671265 6850700 7022628 7045407 6938897
4588 6938897 6727326 6509967 6326766 6182131 6059609 5924732 5749263 5509511 5208657 4859178
4578D859178k83719k68531k40030k20216k19877k39577k62870k43485j99428k43675
4568B437770j80194j81294j72660j27162j10130r7340j06448q8753l6655o6676
4558A270458q3495m3497k5262l8843l8608k2888n8843l8114j8010n051k0828k5832
4546H51187j8895N419m5474j3223k5555k9252k3596Q892O25m2746l4940J3853
4534F46295j9234J1179j9528j5765l4844M67K871j8354o763K7182M437o8773o834
4521E02336N14j0545k2696j1305n709J5316q236p747k4736p621J1987O976J1855
4508D50389Q901k2074J7473j8628l0865J0714J0116J6149j0154j5353L3303j3874
4496D36097J2839j9765q475k2392Q55J5093k4293j1766J6929j6674l3435N570
$$ plain form
4578 4859178 4575459 4306928 4066898 3846682 3626805 3387228 3124358 2880873 2681445 2437770
4568 2437770 2257576 2076282 1903622 1776460 1666330 1568990 1462542 1373789 1337134 1270458
4558 1270458 1186963 1143466 1118204 1079361 1040753 1017865 959022 920908 902898 897847 877019 851187
4546 851187 832292 837711 792237 779014 753459 724207 700611 709503 710128 667382 632442 646295
4534 646295 627061 638240 618712 602947 568103 568570 571441 553087 546324 573506 577943 509170 502336
4521 502336 502850 492305 469609 458304 452595 467911 459675 451928 427192 419571 431558 438534 450389
4508 450389 459290 437216 454689 436061 405196 415910 426026 442175 432021 416668 449971 436097
4496 436097 448936 429171 420696 398304 399159 414252 389959 378193 395122 378448 345013 350583
4484C50583o612J7106J6658j0160r902R311J1412j3556j069J3819j5035O156K0739
4471C89450l906j266k1407j1395m839J1922L7578j0299K326j8879J7081R357m978
4458C90745o183K5576r268O094J1973j2386J3476j0J0067n064k0503j921k7323
4445C75273j268J4429n546L0208m031r046Q253K3178J3283j8259q99J3067R595
4432D48237r709k8034J3565K8564j7063j9846L396j6792K1513L2106L873p072
4420D52738P20j8202J2540O99o832O492K0173l751m366K1357N799J9397j1226
4407D95538p511M904k4367Q110J3037J4478j731M665K8387l287J3138j2935k5971
4394E06455k18J0007M1785j7516j1438J0586L0556k1536K770L5979j4069K444
$$ plain form
4484 350583 343971 361077 377735 367575 357673 366984 378396 364840 363771 377590 362555 368711 389450
4471 389450 385544 384278 362871 351476 346637 358559 396137 385838 388164 369285 386366 395723 390745
4458 390745 384562 410138 400870 406964 418937 406551 420027 420017 430084 425020 404517 402596 375273
4445 375273 374005 388434 382888 413096 409065 400019 408272 431450 444733 426474 425575 438642 448237
4432 448237 438528 410494 424059 452623 435560 415714 419110 402318 423831 455937 459810 452738
4420 452738 453458 435256 447796 448495 441663 448155 468328 464577 460211 481568 487367 506764 495538
4407 495538 488027 492931 468564 476674 489711 504189 502458 507123 535510 532223 545361 532426 506455
4394 506455 506237 516244 558029 540513 529075 539661 570217 548681 551451 587430 573361 575805
4382E75805l860J4087Q360J9164p931N556N287K3003k980j9047O411k6392M0653
4369F38116J5520L559J8827j0970J4743M422j550L0034K3350L025K0323M777j0672
4356G53504J47K7378J7212j9658L4517k075J5755K5207r728L1363j5667J3009
4344H70964K2075L5647O618K8324K4994K2409r977j0603k967l685L7301L8238
4332A059338J8314J9743J5433R577K5718J4894K1008L9720J9147J6108J6902K4209
4320A300111M190K4197J7971J1454L9287K0101L1925L4508J6242K8625L2479k121
4308A558969K0964M7802J9667K9015L3439R783L2087K1356J8466M7506N4010K7350
4296A920414J8539R146L8225M1589K7497K8821K6559O4778P526P0437P3505N1180
$$ plain form
4382 575805 571945 586032 594392 613556 605625 611181 616468 639471 636491 617444 623855 597463 638116
4369 638116 653636 657195 676022 665052 679795 684217 682667 712701 736051 739076 759399 764176 753504
4356 753504 753651 781029 798241 778583 813100 811025 826780 851987 842259 873622 857955 870964
4344 870964 893039 928686 935304 963628 988622 1011031 1001054 990451 987484 983799 1021100 1059338
4332 1059338 1077652 1097395 1112828 1122405 1148123 1163017 1184025 1223745 1242892 1259000 1275902 1300111
4320 1300111 1304301 1328498 1346469 1357923 1397210 1417311 1449236 1483744 1499986 1528611 1561090 1558969
4308 1558969 1579933 1627735 1647402 1676417 1709856 1719639 1751726 1773082 1791548 1839054 1893064 1920414
4296 1920414 1938953 1948099 1986324 2027913 2055410 2084231 2110790 2175568 2183094 2253531 2327036 2378216
4284B378216J8404M5374O0018N2445M5186Q5813P7410M3926R7513R2417P6708
4273C073430N8884J06096Q8622J03442J26915J09858J14577J32684J37653J35415
4263D187576J33688J52959J54971J70017J61616J87750J73244J74997J82525K33012
4253E912355K20652J87554K02816K03668K21045K11994J96780K01839K20654J99046
4243G978403J94308K14927J73719K01918J70055J74357J66393J58734J45334J05226
4233I683374R9952Q7329O4981L2605N0177M9274M025r266j0054l3839k1820j3464
4221I983274k9375o6369p4886k8654l4154m2895j5818N1986R1012J03523K28960
4210A0166604L23179L90260N32895N37864J36582o71771r69970q44891p51174
$$ plain form
4284 2378216 2396620 2441994 2502012 2554457 2599643 2685456 2762866 2806792 2904305 2996722 3073430
4273 3073430 3132314 3238410 3327032 3430474 3557389 3667247 3781824 3914508 4052161 4187576
4263 4187576 4321264 4474223 4629194 4799211 4960827 5148577 5321821 5496818 5679343 5912355
4253 5912355 6133007 6320561 6523377 6727045 6948090 7160084 7356864 7558703 7779357 7978403
4243 7978403 8172711 8387638 8561357 8763275 8933330 9107687 9274080 9432814 9578148 9683374
4233 9683374 9783326 9870655 9935636 9968241 10018418 10067692 10071717 10062451 10052397 10018558 9996738 9983274
4221 9983274 9953899 9887530 9812644 9783990 9749836 9706941 9691123 9743109 9834121 9937644 10166604
4210 10166604 10489783 10880043 11412938 11950802 12087384 11415613 10445643 9600752 8849578
4201H849578o94994o26723n26883m73125l91298l33172k77929k28135k29313k13353
4191D854653j89673j79922j78287j64918j51175j46812r2377j08862j25651q6885
4181C430091j02272r1506r2758q9931n9422o3137l6390o2327q2134m7611k2487
4170B680116l3304m8638m6125m581p21j8542n4089J9119k8661k3206j9120r237
4158B413011o233m9420r80L4206J7709Q549N019Q549J494n658L0536J3844K6717
4145B497343J5115J8807L2764J0898q677L5430M7557J6689N7640J7963O846M1267
4133B789642N9704J2939J3777L7767L6335Q0416L3162J0255L0855P8890O4364
4122C248106J8290J7108J2675O8063M8719M1895L7802M1014O6780N6831M6452
$$ plain form
4201 8849578 8154584 7527861 7000978 6527853 6136555 5803383 5525454 5297319 5068006 4854653
4191 4854653 4664980 4485058 4306771 4141853 3990678 3843866 3751489 3642627 3516976 3430091
4181 3430091 3327819 3236313 3143555 3053624 2994202 2931065 2894675 2832348 2750214 2702603 2680116
4170 2680116 2646812 2598174 2552049 2547468 2546747 2528205 2474116 2493235 2464574 2441368 2422248 2413011
4158 2413011 2406778 2357358 2356378 2390584 2408293 2416842 2421861 2430410 2431904 2426246 2456782 2470626 2497343
4145 2497343 2512458 2531265 2564029 2574927 2566250 2601680 2649237 2665926 2723566 2741529 2748375 2789642
4133 2789642 2849346 2862285 2876062 2913829 2950164 3030580 3063742 3073997 3104852 3183742 3248106
4122 3248106 3266396 3283504 3296179 3364242 3412961 3454856 3492658 3533672 3600452 3657283 3703735
4111C703735O0996Q6133Q6123O5403M3319J5184N8464N7980N8288L5999L3927
4100D305551P8757N8339N5323K8300L4821M7028N2961O3237M0222N8029Q9965
4089D912533O0132O1249N1228L2218P4720J00377R8944J12355R1620J03685J12409
4078E811470J08822J41216J69344J58431J52827J97462J96080K34233K18477K32743
4068G621105K20785K62590L15050K86675L48539L38756L37066L40024L69224L98946
4058A0838760L77813M08981M30291M01034L81291M16876L65159L64910L81076
4049A4366191L20220L32567K99156K51551K06676J91385J21485P7673R3067J6078
4039A6276049o642o4235j34920j20049j64462k00315k56498k54304k80179k96354
$$ plain form
4111 3703735 3764731 3850864 3936987 4002390 4045709 4060893 4119357 4177337 4235625 4271624 4305551
4100 4305551 4384308 4442647 4497970 4526270 4561091 4608119 4661080 4724317 4764539 4822568 4912533
4089 4912533 4972665 5033914 5085142 5117360 5192080 5292457 5391401 5503756 5595376 5699061 5811470
4078 5811470 5920292 6061508 6230852 6389283 6542110 6739572 6935652 7169885 7388362 7621105
4068 7621105 7841890 8104480 8419530 8706205 9054744 9393500 9730566 10070590 10439814 10838760
4058 10838760 11216573 11625554 12055845 12456879 12838170 13255046 13620205 13985115 14366191
4049 14366191 14686411 15018978 15318134 15569685 15776361 15967746 16089231 16166904 16259971 16276049
4039 16276049 16269407 16205172 16070252 15950203 15785741 15585426 15328928 15074624 14794445 14498091
4029A4498091l56367l40499l30088l57711l68973m18583m10881l81378l74574
4020A1159037l81338m02511l80105m09017l61881l66146l62305l20529k94660
4011G880545k96331l20424k97642k61883k41301k52562k11800j99645j71164j58227
4001E469566j85663j15469j22211j13321j00676j22693q6018j00732n6572q1365
3991D384846q5969l7086n2289p0101l7927n4766n8701o1464m6686m0284p5792
3980C763781r1020l1127l4089n4604m4859o8971m7266p9311q5533l1641l0797
3969C164563m6007o3994o9991o1656m9929n4526n9161n2803m6752m6779n1531
3958B561434m2412m5628n2048j2491k9188l6802k7661p759k8584m0718j1539k5933
$$ plain form
4029 14498091 14141724 13801225 13471137 13113426 12744453 12325870 11914989 11533611 11159037
4020 11159037 10777699 10375188 9995083 9586066 9224185 8858039 8495734 8175205 7880545
4011 7880545 7584214 7263790 6966148 6704265 6462964 6210402 5998602 5798957 5627793 5469566
4001 5469566 5283903 5168434 5046223 4932902 4832226 4709533 4623515 4522783 4466211 4384846
3991 4384846 4298877 4261791 4209502 4139401 4101474 4046708 3988007 3926543 3879857 3839573 3763781
3980 3763781 3672761 3641634 3607545 3552941 3508082 3439111 3391845 3312534 3227001 3195360 3164563
3969 3164563 3118556 3054562 2984571 2922915 2872986 2818460 2759299 2706496 2659744 2612965 2561434
3958 2561434 2519022 2473394 2421346 2408855 2379667 2342865 2315204 2307445 2278861 2238143 2226604 2200671
3946B200671o608m1221n3019j0392q320j0896j0486k9604k0090j3767O051r211
3934A993108p710k6208j2501j1037k5448j0727l4012k2846k6392J4515M196r439
3922A825499j9196j0668K0678j924n479n099L318q479l0621J3640K01l79J0902
3909A792393k8851r012J1637J7928J5056K8261k113J347L4090r943j944L6259
3897A885108J7117L4785L1732O392J758k792K0998J1963M8469N9279K8722J9878
3885B163409M0111J9472K0338N3641L3417N2964P3531N6980L8528J6234O0181
3874B628806O6172Q9088N9996K9456L2844Q5692O1294N2640N7242Q5680M3845
3863C292755O1190P4673P1278N7445L6575M8808N6003P1186O0404L7470J1967
$$ plain form
3946 2200671 2194063 2152842 2099823 2089431 2081111 2070215 2059729 2030125 2010035 1996268 2002319 1993108
3934 1993108 1985398 1959190 1946689 1935652 1910204 1899477 1865465 1842619 1816227 1830742 1834938 1825499
3922 1825499 1806303 1795635 1816313 1814389 1808910 1803811 1807129 1798650 1768029 1781669 1781870 1781491 1792393
3909 1792393 1763542 1754530 1766167 1784095 1799151 1827412 1825299 1826646 1860736 1850793 1848849 1885108
3897 1885108 1902225 1937010 1968742 1975134 1976892 1974100 1995098 2007061 2055530 2114809 2143531 2163409
3885 2163409 2203520 2222992 2243330 2296971 2330388 2383352 2456883 2513863 2552391 2568625 2628806
3874 2628806 2694978 2784066 2844062 2873518 2906362 2992054 3053348 3105988 3163230 3248910 3292755
3863 3292755 3353945 3428618 3499896 3557341 3593916 3642724 3698727 3769913 3830317 3867787 3879754
3852C879754M8254O2546L8636O1906N3182J4563J8045q58P1031N0397N0282N1625
3840D399363O9276L0158N6326O2071O4387O5388P8455R8760P7760J01861J07029
3829E210834J46043J68120J27332J68327J78476J69099J91316K07460K10372K51677
3819G029056K31592K65495L02575K32200K83547K99663L22573L18526K95442L09543
3809I890212L29696L37648L08196K89126L08558L07623K97868K51372K39308K78329
3799A2837936K59295K11907J98190K10946J77853J54833J04633Q7968P8078O6574
3789A4388213L6224K0218m489m0208m6778l8593n7657j29522j27153j32304j31133
3778A3736818j46764k02256j91046k05381j80315k21951k52963k73993k61718
$$ plain form
3852 3879754 3928008 3990554 4029190 4091096 4144278 4158841 4176886 4176028 4247059 4297456 4347738 4399363
3840 4399363 4468639 4498797 4555123 4617194 4681581 4746969 4825424 4924184 5001944 5103805 5210834
3829 5210834 5356877 5524997 5652329 5820656 5999132 6168231 6359547 6567007 6777379 7029056
3819 7029056 7260648 7526143 7828718 8060918 8344465 8644128 8966701 9285227 9580669 9890212
3809 9890212 10219908 10557556 10865752 11154878 11463436 11771059 12068927 12320299 12559607 12837936
3799 12837936 13097231 13309138 13507328 13718274 13896127 14050960 14155593 14243561 14321639 14388213
3789 14388213 14424437 14444655 14440166 14399958 14353180 14314587 14256930 14127408 14000255 13867951 13736818
3778 13736818 13590054 13387798 13196752 12991371 12811056 12589105 12336142 12062149 11800431
3769A1800431l01189k70679k82440k77170k90789l39675k97500l07100k98009
3760I135880k90307k80966k89336l03275l00539l08889k72803k28100k57808k31768
3750F372089k29346k20367j91390j88002j82646j55017j70235j42690j16134j26906
3740D649356j01264j10181j05619p8323n7588r1409p7641l2565m4706n3367n1519
3729C845174l4265l9540m8431m5764l5812q5814m9136j0031o0024o4245n4886
3718C317226p6764o6571p0197m0422m9172q6689p8426n2888p3582n9739p0219
3707B592557o8246m4242o7084o4336o5683q2924q6106o7002m7634o8055p0627
3696A860618n1189q4679n9468m4397k2631n1984m4536n6307o4731j0877l8526
$$ plain form
3769 11800431 11499242 11228563 10946123 10668953 10378164 10038489 9740989 9433889 9135880
3760 9135880 8845573 8564607 8275271 7971996 7671457 7362568 7089765 6861665 6603857 6372089
3750 6372089 6142743 5922376 5730986 5542984 5360338 5205321 5035086 4892396 4776262 4649356
3740 4649356 4548092 4437911 4332292 4253969 4196381 4104972 4027331 3994766 3950060 3896693 3845174
3729 3845174 3810909 3771369 3722938 3677174 3641362 3555548 3506412 3496381 3436357 3372112 3317226
3718 3317226 3240462 3173891 3103694 3063272 3014100 2927411 2848985 2796097 2722515 2662776 2592557
3707 2592557 2524311 2480069 2412985 2348649 2282966 2200042 2113936 2046934 1999300 1931245 1860618
3696 1860618 1809429 1724750 1665282 1620885 1598254 1546270 1501734 1445427 1380696 1369819 1331293
3685A331293n2006m7423j9728j4109j0062n3355k5885o085j9579m1518k2613Q483
3673A027413l4951m8211j1282r530p433k8342q644l4645j1971q242k1162k8182
3661G74818l0797N626j5191j6918n550j8371j1734J8284k1609j5506j3165j8900
3649F30987Q420k456j5090j7671J6768l6808k5556L308n003J6429k0648N417Q193
3636E66290j3204m0506r263j1829k8689J1180J4496j1248j9901o309J2802J2662
3624D76481q772k0031j3567J4470j9478k962P092j635k0364k2134l951Q976o621
3611C87504M783N914r768j0699J166J8915J460k7822j8398j2942K3748M69k1448
3598C42882r467p508k752m019n430N898K4265l6189j0209N776o01k2063o653Q079
$$ plain form
3685 1331293 1279287 1231864 1212136 1198027 1187965 1134610 1108725 1102640 1083061 1041543 1018930 1027413
3673 1027413 992462 944251 932969 923439 916006 887664 879020 844375 832404 824162 803000 774818
3661 774818 744021 749647 734456 717538 711988 693617 681883 700167 678558 663052 649887 630987
3649 630987 639407 636951 621861 604190 620958 584150 558594 561902 556899 573328 552680 558097 566290
3636 566290 553086 512580 503317 491488 462799 473979 488475 477227 457326 451017 463819 476481
3624 476481 467709 447678 434111 448581 429103 426141 433233 431598 411234 389100 385149 394125 387504
3611 387504 392287 398201 388433 377734 378900 397815 399275 371453 353055 340113 363861 364330 342882
3598 342882 333415 325907 323155 319136 313706 319604 343869 307680 297471 303247 302646 280583 273930 282009
3584B82009K6969q401j4801k2997J5270j1335p745j7383J3558j5406J3326k4681
3572B28383Q49R277M2155j2869k6900J8847j5651Q397j2281q334J8183j4291k3569
3559B12196N779J6314j3283K8351j374j2917M212o948O164q984m147J0068k0513
3546B14918j8582K2419J3986j7449l0894j2074J8678K5582l2001J3794K5816L225
3534B27418r189P60k126J4664r539Q991J3857R278k9131m837J204J3529q169l3384
3520A93326Q491Q338J543J901K39K7345k8779l4243K1895K0418p412M260j05N831
3506B23048n518J88q307J8558j9336j0879L4293P50Q871j046j6681o435j1559
3493B05947J2373j0516K687K2446o081j2279L785J5437q172k8952o842Q59l102
$$ plain form
3584 282009 308978 300577 285776 262779 278049 266714 258969 241586 255144 239738 253064 228383
3572 228383 229232 238509 280664 267795 240895 259742 244091 252488 240207 231873 250056 235765 212196
3559 212196 217975 234289 221006 249357 247983 235066 239278 232330 238494 229510 225363 235431 214918
3546 214918 196336 218755 232741 215292 184398 172324 191002 216584 184583 198377 224193 227418
3534 227418 218229 218989 216863 231527 221988 230979 244836 254114 224983 220146 221350 234879 226710 193326
3520 193326 201817 210155 211698 213599 213838 241183 212404 178161 200056 220474 213062 217322 217217 223048
3506 223048 217530 217718 209411 227969 208633 197754 232047 232797 241668 240622 223941 217506 205947
3493 205947 218320 207804 210491 232937 226856 214577 218362 233799 225627 196675 189833 190692 187590
3480A87590J4502q79o506q32k1715K7547q22j6473o795o180J6938r399k6571K2751
3466A73156J6341P171m1682l1636K1402P817J8396J3388j070O91L929L766r64
3453A90705o724n431j1034P043R366j4781m092k6262j204J5984l3966J5168M1084
3440A75856J885K324K2229P610j2918m0373R514K6871K4151K2449J0506j5616
3428B34488l1598j1509K108J9237k9k2854j4025Q08P95j3543P061j7075M604l9802
3414A18666j5397L1664L596k4796L215j9650J2129Q992k3978K1941L5570l0866
3402A21086m6430K0165J0716J6714m192k5959j61p720p610P743j321j3169M675
3389G4537r750K9873J8205j5161J6322J5913p746m1827J6161p57Q956n688p278
$$ plain form
3480 187590 202092 201213 194707 193875 172160 199707 198885 182412 175617 169437 186375 176976 150405 173156
3466 173156 189497 196668 154986 123350 144752 152569 170965 184353 183283 183974 187903 191669 190705
3453 190705 183981 178550 167516 174559 183925 169144 165052 138790 137586 153570 119604 134772 175856
3440 175856 177741 180065 202294 209904 196986 156613 166127 192998 217149 239598 250104 234488
3428 234488 202890 191381 193489 212726 212697 189843 175818 176626 177421 163878 170939 153864 158468 118666
3414 118666 103269 134933 138529 113733 116948 97298 109427 118419 94441 116382 151952 121086
3402 121086 74656 94821 105537 122251 118059 92100 91939 84219 76609 84352 83031 69862 74537
3389 74537 64787 94660 112865 97704 114026 129939 122193 80366 96527 95770 104726 99038 91760
3376I1760j3895j5469L4226m099J4025J9417o448R101J5902o212l0459j9802M3694
3363A31741R146J976m634l2531K5494L3061J1416K7467k5934m246J8772J8241
3351B09969j5268j9372L0901K4208n421M001q14P952n2197l7427j7425p178k0584
3338A01345l397J2255j6069k3471J3841J0873M068j3678j1618J3066k654n998
3326G8563j9385K8017j2774O165j5126l0027J1869J3456o768N231n54O818m324
3313F1161j8932J1667N833q405J7040j013J4862J3313k9854o838K2901m367L656
3300H1024J3896p231j6683o815j5553K4061p968J8441n383p740j2872p136k020
3287D8021J2356j2692N06K156p271j7567O932Q99k927L9041j637q93j100J3544
$$ plain form
3376 91760 77865 62396 96622 92523 106548 125965 119517 128618 144520 138308 107849 88047 131741
3363 131741 140887 142863 138229 105698 131192 164253 175669 203136 177202 172956 191728 209969
3351 209969 194701 175329 206230 230438 225017 229018 228204 236156 183959 146532 129107 121929 101345
3338 101345 97948 110203 94134 70663 84504 95377 99445 85767 74149 87215 84561 78563
3326 78563 59178 87195 74421 80586 65460 35433 47302 60758 53990 59221 58667 65485 61161
3313 61161 42229 53896 59729 51324 68364 67351 82213 95526 65672 58834 81735 77368 81024
3300 81024 94920 87689 71006 64191 48638 72699 64731 83172 77789 70049 57177 50041 48021
3287 48021 60377 47685 48191 50347 43076 25509 32441 33340 30413 69454 67817 66924 65824 79368
3273G9368K4526j7283K293L3204J2934l838l1122k7737J2986j3677n366J5357
3261H1645j6712j3702O383o895k111J0328j7859K6880j173r480J0196k9437j25
3248C7938K2267j4380J5124k575L961J161Q800J0019K1061L940j1702K933j3114
3235H5433O183N969k5110k2736q901L6574j1438l3069j834o990J0075j0076n612
3222A8468P181N926J820r825J3161R949M22M554r492j3160o783P309j6993l544
3208H993L912J8618J849k4017J8k0565J9196m07N933K0329j0464l912l32N35k0648
3193i62j652K4827J5181m4p420k2864J1107k7122P907J6919l558J1120L708n465
3179B1682N783J8544k6275o895J235J978k2220J1692J1750J0898J4466j3728j1451
$$ plain form
3273 79368 103894 86611 88904 122108 135042 131204 100082 72345 85331 71654 66288 81645
3261 81645 64933 51231 57614 50719 48608 58936 41077 67957 66784 57304 67500 38063 37938
3248 37938 60205 45825 60949 58374 62335 63496 72296 82315 103376 107316 95614 98547 85433
3235 85433 91616 97585 72475 49739 40838 77412 65974 32905 31071 24081 34156 24080 18468
3222 18468 25649 31575 33395 23570 36731 46680 47102 51656 42164 29004 22221 29530 12537 8993
3208 8993 12905 31523 33372 9355 9373 -11192 8004 7597 13530 33859 23395 19483 19151 19686 -962
3193 -962 -2614 22213 37394 37350 29930 7066 18173 -8949 -1042 15877 12319 23439 27147 21682
3179 21682 27465 46009 19734 12839 14074 16052 -6168 5524 17274 28172 42638 28910 17459
3166A7459J2517q940j507J2706o04j1368J3142l212n677J6223j2013j6134L374
3153A5966O540j6352J2571P798K3J2810J2547p886k1986N264P075o348j5020o607
3139F395K0681J363N215q214r476P010j3020K8322p577L104j2127n254J0538J3226
3125D0186J0907j7956J3817k8189J360J9297K1645m649j2291J636j4329L0781
3113F2215m629R546j8560K623M969K1927k4589L360J4745k1964q45J857J6447
3100F7102m379M537k1982J1016L0836J8188o263r034j9445J4237j7946p580K2548
3087H1835L295J2783j0915l3501n718O938K4694p202L90j1698q508j2845o090
3074C3458K2104j3739j855J0444m881N105j3045P543q28N843n345J0753J3516
$$ plain form
3166 17459 29976 21036 19529 32235 31631 20263 33405 30193 24516 40739 28726 12592 15966
3153 15966 22506 6154 18725 26523 26546 39356 51903 44017 22031 27295 34370 28022 13002 6395
3139 6395 27076 28439 33654 25440 15964 22974 9954 38276 30699 33803 21676 16422 26960 40186
3125 40186 51093 33137 46954 18765 20125 39422 61067 56418 44127 45763 31434 62215
3113 62215 57586 67132 48572 51195 56164 78091 53502 56862 71607 49643 48798 50655 67102
3100 67102 62723 67260 45278 56294 87130 105318 99055 90021 70576 84813 66867 59287 81835
3087 81835 85130 97913 86998 53497 47779 54717 79411 72209 72599 60901 52393 39548 33458
3074 33458 55562 41823 39968 50412 45531 50636 37591 45134 44306 50149 44804 55557 69073
3061F9073k6661j3409m322J140j5328j4678K4821L3366k798j3717L975j0019q674
3048B2769j5969J3189J2035L88O895K928j9238L430J608J113m672J1017K5996
3035F1489k2174j5327k4448J8880J0501L28q159N184k2155J253L098k7955M814
3022a4671J0880n310Q126Q730J1230j7472j6978J0056l440O633J9217n230j5902
3009d131J9475J1294j270k5246j7387R736j339Q658J6056j7705J1525J4929k0872
2996C723j3814k0495K5315J1561L577J2692n002j5834j9080j2943j3066O7172
2984B3806q527M996n54j8569Q079P868N078l53k1251o536J8632j634J2056q895
2970A4196o310k1293j5143M0683J2817n5455M426L5059m027j7568J4989O722k9097
$$ plain form
3061 69073 42412 29003 24681 25821 10493 -4185 20636 54002 51204 37487 41462 31443 22769
3048 22769 6800 19989 32024 32412 39307 42235 22997 26427 28035 29148 24476 35493 61489
3035 61489 39315 23988 -460 18420 28921 29249 21090 26274 4119 5372 8470 -19485 -14671
3022 -14671 -3791 -9101 -975 7755 18985 1513 -15465 -5409 -8849 -2216 17001 11771 -4131
3009 -4131 15344 26638 25368 122 -17265 -7529 -8868 -210 15846 -1859 9666 24595 3723
2996 3723 -10091 -30586 -5271 6290 9867 22559 17557 1723 -17357 -30300 -43366 23806
2984 23806 15279 20275 19721 1152 9231 17099 22177 21824 573 -5963 12669 11035 23091 14196
2970 14196 7886 -13407 -28550 12133 24950 -30505 -26079 8980 4953 -12615 2374 9096 -20001
2957b0001K0850L4932k3946o300o355J3684J1542l0422J9103K3782k8173l089
2945E607M199o226j6911N336j4936K2748J2758k2805L187j3731j0397n411K2749
2932a3833J3534N546J9142j708j644K450j4652k419M696k2147N106j0357q40l085
2918b0211p321K0790k558j487K9232k8813r405J7027L5156l5924l7487K0604M763
2905a5634J9014q050k049j452o614J1996j0720K2918J3365j5005p493l091N623
2892B808j2857J4843L0229j1571l8963l531J543j032K5568Q20k3534q884n978
2879c0539r415n185K7695Q418J1775j8915J9930Q311Q794o52j5156K737l632J3744
2865A7910j4351K669j8566j787L425l8620J6580K5633j79J5561L749k2912Q793
$$ plain form
2957 -20001 849 35781 11835 5535 -820 12864 24406 -6016 13087 36869 8696 5607
2945 5607 9806 3580 -13331 -7995 -22931 -183 12575 -10230 -7043 -20774 -31171 -36582 -13833
2932 -13833 -299 5247 24389 22681 21037 23487 8835 6416 11112 -11035 -5929 -16286 -17126 -20211
2918 -20211 -27532 -6742 -9300 -10787 18445 -10368 -19773 -2746 32410 -3514 -41001 -20397 -15634
2905 -15634 3380 -4670 -6719 -8171 -14785 -2789 -13509 9409 22774 7769 276 -2815 2808
2892 2808 -10049 4794 35023 23452 -15511 -19042 -17499 -18531 7037 7857 -15677 -24561 -30539
2879 -30539 -39954 -45139 -17444 -9026 2749 -16166 3764 12075 20869 20217 5061 7798 4166 17910
2865 17910 3559 6228 -12338 -14125 -10700 -49320 -32740 -7107 -7286 8275 12024 -10888 -2095
2852b095m769K1397j3517k5527J4972P92N066l061J1576j3093j26p078j504J450
2838a5517j2076Q940k03o669k0044J9932K4426j3547K0691j8698j9865N199L942
2825b3489J2688q109J3174n831j2746j4982m36j1619J0014K3364O536N285K4660
2812A8509l1687j2036Q080j1257N646r292j8256K3952K6345L360m936p602j6761
2799b5935O842J5970k2112O878M27j0757L5766n569q628J2037M726J0426l3123
2786a3052j0402m917o094Q521J1884K4617k364q054J1197k7962J847J6849k7814
2773b5744M1677O712k3024r423J3452L1932k3487l3277M560J3177J4621L443k1505
2760f886P844Q96M229m939l209j2644n89J4468P839l01j940l8704j209j4506K695
$$ plain form
2852 -2095 -6864 14533 1016 -24511 -9539 -8747 -3681 -6742 4834 -8259 -8385 -15463 -16967 -15517
2838 -15517 -27593 -18653 -18856 -25525 -45569 -25637 -1211 -14758 5933 -12765 -32630 -27431 -23489
2825 -23489 -10801 -18910 -5736 -11567 -24313 -39295 -39731 -51350 -41336 -17972 -11436 -6151 18509
2812 18509 -13178 -25214 -17134 -28391 -22745 -32037 -50293 -26341 4 3364 -1572 -9174 -25935
2799 -25935 -19093 -3123 -25235 -18357 -17930 -28687 7079 1510 -7118 4919 9645 20071 -13052
2786 -13052 -23454 -28371 -34465 -25944 -14060 10557 8193 139 11336 -16626 -14779 2070 -25744
2773 -25744 15933 22645 -379 -9802 3650 35582 12095 -21182 -16622 -3445 11176 14619 -6886
2760 -6886 958 1854 6083 1144 -2065 -14709 -15298 -830 7009 6708 4768 -33936 -35145 -49651 -46956
2745d6956L1705n118o806K2058K730l768K0431j9754j5012k2546l053K1078J8657
2732f354j2319M8K857k7801J8355K2884j22J2454M339l348j4245j0906M642j6655
2718b6171K1635n949J3332Q703j9350N645L2728r835r974j5035R63J0438r959
2705b829j2281L3107q391j575J4286m5660nJ0814o446J7929p154j736m175K2768
2691H652n789j1059J8047j4141j0071n799P671k7424J9205J2508j2938K244Q513
2678a0381o552l741j5175J6510L83n255K5769l0993J0355M15R80K366k6188R465
2664c2042J5038L493j5487Q588j3503J9914R401m253L639n668J3724J5902k6709
2651g963j6980K2472J7155l9492j7661R116K5125j1627j7580J5310L473K8709
$$ plain form
2745 -46956 -15251 -20369 -27175 -5117 -2387 -6155 14276 -5478 -20490 -43036 -46089 -25011 -6354
2732 -6354 -18673 -18625 -15768 -43569 -25214 -2330 -2452 10002 14341 10993 -3252 -14158 -9516 -26171
2718 -26171 -4536 -10485 2847 11550 -7800 -2155 30573 20738 10764 -4271 -3308 7130 -2829
2705 -2829 -15110 17997 9606 8031 22317 -23343 -23348 -12534 -18980 -1051 -8205 -9941 -14116 8652
2691 8652 2863 -8196 9851 -4290 -14361 -20160 -12489 -39913 -20708 -8200 -21138 -18894 -10381
2678 -10381 -16933 -20674 -35849 -19339 -18956 -24211 1558 -29435 -19080 -18665 -17685 -15319 -41507 -32042
2664 -32042 -17004 -13511 -28998 -20410 -33913 -13999 -4598 -8851 -5212 -10880 2844 18746 -7963
2651 -7963 -24943 -2471 14684 -24808 -42469 -33353 -8228 -19855 -37435 -22125 -18652 10057
2639A0057J0907j6370J6142j0512q687O808l859n139J0486K43j6744k4127L1589
2626G94j6157k126J2370l024J5656K079N447l617J1345j869p994k1946J5867J0836
2612A7661J126m4248P999m930J8469J2659m655K5263j1669j6232O906j1341o981
2599i973o153p856m087N692M614r007L755L288J1480r800J3065j8288q349J2982
2585a8637Q228J3245o239q608L335j8122J9156O980K1917j8655j1329J0606m519
2572b642K0367M129j8088k9825j9542O384N325N391K5693J3323m797r415j6773
2559b0470l294K6230m93k339k2991J6615R550l83j3179j0127J1634q828P765L3116
2545B2806J659j6583k436Q005l4651P092J686k8603M791J2203J7824j9425k1190
$$ plain form
2639 10057 20964 4594 20736 10224 1537 8345 4486 -653 9833 10076 -6668 -30795 794
2626 794 -15363 -17489 -5119 -8143 7513 9592 15039 11422 22767 20898 12904 -9042 6825 17661
2612 17661 18787 -25461 -17462 -22392 -3923 8736 4081 29344 17675 1443 8349 -2992 -9973
2599 -9973 -16126 -23982 -28069 -22377 -17763 -26770 -23015 -19727 -8247 -18047 -4982 -23270 -31619 -18637
2585 -18637 -10409 2836 -3403 -12011 -8676 -26798 -7642 -662 21255 2600 -8729 1877 -2642
2572 -2642 17725 21854 3766 -26059 -45601 -39217 -33892 -28501 -2808 10515 5718 -3697 -20470
2559 -20470 -23764 2466 1973 -366 -23357 -6742 2808 2425 -10754 -20881 -9247 -18075 -10310 22806
2545 22806 24465 7882 5446 13451 -21200 -14108 -12422 -41025 -36234 -24031 -6207 -25632 -46822
2532d6822j5836L2926J6387j1750N093J8876M690q312j8658n912J7387k1116j5099
2519d8146m1K4322L6866j5516r197N513m824p076Q412L090L7724n985j3384j1479
2505B79j669J0597j738Q479j0085j1165o38R274q803L621K488L3517j9166l5978
2491b0987K0875p31l1906J651M270K3251j7541K0823J1242n89k53l014j863J1861
2477A7089l9204J5914K1316n0769o372K9596L2504p509j2643R732l777R934j9019
2464c208n518J2739l465J2157k5811k676K7876n042k5313O29j8225L5439Q729
2451H311n426l306m599k3044K3476J3605k1736K446N509k668j986o559Q583N343
2437b051P022j9727k5518P096O279L0709j981r981J4202N587J6114Q47k0752j1909
$$ plain form
2532 -46822 -62658 -29732 -13345 -25095 -20002 -1126 3564 -4748 -23406 -29318 -11931 -33047 -48146
2519 -48146 -48187 -23865 13001 -2515 -11712 -6199 -11023 -18099 -9687 -6597 31127 25142 11758 279
2505 279 -1390 9207 7469 15948 5863 -5302 -5940 3334 -5469 -1848 640 34157 14991 -20987
2491 -20987 -112 -843 -32749 -31098 -26828 -3577 -21118 -295 10947 10358 10105 7091 5228 17089
2477 17089 -22115 -6201 15115 -35654 -42026 -12430 20074 12565 -78 9654 5877 15811 -3208
2464 -3208 -8726 4013 548 12705 -13106 -15782 12094 7052 -18261 -17632 -35857 -418 8311
2451 8311 2885 -421 -5020 -28064 -4588 9017 -12719 -10273 -4764 -7432 -9418 -15977 -7394 -2051
2437 -2051 4971 -14756 -40274 -33178 -26899 3810 1829 -8152 6050 11637 27751 28598 7846 -4063
2423d063J9208O386j3357K080l3332R037R264L063k6335K9972K4065l5970J2944
2410B962N460m270P840P678k2840l500k0712M810K5860j0529r043K7752J7014
2397B8482j5422r566q532K2257l298n341l661J1876J1192r720q382j110q34j0524
2383b583J4009l1221j9048R644J3432j0289J6528K2189j4620l0646R095P019K1306
2370D815Q186j3985R451p587j6123K4810K6238o030j7834n353m013k6053K0682
2357b796L460R624K0652j3659l238k1877j7562K724N216M252n51n771J7985p25
2343b266j8167j4839j0569N5374J0766j5430j7371p327J7630k5938J5470L602
2331i065k905J6796P443j5623J5725Q495P55P004j1103k3407l0133j1160K6787
$$ plain form
2423 -4063 15145 21531 8174 10254 -23078 -14041 -4777 -1714 -28049 1923 25988 -9982 2962
2410 2962 8422 4152 11992 19670 -3170 -6670 -27382 -22572 3288 -7241 -16284 11468 28482
2397 28482 13060 3494 -5038 17219 13921 8580 4919 16795 27987 18267 9885 8775 7941 -2583
2383 -2583 11426 -19795 -38843 -29199 -15767 -26056 -9528 12661 -1959 -32605 -23510 -16491 4815
2370 4815 13001 -984 8467 880 -15243 9567 35805 29775 11941 6588 2575 -23478 -2796
2357 -2796 664 10288 30940 17281 14043 -7834 -25396 -22672 -17456 -13204 -13755 -19526 -1541 -2266
2343 -2266 -20433 -35272 -45841 9533 20299 4869 -12502 -19829 -2199 -28137 -12667 -9065
2331 -9065 -11970 4826 12269 -3354 12371 20866 21621 28625 17522 -5885 -36018 -47178 -20391
2318b0391J4615O047J6480J1618J2491N34J4025Q499q653j6319n079k8923K6157
2305C1101m473J3401o085l9718J9067J4453n059m3161M37J5729N995q400J9815
2292A3102p712r170m59M500M17l6976k3226M5648K2762j0399J7348l2164N484
2279a0845M332O513k6427J6220J3628j9966L704K2605K956k7864j4819J8184J5674
2266C895j2688r553K049J8173J1704O320p783j0018J5546k5379J4057k5858L761
2253a5774K812N264l440J4651j4107l893N731l342r008l783K2871j0985o044r620
2239b8667M797J7711j1033j4250K3023j4618j922J4052J1956n161m148O650k4825
2226b6435J7850J908K4510p859k9797L7282l619m594M419j1338J2r08M629J7541
$$ plain form
2318 -20391 -5776 271 16751 28369 40860 41394 55419 63918 55265 38946 33867 4944 31101
2305 31101 26628 40029 33944 -5774 13293 27746 22687 -20474 -20037 -4308 1687 -6713 13102
2292 13102 5390 -3780 -4239 261 678 -36298 -59524 -13876 8886 -1513 15835 -16329 -10845
2279 -10845 -6513 0 -26427 -10207 3421 -16545 -12841 9764 12720 -15144 -29963 -11779 3895
2266 3895 -8793 -18346 -16297 1876 13580 19900 12117 2099 17645 -7734 6323 -19535 -15774
2253 -15774 -12962 -7698 -11138 3513 -10594 -14487 -8756 -12098 -21106 -24889 -2018 -13003 -19047 -28667
2239 -28667 -23870 -6159 -17192 -31442 -8419 -23037 -24959 -10907 1049 -4112 -8260 -1610 -26435
2226 -26435 -8585 -6677 17833 9974 -19823 17459 13840 9246 13665 2327 2339 1431 6060 23601
2212B3601p883j949l7774K444R19M941k21J6156l2460L512Q636K5157o329j4430
2198a5680J7751k303N389j1610j0493K0365J8173r580l2128J2664J2497r246n336
2185i537j5344n523l139L679M554J2591L031L17K0088m489M256J184J3084j8111
2171F641k6489J0092J0657J2276p42j9289O185K0551k1135k0365J8697L2046j7115
2158A2010j4508L067N140j5844N205r378N928M744n51K0726r563J3369k3588K033
2144a210k545Q897l765j4739R599j3861J1777j1168K8069L9278l6327j2364J3456
2131A5097J011J2950j6640j2486O294O15P673k774M365j160j6978N726l1734K1761
2117f280J5107j2872J0654j9438j5229K6804k51r58N492l951J6223l7934k927
$$ plain form
2212 23601 15718 13769 -24005 -21561 -20642 -15701 -15922 234 -32226 -28714 -20078 5079 -1250 -15680
2198 -15680 2071 -232 5157 -6453 -16946 3419 21592 12012 -20116 -7452 5045 -4201 -9537
2185 -9537 -24881 -30404 -33543 -29864 -25310 -12719 -9688 -9371 10717 6228 10484 11668 24752 6641
2171 6641 -19848 -9756 901 13177 12435 -6854 -669 19882 -1253 -21618 -2921 29125 12010
2158 12010 -2498 569 5709 -10135 -4930 -14308 -8380 -3636 -4187 16539 6976 20345 -3243 -1210
2144 -1210 -3755 5142 1377 -13362 -3763 -17624 -5847 -17015 11054 50332 14005 1641 15097
2131 15097 16108 29058 12418 -68 6226 6841 14514 11740 16105 14945 -2033 3693 -28041 -6280
2117 -6280 8827 -4045 6609 -12829 -28058 -1254 -1505 -2463 3029 -922 15301 -22633 -25560
$$ [...]
##END NTUPLES=NMR SPECTRUM
##END=
