##TITLE=1H_CA-9207-21
 CDCl3
 8 sc, 
 30.10.2023
##JCAMPDX= 6.0         $$ Bruker NMR JCAMP-DX V2.0
##DATA TYPE= NMR SPECTRUM
##DATA CLASS= NTUPLES
##ORIGIN= UXNMR, Bruker Analytische Messtechnik GmbH
##OWNER= root
$$ XWIN-NMR		Version 3.5
$$ Mon Oct 30 13:53:39 2023 Russian Standard Time (UT+4h)  she@DPX200
##.OBSERVE FREQUENCY= 200.13135
##.OBSERVE NUCLEUS= ^1H
##.ACQUISITION MODE= SIMULTANEOUS
##.ACQUISITION SCHEME= undefined
##.AVERAGES= 8
##.DIGITISER RES= 18
##SPECTROMETER/DATA SYSTEM= spect
##.PULSE SEQUENCE= zg30
##.SOLVENT NAME= CDCl3
##.SHIFT REFERENCE= (INTERNAL, CDCl3, 0, 15.7315)
##AUDIT TRAIL= $$ (NUMBER, WHEN, WHO, WHERE, WHAT)
$$ ##TITLE= Audit trail, XWIN-NMR		Version 3.5
$$ ##JCAMPDX= 5.01
$$ ##ORIGIN= Bruker BioSpin GmbH
$$ ##OWNER= she
$$ F:/spectra/data/she/nmr/H-F/1/pdata/1/auditp.txt
$$ ##AUDIT TRAIL=  $$ (NUMBER, WHEN, WHO, WHERE, WHAT)
(   1,<2023-10-30 13:52:22.32 +0400>,<she>,<DPX200>,
      <created by zg, POWCHK disabled, PULCHK disabled
       configuration hash MD5:
       00 E9 B6 7A A2 85 ED C7 34 08 36 98 17 FE 4E 26
       data hash MD5: 16K
       06 4D B6 EC D5 00 D0 40 CF 6C 41 E5 BB D0 B0 34>)
(   2,<2023-10-30 13:52:24.76 +0400>,<she>,<DPX200>,
      <Start of raw data processing
       efp BC_mod = 2 LB = 0.24 FT_mod = 6 PKNL = 1 PHC0 = -23869.11 PHC1 = 19.25271 SI = 16K 
       data hash MD5: 16K
       1B 35 04 A4 00 9E D0 EA CA F0 C0 81 98 60 D8 72>)
(   3,<2023-10-30 13:52:48.90 +0400>,<she>,<DPX200>,
      <pk PHC0 = 8.525504 PHC1 = -11.4 
       data hash MD5: 16K
       97 CD 06 B5 EF 83 A9 E6 BC BC 9B 90 DF C9 0B 61>)
(   4,<2023-10-30 13:52:52.59 +0400>,<she>,<DPX200>,
      <abs ABSG = 5 
       data hash MD5: 16K
       F2 25 12 16 62 9F 34 6F B5 26 17 06 62 A0 FC BA>)
$$ ##END=
$$ 
$$ hash MD5
$$ 4E E6 F4 5B 0D 3E EF 27 CF 62 96 E4 33 2D 1A 2C
##$RELAX= 
##$RELAX= 
##$RELAX= 
##$RELAX= 
##$RELAX= 
##$RELAX= 
$$ Bruker specific parameters
$$ --------------------------
##$DU= <F:/spectra>
##$EXPNO= 1
##$NAME= <H-F>
##$PROCNO= 1
##$TYPE= <nmr>
##$USER= <she>
##$AMP= (0..31)
100 100 100 100 100 100 100 100 100 100 100 100 100 100 100 100 100 100 
100 100 100 100 100 100 100 100 100 100 100 100 100 100 
##$AQSEQ= 0
##$AQ_mod= 1
##$AUNM= <au_zg>
##$AUTOPOS= <>
##$BF1= 200.13
##$BF2= 200.13
##$BF3= 200.13
##$BF4= 200.13
##$BF5= 200.13
##$BF6= 200.13
##$BF7= 200.13
##$BF8= 200.13
##$BYTORDA= 1
##$CFDGTYP= 0
##$CFRGTYP= 5
##$CHEMSTR= <none>
##$CNST= (0..31)
1 1 145 1 1 1 1 1 1 1 1 1 1 1 1 1 1 1 1 1 1 1 1 1 1 1 1 1 1 1 1 1 
##$CPDPRG= <>
##$CPDPRG1= <>
##$CPDPRG2= <>
##$CPDPRG3= <>
##$CPDPRG4= <mlev>
##$CPDPRG5= <mlev>
##$CPDPRG6= <mlev>
##$CPDPRG7= <mlev>
##$CPDPRG8= <mlev>
##$CPDPRGB= <>
##$CPDPRGT= <>
##$D= (0..31)
0 1.2 0 0 0 0 0 0 0 0.06 0 0.03 0 0 0 0 0.0002 0 0 0 0 0 0 0 0 0 0 0 0 
0 0 0 
##$DATE= 1698659541
##$DBL= (0..7)
120 120 120 120 120 120 120 120 
##$DBP= (0..7)
150 150 150 150 150 150 150 150 
##$DBP07= 0
##$DBPNAM0= <>
##$DBPNAM1= <>
##$DBPNAM2= <>
##$DBPNAM3= <>
##$DBPNAM4= <>
$$ [...]
##$SUBNAM3= <"">
##$SUBNAM4= <"">
##$SUBNAM5= <"">
##$SUBNAM6= <"">
##$SUBNAM7= <"">
##$SUBNAM8= <"">
##$SUBNAM9= <"">
##$SW= 18.05172834244
##$SWIBOX= (0..15)
0 0 2 0 0 0 0 0 0 0 0 0 0 0 0 0 
##$SW_h= 3612.71676300578
##$TD= 16384
##$TD0= 1
##$TE= 0
##$TE2= 300
##$TE3= 300
##$TEG= 300
##$TL= (0..7)
0 120 120 120 120 120 120 120 
##$TP= (0..7)
150 150 150 150 150 150 150 150 
##$TP07= 0
##$TPNAME0= <>
##$TPNAME1= <>
##$TPNAME2= <>
##$TPNAME3= <>
##$TPNAME4= <>
##$TPNAME5= <>
##$TPNAME6= <>
##$TPNAME7= <>
##$TPOAL= (0..7)
0.5 0.5 0.5 0.5 0.5 0.5 0.5 0.5 
##$TPOFFS= (0..7)
0 0 0 0 0 0 0 0 
##$TUNHIN= 0
##$TUNHOUT= 0
##$TUNXOUT= 0
##$USERA1= <user>
##$USERA2= <user>
##$USERA3= <user>
##$USERA4= <user>
##$USERA5= <user>
##$V9= 5
##$VALIST= <valist>
##$VCLIST= <CCCCCCCCCCCCCCC>
##$VD= 0
##$VDLIST= <DDDDDDDDDDDDDDD>
##$VPLIST= <PPPPPPPPPPPPPPP>
##$VTLIST= <TTTTTTTTTTTTTTT>
##$WBST= 1024
##$WBSW= 4
##$XGAIN= (0..3)
0 0 0 0 
##$XL= 0
##$YL= 0
##$YMAX_a= 268159
##$YMIN_a= -324812
##$ZGOPTNS= <>
##$ZL1= 120
##$ZL2= 120
##$ZL3= 120
##$ZL4= 120
##$ABSF1= 15.65434
##$ABSF2= -2.397508
##$ABSG= 5
##$ABSL= 3
##$ALPHA= 0
##$AQORDER= 0
##$ASSFAC= 0
##$ASSFACI= 0
##$ASSFACX= 0
##$ASSWID= 0
##$AUNMP= <proc_1d>
##$AZFE= 0.1
##$AZFW= 0.1
##$BCFW= 0
##$BC_mod= 2
##$BYTORDP= 0
##$COROFFS= 0
##$CY= -3
##$DATMOD= 1
##$DC= 0
##$DFILT= <>
##$DTYPP= 0
##$F1P= 0
##$F2P= 0
##$FCOR= 1
##$FTSIZE= 16384
##$FT_mod= 6
##$GAMMA= 0
##$GB= 0
##$INTBC= 1
##$INTSCL= 3.70164e-10
##$ISEN= 128
##$LB= 0.24
##$LEV0= 0
##$LPBIN= 0
##$MAXI= 10000
##$MC2= 0
##$MEAN= 0
##$ME_mod= 0
##$MI= 1.114404
##$NCOEF= 0
##$NC_proc= -8
##$NLEV= 6
##$NOISF1= 3.799351
##$NOISF2= 2.8
##$NSP= 0
##$NTH_PI= 0
##$NZP= 0
##$OFFSET= 15.73146
##$PC= 1
##$PHC0= -23860.58
##$PHC1= 7.852711
##$PH_mod= 1
##$PKNL= yes
##$PPARMOD= 0
##$PSCAL= 0
##$PSIGN= 0
##$REVERSE= no
##$SF= 200.13000802128
##$SI= 16384
##$SIGF1= 3
##$SIGF2= 2
##$SINO= 5.538805
##$SIOLD= 16384
##$SREGLST= <1H.CDCl3>
##$SSB= 0
##$STSI= 16384
##$STSR= 0
##$SW_p= 3612.71676300578
##$SYMM= 0
##$S_DEV= 0
##$TDeff= 16384
##$TDoff= 0
##$TI= <>
##$TILT= no
##$TM1= 0
##$TM2= 0
##$TOPLEV= 0
##$USERP1= <user>
##$USERP2= <user>
##$USERP3= <user>
##$USERP4= <user>
##$USERP5= <user>
##$WDW= 1
##$XDIM= 16384
##$YMAX_p= 446159871
##$YMIN_p= -1191617
$$ End of Bruker specific parameters
$$ ---------------------------------
##NTUPLES= NMR SPECTRUM
##VAR_NAME=  FREQUENCY,     SPECTRUM/REAL,   SPECTRUM/IMAG
##SYMBOL=    X,             R,               I
##VAR_TYPE=  INDEPENDENT,   DEPENDENT,       DEPENDENT
##VAR_FORM=  AFFN,          ASDF,            ASDF
##VAR_DIM=   16384,         16384,           16384
##UNITS=     HZ,            ARBITRARY UNITS, ARBITRARY UNITS
##FACTOR=    0.220516191357247, 1,           1
##FIRST=     3148.33713945968, 0,            0
##LAST=      -464.379623546099, 0,           0
##MIN=       -464.379623546099, -1191617,    0
##MAX=       3148.33713945968, 446159871,    0
$$ Real data points
##PAGE= N=1
##DATA TABLE= (X++(R..R)), XYDATA
$$ [...]
6043A902794L01949R3201m04941p02900J32344M73006L77983L79014k49126l91382
$$ 1902794 2204743 2297944 1893003 1190103 1322447 1795453 2173436 2552450 2303324 1911942
6033A911942K82624N41507J07987K23612L4866j0420k22076J01436L0238r3159
$$ 1911942 2194566 2736073 2844060 3067672 3102538 3092118 2870042 2971478 3001716 2908557
6023B908557O5784J22938m22465J88253P4436q619L12134L2742L4460M5072K75462
$$ 2908557 2974341 3097279 2674814 2863067 2937503 2928884 3241018 3273760 3308220 3353292 3628754
6012C628754k36990j17075o3499Q732L78301K79440n34218N7990j49121k11193
$$ 3628754 3391764 3274689 3211190 3219922 3598223 3877663 3343445 3401435 3252314 3041121
6002C041121L40275L26262J68685n606j71770n0579j03992L14034R0004K29134
$$ 3041121 3381396 3707658 3876343 3870737 3698967 3648388 3544396 3858430 3948434 4177568
5992D177568j67648k22081k40755n0480p4864j33978K41148K44140m6060J06799
$$ 4177568 4009920 3787839 3547084 3496604 3421740 3287762 3528910 3773050 3726990 3833789
5982C833789k82950j55252L81215K55917m62923j0196j46747o3767L12325k74732
$$ 3833789 3550839 3395587 3776802 4032719 3569796 3559600 3412853 3349086 3661411 3386679
5972C386679K94985L41219K16231j44261l71249J96918j6867j33013j17773k76343
$$ 3386679 3681664 4022883 4239114 4094853 3723604 3920522 3903655 3770642 3652869 3376526
5962C376526R4804J23288q3962O8158q9127L5585Q6983p811J24715N3469K33592
$$ 3376526 3471330 3594618 3510656 3578814 3489687 3525272 3612255 3604444 3729159 3782628 4016220
5951D016220K19417k28064M26097J07989n16576J67456M28766k84327k85016p05345
$$ 4016220 4235637 4007573 4433670 4541659 4025083 4192539 4621305 4336978 4051962 3346617
5941C346617l30229L91130J19456j98999K5881L02762l17326L20492j64344j10713
$$ 3346617 3016388 3407518 3526974 3327975 3353856 3656618 3339292 3659784 3495440 3384727
5931C384727j23278N024K90809j73270M00478M00816j91372J05252L6173J84359
$$ 3384727 3261449 3266473 3557282 3384012 3784490 4185306 3993934 4099186 4135359 4319718
5921D319718J11869K04843N1727N55108J20090J38185r0560L77338O3010j19177
$$ 4319718 4431587 4636430 4688157 5243265 5363355 5501540 5410980 5788318 5851328 5732151
5911E732151J67145k50022n09640n4437R0197m23361K09163J5686M0670l62557
$$ 5732151 5899296 5649274 5139634 5085197 5175394 4752033 4961196 4976882 5017552 4654995
5901D654995k29351P9705J08187j58907l15240J10309J50045R4655m06969K44244
$$ 4654995 4425644 4505349 4613536 4454629 4139389 4249698 4399743 4494398 4087429 4331673
5891D331673j96444J77903J98904k8350j46259r6150M24920K4436l29846R896
$$ 4331673 4135229 4313132 4512036 4483686 4337427 4241277 4666197 4690633 4360787 4370683
5881D370683L66626L63333m14849L36616q0251m84340J4265L7480K70677q4275
$$ 4370683 4737309 5100642 4685793 5022409 4942158 4457818 4472083 4509563 4780240 4695965
5871D695965O06466M63001M17746n44973J90932J81153j52695N21634K31329j30990
$$ 4695965 5302431 5765432 6183178 5638205 5829137 6010290 5857595 6379229 6610558 6479568
5861F479568N74139M60358R92100M95054L71159O12832L62900L36483L71863k77303
$$ 6479568 7053707 7514065 8506165 9001219 9372378 9985210 10348110 10684593 11056456 10779153
5851A0779153l66929l04683l77214l00559P0275k18036n89230J39792R3635j15011
$$ 10779153 10412224 10107541 9730327 9429768 9500043 9282007 8692777 8832569 8926204 8811193
5841H811193L92782L42076j58009L159K13696K33556r5285M57851k907L30846
$$ 8811193 9203975 9546051 9388042 9391201 9604897 9838453 9743168 10201019 10198112 10528958
5831A0528958O80761J76975M0833l89993p2764M1471M5892j43657k37716J67403
$$ 10528958 11209719 11386694 11427527 11037534 10964770 11006241 11052133 10908476 10670760 10838163
5821A0838163j70717p75372L0803l01322j30996k5181K34062l06366L55514q7948
$$ 10838163 10667446 9892074 9922877 9621555 9490559 9465378 9699440 9393074 9748588 9660640
5811I660640k93761J32035K9804l090l87394N3442k77416l3958o848J11789J72539
$$ 9660640 9366879 9498914 9528718 9525628 9138234 9191676 8914260 8880302 8873454 8985243 9157782
5800I157782K93603K52634M47707k43408n5672J33992L061J47825O06317J38432
$$ 9157782 9451385 9704019 10151726 9908318 9852646 9986638 9989699 10137524 10743841 10882273
5790A0882273M8973K60790p8284Q3549q1974r0008P62382O28896j6093k60463
$$ 10882273 10931246 11192036 11113752 11197301 11115327 11025319 11787701 12416597 12400504 12140041
5780A2140041N54046L31044M25453J21742J82850P79726P20461N0890O31289R82033
$$ 12140041 12694087 13025131 13450584 13572326 13755176 14534902 15255363 15306253 15937542 16919575
5770A6919575P15148Q73074R54200M70351J474225P77981K57167O87649K28031
$$ 16919575 17634723 18507797 19461997 19932348 21406573 22184554 22441721 23129370 23357401
5761B3357401J40749k7051K16040N07382J35118K99731L18603Q24594Q10804N99872
$$ 23357401 23498150 23471099 23687139 24194521 24329639 24629370 24947973 25772567 26583371 27183243
5751B7183243J169529J251331J080786P98168O97347P29381j21306o84336n99163
$$ 27183243 28352772 29604103 30684889 31483057 32180404 32909785 32788479 32104143 31504980
5742C1504980p15387j165156j077139n37618o51795m363o45737n813L22584P03843
$$ 31504980 30789593 29624437 28547298 28009680 27357885 27353522 26707785 26701972 27024556 27728399
5732B7728399N6580M48320O11081M96544K06892J83755J15322K20488L95562L0961
$$ 27728399 27784979 28233299 28844380 29340924 29547816 29731571 29846893 30067381 30462943 30493904
5722C0493904N04412Q31910O12068O75219O29535J178705J179304J315879J326003
$$ 30493904 30998316 31830226 32442294 33117513 33747048 34925753 36105057 37420936 38746939
5713C8746939J741525K521063K388151K367256K811571K731736L189873L733013
$$ 38746939 40488464 43009527 45397678 47764934 50576505 53308241 56498114 60231127
5705F0231127L378967L224317K978947K780280J623558O19857J29027j55420n99177
$$ 60231127 63610094 66834411 69813358 72593638 74217196 74837053 74966080 74810660 74211483
5696G4211483m56080m11057l20752R97437J053967J447309J948264J921417J898563
$$ 74211483 73755403 73344346 73023594 74021031 75074998 76522307 78470571 80391988 82290551
5687H2290551J837562J938466J597763J450626O39967Q49295L53175n60204o02629
$$ 82290551 84128113 86066579 87664342 89114968 89754935 90604230 90957405 90397201 89794572
5678H9794572l39862r69915j433286j991300l103366l452755l350692l354716
$$ 89794572 89454710 88484795 87051509 85060209 81956843 78504088 75153396 71798680
5670G1798680l058227k422219k229087k602727j653884p75683j648642n40387
$$ 71798680 68740453 66318234 64089147 61486420 59832536 59056853 57408211 56867824
5662E6867824k92125m21556n19093L902O95473J96215O6954O31014J110096J371059
$$ 56867824 56575699 56154143 55635050 55638952 56334425 56530640 56597594 57228608 58338704 59709763
5652E9709763J767111J663762J912463K239600K475498L265846L055209K876211
$$ 59709763 61476874 63140636 65053099 67292699 69768197 73034043 76089252 78965463
5644G8965463K051994J019133l77842j294868j870804l797803m090022m268976
$$ 78965463 81017457 82036590 81658748 80363880 78493076 74695273 70605251 66336275
5636F6336275l905873l695689l255486k501784k705303k503944j902459j629889
$$ 66336275 62430402 58734713 55479227 52977443 50272140 47768196 45865737 44235848
5628D4235848j335153j392367j475899l86763p08521j387046q94327o93968m35127
$$ 44235848 42900695 41508328 40032429 39645666 38937145 37550099 36655772 35961804 35526677
5619C5526677l29054o30663j80365l9131j28600n24817m70446Q4170P5110L5345
$$ 35526677 35197623 34566960 34386595 34347464 34218864 33694047 33223601 33307771 33382881 33418226
5609C3418226L43539j51186j80305K74197M05664P11396O08099R81114Q39255
$$ 33418226 33761765 33610579 33430274 33704471 34110135 34821531 35429630 36410744 37249999
5600C7249999Q54612J097355J360617J467969J666107J758705K318991J812739
$$ 37249999 38104611 39201966 40562583 42030552 43696659 45455364 47774355 49587094
5592D9587094K104141K103625K983893K890763K405611K603176K655582K218595
$$ 49587094 51691235 53794860 56778753 59669516 62075127 64678303 67333885 69552480
5584F9552480J905596J296734J142003P56658K73027q07130j305467j357431k114877
$$ 69552480 71458076 72754810 73896813 74653471 74926498 74119368 72813901 71456470 69341593
5575F9341593k213189k281692j722150j846962j368684j272342j066521j23942
$$ 69341593 67128404 64846712 63124562 61277600 59908916 58636574 57570053 57446111
5567E7446111m33601r9659m26961k67169O4687j41943k82683p12220j070238j204964
$$ 57446111 57012510 56912851 56485890 56218721 56283408 56141465 55858782 55146562 54076324 52871360
5557E2871360n18332q02708n98537l06589L55286N167L01887J38454L6688M08242
$$ 52871360 52353028 51550320 50951783 50645194 51000480 51005647 51307534 51445988 51482676 51890918
5547E1890918L24591M17259l61829m84346o66622j235600o51528p41299j029171
$$ 51890918 52215509 52632768 52270939 51786593 51119971 49884371 49232843 48491544 47462373
5538D7462373j170296o52407j50816k24183l20534j37104k57297J65954N7921
$$ 47462373 46292077 45639670 45488854 45264671 44944137 44807033 44549736 44715690 44773611
5529D4773611k41490l18742r20130o81507j553940j357017j217876q95566p63064
$$ 44773611 44532121 44213379 43293249 42611742 41057802 39700785 38482909 37587343 36824279
5520C6824279q05823m87332o28456l54588J81943k87859n80299K48334k02068
$$ 36824279 36018456 35531124 34902668 34548080 34730023 34442164 33861865 34110199 33908131
5511C3908131j85034p29375q87894j012709p37579m82068q70492j221212j135844
$$ 33908131 33723097 32993722 32105828 31093119 30355540 29873472 29002980 27781768 26645924
5502B6645924m15416j88751n15395q30652k96355r0225m70742p2237r0379m56692
$$ 26645924 26230508 26041757 25526362 24695710 24399355 24309130 23838388 23766151 23675772 23219080
5492B3219080m95172k08036l55362r22068m47065n39425o24079n29116m02289
$$ 23219080 22723908 22515872 22160510 21238442 20791377 20251952 19627873 19098757 18696468
5483A8696468m81180o94304o50617m8626J28785n87019o62529m77662l71046l6097
$$ 18696468 18215288 17520984 16870367 16821741 16950526 16363507 15700978 15223316 14852270 14816173
5473A4816173J01415K7158n0672l51651j25951j33514J12123n4858K423J92837
$$ 14816173 14917588 14944746 14894074 14542423 14416472 14282958 14395081 14340223 14342646 14535483
5463A4535483k43403k34901P9948j91166L99912k43954j95418K26212J0352J098
$$ 14535483 14292080 14057179 14137127 13945961 14345873 14101919 13906501 14132713 14143065 14144163
5453A4144163J23923L16670N5445J19084K51982J38423J40771O3965j5977K03822
$$ 14144163 14268086 14584756 14640201 14759285 15011267 15149690 15290461 15354426 15338449 15542271
5443A5542271J46515j58429k06190m08403K77817N74434r6932K4329l44622J1086
$$ 15542271 15688786 15530357 15324167 14915764 15193581 15768015 15671083 15695412 15350790 15361876
5433A5361876P10259k62915K68660K1082k64689K18679p2921P87408o8232M33594
$$ 15361876 16072135 15809220 16077880 16098962 15834273 16052952 15980031 16767439 16699207 17132801
5423A7132801K24671q8066N37302J94657N02714M13868M96927K39854J39302L90310
$$ 17132801 17357472 17269406 17806708 18001365 18504079 18917947 19414874 19654728 19794030 20184340
5413B0184340O41430Q48424Q38M99617N85354Q77463O69030O52461Q00525P78115
$$ 20184340 20825770 21674194 21675032 22174649 22760003 23637466 24306496 24958957 25759482 26537597
5403B6537597O96254J110137J458272J212643J317293J407173J209463J560566
$$ 26537597 27233851 28343988 29802260 31014903 32332196 33739369 34948832 36509398
5395C6509398J179310J098489J026491R55198J328478M64582N95480O96374N20141
$$ 36509398 37688708 38787197 39813688 40768886 42097364 42561946 43157426 43853800 44373941
5386D4373941Q81689J39848J13601P35767M98749P05244P27200N49366M89830
$$ 44373941 45255630 45395478 45509079 46244846 46743595 47448839 48176039 48725405 49215235
5377D9215235Q04697Q72094O08119K63041K85411N30727O19387R22286O82054
$$ 49215235 50019932 50892026 51500145 51763186 52048597 52579324 53198711 54120997 54803051
5368E4803051P58851N62170R46613J365071J446580J165007K171178K696450K945438
$$ 54803051 55561902 56124072 57070685 58435756 59882336 61047343 63218521 65914971 68860409
5359F8860409L309853L262929L909122M496218M662776N233858M976269M873929
$$ 68860409 72170262 75433191 79342313 83838531 88501307 93735165 98711434 103585363
5351A03585363M684080M594688N095782N002342M319820K469677J910173O02680
$$ 103585363 108269443 112864131 117959913 122962255 127282075 129751752 131661925 132264605
5343A32264605L95867J194207J243668J518652K249626K438924L054466L262354
$$ 132264605 132660472 133854679 135098347 136616999 138866625 141305549 144360015 147622369
5335A47622369L455564L771066M117495M334995L569371K660057J977661Q99322
$$ 147622369 151077933 154848999 158966494 163301489 166870860 169530917 171508578 172407900
5327A72407900O88152n59929l89149q99000j482151j721134k480325l177069l933008
$$ 172407900 173096052 172536123 172146974 171247974 169765823 168044689 165564364 162387295 158454287
5318A58454287m970919o013365o658401p136413p437124p536295o624502p159067
$$ 158454287 153483368 147470003 140811602 133675189 126238065 118701770 112077268 104918201
5310A04918201o714124o350613o210813n438236n336808m620020l901331l784968
$$ 104918201 98204077 91853464 85642651 80204415 74867607 70247587 66346256 62561288
5302F2561288k982508l327871k559581k818742k290523j561416j503709j495905
$$ 62561288 59578780 56250909 53691328 50872586 48582063 47020647 45516938 44021033
5294D4021033j683911j215175j134143j345691j137903n94887p82795q84339m68105
$$ 44021033 42337122 41121947 39987804 38642113 37504210 36909323 36126528 35242189 34774084
5285C4774084l39434p42946o50771o02656m42554n42430m6482k53934q46408J43738
$$ 34774084 34434650 33691704 33040933 32438277 31995723 31453293 31406811 31152877 30306469 30450207
5275C0450207j34838O0089j8300N6945Q04193P97831L57246O61260L31742j19343
$$ 30450207 30315369 30375458 30357158 30414103 31218296 32016127 32373373 33034633 33366375 33247032
5265C3247032M30249k61540Q8637k50542l23660l95085o98219m84496j016247
$$ 33247032 33677281 33415741 33504378 33253836 32930176 32535091 31836872 31352376 30336129
5256C0336129j481079n91011j349828m86881o19771j306702j323601r58667n65899
$$ 30336129 28855050 28264039 26914211 26427330 25807559 24500857 23177256 22218589 21652690
5247B1652690q34961n28597p84262p56460j087024m48852l34816m43947K47942
$$ 21652690 20817729 20289132 19504870 18748410 17661386 17212534 16877718 16433771 16681713
5238A6681713m05784n18643m74556k99644k86580k44766n51514k13627m36319
$$ 16681713 16275929 15757286 15282730 14983086 14696506 14451740 13900226 13686599 13250280
5229A3250280k02953j10538k69185L52939l3338l19552j81963r0160r3047L6411
$$ 13250280 13047327 12936789 12667604 13020543 12987205 12667653 12485690 12395530 12302483 12338894
5219A2338894l70243J74393J20750l01391j56177l47713l60783K02328m4328k60193
$$ 12338894 11968651 12143044 12263794 11962403 11806226 11458513 11097730 11300058 11255730 10995537
5209A0995537n8669K80460P5064J46677J21894J15585j58733o4712k12599K3061
$$ 10995537 10936868 11217328 11292392 11439069 11560963 11676548 11517815 11453103 11240504 11263565
5199A1263565j81667k83264J98484l55266j35444k31956n97022L4978j95175M7684
$$ 11263565 11081898 10798634 10997118 10641852 10506408 10274452 9677430 9712408 9517233 9564917
5189I564917k86072k52154j89576k0512L5257l36352j20611L34826J97139l5286
$$ 9564917 9278845 9026691 8837115 8816603 8851860 8515508 8394897 8729723 8926862 8891576
5179H891576k99190k68227N1624m98916K22918m8614l48738P7395K32113L3694
$$ 8891576 8592386 8324159 8375783 7876867 8099785 8051171 7702433 7779828 8011941 8045635
5169H045635l76033l43506l21231l22868k64144l61326K18908o6870J5639J97337
$$ 8045635 7669602 7326096 7004865 6681997 6417853 6056527 6275435 6208565 6224204 6421541
5159F421541l01406j41932K76471K00439Q8359j27481n84593o83002K13975L10110
$$ 6421541 6120135 5978203 6254674 6455113 6543472 6415991 5831398 5148396 5362371 5672481
5149E672481M97686j91426l38716j21371l69955M92552O0070j54987p6821M19069
$$ 5672481 6170167 5978741 5640025 5518654 5148699 5641251 5701321 5546334 5469513 5888582
5139E888582k74492p6668L7885k76402K10913K11072l91129R3074l24090Q0425
$$ 5888582 5614090 5537422 5575307 5298905 5509818 5720890 5329761 5422835 5098745 5179170
5129E179170R2542k43054L11000J69485J01163r5677j95461P6496n7174q8445
$$ 5179170 5271712 5028658 5339658 5509143 5610306 5514629 5319168 5395664 5338490 5250045
5119E250045J3253J96548p8534j3658K10273R3545j44950k92613J62997j84382
$$ 5250045 5263298 5459846 5381312 5367654 5577927 5671472 5526522 5233909 5396906 5212524
5109E212524j52716J90108Q4125o9179L04210j84522l91579K62306L19662R8486
$$ 5212524 5059808 5249916 5334041 5264862 5569072 5384550 4992971 5255277 5574939 5673425
5099E673425L28409J09860j10908j29222o6912K18247J15106m4494l86198j07561
$$ 5673425 6001834 6111694 6000786 5871564 5804652 6022899 6138005 6093511 5707313 5599752
5089E599752L87141j35764k77316k44620K41172L70466o17921j45984j51529j22619
$$ 5599752 5986893 5851129 5573813 5329193 5570365 5940831 5322910 5176926 5025397 4902778
5079D902778O00457N48010N364j41054L7409j43266m9554L01204J43782m97165
$$ 4902778 5503235 6051245 6056609 5915555 5952964 5809698 5760144 6061348 6205130 5707965
5069E707965j27036J18944M8946K44858k92977p2967K34470k21868J03860J41818
$$ 5707965 5580929 5699873 5748819 5993677 5700700 5627733 5862203 5640335 5744195 5886013
5059E886013J36316M6900N58679K87103j01430J98359K1213Q8591l88614k64689
$$ 5886013 6022329 6069229 6627908 6915011 6813581 7011940 7033153 7121744 6733130 6468441
5049F468441M15654J15993j57974J29633K33706K5067J71955M3087J27475j01313
$$ 6468441 6884095 7000088 6842114 6971747 7205453 7230520 7402475 7445562 7573037 7471724
5039G471724K02757k9816m29955o9938Q0904j9331M51562n45771k28796R3749
$$ 7471724 7674481 7644665 7214710 7144772 7225676 7206345 7657907 7112136 6883340 6977089
5029F977089k11051l62329k26616J71641J37879K60501Q5511m93523N9592j6702
$$ 6977089 6766038 6403709 6177093 6348734 6486613 6747114 6832625 6339102 6398694 6381992
5019F381992j20886J2125k36341j79419K68030l00247J14006J59523o25479L68215
$$ 6381992 6261106 6273231 6036890 5857471 6125501 5825254 5939260 6098783 5473304 5841519
5009E841519q1788k60591q5606O17o7790J63238L76255k79787j93576M66555k63788
$$ 5841519 5759731 5499140 5413534 5414151 5346361 5509599 5885854 5606067 5412491 5879046 5615258
4998E615258J25712j3571k15404k8641o6186J08868L98728o35340k75690M71600
$$ 5615258 5740970 5727399 5511995 5483354 5417168 5526036 5924764 5289424 5013734 5485334
4988E485334o6101O7504M0750O63805m3879k79L64457k67142J37812J78870R6459
$$ 5485334 5419233 5486737 5527487 6191292 6147413 6147134 6511591 6244449 6382261 6561131 6657590
4977F657590K46833j33540K52793j6480L3785q5757L41263j33767j35132Q9221
$$ 6657590 6904423 6770883 7023676 7007196 7040981 6955224 7296487 7162720 7027588 7116809
4967G116809j68713k57988k78062M00936q0254J11672o40691n41682L1052L71699
$$ 7116809 6948096 6690108 6412046 6812982 6732728 6844400 6203709 5662027 5693079 6064778
4957F064778J26920m38021j04159L15985k06508l52800l1834j184L3490K30010
$$ 6064778 6191698 5753677 5649518 5965503 5758995 5406195 5374361 5373177 5406667 5636677
4947E636677j1826J55398l55038j15970r6471K14893k881l7476K90948J13428
$$ 5636677 5624851 5780249 5425211 5309241 5212770 5427663 5424782 5387306 5678254 5791682
4937E791682k11514m77850O5274N13361k1897q383J50934K18281j07002M64947
$$ 5791682 5580168 5102318 5167592 5680953 5659056 5650673 5801607 6019888 5912886 6377833
4927F377833m2553k54107l9112k7142j7567j48931M7081N38032K04015k75627
$$ 6377833 6335280 6081173 6042061 6014919 5997352 5848421 5895502 6433534 6637549 6361922
4917F361922k6279r4182J69205J61238K25743L3741K12710J70658M56309L30370
$$ 6361922 6335643 6241461 6410666 6571904 6797647 6831388 7044098 7214756 7671065 8001435
4907H001435P4227K24488J44264J52562L71260m03411k30006j89841l24372j67294
$$ 8001435 8075662 8300150 8444414 8596976 8968236 8564825 8334819 8144978 7820606 7653312
4897G653312m17886J43039q0961j04899N9408j27804L12169j48412k25321R8116
$$ 7653312 7235426 7378465 7297504 7192605 7252013 7124209 7436378 7287966 7062645 7160761
4887G160761l0299k02733p2410q1225L3438L0777J89323L15276M020k76491J35029
$$ 7160761 7130462 6927729 6855319 6774094 6807532 6838309 7027632 7342908 7346928 7070437 7205466
4876G205466J05078K49698J25520K84832M68036j53053r0045O930n9256k66462
$$ 7205466 7310544 7560242 7685762 7970594 8438630 8285577 8195532 8202462 8143206 7876744
4866G876744l99811m13596L68847K99030o91386J74655M21804l28156J12685N84324
$$ 7876744 7476933 7063337 7432184 7731214 7039828 7214483 7636287 7308131 7420816 8005140
4856H005140l780n43402K66392M9482K86528J21599k43049j29427K00976q304
$$ 8005140 8001360 7457958 7724350 7773832 8060360 8181959 7938910 7809483 8010459 8002155
4846H002155l20341M9617K62266K67403r8462j2770j54807M25271k87746J63463
$$ 8002155 7681814 7731431 7993697 8261100 8162638 8149868 7995061 8420332 8132586 8296049
4836H296049k0833p1331q8387J49183j00996L61137K55967j92934l37550N45054
$$ 8296049 8275216 8203885 8115498 8264681 8163685 8524822 8780789 8587855 8250305 8795359
4826H795359O6904p78319N1612K08086K48483J30242L85807l49835k86799N75958
$$ 8795359 8862263 8083944 8135556 8343642 8592125 8722367 9108174 8758339 8471540 9047498
4816I047498J1623K60339J34558m93951M98550O5623K36015K38148L42713J61281
$$ 9047498 9059121 9319460 9454018 8960067 9458617 9524240 9760255 9998403 10341116 10502397
4806A0502397J4665O7166r3745M54100l42768L95730n9227p2819J62707K47860
$$ 10502397 10517062 10584228 10490483 10944583 10601815 10997545 10938318 10865499 11028206 11276066
4796A1276066M09307J75312Q2728k84144L70422M12586M4414J09045J36176O22585
$$ 11276066 11685373 11860685 11943413 11659269 12029691 12442277 12486691 12595736 12731912 13354497
4786A3354497L36801l3298M11084K96872N01812N90048L69079P09707J059263
$$ 13354497 13691298 13658000 14069084 14365956 14867768 15457816 15826895 16536602 17595865
4777A7595865L08293k3415p0583K58443K24101L9877k49262K82547M52557K31350
$$ 17595865 17904158 17880743 17810160 18068603 18292704 18332581 18083319 18365866 18818423 19049773
4767A9049773N29360Q14609M03863K44333N7407P83884J93979M74040P23256j04607
$$ 19049773 19579133 20393742 20797605 21041938 21099345 21883229 22077208 22551248 23274504 23169897
4757B3169897j78628K56970j04299K71730J94489J42897K79412N89240N85532
$$ 23169897 22991269 23248239 23143940 23415670 23610159 23753056 24032468 24621708 25207240
4748B5207240M29345J44933N53832P68784M45308K88537Q05558M56935K87884
$$ 25207240 25636585 25781518 26335350 27104134 27549442 27837979 28643537 29100472 29388356
4739B9388356O66608M13279J145457O18014M2857J38293L51735k08365j67513
$$ 29388356 30054964 30468243 31613700 32231714 32274571 32412864 32764599 32556234 32388721
4730C2388721M10681K75701J00158L33023N48800K9513N31539O24034K11527P89725
$$ 32388721 32799402 33075103 33175261 33508284 34057084 34086597 34618136 35242170 35453697 36243422
4720C6243422Q52339P74663M90458J298930J365785J255129J248365O02528O74044
$$ 36243422 37095761 37870424 38360882 39659812 41025597 42280726 43529091 44131619 44805663
4711D4805663N58602R1319L19745P998M90888P31925o6481j9487M67062J82823
$$ 44805663 45364265 45455584 45775329 45783327 46274215 47006140 46939659 46920172 47387234 47570057
4701D7570057l4335N0898O35826O03111K4417P51013O76261L42674M63831R70700
$$ 47570057 47535722 47586620 48222446 48825557 48849974 49600987 50277248 50619922 51083753 52054453
4691E2054453J010373J68491N83311N53636P44626L06742K25097M18160L62882
$$ 52054453 53064826 53233317 53816628 54370264 55114890 55421632 55646729 56064889 56427771
4682E6427771O26912Q00921M33613N66631P54683J030630J369476J043338R92114
$$ 56427771 57054683 57855604 58289217 58855848 59610531 60641161 62010637 63053975 64046089
4673F4046089R63492J275988J341290J371807J058376J667989P91543J059735
$$ 64046089 65009581 66285569 67626859 68998666 70057042 71725031 72516574 73576309
4665G3576309R79445J62652L01272O56597K04917k23626p24083j202020p23920
$$ 73576309 74555754 74718406 75019678 75676275 75881192 75657566 74933483 73731463 73007543
4656G3007543q72882r60292r55634j080387q14232p77633j189117m54132m51433
$$ 73007543 72134661 71174369 70218735 69138348 68324116 67546483 66357366 65903234 65451801
4647F5451801p5190o20403l24964l17569q6360M66269K50255P20081P79156K79591
$$ 65451801 65376611 64756208 64431244 64113675 64027315 64493584 64743839 65463920 66243076 66522667
4637F6522667R86341Q59286L33596N25389Q32086N47838q2104l12143O4180K34794
$$ 66522667 67509008 68368294 68701890 69227279 70059365 70607203 70525099 70212956 70277136 70511930
4627G0511930j34856m23138k17982K42187P2913j16837l64531m36793k42455j50785
$$ 70511930 70377074 69953936 69735954 69978141 70051054 69934217 69569686 69132893 68890438 68739653
4617F8739653J10987J50036J73339N48002M62875L31734Q78063J472873J581346
$$ 68739653 68850640 69000676 69174015 69722017 70184892 70516626 71394689 72867562 74448908
4608G4448908J222554J551267K155162K006762J775941J663045J477450J048601
$$ 74448908 75671462 77222729 79377891 81384653 83160594 84823639 86301089 87349690
4600H7349690J535528Q98244M88754P75037M20890M59416j0603N2790K60379R20487
$$ 87349690 88885218 89783462 90272216 91047253 91468143 91927559 91916956 91969746 92230125 93150612
4590I3150612K84103L55991J713084J100437J947821K592998L037194L473346
$$ 93150612 93434715 93790706 95503790 96604227 98552048 101145046 104182240 107655586
4582A07655586L884521L581859L360756K420492J057957k78145n93981o45627
$$ 107655586 111540107 115121966 118482722 120903214 121961171 121683026 121089045 120443418
4574A20443418o4108K76651K3376N04271J186213J642304J636342K693084K551303
$$ 120443418 120379310 120655961 120679337 121183608 122369821 124012125 125648467 128341551 130892854
4565A30892854J393773J375741Q74091N1695j86684j284042j455243j042856j087012
$$ 130892854 132286627 133662368 134536459 134588154 134401470 133117428 131662185 130619329 129532317
4556A29532317p78412j105759j165095j183537k024061k063744j829578k276012
$$ 129532317 128753905 127648146 126483051 125299514 123275453 121211709 119382131 117106119
4548A17106119k081260j967258j552342j678054j532127j248752j615918q64686
$$ 117106119 115024859 113057601 111505259 109827205 108295078 107046326 105430408 104565722
4540A04565722j130611o82566o23768n00811L09262l14133l92681j86407O5826
$$ 104565722 103435111 102752545 102128777 101627966 101937228 101623095 101230414 101044007 101109833
4531A01109833N01101L57599O45412R10871J772527J530108J639872J239837J289756
$$ 101109833 101610934 101968533 102613945 103524816 105297343 106827451 108467323 109707160 110996916
4522A10996916R52884J174080J092199l93984l06049n57050m28241p33288n15422
$$ 110996916 111949800 113123880 114216079 113822095 113516046 112958996 112530755 111797467 111282045
4513A11282045n71151k62328o16396m50980k58255k27595n26143L58038P66037
$$ 111282045 110710894 110448566 109832170 109381190 109122935 108895340 108369197 108727235 109493272
4504A09493272R26417J542233J353267J759780J137420J335042P90443J6156J12054
$$ 109493272 110419689 111961922 113315189 115074969 116212389 117547431 118337874 118354030 118466084
4495A18466084l55165j240485j876983k368930k343986l191954k320621j605011
$$ 118466084 118110919 116870434 114993451 112624521 110280535 107088581 104767960 103162949
4487A03162949k171757j589446p13538j08464N05016N88709Q39535R07730P51633
$$ 103162949 100991192 99401746 98688208 98579744 99084760 99673469 100513004 101420734 102172367
4478A02172367R04672R01427O85720K00183j6155l74487p25833k81578J13370
$$ 102172367 103077039 103978466 104664186 104864369 104848214 104473727 103747894 103466316 103579686
4469A03579686M32395O17044P67036J357259K113470J850424J829386K268782
$$ 103579686 104012081 104629125 105396161 106753420 108866890 110717314 112546700 114815482
4461A14815482K308656K268575K038742J723537J500201J425039J271792J517884
$$ 114815482 117124138 119392713 121431455 123154992 124655193 126080232 127352024 128869908
4453A28869908J726239K021482J632545J315751Q30704j72281j038385k234811
$$ 128869908 130596147 132617629 134250174 135565925 136396629 136224348 135185963 132951152
4445A32951152k909260l541112m012452m677773m473462m012792m240210l342068
$$ 132951152 130041892 126500780 122488328 117810555 113337093 109324301 105084091 101742023
4437A01742023l529908k442273k223380j328464j139074r84506m81186J65112
$$ 101742023 98212115 95769842 93546462 92217998 91078924 90094418 89613232 89778344
4429H9778344L86620L46119J254330J088200Q19930M75297M70463M27468o7425
$$ 89778344 90164964 90511083 91765413 92853613 93673543 94148840 94619303 95046771 94979346
4420I4979346N26482j0437k40116L26077Q02046J205620J803712J960235J907639
$$ 94979346 95505828 95495391 95255275 95581352 96383398 97589018 99392730 101352965 103260604
4411A03260604K789586K224322J666099K051839K139758K150058K587308K547136
$$ 103260604 106050190 108274512 109940611 111992450 114132208 116282266 118869574 121416710
4403A21416710K047874J556941K255831K221003K047689K408389K203575J990619
$$ 121416710 123464584 125021525 127277356 129498359 131546048 133954437 136158012 138148631
4395A38148631J647301J243957J365665J271039M26763K55919O82604J947549
$$ 138148631 139795932 141039889 142405554 143676593 144103356 144359275 145041879 146989428
4387A46989428L126539M849132P423393R103507J1362501J2782436J1725332N767786
$$ 146989428 150115967 154965099 162388492 171491999 182854500 195636936 207362268 213130054
4379B13130054m715507j2977483j6557350j6346608j3660233j1562094q575183
$$ 213130054 208414547 195437064 178879714 162533106 148872873 137310779 128735596
4372A28735596o385385m901352l557589k579911j718529j540190j222887l34654
$$ 128735596 122350211 117448859 113891270 111311359 109592830 108052640 106829753 106495099
4364A06495099o84792o72350j178556r51315j572741j800024k475331k753750
$$ 106495099 105810307 105137957 103959401 103008086 101435345 99635321 97159990 94406240
4356I4406240k668062k830178j744018k370239j720083j253161j187673p03330
$$ 94406240 91738178 88908000 87163982 84793743 83073660 81820499 80632826 79929496
4348G9929496p46197n89584n72536p91494o02252q11263j361713j027985r47269
$$ 79929496 79183299 78593715 78021179 77229685 76627433 75816170 74454457 73426472 72479203
4339G2479203p54655r28397m61443l98725p33917n9974k06053K80947O9989N75992
$$ 72479203 71724548 70796151 70334708 69935983 69202066 69142092 68936039 69216986 69286975 69862967
4329F9862967M79345M05928J184582J114944J411703J360725J700889J709098
$$ 69862967 70342312 70748240 71932822 73047766 74459469 75820194 77521083 79230181
4321G9230181K425714J989708K426958L185611K693077L332101L456786L468901
$$ 79230181 81655895 83645603 86072561 89258172 91951249 95283350 98740136 102209037
4313A02209037L755283M358646M522971M542369M480869N306331N477224O213401
$$ 102209037 105964320 110322966 114845937 119388306 123869175 129175506 134652730 140866131
4305A40866131P539829Q310268J0283656J2056409J3303009J6245906J8597682
$$ 140866131 148405960 156716228 166999884 179056293 192359302 208605208 227202890
4298B27202890K1969405K4517791K7161301K9276189K9367099K6410463J8349933
$$ 227202890 249172295 273690086 300851387 330127576 359494675 385905138 404255071
4291D04255071N519826j0033663k3127439l1557400l3966759l2661611k9193230
$$ 404255071 409774897 399741234 376613795 345056395 311089636 278428025 249234795
4284B49234795k5731990k1846803j8314531j5510481j3438419j1620388j0345845
$$ 249234795 223502805 201656002 183341471 167830990 154392571 142772183 132426338
4277A32426338q782158p624219p494020o642524n398468n643775m593108l197106
$$ 132426338 123644180 116019961 108525941 101883417 96484949 90841174 86248066 83050960
4269H3050960l821078l241092l203895k648014k763888k461382j554778j713326
$$ 83050960 79229882 75988790 72784895 70136881 67372993 64911611 63356833 61643507
4261F1643507k432981j780962j263188j623920j401208j432498o64802j039961
$$ 61643507 59210526 57429564 56166376 54542456 53141248 51708750 51043948 50003987
4253E0003987j655954j192435j210188j641131q58319j207239j163448j130676
$$ 50003987 48348033 47155598 45945410 44304279 43445960 42238721 41075273 39944597
4245C9944597n34931m94667o31725o11108n40700k97608j086662q30935q57054
$$ 39944597 39409666 38914999 38283274 37672166 37131466 36833858 35747196 34916261 34059207
4236C4059207o17137q57733p53321k48445q49128q57473K4029m56197k46700n06591
$$ 34059207 33442070 32584337 31831016 31582571 30733443 29875970 29899999 29443802 29197102 28690511
4226B8690511l63934o61722j06350l39904m01537m81324j63674k06456o14541
$$ 28690511 28326577 27664855 27558505 27218601 26817064 26335740 26172066 25965610 25351069
4217B5351069O7619j15016k29037k81111j90829k08596l94230k9282q9086P6416
$$ 25351069 25418688 25303672 25074635 24793524 24602695 24394099 23999869 23970587 23881501 23957917
4207B3957917k14525K1586P9127Q8332J7265R7968l92230k56458L36275l0698
$$ 23957917 23743392 23764978 23844105 23932437 23949702 24047670 23655440 23398982 23735257 23704559
4197B3704559l84558m14047j64563m75053m45668l57675K77874k04984p62757
$$ 23704559 23320001 22905954 22741391 22266338 21820670 21462995 21740869 21535885 20773128
4188B0773128m53770K32587k56799j12822j64904l32078n51786k39485o1215l04408
$$ 20773128 20319358 20551945 20295146 20182324 20017420 19685342 19133556 18894071 18832856 18528448
4178A8528448m99417o6849K9808l99986l50724p4657l60303R1597M00541k84512
$$ 18528448 18029031 17962182 17991990 17592004 17241280 17166623 16806320 16897917 17298458 17013946
4168A7013946k01068J9853O1007m8975P4401M45706N5631j40150m5787J0400k22292
$$ 17013946 16812878 16832731 16893738 16844763 16919164 17364870 17420501 17280351 17234564 17244964 17022672
4157A7022672J04522K6304J03780n10225K07876L15498n6385j91332M45908J73491
$$ 17022672 17127194 17153498 17257278 16747053 16954929 17270427 17214042 17022710 17468618 17642109
4147A7642109r6774K77264N89817k45237l32134M61529k2987N18634M71483K74492
$$ 17642109 17545335 17822599 18412416 18167179 17835045 18296574 18273587 18792221 19263704 19538196
4137A9538196O88515J49983n95732j62525p64277p04996k03432k09072l98872
$$ 19538196 20226711 20376694 19780962 19618437 18854160 18149164 17945732 17736660 17337788
4128A7337788m58479o0638K09560n60028K1579k82096l08137N8647n4279q4320
$$ 17337788 16879309 16818671 17028231 16468203 16489782 16207686 15899549 15958196 15903917 15819597
4118A5819597k24254j74284L83376J05521l4442j93237N3483L69426L02943J86617
$$ 15819597 15595343 15421059 15804435 15909956 15875514 15682277 15735760 16105186 16408129 16594746
4108A6594746j94887K79956L68363r489n9867J35J39693j05215m51561M54535
$$ 16594746 16399859 16679815 17048178 17038689 16978822 16978957 17118650 17013435 16561874 17016409
4098A7016409K66194K99527R7801J82040p2057j16348K29388K05450r1137Q1204
$$ 17016409 17282603 17582130 17679931 17861971 17789914 17673566 17902954 18108404 18017267 18098471
4088A8098471J00752J25879K88064L10848O65658L84727J080391P49872N94923
$$ 18098471 18199223 18325102 18613166 18924014 19589672 19974399 21054790 21804662 22399585
4079B2399585J256387J204555J662360J571730J185648L19269n33340r28388j686067
$$ 22399585 23655972 24860527 26522887 28094617 29280265 29599534 29066194 28137806 26451739
4070B6451739j201359p58814m88216k49074p66301n50276l16577m34624O6593
$$ 26451739 25250380 24491566 24003350 23754276 22987975 22437699 22121122 21686498 21753091
4061B1753091o27292k88230J19971j69906J73380l56759l23373L3205K5858J02226
$$ 21753091 21125799 20837569 20957540 20787634 20961014 20604255 20280882 20314087 20339945 20442171
4051B0442171N98209K2817m57482J92653K00813K77222J13810J82232J61391O34592
$$ 20442171 21040380 21063197 20605715 20798368 20999181 21276403 21390213 21572445 21733836 22368428
4041B2368428J85901L07786K07247j50897O53480P30128L43575O41025N08949
$$ 22368428 22554329 22862115 23069362 22918465 23571945 24302073 24645648 25286673 25795622
4032B5795622K97173M77680K16293Q59448R53697P63481P69384N70370M67985
$$ 25795622 26092795 26570475 26786768 27646216 28599913 29363394 30132778 30703148 31171133
4023C1171133P40327R98410R06580J079861J041228J112171J199798J303244J338124
$$ 31171133 31911460 32909870 33816450 34896311 35937539 37049710 38249508 39552752 40890876
4014D0890876R37055R44086J036996M37845M81010Q12892M66194O2388P8222K53460
$$ 40890876 41827931 42772017 43809013 44246858 44727868 45540760 46006954 46069342 46147564 46401024
4004D6401024L62835p7615L57587L71827M74654P61616L73474J007087J041749
$$ 46401024 46763859 46686244 47043831 47415658 47890312 48651928 49025402 50032489 51074238
3995E1074238O70633N73600P52993J024896J191486J145267J095793J077920Q58247
$$ 51074238 51744871 52318471 53071464 54096360 55287846 56433113 57528906 58606826 59465073
3986E9465073N04120P24303R17173R76948Q70618R09920J126876J008257J041626
$$ 59465073 59969193 60693496 61610669 62587617 63458235 64368155 65495031 66503288 67544914
3977F7544914J042425R15564R57878K004921J020384J107322K108496J760219
$$ 67544914 68587339 69502903 70460781 72465702 73486086 74593408 76701904 78462123
3969G8462123J743424J210523J555090J414320J787161J936995J828083K090627
$$ 78462123 80205547 81416070 82971160 84385480 86172641 88109636 89937719 92028346
3961I2028346J771389J785098J911001K111119J984975K657032K413335K470848
$$ 92028346 93799735 95584833 97495834 99606953 101591928 104248960 106662295 109133143
3953A09133143L038589K820577L133109K974954K755762L234964L636613L429471
$$ 109133143 112171732 114992309 118125418 121100372 123856134 127091098 130727711 134157182
3945A34157182L462281L732787L598014L496451L439560M128420L834371L760376
$$ 134157182 137619463 141352250 144950264 148446715 151886275 156014695 159849066 163609442
3937A63609442M015565L363303L750976L472829L107162K669254K036788K335524
$$ 163609442 167625007 170988310 174739286 178212115 181319277 183988531 186025319 188360843
3929A88360843K079610J828462K005016K256496J650220R69415Q09578M33621
$$ 188360843 190440453 192268915 194273931 196530427 198180647 199150062 199959640 200393261
3921B00393261Q7018n72554r90983j053992j669792k863606j937614k602890k772544
$$ 200393261 200480279 199907725 198916742 197862750 196192958 193329352 191391738 188788848 186016304
3912A86016304l284365l561587l463857l457898m401983l935110l815998m547814
$$ 186016304 182731939 179170352 175706495 172248597 167846614 163911504 160095506 155547692
3904A55547692m759381n067508n002061n208919m957354m489284m749020m740976
$$ 155547692 150788311 145720803 140718742 135509823 130552469 126063185 121314165 116573189
3896A16573189m789523m135215m016735m378277l989988m160245m019191m008101
$$ 116573189 111783666 107648451 103631716 99253439 95263451 91103206 87084015 83075914
3888H3075914l717026l503265l641286l214940k793723k502029k962997k441538
$$ 83075914 79358888 75855623 72214337 68999397 66205674 63703645 60740648 58299110
3880E8299110k272021k790636k149246k035619k184067j841761j014117j821108
$$ 58299110 56027089 53236453 51087207 49051588 46867521 45025760 44011643 42190535
3872D2190535j445646j140313j753794j251303o72869j135593j141041j261628
$$ 42190535 40744889 39604576 37850782 36599479 35926610 34791017 33649976 32388348
3864C2388348q10518m60957p61100r01704r61317m36406k78757r87068p52550
$$ 32388348 31577830 31116873 30355773 29454069 28492752 28056346 27777589 26790521 26037971
3855B6037971p34996k48461k87461n90896l90866j08151o6498m65961o87872n29284
$$ 26037971 25302975 25054514 24767053 24176157 23785291 23677140 23610642 23144681 22456809 21927525
3845B1927525k71447m03991m05925n63147j01912j76796k99780j66865R8673K49437
$$ 21927525 21656078 21252087 20846162 20283015 20181103 20004307 19704527 19537662 19636335 19885772
3835A9885772p10258m38171q6025m63739o36857j7228k76583l84520k39234J52755
$$ 19885772 19175514 18737343 18651318 18187579 17550722 17533494 17256911 16872391 16633157 16785912
3825A6785912L311k51641j24039m20372n16495K73529j07345j90544J77448j19740
$$ 16785912 16789223 16537582 16413543 15993171 15476676 15750205 15642860 15452316 15629764 15510024
3815A5510024k14622j06032o5890n2327J00073k71082N0797j41393j65176J23019
$$ 15510024 15295402 15189370 15123480 15071153 15171226 14900144 14950941 14809548 14644372 14767391
3805A4767391m96772r7351K91601M2745n46607n9790L47834j83333l9294l1996
$$ 14767391 14270619 14173268 14464869 14507614 13961007 13901217 14249051 14065718 14026424 13994428
3795A3994428j11679m73177O7426M52688K55653M27850k27735l74493q3545J99051
$$ 13994428 13882749 13409572 13476998 13929686 14185339 14613189 14385454 14010961 13927416 14126467
3785A4126467K0710j39771j28278N1751j01399m25123J21022K87915l2212j26813
$$ 14126467 14147177 14007406 13879128 13930879 13829480 13404357 13525379 13813294 13781082 13654269
3775A3654269l0013L52105o4134j99253Q6202P416K8747j01897R1904j02676K42104
$$ 13654269 13624256 13976361 13912227 13712974 13799176 13806592 13835339 13733442 13825346 13722670 13964774
3764A3964774k6144n2697l04674O81217O82606J06617k32633j35774l17802K68427
$$ 13964774 13938630 13885933 13581259 14262476 14945082 15051699 14819066 14683292 14365490 14633917
3754A4633917N08894j63616k59832r9751M14571q5482K99033J21811K48627K00320
$$ 14633917 15142811 14979195 14719363 14619612 15034183 14948701 15247734 15369545 15618172 15818492
3744A5818492J40813k81992J57464N13929l67648k64132N48816L26476j17691
$$ 15818492 15959305 15677313 15834777 16348706 15981058 15716926 16265742 16592218 16474527
3735A6474527L1338l3347K98661l7874L36766L07014j07635o547J28149k01357
$$ 16474527 16505865 16472518 16771179 16733305 17070071 17377085 17269450 17262903 17391052 17189695
3725A7189695J46377J46L61165K07112N0456L96290k4284N5111K97337J95430
$$ 17189695 17336072 17336218 17697383 17904495 17954951 18351241 18326957 18382068 18679405 18874835
3715A8874835M78511L31303J54250O8448k1540J43895k8761J62124N3809M8861
$$ 18874835 19353346 19684649 19838899 19907347 19885807 20029702 20000941 20163065 20216874 20265735
3705B0265735L12015K45662M99663M14851J84460k9809J66835N10458M18659N47949
$$ 20265735 20577750 20823412 21323075 21737926 21922386 21892577 22059412 22569870 22988529 23536478
3695B3536478k8250N37323L61655K20407M15434K81696N72675N85731N18750o0597
$$ 23536478 23508228 24045551 24407206 24627613 25043047 25324743 25897418 26483149 27001899 26941302
3685B6941302P94624O79500j54606L83034J55069K65602N20019P40715L51962
$$ 26941302 27735926 28415426 28260820 28643854 28798923 29064525 29584544 30325259 30677221
3676C0677221K20972L74921L95161O83200M42761M20461L33788M80317M17317
$$ 30677221 30898193 31273114 31668275 32351475 32794236 33214697 33548485 34028802 34446119
3667C4446119O00662P69008L53332L88557K76978M73398R17960Q96770O73357
$$ 34446119 35046781 35815789 36169121 36557678 36834656 37308054 38226014 39122784 39796141
3658C9796141Q56277R91821O60798J043071J181828J107555J217391J696988J620299
$$ 39796141 40652418 41644239 42305037 43348108 44529936 45637491 46854882 48551870 50172169
3649E0172169J428712J282367J278285J934404J717263J550583J569300K209481
$$ 50172169 51600881 52883248 54161533 56095937 57813200 59363783 60933083 63142564
3641F3142564K261895K395063J959879J818899K457618K459113K301076K582159
$$ 63142564 65404459 67799522 69759401 71578300 74035918 76495031 78796107 81378266
3633H1378266K633586K455906K408061J693007K080087K315231K204861J482918
$$ 81378266 84011852 86467758 88875819 90568826 92648913 94964144 97169005 98651923
3625I8651923J559768J711201J762080J657781J866882J010440R07992J245144
$$ 98651923 100211691 101922892 103684972 105342753 107209635 108220075 109128067 110373211
3617A10373211N85402O18076N42080P59036L49042N19207l19148L08887K11615
$$ 110373211 110958613 111576689 112118769 112877805 113226847 113746054 113426906 113735793 113947408
3608A13947408j03222M70035O47754M04312P30041R97369P33781J032411J622825
$$ 113947408 113844186 114314221 114961975 115366287 116096328 117093697 117827478 118859889 120482714
3599A20482714J186303J789661J786640K162353K537818K659847L304682K929542
$$ 120482714 121669017 123458678 125245318 127407671 129945489 132605336 135910018 138839560
3591A38839560L589735M586394M755226M698303N419634N534707N931421O210215
$$ 138839560 142429295 147015689 151770915 156469218 161888852 167423559 173354980 179565195
3583A79565195O483641P226110P246175P104124P576802P594478P448162P155623
$$ 179565195 186048836 193274946 200521121 207625245 215202047 222796525 230244687 237400310
3575B37400310P091804O950017O602060O126464O020356O325482N447903M988114
$$ 237400310 244492114 251442131 258044191 264170655 270191011 276516493 281964396 286952510
3567B86952510M777893M163094M120373L284793K162888J524930J082659j51965
$$ 286952510 291730403 295893497 300013870 303298663 305461551 306986481 308069140 307917175
3559C07917175n75206j547200k145263k087410k143802k956798k740692k691557
$$ 307917175 307341969 305794769 303649506 301562096 299418294 296461496 293720804 291029247
3551B91029247k669204k808564l340965l028626l247301l626901l487169l105289
$$ 291029247 288360043 285551479 282210514 279181888 275934587 272307686 268820517 265715228
3543B65715228l632763k519050k020628k363319r40035o91098j73032K04340K14366
$$ 265715228 262082465 259563415 257542787 255179468 254239433 253548335 253375303 253579643 253794009
3534B53794009O22525J188528J418004J469752J299361M27848J316940J300976
$$ 253794009 254416534 255605062 257023066 258492818 259792179 260220027 261536967 262837943
3526B62837943J164025J513408J451051J423416J605331J374977J130251J138829
$$ 262837943 264001968 265515376 266966427 268389843 269995174 271370151 272500402 273639231
3518B73639231J556690J194318N06459k05006N28419j65118j039290j076518j719856
$$ 273639231 275195921 276390239 276896698 276691692 277220111 277054993 276015703 274939185 273219329
3509B73219329k359982l082661l539295n084657n189908n471461o002608n296235
$$ 273219329 270859347 267776686 264237391 259152734 253962826 248491365 242488757 237192522
3501B37192522n760849o030984n529703n170068n143556n148750n780963n598193
$$ 237192522 231431673 225400689 219870986 214700918 209557362 204408612 198627649 193029456
3493A93029456n495781n582058o276673o444694o224156n714405n165704m228840
$$ 193029456 187533675 181951617 175674944 169230250 163006094 157291689 152125985 147897145
3485A47897145l855711l022055k313285j487956j149392j209142l96433n65101
$$ 147897145 144041434 141019379 138706094 137218138 136068746 134859604 134463171 133898070
3477A33898070l87191l09338K01788K40907M14894O2659J46343L89900N55444
$$ 133898070 133510879 133201541 133403329 133644236 134059130 134121789 134268132 134658032 135213476
3468A35213476N50080M17412R30097N05561L99302N88134k81569j70874n36261
$$ 135213476 135763556 136180968 137111065 137616626 138015928 138604062 138322493 138151619 137615358
3459A37615358q25718q58739j007169j004065r31690j043159j243753j883335
$$ 137615358 136789640 135930901 134923732 133919667 132987977 131944818 130701065 128817730
3451A28817730j700701j393142j740734j629354j108677j339573r04602j832968
$$ 128817730 127117029 125723887 123983153 122353799 121245122 119905549 119000947 117167979
3443A17167979j531655r22859j134795j372065o33398j213484o41567l10173j64215
$$ 117167979 115636324 114713465 113578670 112206605 111573207 110359723 109718156 109407983 109243768
3434A09243768j01482J17681j4846J025312J494090J143347J575049K011146K303073
$$ 109243768 109142286 109259967 109245121 110270433 111764523 112907870 114482919 116494065 118797138
3425A18797138K529537L344300K897038L627505M939786M928583N109961O177432
$$ 118797138 121326675 124670975 127568013 131195518 136135304 141063887 146173848 152351280
3417A52351280O910994P765957Q291622Q298542J0021441J1338545J2225841J3358777
$$ 152351280 159262274 167028231 175319853 183618395 193639836 204978381 217204222 230562999
3409B30562999J3549963J4943252J5642117J6665644J7138137J7554947J6986138
$$ 230562999 244112962 259056214 274698331 291363975 308502112 326057059 343043197
3402C43043197J6830067J5895079J4980912J3169991J1761870R819519Q104256
$$ 343043197 359873264 375768343 390749255 403919246 415681116 425500635 433604891
3395D33604891N769671L844573K320306O20430r20525k189082m006647n017757
$$ 433604891 439374562 443219135 445539441 446159871 445239346 443050264 439043617 434025860
3387D34025860o688469q638965r769192j1668845j3253360j4454375j5492903
$$ 434025860 427337391 418698426 408929234 397260389 384007029 369552654 354059751
3380C54059751j6514093j7132140j7622464j7262000j6883941j6446610j5705472
$$ 354059751 337545658 320413518 302791054 285529054 268645113 252198503 236493031
3373B36493031j5042291j3870545j3385914j1935917j0877719r992205r005259
$$ 236493031 221450740 207580195 194194281 182258364 171380645 161388440 152383181
3366A52383181q650011p732455p046619o519057n797194n485348m626200m291264
$$ 152383181 143733170 136000715 128954096 122435039 116637845 111152497 106526297 102235033
3358A02235033m111525l551721k988345l084661k603965k513467k306892j927264
$$ 102235033 98123508 94571787 91583442 88498781 85894816 83381349 81074457 79147193
3350G9147193j670692j832955k032388j306455j481055j166649j488866j048085
$$ 79147193 77476501 75643546 73611158 72304703 70823648 69656999 68168133 67120048
3342F7120048q94182j112411j377726j183474j181891p22749r40146j258412j048147
$$ 67120048 66225866 65113455 63735729 62552255 61370364 60647615 59707469 58449057 57400910
3333E7400910o99042j050074o16492p99226j261869o59665n16794j699630j067262
$$ 57400910 56701868 55651794 55035302 54236076 52974207 52314542 51797748 50098118 49030856
3324D9030856r02063r77085q58032j167957o47475p28190j301250j166845j311568
$$ 49030856 48128793 47151708 46293676 45125719 44478244 43750054 42448804 41281959 39970391
3315C9970391j186092p10484q85173j061937p44218n27376n59291p67814r88716
$$ 39970391 38784299 38073815 37188642 36126705 35382487 34855111 34295820 33528006 32539290
3306C2539290o05740j024849n86744o00005l66373m28290m31394m24322p48123
$$ 32539290 31933550 30908701 30321957 29721952 29355579 28927289 28495895 28071573 27323450
3297B7323450l01186l1279k71119k68088o33567j57336l70195m7052k93604k5814
$$ 27323450 27022264 26990985 26719866 26451778 25818211 25660875 25290680 25243628 24950024 24924210
3287B4924210q5478j67590L51723m69947o23661J756k5019m12303P2136j50268
$$ 24924210 24838732 24671142 25022865 24552918 23929257 23931013 23905994 23493691 23565827 23415559
3277B3415559j2051J37822P8458l69445l2914k3249J3100J82016j20826P296M08367
$$ 23415559 23403508 23541330 23619788 23250343 23217429 23194180 23207280 23389296 23268470 23275766 23684133
3266B3684133J51698K79262J68561j56049r7081M06110J46200q0530J56348L93317
$$ 23684133 23835831 24115093 24283654 24127605 24030524 24436634 24582834 24502304 24658652 25051969
3256B5051969L01239j39298M39582J56327O7396N52016M31674K17529J96718O97948
$$ 25051969 25353208 25213910 25653492 25809819 25877215 26429231 26860905 27078434 27275152 27973100
3246B7973100J21953R1718k98198n21188k85874j247405j209714q06256j048550
$$ 27973100 28095053 28186771 27888573 27367385 27081511 25834106 24624392 23818136 22769586
3237B2769586j155270l77713m85117l31387k71547p11989o68705n25046o82368
$$ 22769586 21614316 21236603 20751486 20420099 20148552 19436563 18767858 18242812 17560444
3228A7560444m56971m00988k37426m46297l67905j66919O9874o1257l640m93306
$$ 17560444 17103473 16702485 16465059 16018762 15650857 15483938 15553812 15492555 15488915 14995609
3218A4995609n33340k15208p9785p2849m09722r4299j79159j30839j56763l04811
$$ 14995609 14462269 14247061 14167276 14094427 13684705 13590406 13411247 13280408 13123645 12818834
3208A2818834L7274L58883n75715m2128o291L7032M9895j80706j97683l25443
$$ 12818834 12856108 13214991 12639276 12597148 12590857 12627889 12677784 12497078 12299395 11973952
3198A1973952j12401j30176p28810k42923K7007n0192r8277j74309k35446k11301
$$ 11973952 11861551 11731375 11002565 10759642 10786649 10736457 10638180 10463871 10228425 10017124
3188A0017124J27141j71697l36615k52653m2841L55703o19903J94119K56919j04810
$$ 10017124 10144265 9972568 9635953 9383300 9340459 9696162 9076259 9270378 9527297 9422487
3178I422487k49425k2006j05032m75475L70133j42189k35793o8506k67332j86001
$$ 9422487 9173062 9151056 9046024 8570549 8940682 8798493 8562700 8494194 8226862 8040861
3168H040861J495L52247K27617l78315l20489k03508N69484p3040m0258j1448
$$ 8040861 8042356 8394603 8622220 8243905 7923416 7719908 8289392 8216352 8176094 8164646
3158H164646k40887J85224L77997K8985n74429q5075N78374o83791r8798j34336
$$ 8164646 7923759 8108983 8486980 8515965 7941536 7856461 8434835 7751044 7652246 7517910
3148G517910j3852o4066m61159J40335p4997L43442j89340P1747j47126k68567
$$ 7517910 7504058 7439992 6978833 7119168 7044171 7387613 7198273 7270020 7122894 6854327
3138F854327M4999M11639j56531k71413M18143n9133r18p17701j67988M28867
$$ 6854327 6899326 7310965 7154434 6883021 7301164 7242031 7241113 6523412 6355424 6784291
3128F784291L49614O7705j24454L97048k12337q818L3865j35228K11642k83296
$$ 6784291 7133905 7201610 7077156 7474204 7261867 7253049 7286914 7151686 7363328 7080032
3118G080032M13834J24638j39034j09734m4879j738K57695p4422k5266r2822n8867
$$ 7080032 7493866 7618504 7479470 7369736 7324857 7323119 7580814 7506392 7481126 7388304 7329437
3107G329437K54950K30388k30467q6503J08804J20672n97607k14566K59012j18604
$$ 7329437 7584387 7814775 7584308 7497805 7606609 7727281 7129674 6915108 7174120 7055516
3097G055516K75057l01325j87780J17197k92014j85731L44134k83960K1016J39360
$$ 7055516 7330573 7029248 6841468 6958665 6666651 6480920 6825054 6541094 6562110 6701470
3087F701470J2353l22501k33079k23733p6484k24820k24483K54661k66781j90389
$$ 6701470 6713823 6391322 6158243 5934510 5858026 5633206 5408723 5663384 5396603 5206214
3077E206214K46732j52297l09273Q4380J07526m55133P5889O29480J97459j24497
$$ 5206214 5452946 5300649 4991376 5075756 5183282 4728149 4804038 5433518 5630977 5506480
3067E506480m05181m20308n4034m12441k5684L84380R5582n9283l12821k49884
$$ 5506480 5101299 4680991 4626957 4214516 4188832 4573212 4668794 4609511 4296690 4046806
3057D046806J40930K38258L23003k6086p3050R1911o0035k77108p2526j89607
$$ 4046806 4187736 4425994 4748997 4722911 4649861 4741772 4681737 4404629 4332103 4142496
3047D142496r6480M8731K13405J23078J2503J08011L9368k2992k61590j93419
$$ 4142496 4046016 4094747 4308152 4431230 4443733 4551744 4591112 4568120 4306530 4113111
3037D113111J02987J92232l48003j80690k4026J46211l9736l65348j86453N46381
$$ 4113111 4216098 4408330 4060327 3879637 3855611 4001822 3962086 3596738 3410285 3956666
3027C956666k28934k30898M94624K07024J83253p2079K99190m14840m8710m75615
$$ 3956666 3727732 3496834 3991458 4198482 4381735 4309656 4608846 4194006 4145296 3669681
3017C669681l17193L20503N040L81362P337j07501L70744l99656M9192K86756
$$ 3669681 3352488 3672991 3678031 4059393 4066730 3959229 4329973 3930317 3979509 4266265
3007D266265j45476j15185l08077n8313M03693Q9588k26466n08913n8481P49923
$$ 4266265 4120789 4005604 3697527 3639214 4042907 4132495 3906029 3397116 3338635 4088558
2997D088558m37663L495M14819j47255l26662L84400j43315j69783j79076J48045
$$ 4088558 3650895 3654390 4069209 3921954 3595292 3979692 3836377 3666594 3487518 3635563
2987C635563q1139j60729M04879J8853l82693J03484M13577k001k82733k16701
$$ 3635563 3554424 3393695 3798574 3817427 3434734 3538218 3951795 3949794 3667061 3450360
2977C450360K44532L98100N94071Q3655j52196m6644q7082l60205p9876K74651
$$ 3450360 3694892 4092992 4687063 4770718 4618522 4571878 4484796 4124591 4044715 4319366
2967D319366K23571p8498l08120J69012K01341o04459m7459o9447K47610M79051
$$ 4319366 4542937 4464439 4156319 4325331 4526672 3922213 3874754 3805307 4052917 4531968
2957D531968j01243j76115R5242L50923O6249l84205N8970K11504k7445K1152
$$ 4531968 4430725 4254610 4349852 4700775 4767024 4382819 4441789 4653293 4625848 4647000
2947D647000J58309Q7434j50319k1479N68834J0608N4679L14169k83100M7458
$$ 4647000 4805309 4892743 4742424 4720945 5289779 5300387 5355066 5669235 5386135 5433593
2937E433593j78114r4775O2804r2391K12472J77872j50221k61797K68114j94205
$$ 5433593 5255479 5160704 5223508 5131117 5343589 5521461 5371240 5109443 5377557 5183352
2927E183352o11922J81924K49874K28774k68064L17580p3310J01007J12356k06705
$$ 5183352 4571430 4753354 5003228 5232002 4963938 5281518 5208208 5309215 5421571 5214866
2917E214866k21308n0378J93471O80393K16860k58609j0862k77824K78326L26828
$$ 5214866 4993558 4943180 5136651 5817044 6033904 5775295 5764433 5486609 5764935 6091763
2907F091763J62826j61283R7921O5248l58230P0875j29227l09462Q4583J96043
$$ 6091763 6254589 6093306 6191227 6256475 5898245 5969120 5839893 5530431 5615014 5811057
2897E811057k55848n2671R9317P0965m75039j28740J47644k48101j17992K44091
$$ 5811057 5555209 5502538 5601855 5672820 5197781 5069041 5216685 4968584 4850592 5094683
2887E094683J14678K64565P8114l19931n8693K36400M2577J80026K2200p3354
$$ 5094683 5209361 5473926 5552040 5232109 5173416 5409816 5452393 5632419 5654619 5581265
2877E581265J40555L6621L2420j04068l5349k10683K41891m2345l02297J4264
$$ 5581265 5721820 5758441 5790861 5686793 5651444 5440761 5682652 5640307 5338010 5352274
2867E352274m2877j8266J58660K3854k23584m32496Q2072j19622L72479L0995
$$ 5352274 5309397 5291131 5449791 5473645 5250061 4817565 4899637 4780015 5152494 5183489
2857E183489l92060k13181N73696l89888n6923N3179k34172N5204O4573l83976
$$ 5183489 4791429 4578248 5151944 4762056 4705133 4758312 4524140 4579344 4643917 4259941
2847D259941l24193K63296J94961p3993m53112M00444m043o58530k08521M44350
$$ 4259941 3935748 4199044 4394005 4320012 3866900 4267344 4263301 3604771 3396250 3840600
2837C840600M4936m74066K44614k21770m94504r0172J00232r2032l99938O7768
$$ 3840600 3885536 3411470 3656084 3434314 2939810 2849638 2949870 2857838 2457900 2525668
2827B525668J14385j62849m20014M62814J36351M05476j97070l05958J83992l57231
$$ 2525668 2640053 2477204 2057190 2520004 2656355 3061831 2864761 2558803 2742795 2385564
2817B385564N115M58870n72322m04794M22821K03670l50267J67600J82248l79038
$$ 2385564 2390679 2849549 2277227 1872433 2295254 2498924 2148657 2316257 2498505 2119467
2807B119467M2198J4073q5339K96462j91306m21808O0779J45545j09011J25827
$$ 2119467 2161665 2175738 2090399 2386861 2195555 1773747 1834526 1980071 1871060 1996887
2797A996887j84686l20031K22548j93159K12404K63742l70582N7477K71787Q3762
$$ 1996887 1812201 1492170 1714718 1521559 1733963 1997705 1627123 1684600 1956387 2040149
2787B040149n5600K39599o9398k68460k53650M7276K03120l20377j27307q4710
$$ 2040149 1984549 2224148 2154750 1886290 1632640 1679916 1883036 1562659 1435352 1350642
2777A350642K9765J95995Q0902r0842L9283k39067j11755L29004m0364n9068k41306
$$ 1350642 1380407 1576402 1657304 1566462 1605745 1366678 1254923 1583927 1543563 1484495 1243189
2766A243189K81277L46203m61617l71J25635K33413J29073j02649k90614J24867
$$ 1243189 1524466 1870669 1409052 1408681 1534316 1767729 1896802 1794153 1503539 1628406
2756A628406m41104o4098N26212k32371k49766m6534N14938n2123l02622K61660
$$ 1628406 1187302 1123204 1649416 1417045 1167279 1120745 1635683 1583560 1280938 1542598
2746A542598O6844j28271l21005J29461j10449q1730K0371J81863J6944m0200
$$ 1542598 1609442 1481171 1160166 1289627 1179178 1097448 1117819 1299682 1316626 1276426
2736A276426k3675j92315j67167N4656j10421o407P7777K39285J51262L2894m0448
$$ 1276426 1252751 1060436 893269 947925 837504 831097 908874 1148159 1299421 1332315 1291867
2725A291867o4516n5030k03759K5283k48949J90745P5811m22400O1466J68670
$$ 1291867 1227351 1172321 968562 993845 744896 935641 1011452 589052 650518 819188
2715H19188K82669K67131l45277k32097Q1007J76232k15097K14363L69780l00598
$$ 819188 1101857 1368988 1023711 791614 872621 1048853 833756 1048119 1417899 1117301
2705A117301J2736o5344L09130k64014n860k97483k37983M57546J07670K36193
$$ 1117301 1130037 1064693 1373823 1109809 1103949 806466 568483 1026029 1133699 1369892
2695A369892K97900m68714j76943J97258o2152l83533N47059J3761k66482k03776
$$ 1369892 1667792 1199078 1022135 1219393 1157241 773708 1320767 1334528 1068046 864270
2685H64270P777K29169K19987L64247m95042m33497p12524J57511N74745J75760
$$ 864270 872047 1101216 1321203 1685450 1190408 756911 44387 201898 776643 952403
2675I52403l37166J91547K19489N07695j76312p0183m57086l7367K96017k3500
$$ 952403 615237 806784 1026273 1533968 1357656 1287473 830387 793020 1089037 1065537
2665A065537p7674q428j93983J649M840r6477L46156r2067l31363O3598r8057
$$ 1065537 987863 979435 785452 787101 791941 695464 1041620 949553 618190 681788 583731
2654E83731J17065P607J29261K1828J27940q5061j09094M81220j59113n24828
$$ 583731 700796 708403 837664 859492 987432 902371 793277 1274497 1115384 590556
2644E90556J9570L49305Q0838l02500J07496K12145j96205k39742l9219J97792
$$ 590556 610126 959431 1040269 737769 845265 1057410 861205 621463 582244 780036
2634G80036K55005J61506j25423k13528j3794J50584n200o4144M62946k53317
$$ 780036 1035041 1196547 1071124 857596 843802 994386 989186 925042 1387988 1134671
2624A134671r9285j20984R9481J70731O9276k40386k04610R9172j29180K33715
$$ 1134671 1035386 914402 1013883 1184614 1253890 1013504 808894 908066 778886 1012601
2614A012601k16565j28052K98897l5682l12274J03614R9584j2687j65964K214
$$ 1012601 796036 667984 966881 931199 618925 722539 822123 809436 643472 645686
2604F45686j9629N19263J40661j82564q6587K62328m38510q2885K84788K47532
$$ 645686 626057 1145320 1285981 1103417 1016830 1279158 840648 757763 1042551 1290083
2594A290083k01529n62722L33682j6813k66730m1006J7593J78166L69362J8397
$$ 1290083 1088554 525832 859514 842701 575971 534965 552558 730724 1100086 1118483
2584A118483m11266k62451N29179o1729n8862P8916j27459R548P6039q363j85746
$$ 1118483 707217 444766 973945 912216 853354 932270 804811 814359 890398 882035 696289
2573F96289l53956N5706J04345j79410P5701J02155N22126k30786N750p394N4212
$$ 696289 342333 398039 502384 322974 398675 500830 1022956 792170 797920 790526 844738
2562H44738J0451m6038l43963J85673k19268J4713J53326J30768L02492O1086
$$ 844738 855189 809151 465188 650861 431593 446306 599632 730400 1032892 1093978
2552A093978k89828j31797k5683J32734l56255j65324K54837J19235j12902l2515
$$ 1093978 804150 672353 646670 779404 423149 257825 512662 631897 518995 486480
2542D86480j18473K4366L46926l75147P9943l40691L20073K41689Q3344l39289
$$ 486480 368007 392373 739299 364152 444095 103404 423477 665166 748510 409221
2532D09221r5942J61980k6561K01409l86766K57162p6130l75588K49216Q8914
$$ 409221 313279 475259 448698 650107 263341 520503 444373 68785 318001 406915
2522D06915M4534J66813P7852k1650n891Q3295p0800N03140j00992l37955J6393
$$ 406915 451449 618262 696114 674464 668573 751868 681068 1184208 1083216 745261 761654
2511G61654k14838N6536k48936K93325K53658l34645J65966J83503l49252K25530
$$ 761654 546816 603352 354416 647741 901399 566754 732720 916223 566971 792501
2501G92501j74709k27950K71015l11317j32319J61769L44604j02802j46452j88571
$$ 792501 617792 389842 660857 349540 217221 378990 723594 620792 474340 285769
2491B85769Q5360M03593J04936n98224j92690Q1525j18803j36792L99678J20581
$$ 285769 371129 774722 879658 281434 88744 170269 51466 -85326 314352 434933
2481D34933j46456k4558j75882K24742p0714k44966k5193J96974K12194k03462
$$ 434933 288477 263919 88037 312779 242065 -2901 -28094 168880 381074 177612
2471A77612j09083L01812n5360J87791M5952K56241j7938p8805J1189J86476j6614
$$ 177612 68529 370341 314981 502772 548724 804965 787027 708222 719411 905887 889273
2460H89273L0591j5478P913j50140J6956j87447J52248J30603o1831k50744j3925
$$ 889273 919864 904386 912299 762159 779115 591668 743916 874519 812688 561944 548019
2449E48019j2777j68995l1146M33325j17507l19503k16626k13370L03520n5249
$$ 548019 535242 366247 335101 768426 650919 331416 114790 -98580 204940 149691
2439A49691l52101N80700j13894j88369J33806L41511N8953j39347L03781j86923
$$ 149691 -202410 378290 264396 76027 209833 551344 610297 470950 774731 587808
2429E87808k30943m2780J41782k75098J55933r2479k1325J81092K25832o1023
$$ 587808 356865 314085 455867 180769 336702 244223 222898 403990 629822 568799
2419E68799p1882K42421Q7839k0061n01261K880j76211N6062K43427j87486J08205
$$ 568799 496917 739338 827177 807116 305855 308735 132524 188586 432013 244527 352732
2408C52732p66J38470J79779n3572m79093K59249L30382j22925l68387J52833
$$ 352732 351966 490436 670215 616643 137550 396799 727181 604256 235869 388702
2398C88702q5659L90091N05316l24471q2082m13238k04300j904J03672K13285
$$ 388702 303043 693134 1198450 873979 791897 378659 174359 172455 276127 489412
2388D89412L63177P9029m27668j3209k04765J93714M27972L75582k8648n00891
$$ 489412 852589 931618 503950 490741 285976 479690 907662 1283244 1254596 753705
2378G53705j18789J72174J81845n628j36663J62846K03964j88587l28502Q9141
$$ 753705 634916 807090 988935 983307 846644 1009490 1213454 1024867 696365 785506
2368G85506K31353o5889k63594m45228O12360K45898j40814m43889m4891J20777
$$ 785506 1016859 950970 687376 242148 854508 1100406 959592 515703 470812 591589
2358E91589R5324p9308q72601L78729K31473K1539P8933P7578L42062J03861r18503
$$ 591589 686913 607605 -264996 113733 345206 366745 445678 523256 865318 969179 50676
2347E0676Q4016O8477L5400Q8518k1350o5784Q0792K51203P4394O3532l13376
$$ 50676 134692 203169 238569 327087 305737 239953 320745 571948 646342 709874 396498
2336C96498k0421K29882J13936k01627k91950j60881J11217L47166O3270J96582
$$ 396498 376077 605959 719895 518268 226318 65437 176654 523820 587090 783672
2326G83672K97977l22033k01784j12670K07489J42168l27006p09128K24712L74163
$$ 783672 1081649 759616 557832 445162 652651 794819 467813 -241315 -16603 357560
2316C57560L68416K4814K8895k85184l24851M88590J43315j59222l83973J91234
$$ 357560 725976 750790 779685 494501 169650 658240 801555 642333 258360 449594
2306D49594j06862l50937J54167L08138k22284K90669j07999J617R784j77984
$$ 449594 342732 -8205 145962 454100 231816 522485 414486 416103 425887 247903
2296B47903L6394J68826k49044J83821J28045j39308L90406L7728J14306k85740
$$ 247903 284297 453123 204079 387900 515945 376637 767043 804771 919077 633337
2286F33337j07352j83037o2992K77556L95265k40196L9649K76029k03454q1330
$$ 633337 525985 342948 279956 557512 952777 712581 752230 1028259 824805 743475
2276G43475L05713l21244m70925J55923K4958K49325l63447j79962M92777K43202
$$ 743475 1049188 727944 257019 412942 437900 687225 323778 143816 636593 879795
2266H79795l67737k27756J23204K61664k0860J79551R0235l71464K64614J0227
$$ 879795 512058 284302 407506 669170 648310 827861 918096 546632 811246 821473
2256H21473k38449J00554k52715P4228K01272J28454L6884j80542J05496m30300
$$ 821473 583024 683578 430863 505091 706363 834817 871701 691159 796655 366355
2246C66355j3215K14946L9617k3035k16402M40121J58675r1908j19990m10061
$$ 366355 353140 568086 607703 584668 368266 808387 967062 875154 755164 345103
2236C45103K53734N14649m51440M0460M66794l39838m0805N36114m15504l83136
$$ 345103 598837 1113486 662046 702506 1169300 829462 788657 1324771 909267 526131
2226E26131L63676J02083L54205J75618j15087l25372K07518K44004l95394k45065
$$ 526131 889807 991890 1346095 1521713 1406626 1081254 1288772 1532776 1137382 892317
2216H92317J92881q6649K39350l37291K38853j19667m67825J76155O20018J59344
$$ 892317 1085198 998549 1237899 900608 1139461 1019794 551969 728124 1348142 1507486
2206A507486K2601m04564k02347K62586L32198o202k4042l6653M09674L43166
$$ 1507486 1530087 1125523 923176 1185762 1517960 1511758 1487716 1451063 1860737 2203903
2196B203903M26270r5750q56252K4523K66794K3890N9719j18278K02601K6157
$$ 2203903 2630173 2534423 1678171 1702694 1969488 1993378 2053097 1934819 2137420 2163577
2186B163577L20197K66421P9579j27011K0196R9790J6680k26346O849N76908j90476
$$ 2163577 2483774 2750195 2829774 2702763 2722959 2822749 2839429 2613083 2619932 3196840 3006364
2175C006364J14941L36530j45293l18032K82953p139L61972J06723K15419J25018
$$ 3006364 3121305 3457835 3312542 2994510 3277463 3270324 3632296 3739019 3954438 4079456
2165D079456L959K36980k41991L90888K07695k342j75469k14150N60516M0526
$$ 4079456 4083415 4320395 4078404 4469292 4676987 4674645 4499176 4285026 4845542 4886068
2155D886068K40352J83817k18325j72213M19114J88779p1760J31187P93773m7742
$$ 4886068 5126420 5310237 5091912 4919699 5338813 5527592 5455832 5587019 6380792 6333050
2145F333050Q1270L01217M81174J69932L89108K27518L84150K71905L62226R61749
$$ 6333050 6414320 6715537 7196711 7366643 7755751 7983269 8367419 8639324 9001550 9963299
2135I963299L48563O3767M46093R56568L85742N70240J092491K57013P78670J123895
$$ 9963299 10311862 10375629 10821722 11778290 12164032 12734272 13826763 14083776 14862446 15986341
2125A5986341J037040J162326J570992J936552J454240J376395J458385K091644
$$ 15986341 17023381 18185707 19756699 21693251 23147491 24523886 25982271 28073915
2117B8073915K475518L734482M533180N746410O692822P723477R472589J1841963
$$ 28073915 30549433 34283915 38817095 44563505 51256327 58979804 68452393 80294356
2109H0294356J4110067J7588113J7187608M62871j5351890k0721014j8376136
$$ 80294356 94404423 111992536 129180144 129643015 114291125 93570111 75193975
2102G5193975j3644602j0917846q081054n473404m039374l389597k801786k071702
$$ 75193975 61549373 50631527 42550473 37077069 33037695 29648098 26846312 24774610
2094B4774610j776840j114904j431408j088849j245382j750127j415746j785821
$$ 24774610 22997770 21882866 20451458 19362609 18117227 16367100 14951354 13165533
2086A3165533o08783j046994m22056n72761m96140o80432k70040j98240k78460
$$ 13165533 12556750 11509756 11087700 10514939 10018799 9338367 9068327 8870087 8591627
2077H591627m50306o92907o26494k8671J56766j58507n29496l48019l83811j05326
$$ 8591627 8141321 7448414 6821920 6793249 6950015 6791508 6262012 5913993 5530182 5424856
2067E424856k01587n91027j58246n296J76762k23188j45156k43905k7293l41555
$$ 5424856 5223269 4632242 4473996 4468700 4645462 4422274 4277118 4033213 4005920 3664365
2057C664365m49469N9078J57395l6554p4891j71643J4718l43881k06590j61763
$$ 3664365 3214896 3273974 3431369 3394815 3319924 3148281 3162999 2819118 2612528 2450765
2047B450765L72327j00584p8089j3651j37318N00380k85192j69527N699k87246
$$ 2450765 2823092 2722508 2644419 2630768 2493450 2993830 2708638 2539111 2544810 2257564
2037B257564j34632N63349l12198o48960p4624R1190J60936J72134m25630l20165
$$ 2257564 2122932 2686281 2374083 1725123 1650499 1741689 1902625 2074759 1649129 1328964
2027A328964R0915J48711K17152K65669j44182m81229R5182r6172k19783K20612
$$ 1328964 1419879 1568590 1785742 2051411 1907229 1426000 1521182 1425010 1205227 1425839
2017A425839k04726K01105m66274K83166N2475k97413M284o6896J78187j96424
$$ 1425839 1221113 1422218 955944 1239110 1291585 994172 998456 931560 1109747 913323
2007I13323j38851O0972L67288L0064J05550n27804P4498J17742r8420j91233
$$ 913323 774472 835444 1202732 1232796 1338346 810542 885040 1002782 904362 713129
1997G13129P7617J76504j41879J72377p388o47303L14796K73803K5116L03528
$$ 713129 790746 967250 825371 997748 990360 343057 657853 931656 956772 1260300
1987A260300l68173j09224m4907O42853m60255l01168j41169k28199J61006J9625
$$ 1260300 892127 782903 737996 1380849 920594 619426 478257 250058 411064 430689
1977D30689K62178K01825k09753p7734l5271K76241J54485j92342j96217k52842
$$ 430689 692867 894692 684939 607205 571934 848175 1002660 810318 614101 361259
1967C61259M00602J33716m16721O0748M7822o7562l89656l0915P73845J0584m14838
$$ 361259 761861 895577 478856 539604 587426 519864 130208 99293 873138 883722 468884
1956D68884K8607M801l25627j08275K38577J54988J07208j91959n4120M003J92717
$$ 468884 497491 502292 176665 68390 306967 461955 569163 377204 323084 327087 519804
1945E19804J89641j54959l5349l23003J55831k3939k24821N512K10385Q431L3163
$$ 519804 709445 554486 519137 196134 351965 328026 103205 108717 319102 327533 360696
1934C60696k61568l03570k26775K05559O55195Q4946n2983j35017m19629j31100
$$ 360696 99128 -204442 -431217 -225658 429537 514483 461500 326483 -93146 -224246
1924b24246l5494p1091K11844M5157L38881p1116l881k11873J06957J30399J28477
$$ -224246 -259740 -330831 -118987 -73830 265051 193935 190054 -21819 85138 215537 344014
1913C44014M0147m48823M75110n42904J1184K41681L1055k23423j16729k40468
$$ 344014 384161 -64662 410448 -132456 -121272 120409 151464 -71959 -188688 -429156
1903d29156Q8214J40669K77138k11400J49751Q4575L73583J36187l03626L05303
$$ -429156 -340942 -200273 76865 -134535 15216 99791 473374 609561 305935 611238
1893F11238O9527k0501l01879p9099j74827m583k20883j08511L1142L54895J30735
$$ 611238 680765 660264 358385 279286 104459 99876 -121007 -229518 -198376 156519 287254
1882B87254K6173n8952k27904J79783K23450j80194q324L53354p7849j93206K88602
$$ 287254 313427 254475 26571 206354 429804 249610 241286 594640 516791 323585 612187
1871F12187k11922J1973j46210k2505K62484l93953j36974P9490K26984j3991
$$ 612187 400265 412238 266028 243523 506007 112054 -24920 54570 281554 267563
1861B67563j8640j73883p4954K36877p2374J97040K77497k35339l9938L81847
$$ 267563 248923 75040 86 236963 164589 361629 639126 403787 363849 745696
1851G45696L16942j74895k61290l75354J67309P7784o4966o3632P0615K71472
$$ 745696 1062638 887743 626453 251099 418408 496192 431226 367594 438209 709681
1841G09681k03724Q5539J49215j18064j95l30921K64228j37719j98063K49577
$$ 709681 505957 591496 740711 622647 622452 291531 555759 418040 219977 469554
1831D69554j18110m9880m80805l2038K36061J65276K73134M7651m79621K08337
$$ 469554 351444 301564 -179241 -211279 24782 190058 463192 510843 31222 239559
1821B39559o2007k88139j6220j38826K71212m265j36075J24417J59997N7239l23072
$$ 239559 177552 -110587 -126807 -265633 5579 1314 -134761 -10344 149653 206892 -116180
1810a16180K05767q3139Q9491J64226k15758J48233k16468k33842O3422K12049
$$ -116180 89587 6448 95939 260165 44407 192640 -23828 -257670 -194248 17801
1800A7801Q0148j80550J42962L14020k60427J44944j25341R6652Q32365m31430
$$ 17801 97949 -82601 60361 374381 113954 258898 133557 230209 1062574 631144
1790F31144m75902j73681j41817J53128L23984k83167K6091O683m2313n27705
$$ 631144 155242 -18439 -160256 -7128 316856 33689 59780 66463 24150 -503555
1780e03555K5316J94152j02022k01046L39373k2284j66903O20979L32503l29227
$$ -503555 -478239 -284087 -386109 -587155 -247782 -270066 -436969 184010 516513 187286
1770A87286m37918k78103l583K78177L21134J76973k9417j99898N2444J58570
$$ 187286 -250632 -528735 -532318 -254141 66993 243966 214549 14651 67095 225665
1760B25665k30432K50954l54932l26393J35767q1328k66434O86433Q5441Q817
$$ 225665 -4767 246187 -108745 -435138 -299371 -380699 -647133 39300 124741 133558
1750A33558q0220k11148N77674m42772k31327L4925J16403J70441J17101p6945
$$ 133558 53338 -157810 419864 -22908 -254235 -219310 -102907 67534 184635 107690
1740A07690l11151K0245J54131j22789l46763J31098l9170Q7965K30068m79730
$$ 107690 -203461 -183216 -29085 -151874 -498637 -367539 -406709 -318744 -88676 -568406
1730e68406L92780K36810l30368J61030j88034j94813L33015L54659J73000j81193
$$ -568406 -175626 61184 -269184 -108154 -296188 -491001 -157986 196673 369673 188480
1720A88480k41239M8663R2189L8446O5373j40048k51487j8117Q7753j01232J75932
$$ 188480 -52759 -4096 88093 126539 191912 51864 -199623 -217740 -129987 -231219 -55287
1709e5287J55078n47140j39803o869O6999l10662N65912l89274k83720L06471
$$ -55287 99791 -447349 -587152 -594021 -527022 -837684 -271772 -661046 -944766 -638295
1699f38295M88161K2477k14154k02894P7685J07245K76851K05745P6267k76511
$$ -638295 -150134 -127657 -341811 -544705 -467020 -359775 -82924 122821 199088 -77423
1689g7423m8342M96816J13122k07056j21614J73933m01811j32359K06703m41241
$$ -77423 -125765 371051 484173 277117 155503 329436 -72375 -204734 1969 -439272
1679d39272J9952O19040k28933j1952m0936M2789J16032K3769N5341N46469l39165
$$ -439272 -419320 199720 -29213 -41165 -82101 -39312 76720 100489 155830 702299 363134
1668C63134l37541K9723j89321l4575L12923k26430j47034o7041q8027j38252
$$ 363134 25593 55316 -134005 -168580 144343 -82087 -229121 -296162 -384189 -522441
1658e22441J56171L37756j63839k1102J09776n54966k10483K47300k10683K30105
$$ -522441 -366270 -28514 -192353 -213455 -103679 -658645 -869128 -621828 -832511 -602406
1648f02406R9423r2208K85197J74345k00120K00768K49877k26157j10836K19872
$$ -602406 -502983 -595191 -309994 -135649 -335769 -135001 114876 -111281 -222117 -2245
1638b245J8139L6068p0656j97854l4659Q5333o1941k1582n318Q7885J75134L83265
$$ -2245 15894 51962 -18694 -216548 -251207 -165874 -227815 -249397 -254715 -166830 8304 391569
1626C91569l6999J31212l36954Q1068J49041l11081j84234l2298Q483j57005n2529
$$ 391569 354570 485782 148828 229896 378937 67856 -116378 -148676 -140193 -297198 -349727
1615c49727J05117J8169J83511K49216j20428k62843k63933k53430L78574L71664
$$ -349727 -244610 -226441 -42930 206286 85858 -176985 -440918 -694348 -315774 55890
1605E5890j70593R2420K78046k3866j6302j94051k24155r36743N72598L07755
$$ 55890 -114703 -22283 255763 231897 215595 21544 -202611 -1139354 -566756 -259001
1595b59001l1619j30981J51053P6614m3951P25637l35923J34909l3907j4924m62334
$$ -259001 -290620 -421601 -270548 -193934 -237885 487752 151829 286738 252831 237907 -224427
1584b24427K89037j4457J37412m2562J02652k09199k3322N57239N2367n6985j02871
$$ -224427 64610 50153 187565 145003 247655 38456 15134 572373 624740 567755 464884
1573D64884n81498J44559n09922O2593M02745j66751m3148Q5018m5123K701K61403
$$ 464884 -116614 27945 -481977 -419384 -16639 -183390 -226538 -141520 -186643 -183942 77461
1562G7461J97639j56670K24273n4642k01338J8876j0215l22771Q0301J36585l6346
$$ 77461 275100 118430 342703 288061 86723 105599 95384 -227387 -147086 -10501 -46847
1551d6847j13248p6828j01119r9489K11829M44537P1159n13223J68231K47832
$$ -46847 -160095 -236923 -338042 -437531 -225702 218835 289994 -223229 -54998 192834
1541A92834J7826k46312l03522R8647k3802J17999p5528n6203O28474k59008l49973
$$ 192834 210660 -35652 -339174 -240527 -264329 -146330 -221858 -278061 350413 91405 -258568
1530b58568j08868N45562R9194l16702K5342k05248L38506J96452k25520k78462
$$ -258568 -367436 178126 277320 -39382 -14040 -219288 119218 315670 90150 -188312
1520a88312K74251O9185j78812k45841l12391R1191J54408L02391L14611K434
$$ -188312 85939 155124 -23688 -269529 -581920 -490729 -336321 -33930 280681 283115
1510B83115n87418J93345M5990j65197N5986q097N6873l13764J29614M29683k67989
$$ 283115 -304303 -110958 -64968 -230165 -174179 -182276 -125403 -439167 -309553 120130 -147859
1499a47859J04539j99541J41580L33294M1422j16659j34178l302l88002K795N23018
$$ -147859 -43320 -242861 -101281 232013 273435 156776 22598 19296 -368706 -365911 157107
1488A57107l05786L45403n91235m9888o5343k32534J08827N58435J93908r7962
$$ 157107 -148679 196724 -394511 -444399 -509742 -742276 -633449 -75014 118894 20932
1478B0932J56591n14298p5709J05416K08333L61029m63332k41645j25362M4378
$$ 20932 177523 -336775 -412484 -307068 -98735 262294 -201038 -442683 -568045 -523667
1468e23667L40886O6621J20983J33631k64820K10197K48814J12888j01357n36881
$$ -523667 -182781 -116160 4823 138454 -126366 83831 332645 445533 344176 -192705
1458a92705J75157M87032n9457o34208J83567k4938m1394K40077j32328n53051
$$ -192705 -17548 469484 410027 -224181 -40614 -65552 -106946 133131 803 -552248
1448e52248M7283N77190l98848L72187K17144m84638p4346k3800N83038j78105
$$ -552248 -504965 72225 -326623 45564 262708 -221930 -296276 -320076 262962 84857
1438H4857J93517k23502j75312M8191j60332p552K87488j87826J79624q8209k50338
$$ 84857 278374 54872 -120440 -72249 -232581 -240133 47355 -140471 39153 -49056 -299394
1427b99394j21726K24736q1757r9160K03045K88558q7263J26743M02335j97530
$$ -299394 -421120 -196384 -278141 -377301 -174256 114302 27039 153782 556117 358587
1417C58587m51887j32434q1539O5467Q48J4244q1031j27331J95553J51713M03449
$$ 358587 -93300 -225734 -307273 -241806 -240958 -226714 -307745 -435076 -239523 -87810 315639
1406C15639j4877k17272K9311Q3864J04995j26243m0046K3261j46134l16402R8911
$$ 315639 300762 83490 112801 196665 301660 175417 135371 158632 12498 -303904 -204993
1395b04993L80461J05021p4708J30353k42887m49540K04007J53305o3929k30976
$$ -204993 175468 280489 205781 336134 93247 -356293 -152286 1019 -62910 -293886
1385b93886N54014m49284m6436n6065K42148L15360j50468P2278j57251R1292
$$ -293886 260128 -189156 -235592 -291657 -49509 265851 115383 187661 30410 121702
1375A21702J56678o3735o69219J62864J72081k07432P6930L29865J42728k98956
$$ 121702 278380 214645 -454574 -291710 -119629 -327061 -250131 79734 222462 -76494
1365g6494q4573m24453K99104L92619k21616k83820q5414J49815L80503J40368
$$ -76494 -161067 -585520 -286416 106203 -115413 -399233 -484647 -334832 45671 186039
1355A86039m19515l16167j48079L73167L31444J8007j66068J22761k43312O5838
$$ 186039 -233476 -549643 -697722 -324555 6889 24896 -141172 -18411 -261723 -195885
1345a95885K45752k14594l47495K33385L00494j50672l66041M8532N29528m61883
$$ -195885 49867 -164727 -512222 -278837 21657 -129015 -495056 -446524 83004 -378879
1335c78879L29721p6651j54984J20413L05553K03335j2872l36814k24614J60401
$$ -378879 -49158 -125809 -280793 -160380 145173 348508 335636 -1178 -225792 -65391
1325f5391j1207o5479K94761l06949j65310J33547L06446O6534n90609j36386
$$ -65391 -76598 -142077 152684 -154265 -319575 -186028 120418 186952 -403657 -540043
1315e40043M1397K03362L8107j48668J37870L73228k65970J61138L4367o4166
$$ -540043 -498646 -295284 -257177 -405845 -267975 105253 -160717 421 34788 -29378
1305b9378J72926k07742k56958Q407J60819K44869j97759j27851o7650L25306
$$ -29378 143548 -64194 -321152 -312745 -151926 92943 -104816 -232667 -300317 24989
1295B4989J76006L7032m61164j53455K71178J55234p4611J8225l19925L30240
$$ 24989 200995 238027 -223137 -376592 -105414 49820 -24791 -6566 -326491 3749
1285C749n8402l01941J40212l84508n8256M78889l64925l8059N82096m4716J18757
$$ 3749 -54653 -356594 -216382 -600890 -659146 -180257 -545182 -583241 -1145 -45861 72896
1274G2896n24810k00565K96777j4786O9165K24374N0791k04504p5797L32959j87617
$$ 72896 -451914 -652479 -355702 -370488 -301323 -76949 -26158 -230662 -306459 26500 -161117
1263a61117L14232o7637r4314k81302l19320K46445K64879k90182J76361P4896
$$ -161117 153115 85478 -8836 -290138 -609458 -363013 -98134 -388316 -211955 -137059
1253a37059l25067K56315J7617K97484J10875k2691r0394R7506j437m8207j00012
$$ -137059 -462126 -205811 -188194 109290 220165 197474 107080 204586 203149 154942 54930
1242E4930k68860J54037J23415r7865J25834j21112J78450m9601k99077K25951
$$ 54930 -213930 -59893 63522 -34343 91491 -29621 148829 99228 -199849 26102
1232B6102J45783m5903K42086l01661k74270K5563j51443L16879J0496K64565
$$ 26102 171885 125982 368068 66407 -207863 -182300 -333743 -16864 -6368 258197
1222B58197M60o7012J6208J89476M2698m13134l81203R483M11337k51585K11435
$$ 258197 258657 191645 207853 397329 440027 26893 -354310 -344827 66510 -185075 26360
1211B6360o5861l53787J25306k40982O976J66124M11368J9000j35292L40241k7579
$$ 26360 -39501 -393288 -267982 -508964 -501988 -335864 75504 94504 -40788 299453 271874
1200B71874k34770r1151J70428j57158N73941l44591n86278O8514K19923n7139
$$ 271874 37104 -54047 116381 -40777 533164 188573 -397705 -329191 -109268 -166407
1190a66407J46791K05456p77490J0726j10486J86302K68829M25721k3970k51714
$$ -166407 -19616 185840 -591650 -580924 -691410 -505108 -236279 189442 165472 -86242
1180h6242r8689J69720o8076j03460j54966J32919J84607k652k42786K09375L20711
$$ -86242 -184931 -15211 -83287 -186747 -341713 -208794 -24187 -26839 -269625 -60250 260461
1169B60461o70511p9336M0637L57973k29340J11404J55301k98808J06778r3606
$$ 260461 -410050 -489386 -448749 -90776 -320116 -208712 -53411 -352219 -245441 -339047
1159c39047K11528O6158k15431k30720L23049N10126O8883l4199k36138J19489
$$ -339047 -127519 -61361 -276792 -507512 -184463 325663 394546 360347 124209 243698
1149B43698l0307J15529N6354l63612N20489j17142l04113Q0651q7230p1107p2732
$$ 243698 213391 328920 385274 21662 542151 425009 120896 201547 114317 43210 -29522
1138b9522k90942j15964q0511o5764k18940L35622L80253K23608j93537k17609
$$ -29522 -320464 -436428 -516939 -582703 -801643 -466021 -85768 137840 -55697 -273306
1128b73306l21717K44451j0252J07124L05553r9564M43125k58316L2246j07893
$$ -273306 -595023 -350572 -360824 -253700 51853 -47711 395414 137098 169344 61451
1118F1451J8918m210k78790K91596K27253J54437l82957M2997K68579M7851k65917
$$ 61451 80369 76159 -202631 88965 316218 470655 87698 130695 399274 447125 181208
1107A81208l86211k14849J91457P86298k98658k10935K82712q8931j36187j99366
$$ 181208 -205003 -419852 -228395 557903 259245 48310 331022 242091 105904 -93462
1097i3462j76841O01691m61735q2465N8861K83249l54028o2564k2618K5698L12668
$$ -93462 -270303 331388 -130347 -212812 -153951 129298 -224730 -287294 -309912 -284214 28454
1086B8454k58319K00074K57779k50640K008j6611L38748m9240n91610J67944M77802
$$ 28454 -229865 -29791 227988 -22652 -20644 -37255 301493 252253 -339357 -171413 306389
1075C06389j52974n51587R7764L4765L35827k585l28812L15587J05585L7009K1793
$$ 306389 153415 -398172 -300408 -265643 70184 67599 -261213 54374 159959 196968 218761
1064B18761l26705Q2205J40537k88247j9239p0117N9504k53641j64720j37567
$$ 218761 -107944 -25739 114798 -173449 -192688 -262805 -203301 -456942 -621662 -759229
1054g59229M38880M4739O9276L39703k9098l5892p3970j24656k56548K55753J9390
$$ -759229 -320349 -275610 -206334 133369 104271 68379 -5591 -130247 -386795 -131042 -111652
1043a11652J55042k31153j10717J4638l55j21867K50736J2131l33948j94310K36071
$$ -111652 43390 -187763 -298480 -283842 -284197 -406064 -155328 -143197 -477145 -671455 -435384
1032d35384K70812R1645m44253M03457l0845K34276O1918j54724l09179J97594
$$ -435384 -164572 -72927 -517180 -113723 -144568 89708 151626 -3098 -312277 -114683
1022a14683K56141k94578J88072J47064r5947n35552N355J59670J17148J03576
$$ -114683 141458 -153120 34952 182016 86069 -449483 -444128 -284458 -167310 -63734
1012f3734N035n96288L97851K43359J48102K808k29708M17779k44402q9351m5245
$$ -63734 -58699 -654987 -257136 -13777 134325 137133 -92575 325204 80802 -8549 -53794
1001e3794j30102M07394R1820j43024l47304k41337K96611L38682K2799N101m83068
$$ -53794 -183896 223498 315318 172294 -175010 -416347 -119736 218946 241745 246846 -236222
990b36222K37517K42837m99841k17561J93996M90491J29888J22272l18503o3364
$$ -236222 1295 244132 -255709 -473270 -279274 211217 341105 463377 144874 81510
980H1510K14484p359J06117j72213K38583N9657l47752L2482K89020j84700o98581
$$ 81510 295994 288635 394752 222539 461122 520779 173027 205509 494529 309829 -388752
969c88752J12298k0370L58215K80893j94162o8493n8735L1335j74862J52035j16403
$$ -388752 -276454 -296824 61391 342284 148122 79629 20894 52229 -122633 29402 -87001
958h7001J84595o5408o2507J2651k72118K07045K24835J81128k88713j25170j08118
$$ -87001 97594 32186 -30321 -17670 -289788 -82743 142092 323220 34507 -90663 -198781
947a98781J60616j93529k5332Q2304P2602l75882J14208K2703m06839K59248k834
$$ -198781 -38165 -231694 -257026 -174722 -102120 -478002 -363794 -341091 -747930 -488682 -491516
936d91516K37046J70301J45872R5634K98482p3241j87237J35583j38497J73343
$$ -491516 -254470 -84169 61703 157337 455819 382578 195341 330924 192427 365770
926C65770q6265J08901k9638m7088k73007k60429j23655K07905M5387J42534R7118
$$ 365770 279505 388406 358768 311680 38673 -221756 -345411 -137506 -92119 50415 147533
915A47533m56146J88883J63780o6826m7167K62840n2345K62000n23343r047L9984
$$ 147533 -308613 -119730 44050 -22776 -69943 192897 140552 402552 -120791 -129838 -89854
904h9854M5727J84104n4880j21675K06023J40983m48792q4461p4281k5376L94327
$$ -89854 -44127 139977 85097 -36578 169445 310428 -138364 -222825 -297106 -322482 71845
893G1845J83323j19948j84496m11646m0786j39210M0260j73845J29338K15146
$$ 71845 255168 135220 -49276 -460922 -501708 -640918 -600658 -774503 -645165 -430019
883d30019l8008L49710J5424m5741k4442N4917j27985M62056N7009n10415k32070
$$ -430019 -468027 -118317 -102893 -148634 -173076 -118159 -246144 215912 272921 -237494 -469564
872d69564k40328J17743j0167K03892J58090N9634n5409N96631J06276m97067
$$ -469564 -709892 -592149 -602316 -398424 -240334 -180700 -236109 360522 466798 -30269
862c0269j51835J26722j6251n5592l13649k51894M1576K14288L28262J2693n1208
$$ -30269 -182104 -55382 -71633 -127225 -440874 -692768 -651192 -436904 -108642 -95949 -147157
851a47157k15323k37753K29825N50804n80827L65962K0572q9887j63237O10768
$$ -147157 -362480 -600233 -370408 180396 -400431 -34469 -13897 -103784 -267021 343747
841C43747j67701J17137J47864m72061L31162j36766k84254k12539M19280K60743
$$ 343747 176046 293183 441047 -31014 300148 163382 -120872 -333411 85869 346612
831C46612J26605m50009J266j7022k87460L0594N8242n5113K681K13995K39986
$$ 346612 473217 23208 24474 7452 -280008 -249414 -191172 -246285 -243604 -29609 210377
820B10377o4763j84254j38734o5347j06338R2683Q41l66916M39273M18087k95683
$$ 210377 145614 -38640 -177374 -242721 -349059 -256376 -255535 -622451 -183178 234909 -60774
809f0774k03280R5729L13657q6433J18598J25035j36194N1656J97271L0129j99126
$$ -60774 -264054 -168325 145332 58899 177497 302532 166338 217994 415265 445394 246268
798B46268k20092M03623J43310j81144J80473l78298l72810J12302M68422k75052
$$ 246268 26176 429799 573109 391965 572438 194140 -178670 -66368 402054 127002
788A27002m36818j4491K3518n814J64889K55091j88192J94795l01743J3890L55710
$$ 127002 -309816 -324307 -300789 -306603 -141714 113377 -74815 119980 -181763 -167873 187837
777A87837k61130m77313J61989N0291K7830L26604J81048J17020J30619k96759
$$ 187837 -73293 -550606 -388617 -338326 -310496 16108 197156 314176 444795 148036
767A48036m47396J21994K46059k39659k06817K29208K02883Q2970l81239p4247
$$ 148036 -299360 -177366 68693 -170966 -377783 -148575 54308 137278 -243961 -318208
757c18208K32405P5111P9805j43476j94622p3152K16441K65656P0807J98060k21374
$$ -318208 -85803 -10692 69113 -74363 -268985 -342137 -125696 139960 210767 408827 187453
746A87453n82337K51447M5388k45282J90042k12436K45908q3663l98188K75838
$$ 187453 -394884 -143437 -98049 -343331 -153289 -365725 -119817 -203480 -601668 -325830
736c25830J4003r8354L56771J27008J53626J53222k43662j00387Q5916J0992M9354
$$ -325830 -311827 -410181 -53410 73598 227224 380446 136784 36397 122313 133305 182659
725A82659j86963j93990N05559P2591j73476J0963L77083j38431o09403J30457
$$ 182659 -4304 -198294 307265 379856 206380 217343 594426 455995 -153408 -22951
715b2951K31623k6956j97059M61108j1918l65336j413Q641n90523k46521M80993
$$ -22951 208672 181716 -15343 445765 433847 68511 67098 75739 -514784 -761305 -280312
704b80312M16473J88115k33950k39771j33112L92838J11329J8195m45280J29483
$$ -280312 136161 324276 90326 -149445 -282557 110281 221610 239805 -205475 -75992
694g5992J18597K19670j92145j46851J73084l108K70521k91736m84591L11044
$$ -75992 42605 262275 70130 -76721 96363 93255 363776 72040 -412551 -101507
684a01507r7180j79345J38554P73240P7116O2504m68949k17565l11688N7290J58112
$$ -101507 -198687 -378032 -239478 533762 610878 673382 204433 -13132 -324820 -267530 -109418
673a09418k84523N87040m4836P962k97404L20600k16315j00763K17508j46418
$$ -109418 -393941 193099 148263 156225 -141179 179421 -36894 -137657 79851 -66567
663f6567J32122r4619k02910K14725J62206J88321R181n5072k71043P1346k08503
$$ -66567 65555 -29064 -231974 -17249 144957 333278 342459 287387 16344 87690 -120813
652a20813J57537k45374K86316o5343K00079j35353m76260K72109K38588O3084
$$ -120813 36724 -208650 77666 12323 212402 77049 -399211 -127102 111486 174570
642A74570n4911J01622J06097j81959J07349k40130k42399J53349M08209k44617
$$ 174570 119659 221281 327378 145419 252768 12638 -229761 -76412 331797 87180
632H7180j73513J09962l3049m1067j59035J59036M07708L1236l11571K8977R2519
$$ 87180 -86333 23629 -9420 -50487 -209522 -50486 357222 388458 76887 105864 198383
621A98383m54193k93114L68863M0802J45579L46888j18810J11411K36855l25141
$$ 198383 -255810 -548924 -180061 -139259 6320 353208 234398 345809 582664 257523
611B57523o13191P0280O28714m37421m0133K73541j66715O6214K29637k3181l31272
$$ 257523 -355668 -285388 343326 -94095 -134228 139313 -27402 38812 268449 245268 -86004
600h6004o3470j64283j80838K09577j2004K48259O755n2826J9352L11576n5697
$$ -86004 -149474 -313757 -494595 -285018 -297022 -48763 -42008 -94834 -75482 236094 180397
589A80397M06036l85591k02613L85345k19431k84769K3118k09878K71503L98931
$$ 180397 586433 200842 -1771 383574 164143 -120626 -97508 -307386 -35883 363048
579C63048Q979k8056O3634o2234J04875j47611q602l9497l37453J59241j94359
$$ 363048 372027 343971 407605 345371 450246 302635 294033 254536 -82917 76324 -118035
568a18035q7114J79207K53380j88748j75223J51276m773j59757Q2151j00861J82873
$$ -118035 -205149 -25942 227438 38690 -136533 14743 9970 -149787 -67636 -168497 14376
557A4376k27050J95209k9125O3060J56159k08853K50650K26882m81024j46667
$$ 14376 -212674 -17465 -46590 16470 172629 -36224 214426 441308 -39716 -186383
547a86383J72412J21564k92659K08429n6395q355K10456k43335K45300l02776
$$ -186383 -13971 107593 -185066 23363 -33032 -41387 169069 -74266 171034 -131742
537a31742J36018K36755j44057K5117k4074r4802P1337k12653L6160L42375K66752
$$ -131742 4276 241031 96974 122091 98017 3215 74552 -138101 -101941 240434 507186
526E07186k71199j08R1306O5568J27202j25852O2746m17263J53089L07011k06463
$$ 507186 235987 235879 327185 392753 519955 394103 456849 39586 192675 499686 293223
515B93223n145Q9599J42359m49144K46094K21346n52108Q405M43866l22942l76436
$$ 293223 288078 377677 520036 70892 316986 538332 -13776 -5371 438495 115553 -260883
504b60883J78669O76106j29477l35093k50551Q1652k45104o5796J00068Q7239
$$ -260883 -82214 593892 464415 129322 -121229 -39577 -284681 -350477 -250409 -163170
494a63170M3221j20655m8118K94809O9752j21507r0323l09633q6338L1971L32449
$$ -163170 -119949 -240604 -288722 6087 75839 -45668 -135991 -445624 -531962 -499991 -167542
483a67542L49587j59101k03653M9245L72601j29039j49257k1262k02731L41636
$$ -167542 182045 22944 -180709 -131464 241137 112098 -37159 -58421 -261152 80484
473H0484q9594M6491p2556O2423K30057j08042K39280M5902k15427k44077K24956
$$ 80484 -9110 37381 -35175 27248 257305 149263 388543 434445 219018 -25059 199897
462A99897j31474J40413L93343n26509P4890J85482N5400P0675l54815o8120N50896
$$ 199897 68423 208836 602179 75670 150560 336042 391442 462117 107302 39182 590078
451E90078l31942k14107q4365Q831R9111k215K6330j35599j53484M7465K14413
$$ 590078 258136 44029 -40336 -31505 67606 65391 91721 -43878 -197362 -149897 64516
440F4516R3055k04437K5261K5384L66092Q5616l38685o0686K00969j63398N112
$$ 64516 157571 -46866 -21605 3779 369871 455487 116802 56116 257085 93687 98799
$$ [...]
##END NTUPLES=NMR SPECTRUM
##END=
