##TITLE=1H_CA-9207-2
 CDCl3
 8 sc, 
 26.10.2023
##JCAMPDX= 6.0         $$ Bruker NMR JCAMP-DX V2.0
##DATA TYPE= NMR SPECTRUM
##DATA CLASS= NTUPLES
##ORIGIN= UXNMR, Bruker Analytische Messtechnik GmbH
##OWNER= root
$$ XWIN-NMR		Version 3.5
$$ Thu Oct 26 16:07:04 2023 Russian Standard Time (UT+4h)  she@DPX200
##.OBSERVE FREQUENCY= 200.13135
##.OBSERVE NUCLEUS= ^1H
##.ACQUISITION MODE= SIMULTANEOUS
##.ACQUISITION SCHEME= undefined
##.AVERAGES= 8
##.DIGITISER RES= 18
##SPECTROMETER/DATA SYSTEM= spect
##.PULSE SEQUENCE= zg30
##.SOLVENT NAME= CDCl3
##.SHIFT REFERENCE= (INTERNAL, CDCl3, 0, 15.7248)
##AUDIT TRAIL= $$ (NUMBER, WHEN, WHO, WHERE, WHAT)
$$ ##TITLE= Audit trail, XWIN-NMR		Version 3.5
$$ ##JCAMPDX= 5.01
$$ ##ORIGIN= Bruker BioSpin GmbH
$$ ##OWNER= she
$$ F:/spectra/data/she/nmr/H-F/1/pdata/1/auditp.txt
$$ ##AUDIT TRAIL=  $$ (NUMBER, WHEN, WHO, WHERE, WHAT)
(   1,<2023-10-26 16:06:02.28 +0400>,<she>,<DPX200>,
      <created by zg, POWCHK disabled, PULCHK disabled
       configuration hash MD5:
       00 E9 B6 7A A2 85 ED C7 34 08 36 98 17 FE 4E 26
       data hash MD5: 16K
       E3 FD F0 FA F9 01 E9 35 FE F4 82 7B EB 31 44 CC>)
(   2,<2023-10-26 16:06:04.89 +0400>,<she>,<DPX200>,
      <Start of raw data processing
       efp BC_mod = 2 LB = 0.24 FT_mod = 6 PKNL = 1 PHC0 = -23508.54 PHC1 = 12.85272 SI = 16K 
       data hash MD5: 16K
       67 36 AC 76 BB 52 8A 1E 67 13 B7 A4 83 F7 66 C4>)
(   3,<2023-10-26 16:06:21.39 +0400>,<she>,<DPX200>,
      <pk PHC0 = 1.113293 PHC1 = -0.6 
       data hash MD5: 16K
       F8 3B 69 45 8A 8A 2E 01 79 50 19 79 F5 DD 4F 6A>)
(   4,<2023-10-26 16:06:24.75 +0400>,<she>,<DPX200>,
      <abs ABSG = 5 
       data hash MD5: 16K
       6C 22 77 1B 3C A0 6C 35 F0 A3 EC 04 A4 43 E0 A0>)
$$ ##END=
$$ 
$$ hash MD5
$$ 76 53 84 93 C9 44 33 21 E9 23 A0 2A 73 42 3F 30
##$RELAX= 
##$RELAX= 
##$RELAX= 
##$RELAX= 
##$RELAX= 
##$RELAX= 
$$ Bruker specific parameters
$$ --------------------------
##$DU= <F:/spectra>
##$EXPNO= 1
##$NAME= <H-F>
##$PROCNO= 1
##$TYPE= <nmr>
##$USER= <she>
##$AMP= (0..31)
100 100 100 100 100 100 100 100 100 100 100 100 100 100 100 100 100 100 
100 100 100 100 100 100 100 100 100 100 100 100 100 100 
##$AQSEQ= 0
##$AQ_mod= 1
##$AUNM= <au_zg>
##$AUTOPOS= <>
##$BF1= 200.13
##$BF2= 200.13
##$BF3= 200.13
##$BF4= 200.13
##$BF5= 200.13
##$BF6= 200.13
##$BF7= 200.13
##$BF8= 200.13
##$BYTORDA= 1
##$CFDGTYP= 0
##$CFRGTYP= 5
##$CHEMSTR= <none>
##$CNST= (0..31)
1 1 145 1 1 1 1 1 1 1 1 1 1 1 1 1 1 1 1 1 1 1 1 1 1 1 1 1 1 1 1 1 
##$CPDPRG= <>
##$CPDPRG1= <>
##$CPDPRG2= <>
##$CPDPRG3= <>
##$CPDPRG4= <mlev>
##$CPDPRG5= <mlev>
##$CPDPRG6= <mlev>
##$CPDPRG7= <mlev>
##$CPDPRG8= <mlev>
##$CPDPRGB= <>
##$CPDPRGT= <>
##$D= (0..31)
0 1.2 0 0 0 0 0 0 0 0.06 0 0.03 0 0 0 0 0.0002 0 0 0 0 0 0 0 0 0 0 0 0 
0 0 0 
##$DATE= 1698321961
##$DBL= (0..7)
120 120 120 120 120 120 120 120 
##$DBP= (0..7)
150 150 150 150 150 150 150 150 
##$DBP07= 0
##$DBPNAM0= <>
##$DBPNAM1= <>
##$DBPNAM2= <>
##$DBPNAM3= <>
##$DBPNAM4= <>
$$ [...]
##$SUBNAM3= <"">
##$SUBNAM4= <"">
##$SUBNAM5= <"">
##$SUBNAM6= <"">
##$SUBNAM7= <"">
##$SUBNAM8= <"">
##$SUBNAM9= <"">
##$SW= 18.05172834244
##$SWIBOX= (0..15)
0 0 2 0 0 0 0 0 0 0 0 0 0 0 0 0 
##$SW_h= 3612.71676300578
##$TD= 16384
##$TD0= 1
##$TE= 0
##$TE2= 300
##$TE3= 300
##$TEG= 300
##$TL= (0..7)
0 120 120 120 120 120 120 120 
##$TP= (0..7)
150 150 150 150 150 150 150 150 
##$TP07= 0
##$TPNAME0= <>
##$TPNAME1= <>
##$TPNAME2= <>
##$TPNAME3= <>
##$TPNAME4= <>
##$TPNAME5= <>
##$TPNAME6= <>
##$TPNAME7= <>
##$TPOAL= (0..7)
0.5 0.5 0.5 0.5 0.5 0.5 0.5 0.5 
##$TPOFFS= (0..7)
0 0 0 0 0 0 0 0 
##$TUNHIN= 0
##$TUNHOUT= 0
##$TUNXOUT= 0
##$USERA1= <user>
##$USERA2= <user>
##$USERA3= <user>
##$USERA4= <user>
##$USERA5= <user>
##$V9= 5
##$VALIST= <valist>
##$VCLIST= <CCCCCCCCCCCCCCC>
##$VD= 0
##$VDLIST= <DDDDDDDDDDDDDDD>
##$VPLIST= <PPPPPPPPPPPPPPP>
##$VTLIST= <TTTTTTTTTTTTTTT>
##$WBST= 1024
##$WBSW= 4
##$XGAIN= (0..3)
0 0 0 0 
##$XL= 0
##$YL= 0
##$YMAX_a= 812849
##$YMIN_a= -1009410
##$ZGOPTNS= <>
##$ZL1= 120
##$ZL2= 120
##$ZL3= 120
##$ZL4= 120
##$ABSF1= 15.73257
##$ABSF2= -2.31928
##$ABSG= 5
##$ABSL= 3
##$ALPHA= 0
##$AQORDER= 0
##$ASSFAC= 0
##$ASSFACI= 0
##$ASSFACX= 0
##$ASSWID= 0
##$AUNMP= <proc_1d>
##$AZFE= 0.1
##$AZFW= 0.1
##$BCFW= 0
##$BC_mod= 2
##$BYTORDP= 0
##$COROFFS= 0
##$CY= -3
##$DATMOD= 1
##$DC= 0
##$DFILT= <>
##$DTYPP= 0
##$F1P= 0
##$F2P= 0
##$FCOR= 1
##$FTSIZE= 16384
##$FT_mod= 6
##$GAMMA= 0
##$GB= 0
##$INTBC= 1
##$INTSCL= 3.70164e-10
##$ISEN= 128
##$LB= 0.24
##$LEV0= 0
##$LPBIN= 0
##$MAXI= 10000
##$MC2= 0
##$MEAN= 0
##$ME_mod= 0
##$MI= 1.114404
##$NCOEF= 0
##$NC_proc= -6
##$NLEV= 6
##$NOISF1= 3.799351
##$NOISF2= 2.8
##$NSP= 0
##$NTH_PI= 0
##$NZP= 0
##$OFFSET= 15.72485
##$PC= 1
##$PHC0= -23507.43
##$PHC1= 12.25272
##$PH_mod= 1
##$PKNL= yes
##$PPARMOD= 0
##$PSCAL= 0
##$PSIGN= 0
##$REVERSE= no
##$SF= 200.130009344183
##$SI= 16384
##$SIGF1= 3
##$SIGF2= 2
##$SINO= 5.538805
##$SIOLD= 16384
##$SREGLST= <1H.CDCl3>
##$SSB= 0
##$STSI= 16384
##$STSR= 0
##$SW_p= 3612.71676300578
##$SYMM= 0
##$S_DEV= 0
##$TDeff= 16384
##$TDoff= 0
##$TI= <>
##$TILT= no
##$TM1= 0
##$TM2= 0
##$TOPLEV= 0
##$USERP1= <user>
##$USERP2= <user>
##$USERP3= <user>
##$USERP4= <user>
##$USERP5= <user>
##$WDW= 1
##$XDIM= 16384
##$YMAX_p= 365562648
##$YMIN_p= -385852
$$ End of Bruker specific parameters
$$ ---------------------------------
##NTUPLES= NMR SPECTRUM
##VAR_NAME=  FREQUENCY,     SPECTRUM/REAL,   SPECTRUM/IMAG
##SYMBOL=    X,             R,               I
##VAR_TYPE=  INDEPENDENT,   DEPENDENT,       DEPENDENT
##VAR_FORM=  AFFN,          ASDF,            ASDF
##VAR_DIM=   16384,         16384,           16384
##UNITS=     HZ,            ARBITRARY UNITS, ARBITRARY UNITS
##FACTOR=    0.220516191357247, 1,           1
##FIRST=     3147.01431758254, 0,            0
##LAST=      -465.702445423239, 0,           0
##MIN=       -465.702445423239, -385852,     0
##MAX=       3147.01431758254, 365562648,    0
$$ Real data points
##PAGE= N=1
##DATA TABLE= (X++(R..R)), XYDATA
$$ [...]
$$ plain form
6073 1074875 1144064 1120426 1055431 1143550 1171675 1091112 1176157 1220865 1158394 1135254 1095399
6062 1095399 1033763 955086 977621 1063606 1106529 1203979 1129453 1182136 1198487 1121537 1065424
6051 1065424 1135154 1211135 1201634 1136707 1125758 1065587 1153028 1189326 1171184 1163751 1121251 1085156
6039 1085156 1202743 1262024 1220899 1144132 1022914 1152369 1347584 1372145 1426338 1360251 1276234
6028 1276234 1291751 1235567 1255216 1412945 1233349 1198091 1335144 1374686 1352116 1419953 1447159
6017 1447159 1407539 1260765 1462014 1449247 1354795 1447774 1371076 1544712 1419374 1397139 1385182
6006 1385182 1386379 1427113 1428175 1363729 1524166 1628854 1734524 1531965 1594058 1702594 1693820
5995 1693820 1732053 1685661 1773799 1891696 1859656 1871881 1731720 1742368 1856484 1814731 1780549
$$ packed form
6073A074875O9189k3638o4995Q8119K8125q0563Q5045M4708o2471k3140l9855
6062A095399o1636p8677K2535Q5985M2923R7450p4526N2683J6351p6950n6113
6051A065424O9730P5981r501o4927j0949o0171Q7441L6298j8142p433m2500l6095
6039A085156J17587N9281m1125p6767j21218J29455J95215K4561N4193o6087q4017
6028A276234J5517n6184J9649J57729j79596l5258J37053L9542k2570O7837K7206
6017A447159l9620j46774K01249j2767r4452R2979p6698J73636j25338k2235j1957
6006A385182J197M0734J062o4446J60437J04688J05670k02559O2093J08536q774
5995A693820L8233m6392Q8138J17897l2040J2225j40161J0648J14116m1753l4182
$$ plain form
5984 1780549 1847268 1813173 1848610 1846082 1860338 1945691 1981102 1999169 2121232 2163913 2223512
5973 2223512 2162850 2170365 2187649 2236321 2266955 2195792 2166175 2216145 2210624 2193026 2186892 2202165
5961 2202165 2366283 2345120 2322989 2367902 2401178 2401333 2321928 2259909 2289798 2341513 2401959 2335280
5949 2335280 2515850 2463204 2362921 2326026 2386947 2357862 2375788 2429267 2386668 2449592 2509942
5938 2509942 2453251 2568245 2613890 2561515 2529122 2630540 2499216 2524855 2636405 2601886 2639210
5927 2639210 2633794 2642538 2718301 2697072 2700633 2622596 2522139 2453058 2454502 2469110 2398500 2524441
5915 2524441 2512191 2478017 2478662 2568286 2520145 2451798 2524012 2679532 2627389 2614372 2678280 2784456
5903 2784456 2725520 2751217 2809944 2719956 2852018 2764137 2779974 2825782 2712995 2762131 2918919
$$ packed form
5984A780549O6719l4095L5437k528J4256Q5353L5411J8067J22063M2681N9599
5973B223512o0662P515J7284M8672L0634p1163k9617M9970n521j7598o134J5273
5961B202165J64118k1163k2131M4913L3276J55p9405o2019K9889N1715O0446o6679
5949B335280J80570n2646j00283l6895O0921k9085J7926N3479m2599O2924O0350
5938B509942n6691J14994M5645n2375l2393J01418j31324K5639J11550l4519L7324
5927B639210n416Q744P5763k1229L561p8037j00457o9081J444J4608p0610J25941
5915B524441j2250l4174O45Q9624m8141o8347P2214J55520n2143j3017O3908J06176
5903B784456n8936K5697N8727q9988J32062q7881J5837M5808j12787M9136J56788
$$ plain form
5892 2918919 2806893 2893798 3003716 2819079 2855435 3046327 3108871 3181074 3231075 3309549 3471649
5881 3471649 3442990 3380911 3274684 3298918 3150046 3008790 3055301 3037806 3033389 3052914 2887391
5870 2887391 2799978 2882520 2962582 2896743 2821290 2825288 2936114 3010170 2945986 2921245 3049923
5859 3049923 3188443 3186046 3092784 3050149 3094029 3231530 3391844 3419124 3369198 3361785 3395456
5848 3395456 3386980 3388090 3523321 3622139 3777472 3810086 3835872 3871457 3979074 4090660 4169833
5837 4169833 4311431 4406844 4457392 4439047 4554572 4513614 4604176 4520039 4349148 4176976 4242664
5826 4242664 4218768 4235111 4229525 4184588 4301267 4320798 4285797 4267199 4342728 4420533 4563915
5815 4563915 4618998 4732590 4796693 4831623 4836518 4861648 4987229 5003500 4976647 5138748 5242581
$$ packed form
5892B918919j12026Q6905J09918j84637L6356J90892O2544P2203N0001P8474J62100
5881C471649k8659o2079j06227K4234j48872j41256M6511j7495m417J9525j65523
5870B887391q7413Q2542Q0062o5839p5453L998J10826P4056o4184k4741J28678
5859C049923J38520k397r3262m2635M3880J37501J60314K7280m9926p413L3671
5848C395456q476J110J35231R8818J55333L2614K5786L5585J07617J11586P9173
5837D169833J41598R5413N0548j8345J15525m0958R0562q4137j70891j72172O5688
5826D242664k3896J6343n586m4937J16679J9531l5001j8598P5529P7805J43382
5815D563915N5083J13592O4103L4930M895K5130J25581J6271k6853J62101J03833
$$ plain form
5804 5242581 5195951 5144412 5091824 5053907 5062944 4984225 5048961 5036667 5052871 5119753 5133274 5097677
5792 5097677 5170034 5297660 5299492 5433598 5443821 5583936 5643541 5635788 5653378 5775318 5962675
5781 5962675 5968859 5949248 6071319 6159392 6165855 6193969 6255182 6444430 6592454 6617019 6672789
5770 6672789 6855848 7044324 7163408 7324049 7297309 7480397 7630804 7836872 7991235 8198637
5760 8198637 8407913 8492661 8785411 9007196 9168817 9340112 9534630 9613908 9783718 10148347
5750 10148347 10421458 10593506 10745018 10997703 11343517 11624128 11947023 12236189 12585803
5741 12585803 12932275 13405107 13644683 14178385 14674362 15148876 15675849 16403715 17005126
5732 17005126 17655110 18331918 19004078 19658816 20187692 20903405 21449109 22131719 22779240
$$ packed form
5804E242581m6630n1539n2588l7917R037p8719O4736j2294J6204O6882J3521l5597
5792E097677P2357J27626J832J34106J0223J40115N9605p753J7590J21940J87357
5781E962675O184j9611J22071Q8073O463K8114O1213J89248J48024K4565N5770
5770F672789J83059J88476J19084J60641k6740J83088J50407K06068J54363K07402
5760H198637K09276Q4748K92750K21785J61621J71295J94518P9278J69810L64629
5750A0148347K73111J72048J51512K52685L45814K80611L22895K89166L49614
5741A2585803L46472M72832K39576N33702M95977M74514N26973P27866O01411
5732A7005126O49984O76808O72160O54738N28876P15713N45704O82610O47521
$$ plain form
5723 22779240 23437991 24124982 24983074 25852744 26587520 27222939 27686065 27722579 27589587 27125058
5713 27125058 26382888 25413425 24526651 23738206 23042234 22357849 21877699 21437293 21138512
5704 21138512 20968744 20770436 20576080 20474488 20520884 20557487 20798143 21206309 21558510 21847890
5694 21847890 22352441 22914431 23455707 23878857 24376815 24934124 25520099 26209842 27008300
5685 27008300 27914933 28901115 30021712 31088278 32193897 33576098 34963216 36655850
5677 36655850 38500886 40574954 42882410 45384857 47913421 50476522 52988597 55090834
5669 55090834 56757560 57827399 58293805 58318218 57698707 56706460 55626227 54552291 53477315
5660 53477315 52564794 51562307 50470777 49370475 48289202 47164047 45942063 44807282
$$ packed form
5723B2779240O58751O86991Q58092Q69670P34776O35419M63126L6514j32992m64529
5713B7125058p42170r69463q86774p88445o95972o84385m80150m40406k98781
5704B1138512j69768j98308j94356j01592M6396L6603K40656M08166L52201K89380
5694B1847890N04551N61990N41276M23150M97958N57309N85975O89743P98458
5685B7008300R06633R86182J120597J066566J105619J382201J387118J692634
5677C6655850J845036K074068K307456K502447K528564K563101K512075K102237
5669E5090834J666726J069839M66406K4413o19511r92247j080233j073936j074976
5660E3477315r12521j002487j091530j100302j081273j125155j221984j134781
$$ plain form
5652 44807282 43656775 42495389 41339051 40327505 39599637 38971756 38542559 38322730 38231827
5643 38231827 38401468 38497802 39000242 39483924 40195155 41094395 41911026 42874813 44062684
5634 44062684 45144841 46272678 47741144 49002787 50177645 51404373 52582152 53419945
5626 53419945 53982105 54067470 53680226 53143506 52180887 50892807 49544178 48204818 46921091
5617 46921091 45632284 44617379 43627942 42675334 41782573 41080575 40607491 40096997 39827823
5608 39827823 39662310 39574027 39627803 39810974 40074601 40399296 40994551 41729766 42649062 43912571
5598 43912571 45191167 46681253 48319120 50119277 52135728 54213628 56307671 58212420
5590 58212420 59866147 60771917 60930030 60414206 58942708 57014721 54675806 52306383 49702287
$$ packed form
5652D4807282j150507j161386j156338j011546p27868o27881m29197k19829r0903
5643C8231827J69641R6334N02440M83682P11231Q99240Q16631R63787J187871
5634D4062684J082157J127837J468466J261643J174858J226728J177779Q37793
5626E3419945N62160Q5365l87244n36720r62619j288080j348629j339360j283727
5617D6921091j288807j014905r89437r52608q92761p01998m73084n10494k69174
5608C9827823j65513q8283N3776J83171K63627L24695N95255P35215R19296J263509
5598D3912571J278596J490086J637867J800157K016451K077900K094043J904749
5590E8212420J653727R05770J58113n15824j471498j927987k338915k369423k604096
$$ plain form
5581 49702287 47104717 44877020 42779967 40992521 39320239 37941691 36730825 35615631
5573 35615631 34740213 34062603 33404186 32953948 32452964 32168030 32161303 31881975 31891465 32027562
5563 32027562 32238958 32559227 32973847 33540338 33942733 34722231 35645871 36615391 37696684
5554 37696684 38840443 40201150 41665984 43474542 45466207 47280612 49420087 51525536
5546 51525536 53452335 55266239 56869134 58291567 59484886 60496004 61236115 61934201
5538 61934201 62577073 63055356 63465707 63863182 63937771 63976726 64058142 64071314 63776028 63464547
5528 63464547 62947595 62131450 61047466 59685021 58166145 56517325 54715316 53163909
5520 53163909 51656462 50389977 49259640 48179193 47215145 46399957 45636916 44822057 43960366
$$ packed form
5581D9702287k597570k227697k097053j787446j672282j378548j210866j115194
5573C5615631q75418o77610o58417m50238n00984k84934o727k79328R490J36097
5563C2027562K11396L20269M14620N66491M02395P79498R23640R69520J081293
5554C7696684J143759J360707J464834J808558J991665J814405K139475K105449
5546E1525536J926799J813904J602895J422433J193319J011118P40111O98086
5538F1934201O42872M78283M10351L97475P4589L8955Q1416J3172k95286l11481
5528F3464547n16952q16145j083984j362445j518876j648820j802009j551407
5520E3163909j507447j266485j130337j080447r64048q15188p63041q14859q61691
$$ plain form
5511 43960366 42996850 41886084 40653522 39539189 38475762 37460856 36476492 35550224 34897081
5502 34897081 34302871 33539576 33021725 32434207 31784007 31218121 30594586 30003400 29395378
5493 29395378 28769717 28194080 27512307 26904855 26115586 25426426 24935263 24528829 23931111
5484 23931111 23492986 23209901 22937684 22746594 22371663 22186396 22117131 21738347 21435087 21313502
5474 21313502 21091402 20499677 20100201 19732632 19304825 18924087 18547778 18311262 17970294
5465 17970294 17681509 17570204 17400720 17266666 17021487 16754697 16578731 16134650 15857707
5456 15857707 15578628 15295582 14939486 14666250 14291249 14031949 13948017 13831193 13599867 13483760
5446 13483760 13492251 13275677 13075177 13134781 13179606 13199452 13210091 13130498 13253507 13147048 13222611
$$ packed form
5511D3960366r63516j110766j232562j114333j063427j014906r84364r26268o53143
5502C4897081n94210p63295n17851n87518o50200n65886o23535n91186o08022
5493B9395378o25661n75637o81773o07452p89269o89160m91163m06434n97718
5484B3931111m38125k83085k72217j91090l74931j85267o9265l78784l03260j21585
5474B1313502k22100n91725l99476l67569m27807l80738l76309k36516l40968
5465A7970294k88785j11305j69484j34054k45179k66790j75966m44081k76943
5456A5857707k79079k83046l56096k73236l75001k59300q3932j16824k31326j16107
5446A3483760Q491k16574k00500N9604M4825J9846J0639p9593J23009j06459P5563
$$ plain form
5435 13222611 13256005 13294718 13230697 13295870 13404449 13547148 13549290 13577618 13624060 13521031 13534898
5424 13534898 13640390 13696700 13760400 13837854 14015291 14195531 14326328 14476416 14645492 14765546
5414 14765546 14921720 15167936 15457882 15580819 15728516 15907759 16054427 16418776 16664390
5405 16664390 17095367 17510444 17813743 18153204 18744412 19247359 19794415 20483606 20889319
5396 20889319 21257791 21645543 21999455 22361242 22888900 23573606 24235131 25001628 25754832
5387 25754832 26490945 27413317 28216220 29107220 30154525 31094572 31889369 32516257 33141026
5378 33141026 33552282 33977096 34088940 34200865 34188454 34182427 34210962 34150020 34169546 34288552
5368 34288552 34501129 34803880 35073159 35292260 35405835 35615194 35854312 36202598 36555264
$$ packed form
5435A3222611L3394L8713o4021O5173J08579J42699K142K8328M6442j03029J3867
5424A3534898J05492N6310O3700P7454J77437J80240J30797J50088J69076J20054
5414A4765546J56174K46216K89946J22937J47697J79243J46668L64349K45614
5405A6664390M30977M15077L03299L39461N91208N02947N47056O89191M05713
5396B0889319L68472L87752L53912L61787N27658O84706O61525P66497P53204
5387B5754832P36113R22372Q02903Q91000J047305R40047P94797O26888O24769
5378C3141026M11256M24814J11844J11925j2411o027K8535o0942J9526J19006
5368C4288552K12577L02751K69279K19101J13575K09359K39118L48286L52666
$$ plain form
5359 36555264 37155232 37767114 38344895 39105633 39890199 40698048 41773217 43037347 44162023
5350 44162023 45423565 46843438 48447472 50291476 52230964 54412902 56793720 59396770
5342 59396770 62347618 65597882 69188235 73221235 77797371 82826301 88463334 94732766
5334 94732766 101361367 108374394 115698934 123178460 130844124 138624273 146614585 154684837
5326 154684837 162590328 169799343 175374441 179077025 180937447 181242799 180451745 178940976
5318 178940976 176474670 172982327 168646860 163637816 158124927 152550225 147296009 142553531
5310 142553531 138330572 134660405 131610497 129134058 127019257 125253465 123672143 121917521
5302 121917521 119974361 117563220 114464987 110770071 106725375 102255593 97699960 92889917
$$ packed form
5359C6555264N99968O11882N77781P60738P84566Q07849J075169J264130J124676
5350D4162023J261542J419873J604034J844004J939488K181938K380818K603050
5342E9396770K950848L250264L590353M033000M576136N028930N637033O269432
5334I4732766O628601P013027P324540P479526P665664P780149P990312Q070252
5326A54684837P905491P209015N575098L702584J860422L05352p91054j510769
5318A78940976k466306l492343m335467n009044n512889n574702n254216m742478
5310A42553531m222959l670167l049908k476439k114801j765792j581322j754622
5302A21917521j943160k411141l098233l694916m044696m469782m555633m810043
$$ plain form
5294 92889917 87975511 83217409 78528342 73936880 69668506 65606459 61822225 58281612
5286 58281612 54941940 51898496 49176943 46481385 44181432 41967790 39941298 38064735
5278 38064735 36325394 34809638 33353598 32092064 30895126 29891798 28930476 28047835
5270 28047835 26997345 26086422 25323780 24600927 24031435 23356738 22739748 22251347 21889313
5261 21889313 21458909 20963816 20499942 20316400 20181532 19996584 19598821 19403154 19356013 19372901
5251 19372901 19384641 19551669 19637919 19843922 19966808 20207559 20407848 20619797 20908281 21101392
5241 21101392 21228865 21175202 21031584 20695460 20181511 19684241 19032191 18294831 17720740 17063163
5231 17063163 16548544 16114418 15621829 15011688 14495454 14153691 13836860 13530387 13263637
$$ packed form
5294I2889917m914406m758102m689067m591462m268374m062047l784234l540613
5286E8281612l339672l043444k721553k695558k299953k213642k026492j876563
5278C8064735j739341j515756j456040j261534j196938j003328r61322q82641
5270B8047835j050490r10923p62642p22853n69492o74697o16990m88401l62034
5261B1889313m30404m95093m63874j83542j34868j84948l97763j95667m7141J6888
5251A9372901J1740J67028Q6250K06003J22886K40751K00289K11949K88484J93111
5241B1101392J27473n3663j43618l36124n13949m97270o52050p37360n74091o57577
5231A7063163n14619m34126m92589o10141n16234l41763l16831l06473k66750
$$ plain form
5222 13263637 12908874 12657570 12449323 12335918 12205950 12025764 11930496 11891778 11788628 11759746
5212 11759746 11870879 11833841 11808738 11985285 11933751 12007917 12171348 12072813 11974872 11879100 11774300
5201 11774300 11719267 11466531 11095393 10882831 10592970 10234939 10045448 9654052 9410268 9332317
5191 9332317 9014180 8755694 8536790 8269065 8195277 7986248 7806727 7756545 7778470 7556701
5181 7556701 7510133 7396588 7251297 7247373 7308270 7366554 7302877 7223202 7148308 7180942 7079148
5170 7079148 7072983 7187271 7132536 6992039 6906628 6949990 6946358 6874938 6716218 6670606 6524370
5159 6524370 6460915 6470505 6425629 6341832 6106388 5997388 6038981 5887529 5952526 5910411 5957977
5148 5957977 5928860 5683073 5573412 5428469 5407181 5412689 5287061 5320373 5439973 5531062 5715630
$$ packed form
5222A3263637l54763k51304k08247j13405j29968j80186r5268l8718j03150k8882
5212A1759746J11133l7038k5103J76547n1534P4166J63431r8535r7941r5772j04800
5201A1774300n5033k52736l71138k12562k89861l58031j89491l91396k43784p7951
5191I332317l18137k58486k18904k67725p3788k09029j79521n0182K1925k21769
5181G556701m6568j13545j45291l924O0897N8284o3677p9675p4894L2634j01794
5170G079148o165J14288n4735j40497q5411M3362l632p1420j58720m5612j46236
5159F524370o3455R590m4876q3797k35444j09000M1593j51452O4997m2115M7566
5148E957977k9117k45787j09661j44943k1288N508j25628L3312J19600R1089J84568
$$ plain form
5137 5715630 5933660 5961648 6168465 6187991 5929435 5726686 5491687 5252619 5126709 5098650
5127 5098650 4924129 4784598 4610393 4566825 4416522 4452485 4495746 4428225 4430002 4387027 4423942
5116 4423942 4551135 4467987 4465230 4496007 4498605 4508238 4481769 4333097 4432697 4513517 4446980 4368732
5104 4368732 4366076 4357543 4437440 4519354 4457353 4431969 4386624 4423682 4512613 4513445 4396261 4427794
5092 4427794 4456745 4468187 4355335 4192308 4142064 4244551 4399522 4425858 4400658 4255362
5082 4255362 4226551 4235847 4244725 4207613 4111826 4053447 4009715 3972257 4009546 4038613 4007348 3882240
5070 3882240 3926577 3962773 4041088 4062841 4023844 4077002 4133475 4151704 4108578 3967227 4036670
5059 4036670 4071303 4048269 4072218 4177244 4180701 4196252 4028532 4135316 4277493 4326945 4291560
$$ packed form
5137E715630K18030K7988K06817J9526k58556k02749k34999k39068j25910k8059
5127E098650j74521j39531j74205m3568j50303L5963M3261o7521J777m2975L6915
5116D423942J27193q3148k757L0777K598R633k6469j48672R9600Q0820o6537p8248
5104D368732k656q533P9897Q1914o2001k5384m5345L7058Q8931Q32j17184L1533
5092D427794K8951J1442j12852j63027n0244J02487J54971K6336k5200j45296
5082D255362k8811R296Q878l7112r5787n8379m3732l7458L7289K9067l1265j25108
5070C882240M4337L6196P8315K1753l8997N3158N6473J8229m3126j41351O9443
5059D036670L4633k3034K3949J05026L457J5551j67720J06784J42177M9452l5385
$$ plain form
5048 4291560 4245264 4273215 4402827 4623529 4513711 4606391 4631684 4778908 4845200 4834428 4885835
5037 4885835 4825163 4847327 5000476 4996660 5028592 5089745 5159283 5338596 5269216 5170977 5061448
5026 5061448 5240877 5202581 5120859 5166020 5130138 5081949 4977232 4990239 4932118 4932170 4978717 5057674
5014 5057674 4955243 4843293 4791367 4745207 4736770 4565221 4418352 4558369 4456659 4276127
5004 4276127 4178917 4222602 4176722 4083172 4042182 4111179 4014616 3962237 3861466 3869044 3920509
4993 3920509 3838960 3796368 3917852 3994669 3929013 3885505 3833355 3874763 3680884 3749477 3733975
4982 3733975 3787323 3793475 3816743 3818155 3825229 3950256 3886653 4061220 3956247 4002011 4051926
4971 4051926 4156187 4241099 4297868 4238377 4131930 4263201 4243841 4294798 4296316 4262280 4311324
$$ packed form
5048D291560m6296K7951J29612K20702j09818R2680K5293J47224O6292j0772N1407
5037D885835o0672K2164J53149l816L1932O1153O9538J79313o9380r8239j09529
5026E061448J79429l8296q1722M5161l5882m8189j04717J3007n8121N2M6547P8957
5014E057674j02431j11950n1926m6160q437j71549j46869J40017j01710j80532
5004D276127r7210M3685m5880r3550m0990O8997r6563n2379j00771P578N1465
4993C920509q1549m2592J21484P6817o5656m3508n2150M1408j93879O8593j5502
4982C733975N3348O152K3268J412P074J25027o3603J74567j04973M5764M9915
4971D051926J04261Q4912N6769n9491j06447J31271j9360N0957J518l4036M9044
$$ plain form
4960 4311324 4291687 4187242 4079233 3966750 3947183 3981105 3949473 3915626 3862949 3936028 3752474
4949 3752474 3699042 3682943 3793907 3826719 3830961 3976689 3943160 3835714 3716507 3750714 3816026
4938 3816026 3803233 3770186 3704652 3622009 3714237 3775946 3774403 3732353 3578241 3556554 3589363
4927 3589363 3588972 3533166 3613087 3573713 3560574 3451383 3475675 3564432 3544159 3570886 3485677 3515761
4915 3515761 3522716 3473810 3514968 3572608 3638008 3657915 3624716 3633381 3628889 3669424 3639857 3598030
4903 3598030 3600609 3641866 3680493 3730457 3689212 3733735 3615099 3662278 3783050 3883835 3765937
4892 3765937 3686649 3708743 3766524 3771716 3808676 3742850 3782820 3857158 3782342 3828613 3806790 3901640
4880 3901640 3922203 3768611 3828211 3878827 3920484 3875681 3771158 3645578 3606073 3685879 3748915
$$ packed form
4960D311324j9637j04445j08009j12483j9567L3922l1632l3847n2677P3079j83554
4949C752474n3432j6099J10964L2812M242J45728l3529j07446j19207L4207O5312
4938C816026j2793l3047o5534q2643R2228O1709j543m2050j54112k1687L2809
4927C589363l91n5806P9921l9374j3139j09191K4292Q8757k0273K6727q5209L0084
4915C515761O955m8906M1158N7640O5400J9907l3199Q665m492M0535k9567m1827
4903C598030K579M1257L8627M9964m1245M4523j18636M7179J20772J00785j17898
4892C765937p9288K2094N7781N192L6960o5826L9970P4338p4816M6271k1823R4850
4880C901640K0563j53592N9600N0616M1657m4803j04523j25580l9505P9806O3036
$$ plain form
4869 3748915 3835812 3805865 3817643 3953013 3971421 3982125 4036212 4064430 3978841 3949172 4004239
4858 4004239 4151618 4230801 4226594 4285199 4274201 4344361 4407055 4332555 4379251 4389050 4547303
4847 4547303 4629859 4528320 4523930 4534055 4606193 4717737 4686186 4701874 4785677 4843907 4817428
4836 4817428 4781012 4722645 4666573 4695124 4765481 4813600 4826439 4892611 4914682 4875622 4936411
4825 4936411 5016537 4986677 4938590 4967271 5046239 4847721 4823750 4953457 5002481 4999023 5140500
4814 5140500 5171214 5230567 5187970 5170051 5266542 5349290 5337335 5350721 5385845 5248549 5374148
4803 5374148 5433201 5435677 5386379 5373726 5415468 5419493 5499885 5502257 5650971 5560264 5519494 5568505
4791 5568505 5642787 5805839 5917557 5922993 5986882 6097447 6187982 6137899 6239884 6282082 6412814
$$ packed form
4869C748915Q6897k9947J1778J35370J8408J0704N4087K8218q5589k9669N5067
4858D004239J47379P9183m207N8605j0998P0160O2694p4500M6696R799J58253
4847D547303Q2556j01539m390J0125P2138J11544l1551J5688Q3803N8230k6479
4836D817428l6416n8367n6072K8551P0357M8119J2839O6172K2071l9060O0789
4825D936411Q0126k9860m8087K8681P8968j98518k3971J29707M9024l458J41477
4814E140500L0714N9353m2597j7919R6491Q2748j1955J3386L5124j37296J25599
4803E374148N9053K476m9298j2653M1742M025Q0392K372J48714r0707m0770M9011
4791E568505P4282J63052J11718N436O3889J10565R0535n0083J01985M2198J30732
$$ plain form
4780 6412814 6517068 6428541 6483923 6544960 6614255 6719221 6840947 7001432 7128194 7121878 7161127
4769 7161127 7274830 7451512 7533300 7696919 7781227 7734849 7714224 8005715 8228615 8405858
4759 8405858 8570786 8666065 9035618 9452419 9821472 10216875 10555208 10533881 10397335 10378779
4749 10378779 10236694 10273122 10343819 10293200 10342408 10338694 10489172 10686874 10875095 11094981
4739 11094981 11326666 11400761 11623330 11870933 11982094 12189771 12386999 12610508 12842684 13152450
4729 13152450 13477286 13782484 13958774 14164221 14501897 14761366 14941581 15297153 15673082
4720 15673082 15989794 16310114 16592349 16907396 17180946 17515159 17937288 18154616 18402789
4711 18402789 18844584 19212071 19602410 20099238 20610777 21161736 21628804 22309958 22967614
$$ packed form
4780F412814J04254q8527N5382O1037O9295J04966J21726J60485J26762o316L9249
4769G161127J13703J76682Q1788J63619Q4308m6378k0625K91491K22900J77243
4759H405858J64928R5279L69553M16801L69053L95403L38333k1327j36546j8556
4749A0378779j42085L6428P0697n0619M9208l714J50478J97702J88221K19886
4739A1094981K31685P4095K22569K47603J11161K07677J97228K23509K32176L09766
4729A3152450L24836L05198J76290K05447L37676K59469J80215L55572L75929
4720A5673082L16712L20320K82235L15047K73550L34213M22129K17328K48173
4711A8402789M41795L67487L90339M96828N11539N50959M67068O81154O57656
$$ plain form
4702 22967614 23673682 24279782 24896445 25393707 25649548 26070740 26146302 26054278 25985291 25867822
4692 25867822 25747907 25652296 25586195 25565679 25496090 25505158 25385069 25259940 25096999 24987914
4682 24987914 25042400 25014790 25054334 25199693 25246258 25470711 25691626 25956887 26378895 26735852
4672 26735852 27166192 27626346 28144290 28773624 29431702 29987201 30456636 31018802 31569978
4663 31569978 31973864 32412130 32815203 33028246 33189027 33485542 33614677 33641735 33829025 34095402
4653 34095402 34175129 34270101 34356762 34624780 34841601 35008009 35367117 35424919 35698687 35874534
4643 35874534 36020576 36125202 36196149 36455314 36549011 36667217 36911496 37309529 37499179 38030920
4633 38030920 38625001 39057220 39706134 40464509 41264974 41983366 42716934 43338625 43787390
$$ packed form
4702B2967614P06068O06100O16663M97262K55841M21192P5562r2024o8987j17469
4692B5867822j19915r5611o6101k0516o9589R068j20089j25129j62941j09085
4682B4987914N4486k7610L9544J45359M6565K24453K20915K65261M22008L56957
4672B6735852M30340M60154N17944O29334O58078N55499M69435N62166N51176
4663C1569978M03886M38266M03073K13043J60781K96515J29135K7058J87290K66377
4653C4095402P9727R4972Q6661K68018K16821J66408L59108N7802K73768J75847
4643C5874534J46042J04626P0947K59165R3697J18206K44279L98033J89650N31741
4633C8030920N94081M32219O48914P58375Q00465P18392P33568O21691M48765
$$ plain form
4624 43787390 44245672 44610708 44809665 44669826 44344909 43994073 43501356 42822202 42034485
4615 42034485 41482621 40916305 40410677 39969890 39709577 39570349 39488927 39390042 39503214 39719407
4605 39719407 39883928 40261222 40813327 41111786 41383537 41902407 42154762 42482316 42752473
4596 42752473 43074961 43269683 43606082 44011889 44352237 44599582 44652905 44747125 44792031 44763336
4586 44763336 44627450 44333705 44262564 43961605 43740890 43730069 43628579 43549852 43463672 43514921
4576 43514921 43767603 44173101 44495707 44920857 45543391 46140972 46910345 47666325 48618769
4567 48618769 49793518 50858281 52071348 53303354 54658077 56231232 57666695 59184553
4559 59184553 60790934 62436141 64199614 65960127 67693560 69185512 70653889 72230680
$$ packed form
4624D3787390M58282L65036J98957j39839l24917l50836m92717o79154p87717
4615D2034485n51864n66316n05628m40787k60313j39228q1422r8885J13172K16193
4605C9719407J64521L77294N52105K98459K71751N18870K52355L27554K70157
4596D2752473L22488J94722L36399M05807L40348K47345N3323R4220M4906k8695
4586D4763336j35886k93745p1141l00959k20715j0821j01490p8727q6180N1249
4576D3514921K52682M05498L22606M25150O22534N97581P69373P55980R52444
4567D8618769J174749J064763J213067J232006J354723J573155J435463J517858
4559E9184553J606381J645207J763473J760513J733433J491952J468377J576791
$$ plain form
4551 72230680 73627225 74855590 75984435 77046149 78154266 79132578 80288567 81598593
4543 81598593 82868998 84213978 85861978 87479183 89184328 90897338 92708426 94640512
4535 94640512 96635532 98852843 100946390 103132711 105460469 107706546 109824845 111976143
4527 111976143 114045689 115772581 117251186 117720081 117051781 115217177 112757343 110035889
4519 110035889 107486555 105112804 103188233 101758373 100593567 99673371 98926209 98166179
4511 98166179 97324259 96649072 96226241 96031779 96218682 96788767 97571950 98576679 99424892
4502 99424892 99931245 100050461 99503000 98222835 96485614 94293502 91681170 88811568 86156564
4493 86156564 83626865 81465918 79599379 78210963 77277336 76631259 76483648 76553457 77214838
$$ packed form
4551G2230680J396545J228365J128845J061714J108117R78312J155989J310026
4543H1598593J270405J344980J648000J617205J705145J713010J811088J932086
4535I4640512J995020K217311K093547K186321K327758K246077K118299K151298
4527A11976143K069546J726892J478605M68895o68300j834604k459834k721454
4519A10035889k549334k373751j924571j429860j164806r20196p47162p60030
4511I8166179q41920o75187m22831j94462J86903N70085P83183J004729Q48213
4502I9424892N06353J19216n47461j280165j737221k192112k612332k869602k655004
4493H6156564k529699k160947j866539j388416r33627o46077j47611O9809O61381
$$ plain form
4484 77214838 77967161 79095102 80610455 82490143 84503252 86411851 88466513 90373206
4476 90373206 92143095 93438756 94237108 94302223 94054328 93470145 92701663 91953325 91271125
4467 91271125 90649918 90178332 90126298 90180957 90400449 90860352 91373865 92175466 92614600 92921095
4457 92921095 93182194 93385811 93432789 93404501 93338410 92934969 92637810 92196907 91768412 91376904
4447 91376904 90895898 90579347 90452937 90480811 90751867 91179502 91966220 92866812 94041785
4438 94041785 95385811 97240074 99116832 101393028 103839559 106398315 109361090 112484429
4430 112484429 116055208 119847783 123639376 127691121 131706546 135410467 139046907 142108065
4422 142108065 144665630 146802058 148591317 150061494 151181067 151956847 152616678 153208040
$$ packed form
4484G7214838P52323J127941J515353J879688K013109J908599K054662J906693
4476I0373206J769889J295661P98352O5115k47895n84183p68482p48338o82200
4467I1271125o21207m71586n2034N4659K19492M59903N13513Q01601M39134L06495
4457I2921095K61099K03617M6978k8288o6091m03441k97159m40903m28495l91508
4447I1376904m81006l16551j26410K7874K71056M27635P86718R00592J174973
4438I4041785J344026J854263J876758K276196K446531K558756K962775L123339
4430A12484429L570779L792575L791593M051745M015425L703921L636440L061158
4422A42108065K557565K136428J789259J470177J119573P75780O59831N91362
$$ plain form
4414 153208040 153463425 153538191 153743958 153670507 153397005 152998604 152491743 152021893 151641472 151435086
4404 151435086 151624061 152025034 152921000 154122164 155577513 157405548 159413713 161392684
4396 161392684 163508907 165470272 167314840 168838328 169829794 170196697 169926243 168938941 167129479
4387 167129479 164899684 162366297 159450249 156529061 153550055 150917790 148463746 146101126
4379 146101126 144007501 142308177 140745814 139833836 139504118 139713621 140589902 141949491 144065120
4370 144065120 146808624 150087810 153987094 158335718 163233380 168082182 173278171 178925405
4362 178925405 185081560 191914179 199857807 209543734 221320388 235384713 251249346 266794038
4354 266794038 276796823 276590868 265334502 247039121 225763201 204392845 184702901
$$ packed form
4414A53208040K55385P4766K05767p3451k73502l98401n06861m69850l80421k06386
4404A51435086J88975M00973Q95966J201164J455349J828035K008165J978971
4396A61392684K116223J961365J844568J523488R91466L66903k70454r87302j809462
4387A67129479k229795k533387k916048k921188k979006k632265k454044k362620
4379A46101126k093625j699324j562363r11978l29718K09503Q76281J359589K115629
4370A44065120K743504L279186L899284M348624M897662M848802N195989N647234
4362A78925405O156155O832619P943628R685927J1776654J4064325J5864633J5544692
4354B66794038J0002785k05955j1256366j8295381k1275920k1370356j9689944
$$ plain form
4347 184702901 167705096 153238240 141166566 131046948 122622804 115462795 109493682
4340 109493682 104171565 99532166 95538968 91859749 88471663 85531799 82832145 80379313
4332 80379313 78277192 76420272 74728396 73224951 71802031 70404342 69063749 67838423
4324 67838423 66597782 65787226 64993872 64278623 63666618 63260567 62806586 62365214 62281951
4315 62281951 62153613 61971424 61819970 61650652 61392803 61151548 60910246 60516539 60011013
4306 60011013 59534935 59169843 59025989 58834226 58801683 58975918 59200728 59459269 59808832 60308966
4296 60308966 60740332 61351217 62111604 62924341 63688994 64863786 66071638 67473245 69099109
4287 69099109 70843936 72695327 74802221 77126776 79671444 82490650 85605660 89158956
$$ packed form
4347A84702901j6997805j4466856j2071674j0119618q424144p160009n969113
4340A09493682n322117m639399l993198l679219l388086k939864k699654k452832
4332H0379313k102121j856920j691876j503445j422920j397689j340593j225326
4324F7838423j240641q10556p93354p15249o12005m06051m53981m41372q3263
4315F2281951j28338j82189j51454j69318k57849k41255k41302l93707n05526
4306F0011013m76078l65092j43854j91763l2543J74235K24810K58541L49563N00134
4296F0308966M31366O10885P60387Q12737P64653J174792J207852J401607J625864
4287F9099109J744827J851391K106894K324555K544668K819206L115010L553296
$$ plain form
4279 89158956 92990374 97336262 102152624 107578947 113658989 120561858 128168590 136966200
4271 136966200 146712036 157780724 170344833 184727356 201133580 219482892 239641320
4264 239641320 260891947 281872880 299749079 311142844 313244018 305291758 289204239
4257 289204239 267771737 244128808 220511900 198394976 178423765 160791803 145704480
4250 145704480 132750342 121555942 112077460 104061627 97145546 91028227 85797601 81036574
4242 81036574 76806045 73065096 69827092 66970400 64392646 62170359 60210168 58411700
4234 58411700 56868923 55581302 54445116 53590858 52758032 51898858 51151094 50212765 49259981
4225 49259981 48296300 47060190 45729910 44374955 42819841 41211667 39790995 38519309
$$ packed form
4279H9158956L831418M345888M816362N426323O080042O902869P606732Q797610
4271A36966200R745836J1068688J2564109J4382523J6406224J8349312K0158428
4264B39641320K1250627K0980933J7876199J1393765K101174p952260j6087519
4257B89204239k1432502k3642929k3616908k2116924j9971211j7631962j5087323
4250A45704480j2954138j1194400r478482q015833o916081o117319n230626m761027
4242H1036574m230529l740949l238004k856692k577754k222287j960191j798468
4234E8411700j542777j287621j136186q54258q32826q59174p47764r38329r52784
4225D9259981r63681j236110j330280j354955j555114j608174j420672j271686
$$ plain form
4217 38519309 37154486 35993109 34791979 33695016 32844271 31886023 30924528 30128123 29381421
4208 29381421 28525888 27676737 26967214 26283632 25720646 25197667 24675820 24111607 23602149
4199 23602149 23002341 22476805 21961206 21527726 21172818 20721033 20451073 19967782 19636823
4190 19636823 19481105 19131952 18808559 18632017 18384346 18162515 18034056 17754536 17615871
4181 17615871 17520349 17249878 16965685 16753608 16401089 16119316 15975780 15830198 15689732 15594611
4171 15594611 15517574 15180016 15008452 14828176 14702399 14473544 14348410 14220702 14024167 13982627
4161 13982627 13984169 13788148 13621230 13547167 13566576 13376945 13187733 13035322 12789453 12598524
4151 12598524 12629252 12541036 12340178 12164071 12249904 12176114 12127821 12029102 12045935 12128382 12131444
$$ packed form
4217C8519309j364823j161377j201130j096963q50745r58248r61495p96405p46702
4208B9381421q55533q49151p09523o83582n62986n22979n21847n64213n09458
4199B3602149n99808n25536n15599m33480l54908m51785k69960m83291l30959
4190A9636823j55718l49153l23393j76542k47671k21831j28459k79520j38665
4181A7615871r5522k70471k84193k12077l52519k81773j43536j45582j40466r5121
4171A5594611p7037l37558j71564j80276j25777k28855j25134j27708j96535m1540
4161A3982627J542j96021j66918p4063J9409j89631j89212j52411k45869j90929
4151A2598524L0728q8216k00858j76107Q5833p3790m8293r8719J6833Q2447L062
$$ plain form
4140 12131444 12159904 12158102 12102151 12193898 12253438 12144792 12055651 12038737 11958781 11895038 11870970
4129 11870970 11699948 11586486 11529882 11637018 11574991 11543841 11517040 11605556 11567075 11554825 11538560
4118 11538560 11421124 11289831 11171260 11108893 11046333 10860783 10704060 10606162 10576902 10551885
4108 10551885 10528813 10520947 10465678 10446038 10545897 10417469 10347905 10359319 10367621 10242442 10233275
4097 10233275 10249121 10262957 10291169 10320337 10290479 10198792 10222769 10315117 10325522 10237822 10257634
4086 10257634 10210615 10242898 10234946 10278725 10294492 10209156 10398529 10541194 10670102 10724044 10746612
4075 10746612 10910205 11054793 11233217 11444534 11679352 11811118 11924282 12107407 12271415
4066 12271415 12328827 12272205 12313735 12406109 12362061 12421588 12583518 12639374 12729381 13034302 13371768
$$ packed form
4140A2131444K8460j802n5951R1747N9540j08646q9141j6914p9956o3743k4068
4129A1870970j71022j13462n6604J07136o2027l1150k6801Q8516l8481j2250j6265
4118A1538560j17436j31293j18571o2367o2560j85550j56723r7898k9260k5017
4108A0551885k3072p866n5269j9640R9859j28428o9564J1414Q302j25179r167
4097A0233275J5846J3836K8212K9168k9858r1687K3977R2348J0405q7700J9812
4086A0257634m7019L2283p952M3779J5767q5336J89373J42665J28908N3942K2568
4075A0746612J63593J44588J78424K11317K34818J31766J13164J83125J64008
4066A2271415N7412n6622M1530R2374m4048N9527J61930N5856R0007L04921L37466
$$ plain form
4055 13371768 13658831 13964615 14411252 14599382 14700333 14907368 15084243 15081200 14897693 14600203
4045 14600203 14464366 14224834 14162001 14053974 13799852 13661056 13639079 13583904 13597880 13606356
4035 13606356 13513336 13564122 13555036 13622234 13662918 13840951 13974935 14099289 14289356 14284968 14584177
4024 14584177 14925378 15024931 15337061 15623104 16063971 16530338 16836986 17125360 17385232 17744021
4014 17744021 18228726 18634974 19039574 19384840 19618772 19966058 20217643 20478423 20794706
4005 20794706 20945762 21082186 21269434 21509503 21712543 21922126 22156150 22488127 22795072
3996 22795072 23097047 23474696 23727910 23956322 24397597 24796453 25099384 25583391 26066997
3987 26066997 26514625 26977473 27436043 27923314 28454203 29055069 29505963 30026693 30563397
$$ packed form
4055A3371768K87063L05784M46637J88130J00951K07035J76875l043j83507k97490
4045A4600203j35837k39532o2833j08027k54122j38796k1977n5175J3976Q476
4035A3606356r3020N0786r086O7198M0684J78033J33984J24354J90067m388K99209
4024A4584177L41201R9553L12130K86043M40867M66367L06648K88374K59872L58789
4014A7744021M84705M06248M04600L45266K33932L47286K51585K60780L16283
4005B0794706J51056J36424J87248K40069K03040K09583K34024L31977L06945
3996B2795072L01975L77649K53214K28412M41275L98856L02931M84007M83606
3987B6066997M47628M62848M58570M87271N30889O00866M50894N20730N36704
$$ plain form
3978 30563397 31402173 32113032 32702561 33324887 33923335 34616654 35355332 36138493 37027870
3969 37027870 37767842 38500081 39515819 40482315 41246534 42157510 43149229 44276394 45479715
3960 45479715 46699375 47905609 49181259 50605495 51915480 53397081 54741356 56149425
3952 56149425 57754748 59301394 60829950 62557817 64286449 66222269 68209174 70403312
3944 70403312 72551404 74806061 77188424 79602007 82204245 84832998 87606161 90424942
3936 90424942 93286411 96109889 99126651 102201322 105197597 108389543 111611910 114913857
3928 114913857 118246043 121548684 124788985 127987853 131219774 134232173 137035720 139731339
3920 139731339 142236803 144437915 146547676 148605608 150353217 151818244 153272806 154474732
$$ packed form
3978C0563397Q38776P10859N89529O22326N98448O93319P38678P83161Q89377
3969C7027870P39972P32239J015738R66496P64219R10976R91719J127165J203321
3960D5479715J219660J206234J275650J424236J309985J481601J344275J408069
3952E6149425J605323J546646J528556J727867J728632J935820J986905K194138
3944G0403312K148092K254657K382363K413583K602238K628753K773163K818781
3936I0424942K861469K823478L016762L074671K996275L191946L222367L301947
3928A14913857L332186L302641L240301L198868L231921L012399K803547K695619
3920A39731339K505464K201112K109761K057932J747609J465027J454562J201926
$$ plain form
3912 154474732 155493054 156338400 156886128 157127819 156981225 156456579 155490149 154144377 152464426
3903 152464426 150680349 148644113 146455333 144011147 141547070 138844807 135897353 132791081
3895 132791081 129609490 126134956 122418027 118682495 114766966 110687655 106646695 102626039
3887 102626039 98661701 94701402 90720184 86891912 83199066 79523061 76018696 72625559
3879 72625559 69206591 65948976 62726077 59669815 56687210 54015453 51421067 48765465
3871 48765465 46327756 44051932 41793590 39857874 37983941 36199987 34597263 33134440
3863 33134440 31665464 30166896 28965252 27769380 26630189 25560703 24560204 23730452
3855 23730452 22978924 22100179 21361645 20581689 19950843 19370627 18646165 18251798 17832828
$$ packed form
3912A54474732J018322Q45346N47728K41691j46594n24646r66430j345772j679951
3903A52464426j784077k036236k188780k444186k464077k702263k947454l106272
3895A32791081l181591l474534l716929l735532l915529m079311m040960m020656
3887A02626039l964338l960299l981218l828272l692846l676005l504365l393137
3879G2625559l418968l257615l222899l056262k982605k671757k594386k655602
3871D8765465k437709k275824k258342j935716j873933j783954j602724j462823
3863C3134440j468976j498568j201644j195872j139191j069486j000499q29752
3855B3730452p51528q78745p38534p79956o30846n80216p24462l94367m18970
$$ plain form
3846 17832828 17405270 16949746 16552126 16123595 15693340 15180513 14845166 14623667 14420162
3837 14420162 14150476 13880816 13637224 13359836 13055159 12737918 12536412 12323493 12124331
3828 12124331 11906246 11524410 11498469 11388476 11296207 11156000 10911965 10757676 10610682 10677263
3818 10677263 10544727 10303322 10230457 10169307 10005723 9841178 9753503 9658436 9639675 9559392
3808 9559392 9503236 9329842 9300977 9334690 9158743 9053277 9057768 9102819 8888015 8683392 8752799
3797 8752799 8812466 8731881 8697583 8650107 8602987 8579065 8603521 8436624 8420617 8374173 8376041
3786 8376041 8415101 8378495 8209324 8195047 8290043 8185210 8107556 8145492 8092255 8002599 7922327
3775 7922327 7973949 7960957 7846264 7941451 7925337 7870080 7945147 7903348 7962173 7940115 8012505
$$ packed form
3846A7832828m27558m55524l97620m28531m30255n12827l35347k21499k03505
3837A4420162k69686k69660k43592k77388l04677l17241k01506k12919j99162
3828A2124331k18085l81836k5941j09993r2269j40207k44035j54289j46994O6581
3818A0677263j32536k41405p2865o1150j63584j64545q7675r5067j8761q0283
3808I559392n6156j73394k8865L3713j75947j05466M491M5051k14804k04623O9407
3797H752799N9667q0585l4298m7476m7120k3922K4456j66897j6007m6444J868
3786H376041L9060l6606j69171j4277R4996j04833p7654L7936n3237q9656q0272
3775G922327N1622j2992j14693R5187j6114n5257P5067m1799N8825k2058P2390
$$ plain form
3764 8012505 7984231 7894717 7821014 7849144 7853147 7831194 7833079 7860551 7895718 7904090 7898724 7925857
3752 7925857 7905112 7966708 7995090 7946118 7982606 8058144 8138808 7942873 7956926 8011826 8099719
3741 8099719 8109815 8121518 8155449 8210039 8303174 8362608 8471268 8404827 8311395 8417897 8522030
3730 8522030 8517116 8590063 8643350 8732475 8783135 8810008 9005236 8948592 8976067 9132333 9318940
3719 9318940 9397302 9384853 9458649 9423500 9498084 9701591 9800864 9919542 10113884 10136916 10250737
3708 10250737 10345694 10340371 10532194 10511202 10765735 10864529 10903818 11044829 11090409 11215973 11375529
3697 11375529 11585492 11606165 11753668 11934520 12042993 12173139 12304131 12486918 12661870 12802792
3687 12802792 13090224 13282291 13371218 13503397 13718228 14101022 14357918 14488552 14827874 15095064
$$ packed form
3764H012505k8274q9514p3703K8130M003k1953J885K7472L5167Q372n366K7133
3752G925857k0745O1596K8382m8972L6488P5538Q0664j95935J4053N4900Q7893
3741H099719J0096J1703L3931N4590R3135N9434J08660o6441r3432J06502J04133
3730H522030m914P2947N3287Q9125N0660K6873J95228n6644K7475J56266J86607
3719I318940P8362j2449P3796l5149P4584K03507R9273J18678J94342K3032J13821
3708A0250737R4957n323J91823k0992K54533R8794L9289J41011M5580J25564J59556
3697A1375529K09963K0673J47503J80852J08473J30146J30992J82787J74952J40922
3687A2802792K87432J92067Q8927J32179K14831L82794K56896J30634L39322K67190
$$ plain form
3677 15095064 15401928 15710085 16035826 16377941 16654939 17014865 17382409 17608955 17842634
3668 17842634 18268357 18628872 19037386 19530351 19912255 20274835 20931958 21466075 21957518
3659 21957518 22386130 22923433 23433583 24008280 24539321 25088298 25818212 26314829 26811885
3650 26811885 27560769 28348549 29103968 29808384 30453654 31174486 31973422 32953747 33984481
3641 33984481 34957370 36058924 37096820 38225530 39466870 40780492 42148219 43569886
3633 43569886 45210303 46881281 48459229 50179012 52117867 53855631 55604581 57487029
3625 57487029 59350043 61255385 63013603 64756878 66466523 68081503 69620924 70980557
3617 70980557 72392405 73787396 75013865 76145724 77286708 78241730 79015510 79655980 80097127
$$ packed form
3677A5095064L06864L08157L25741L42115K76998L59926L67544K26546K33679
3668A7842634M25723L60515M08514M92965L81904L62580O57123N34117M91443
3659B1957518M28612N37303N10150N74697N31041N48977P29914M96617M97056
3650B6811885P48884P87780P55419P04416O45270P20832P98936R80325J030734
3641C3984481R72889J101554J037896J128710J241340J313622J367727J421667
3633D3569886J640417J670978J577948J719783J938855J737764J748950J882448
3625E7487029J863014J905342J758218J743275J709645J614980J539421J359633
3617G0980557J411848J394991J226469J131859J140984R55022P73780O40470M41147
$$ plain form
3608 80097127 80424893 80611111 80684719 80840378 80779267 80500313 80293883 80196068 80072946 80027707
3598 80027707 79969864 80132400 80226286 80423690 80684535 81059310 81483712 81985606 82803988 83789588
3588 83789588 84965827 86405124 88010299 90009057 92175614 94694053 97398220 100406415
3580 100406415 103917927 107568139 111429744 115503447 119680130 124204595 128990804 133767801
3572 133767801 138862211 144016355 149088395 154065669 159044660 163786197 168376571 172845532
3564 172845532 176949168 180728897 184396541 187902465 191167069 193943220 196477080 198686826
3556 198686826 200532692 201696294 202393767 202657373 202276528 201280315 199832166 198049817 195839790
3547 195839790 193553567 190983803 188303735 185508046 182731151 180051759 177181234 174360556
$$ packed form
3608H0097127L27766J86218P3608J55659o1111k78954k06430r7815j23122m5239
3598H0027707n7843J62536R3886J97404K60845L74775M24402N01894Q18382R85600
3588H3789588J176239J439297J605175J998758K166557K518439K704167L008195
3580A00406415L511512L650212L861605M073703M176683M524465M786209M776997
3572A33767801N094410N154144N072040M977274M978991M741537M590374M468961
3564A72845532M103636L779729L667644L505924L264604K776151K533860K209746
3556A98686826J845866J163602O97473K63606l80845r96213j448149j782349k210027
3547A95839790k286223k569764k680068k795689k776895k679392k870525k820678
$$ plain form
3539 174360556 171772048 169138454 166690278 164537396 162689426 160994445 159626719 158419273
3531 158419273 157547773 157180054 157150757 157613831 158330155 159358800 160695965 162234660 163936376
3522 163936376 165869303 167841217 169775665 171731468 173716742 175738739 177491351 179257903
3514 179257903 180923477 182391241 183663938 184669960 185622632 186269429 186445625 186371366 185837060
3505 185837060 184935796 183639910 181800581 179534707 176882504 173936579 170889447 167677207
3497 167677207 164357723 160973284 157634180 154484122 151328435 148404828 145652513 143145112
3489 143145112 140665202 138449483 136472813 134826684 133337977 131784771 130271766 128841780
3481 128841780 127023254 125346091 123411061 121373904 119339001 117434788 115909667 114765765
$$ packed form
3539A74360556k588508k633594k448176k152882j847970j694981j367726j207446
3531A58419273q71500l67719k9297M63074P16324J028645J337165J538695J701716
3522A63936376J932927J971914J934448J955803J985274K021997J752612J766552
3514A79257903J665574J467764J272697J006022R52672O46797J76196p4259n34306
3505A85837060r01264j295886j839329k265874k652203k945925l047132l212240
3497A67677207l319484l384439l339104l150058l155687k923607k752315k507401
3489A43145112k479910k215719j976670j646129j488707j553206j513005j429986
3481A28841780j818526j677163j935030k037157k034903j904213j525121j143902
$$ plain form
3473 114765765 114016316 113536788 113487180 113468827 113626043 113459884 113012964 112203665 110864093
3464 110864093 109275329 107455966 105437766 103368979 101589902 100023540 98439786 97304189
3456 97304189 96526831 95705284 95051558 94344350 93663054 92927040 92189432 91309346 90321055
3447 90321055 89167585 87957772 86669403 85393118 84247276 83032889 81818735 80742933
3439 80742933 79761828 78679060 77710165 76773478 75798288 74879370 74044880 73073719 72083007
3430 72083007 71079639 70202715 69508244 68879897 68259583 67754650 67411968 67096282 66856292
3421 66856292 66768953 66788411 66903743 67057802 67416251 67702090 68139890 68710690 69452778 70086215
3411 70086215 70784479 71666097 72544894 73540674 74510549 75709482 77043202 78476568 80000269
$$ packed form
3473A14765765p49449m79528m9608j8353J57216j66159m46920q09299j339572
3464A10864093j588764j819363k018200k068787j779077j566362j583754j135597
3456I7304189p77358q21547o53726p07208o81296p36014p37608q80086r88291
3447I0321055j153470j209813j288369j276285j145842j214387j214154j075802
3439H0742933r81105j082768r68895r36687r75190r18918q34490r71161r90712
3430G2083007j003368q76924o94471o28347o20314n04933l42682l15686k39990
3421F6856292q7339J9458J15332J54059L58449K85839M37800N70800P42088O33437
3411G0086215O98264Q81618Q78797R95780R69875J198933J333720J433366J523701
$$ plain form
3402 80000269 81585128 83376599 85418609 87686333 90210759 92922493 95920797 99117785
3394 99117785 102618175 106518877 110739280 115407980 120519128 126170845 132341022 139126394
3386 139126394 146530639 154601611 163480852 173176147 183852136 195503109 207924618 221277575
3378 221277575 235379125 250085811 265152384 280214208 295193577 309328392 322324968
3371 322324968 333951616 343675915 351680031 357601365 361837918 364423661 365562648 365393182
3363 365393182 364147717 361856435 358570522 354173291 348700498 342041817 333884626 324261072
3355 324261072 312965374 300350858 286514479 271886485 256435643 240828938 225299922
3348 225299922 210010514 195540284 181789860 168958860 157126049 146357212 136409055
$$ packed form
3402H0000269J584859J791471K042010K267724K524426K711734K998304L196988
3394I9117785L500390L900702M220403M668700N111148N651717O170177O785372
3386A39126394P404245Q070972Q879241R695295J0675989J1650973J2421509J3352957
3378B21277575J4101550J4706686J5066573J5061824J4979369J4134815J2996576
3371C22324968J1626648R724299Q004116N921334M236553K585743J138987j69466
3363C65393182j245465k291282l285913m397231n472793o658681q157191r623554
3355C24261072j1295698j2614516j3836379j4627994j5450842j5606705j5529016
3348B25299922j5289408j4470230j3750424j2831000j1832811j0768837r948157
$$ plain form
3341 136409055 127429228 119323501 112069678 105436831 99563650 94235166 89241654 84897889
3333 84897889 81001523 77499802 74273000 71202866 68485939 66031648 63684006 61678253
3325 61678253 59810836 58072889 56553068 55072203 53610269 52242145 51010455 49795920
3317 49795920 48644943 47598990 46475812 45509528 44475371 43467473 42419666 41387578
3309 41387578 40549486 39741844 38871080 37934350 37121860 36154812 35193021 34383348 33447899
3300 33447899 32741094 31970058 31159414 30359421 29666285 28891488 28121223 27326456 26626782
3291 26626782 25805756 25131782 24444849 23776573 23178724 22460785 21936833 21582860 21114800
3282 21114800 20642121 20126561 19790404 19535972 19015047 18712004 18372030 18052017 17855372
$$ packed form
3341A36409055q979827q105727p253823o632847n873181n328484m993512m343765
3333H4897889l896366l501721l226802l070134k716927k454291k347642k005753
3325F1678253j867417j737947j519821j480865j461934j368124j231690j214535
3317D9795920j150977j045953j123178r66284j034157j007898j047807j032088
3309D1387578q38092q07642q70764r36730q12490r67048r61791q09673r35449
3300C3447899p06805p71036q10644p99993o93136p74797p70265p94767o99674
3291B6626782q21026o73974o86933o68276n97849p17939n23952l53973m68060
3282B1114800m72679n15560l36157k54432n20925l03043l39974l20013j96645
$$ plain form
3273 17855372 17669290 17533175 17277314 17030382 16797936 16645580 16558587 16308965 16146101 16086992
3263 16086992 15891406 15680691 15577553 15530035 15524588 15367146 15264685 15234090 15082452 15035094
3253 15035094 15036043 15051898 15084625 14896395 14691546 14467370 14420485 14257371 14054896 13853664
3243 13853664 13606877 13359040 13200962 13033958 12727099 12489069 12326049 12126096 11922876
3234 11922876 11709314 11407863 11318878 11230058 10966258 10811084 10762734 10589350 10488978 10320271
3224 10320271 10265915 10243833 10081953 9930967 9901313 9833649 9622490 9651377 9489209 9276767
3214 9276767 9131868 8935936 8858849 8748083 8733044 8704161 8625000 8585380 8587826 8522074 8459571
3203 8459571 8389595 8262636 8210129 8311368 8537087 8633524 8594137 8576756 8374483 8053445
$$ packed form
3273A7855372j86082j36115k55861k46932k32446j52356q6993k49622j62864n9109
3263A6086992j95586k10715j03138m7518n447j57442j02461l0595j51638m7358
3253A5035094R49J5855L2727j88230k04849k24176m6885j63114k02475k01232
3243A3853664k46787k47837j58078j67004l06859k38030j63020j99953k03220
3234A1922876k13562l01451q8985q8820k63800j55174m8350j73384j00372j68707
3224A0320271n4356k2082j61880j50986k9654o7664k11159K8887j62168k12442
3214I276767j44899j95932p7087j10766j5039k8883p9161l9620K446o5752o2503
3203H459571o9976j26959n2507J01239K25719R6437l9387j7381k02273l21038
$$ plain form
3193 8053445 7887213 7690898 7442812 7244137 7123628 6862760 6715694 6590037 6604804 6563588
3183 6563588 6458069 6395905 6344729 6288504 6172664 6111389 5938178 5965592 6063900 5954830 5937983
3172 5937983 5998591 6168277 6181348 6312064 6585456 6862845 7221110 7507308 7273247 6871294
3162 6871294 6566359 6286176 5966685 5599201 5449281 5320640 5231331 5242836 5142617 5089772
3152 5089772 4957777 4868598 4715305 4628188 4677630 4617245 4681298 4637061 4528582 4440824 4530583
3141 4530583 4384991 4495862 4544334 4545877 4691814 4797956 4969347 5148846 5247185 5117136
3131 5117136 4951011 4675672 4426979 4373041 4256070 4105574 3895609 3931949 3910197 3840573
3121 3840573 3814129 3810194 3761948 3660913 3751975 3715979 3653742 3596493 3672386 3547467 3508508
$$ packed form
3193H053445j66232j96315k48086j98675j20509k60868j47066j25657J4767m1216
3183F563588j05519o2164n1176n6225j15840o1275j73211K7414R8308j09070j6847
3172E937983O0608J69686J3071J30716K73392K77389L58265K86198k34061m01953
3162F871294l04935k80183l19491l67484j49920j28641q9309J1505j00219n2845
3152E089772j31995q9179j53293q7117M9442o0385O4053m4237j08479q7758Q9759
3141D530583j45592J10871M8472J543J45937J06142J71391J79499R8339j30049
3131E117136j66125k75339k48693n3938j16971j50496k09965L6340k1752o9624
3121C840573k6444l935m8246j01035R1062l5996o2237n7249P5893j24919l8959
$$ plain form
3110 3508508 3493326 3483767 3510197 3545651 3459466 3378083 3396485 3431987 3498573 3553140 3632530 3550128
3098 3550128 3499862 3562310 3563638 3616392 3748605 3790620 3868167 3943106 4092440 4055118 3911670
3087 3911670 3993772 4103604 4161551 4104609 4142452 4253804 4152007 4241656 4285358 4216766 4325184
3076 4325184 4321029 4231502 4111634 4259659 4246185 4234253 4204917 4049891 3931842 3910906 3817775
3065 3817775 3637237 3480997 3423763 3331808 3207844 3288023 3118458 3000273 2875891 2886117
3055 2886117 2933679 2891584 2733076 2669984 2549046 2536073 2495954 2501349 2451205 2303973 2250501
3044 2250501 2196236 2249557 2115542 2223597 2279881 2102034 2033657 2038264 2068693 2106344 2125245
3033 2125245 2135216 2071485 1954127 1972349 2043165 2066213 1910198 2012420 1998224 1968957 1842928
$$ packed form
3110C508508j5182r559K6430L5454q6185q1383J8402L5502O6586N4567P9390q2402
3098C550128n0266O2448J328N2754J32213M2015P7547P4939J49334l7322j43448
3087C911670Q2102J09832N7947n6942L7843J11352j01797Q9649M3702o8592J08418
3076D325184m155q9527j19868J48025j3474j1932k9336j55026j18049k0936r3131
3065C817775j80538j56240n7234r1955j23964Q0179j69565j18185j24382J0226
3055B886117M7562m2095j58508o3092j20938j2973m0119N395n0144j47232n3472
3044B250501n4265N3321j34015J08055N6284j77847o8377M607L0429L7651J8901
3033B125245R971o3731j17358J8222P0816K3048j56015J02222j4196k9267j26029
$$ plain form
3022 1842928 1905406 1990584 1838140 1899441 1956334 1829568 1874656 1856833 1863037 1878149 1761928
3011 1761928 1723212 1825293 1857167 1839974 1851251 1680993 1737525 1746409 1765443 1719726 1719668 1786904
2999 1786904 1692010 1689947 1675282 1563428 1558506 1536853 1532252 1496895 1501814 1662551 1691478 1614285
2987 1614285 1646981 1628676 1735267 1748508 1679465 1640185 1643639 1672704 1585433 1617820 1638233
2976 1638233 1704997 1670762 1783813 1694667 1508889 1634292 1644072 1572110 1597699 1631927 1563416
2965 1563416 1545922 1563246 1579169 1696170 1767934 1673943 1735800 1679464 1562804 1525346 1600089
2954 1600089 1568795 1643211 1623561 1717301 1641369 1546810 1471786 1512927 1631793 1576555 1564846
2943 1564846 1610433 1673790 1772233 1722671 1662092 1572701 1649270 1532262 1455122 1484531 1605972
$$ packed form
3022A842928O2478Q5178j52444O1301N6893j26766M5088j7823O204J5112j16221
3011A761928l8716J02081L1874j7193J1277j70258N6532Q884J9034m5717n8O7236
2999A786904r4894k063j4665j11854m922k1653m601l5357M919J60737K8927p7193
2987A614285L2696j8305J06591J3241o9043l9280L454K9065q7271L2387K0413
2976A638233O6764l4235J13051q9146j85778J25403R780p1962K5589L4228o8511
2965A563416j7494J7324J5923J17001P1764r3991O1857n6336j16660l7458P4743
2954A600089l1294P4416j9650R3740p5932r4559p5024M1141J18866n5238j1709
2943A564846M5587O3357R8443m9562o0579q9391P6569j17008p7140K9409J21441
$$ plain form
2932 1605972 1626951 1544018 1607952 1613773 1495697 1434051 1450248 1502764 1646156 1646227 1496517 1516916
2920 1516916 1599468 1622897 1632777 1614718 1607408 1611540 1601697 1651622 1758957 1707235 1714961 1743214
2908 1743214 1865420 1732556 1503583 1441820 1607937 1621227 1610803 1599708 1571797 1548440 1637161
2897 1637161 1612853 1514166 1519861 1519442 1470814 1582525 1584659 1599445 1579381 1706672 1600042 1552872
2885 1552872 1466110 1553286 1598795 1583744 1555952 1558791 1526779 1541854 1497168 1480839 1568751 1552186
2873 1552186 1523401 1407451 1422473 1513487 1525952 1362603 1367794 1458713 1537995 1522180 1522955 1477143
2861 1477143 1582440 1584359 1601080 1512802 1530935 1544509 1605932 1536439 1473770 1493126 1551407
2850 1551407 1553964 1569817 1538233 1445663 1497503 1498560 1501806 1553346 1619297 1612437 1458427 1565471
$$ packed form
2932A605972K0979q2933O3934N821j18076o1646J6197N2516J43392P1j49710K0399
2920A516916Q2552K3429R880j8059p310M132r843M9925J07335n1722P726K8253
2908A743214J22206j32864k28973o1763J66117J3290j0424j1095k7911k3357Q8721
2897A637161k4308r8687N695m19m8628J11711K134J4786k0064J27291j06630m7170
2885A552872q6762Q7176M5509j5051k7792K839l2012J5075m4686j6329Q7912j6565
2873A552186k8785j15950J5022R1014J2465j63349N191R0919P9282j5815P75m5812
2861A477143J05297J919J6721q8278J8133J3574O1423o9493o2669J9356N8281
2850A551407K557J5853l1584r2570N1840J057L246N1540O5951o860j54010J07044
$$ plain form
2838 1565471 1524068 1427712 1465438 1233092 1337839 1356446 1318806 1191899 1077072 1040089 985971
2827 985971 937932 871339 957393 1030435 995019 1012713 1030685 898953 937225 1078722 994153
2816 994153 893687 860214 840703 865919 958214 977091 898706 872839 841894 882757 901575
2805 901575 828131 782642 702032 679542 835497 822803 911757 877830 704410 744686 803539
2794 803539 880419 803635 614956 560300 726139 812564 687771 675170 694387 587678 612733
2783 612733 586177 646927 650991 686101 683221 743558 769107 721884 646426 809733 672680 585346
2771 585346 552105 584346 718774 678007 636097 589036 554160 545723 569066 515533 603689 629037
2759 629037 578910 597093 716911 634159 555574 441697 631928 610948 622050 454747 433954
$$ packed form
2838A565471m1403r6356L7726k32346J04747J8607l7640j26907j14827l6983n4118
2827I85971m8039o6593Q6054P3042l5416J7694J7972j31732L8272J41497q4569
2816I94153j00466l3473j9511K5216R2295J8877p8385k5867l0945M0863J8818
2805I01575p3444m5489q0610k2490J55955j2694Q8954l3927j73420M0276N8853
2794H03539P6880p6784j88679n4656J65839Q6425j24793j2601J9217j06709K5055
2783F12733k6556O0750M064L5110k880O0337K5549m7223p5458J63307j37053q7334
2771E85346l3241L2241J34428m0767m1910m7061l4876q437K3343n3533Q8156K5348
2759F29037n0127J8183J19818q2752p8585j13877J90231k0980J1102j67303k0793
$$ plain form
2748 433954 461992 367715 430706 523816 498296 415284 483779 525955 472541 559158 531779 561957
2736 561957 571145 573459 512700 516271 571077 486406 419951 502234 540455 517321 553518 436572
2724 436572 443963 624324 638690 543485 591666 519193 539694 484320 508222 502151 480763 496547
2712 496547 442038 477963 432051 451034 451443 457715 359609 343469 418729 458807 421696 305796
2700 305796 386563 355495 255478 301128 360612 338683 432982 301883 300362 336352 445030
2689 445030 416162 332575 407382 409042 477112 522912 401463 342528 286573 205998 260757 312553
2677 312553 284757 307850 309407 355925 427129 428609 362267 253306 254936 256817 353126 371606
2665 371606 337412 325195 292859 229860 246190 367101 324585 320437 348522 394867 340515 343675
$$ packed form
2748D33954K8038r4277O2991R3110k5520q3012O8495M2176n3414Q6617k7379L0178
2736E61957R188K314o0759L571N4806q4671o6455Q2283L8221k3134L6197j16946
2724D36572P391J80361J4366r5205M8181p2473K0501n5374K3902o071k1388J5784
2712D96547n4509L5925m5912J8983M09O272r8106j6140P5260M0078l7111j15900
2700C05796Q0767l1068j00017M5650N9484k1929R4299j31099j521L5990J08678
2689D45030k8868q3587P4807J660O8070M5800j21449n8935n5955q0575N4759N1796
2677C12553k7796K3093J557M6518P1204J480o6342j08961J630J881R6309J8480
2665C71606l4194j2217l2336o2999J6330J20911m2516m148K8085M6345n4352L160
$$ plain form
2653 343675 382148 392495 298098 341525 349144 440821 445663 288720 273108 310792 471355 471200
2641 471200 394424 379636 248020 323362 399987 304533 301171 301962 288866 224873 215520 129585
2629 129585 193169 359484 444195 407535 511395 351781 343957 304140 257898 266094 176210
2618 176210 220948 336321 331993 409088 335078 306788 293030 259484 226306 300274 366577 314422
2606 314422 211797 210849 308256 293929 175094 203654 393802 272227 292882 228456 287679
2595 287679 291898 293585 449264 359080 321865 365339 316726 272340 217600 195580 252001 357498
2583 357498 458933 448445 413329 359897 388319 463128 322751 294059 195423 251364 381307
2572 381307 393911 350261 252817 299128 401217 375600 430521 282542 273595 292258 253424
$$ packed form
2653C43675L8473J0347r4397M3427P619R1677M842j56943j5612L7684J60563j55
2641D71200p6776j4788j31616P5342P6625r5454l362P91j3096o3993r353q5935
2629A29585O3584J66315Q4711l6660J03860j59614p824l9817m6242Q196q9884
2618A76210M4738J15373m328P7095p4010k8290j3758l3546l3178P3968O6303n2155
2606C14422j02625r48R7407j4327j18835K8560J90148j21575K0655o4426N9223
2595B87679M219J687J55679r0184l7215M3474m8613m4386n4740k2020N6421J05497
2583C57498J01435j0488l5116n3432K8422P4809j40377k8692r8636N5941J29943
2572C81307J2604m3650r7444M6311J02089k5617N4921j47979q947J8663l8834
$$ plain form
2561 253424 223424 326940 258250 260908 250618 243919 321474 285459 300581 261544 277550 255851
2549 255851 297711 180917 156741 235444 175743 114370 238576 199992 184419 162375 183413
2538 183413 229321 225958 245216 249602 199852 41337 130564 210408 173564 198626 275407 226606
2526 226606 217526 256640 296876 284315 271625 239568 177286 78373 -58180 -71783 -71461 68117
2514 68117 202903 179437 73818 110431 221976 249406 113723 94336 193170 38940 54668
2503 54668 159985 178379 155868 57280 94738 172305 146559 151161 181956 97837 77827 150003
2491 150003 42605 39144 135197 92527 236215 235226 358008 330590 239740 101910 108730 209984
2479 209984 194525 156375 105950 139920 200148 223913 314593 281043 201680 173530 194030 192941
$$ packed form
2561B53424l0000J03516o8690K658j0290o699P7555l6015J5122l9037J6006k1699
2549B55851M1860j16794k4176P8703n9701o1373J24206l8584j5573k2044K1038
2538A83413M5908l363J9258M386m9750j58515Q9227P9844l6844K5062P6781m8801
2526B26606r080L9114M0236j2561j2690l2057o2282r8913j36553j3603L22J39578
2514F8117J34786k3466j05619L6613J11545K7430j35683j9387R8834j54230J5728
2503E4668J05317J8394k2511r8588L7458P7567k5746M602L0795q4119k0010P2176
2491A50003j07398l461R6053m2670J43688r89J22782k7418r0850j37830O820J01254
2479B09984j5459l8150n0425L3970O0228K3765R0680l3550p9363k8150K0500j089
$$ plain form
2467 192941 197798 3790 94795 155954 218156 198358 206863 272414 222972 147032 133652 287495
2455 287495 344766 240014 90066 110635 138009 108497 89515 136080 55893 74268 45509
2444 45509 20836 -123617 9147 56246 75281 55619 198129 186728 167315 252432 199681
2433 199681 223044 40832 -113269 -90315 13340 42035 64057 159101 39543 55692 156033
2422 156033 44680 78687 35230 117670 255213 153993 145594 255514 162152 113499 74115
2411 74115 114385 136534 165244 162320 147185 226679 171454 185355 130251 109885 142658 101876
2399 101876 75622 28226 130861 140614 61160 136214 105959 134690 195603 218114 145204 175693
2387 175693 239906 273326 282360 307974 191476 123342 119833 321743 292500 288004 257959 207501
$$ packed form
2467A92941M857j94008R1005O1159O2202j9798Q505O5551m9442p5940j3380J53843
2455B87495N7271j04752j49948K0569K7374k9512j8982M6565q0187J8375k8759
2444D5509k4673j44453J32764M7099J9035j9662J42510j1401j9413Q5117n2751
2433A99681K3363j82212j54101K2954J03655K8695K2022R5044j19558J6149J00341
2422A56033j11353L4007m3457Q2440J37543j01220q399J09920r3362m8653l9384
2411G4115M0270K2149K8710k924j5135P9494n5225J3901n5104k0366L2773m0782
2399A01876k6254m7396J02635R753p9454P5054l0255K8731O0913K2511p2910L0489
2387A75693O4213L3420R034K5614j16498o8134l509K01910k9243m496l0045n0458
$$ plain form
2375 207501 218786 134682 93358 116137 -42665 108283 72210 -9902 150678 111021 140089
2364 140089 43448 108674 119655 97131 276876 146088 75898 182109 152753 108457 65200
2353 65200 23816 104082 121554 167511 183534 93355 18424 121698 159787 43197 -1736
2342 -1736 9790 25570 27233 64011 103220 207256 129515 171381 55476 65503 30676 67710
2330 67710 150146 220186 128254 75454 50587 144209 22594 -35521 -16511 178532 188006 24608
2318 24608 38317 10840 98158 188362 218255 154594 132669 222202 276642 181813 127122 208373
2306 208373 282719 309452 175885 -498 -35089 48979 -39900 55606 180529 222876 295376
2295 295376 105707 86543 104885 234457 107703 75423 85919 83482 102424 55065 109643
$$ packed form
2375B07501J1285q4104m1324K2779j58802J50948l6073q2112J60580l9657K9068
2364A40089r6641O5226J0981k2524J79745j30788p0190J06211k9356m4296m3257
2353F5200m1384Q0266J7472M5957J6023r0179p4931J03274L8089j16590m4933
2342a736J1526J5780J663L6778L9209J04036p7741M1866j15905J0027l4827L7034
2330F7710Q2436P0040r1932n2800k4867R3622j21615n8115J9010J95043R474j63398
2318B4608J3709k7477Q7318R0204K9893o3661k1925Q9533N4440r4829n4691Q1251
2306B08373P4346K6733j33567j76383l4591Q4068q8879R5506J24923M2347P2500
2295B95376j89669j9164J8342J29572j26754l2280J0496k437J8942m7359N4578
$$ plain form
2284 109643 118992 192523 49563 59691 163072 157700 113691 142668 155582 204343 121307 87116
2272 87116 33639 55446 54024 72700 103644 36625 80762 125072 122308 180918 74271 163233
2260 163233 169105 57973 102554 98032 235327 152693 193281 220191 234298 115321 134937
2249 134937 175038 101004 52548 118429 7053 103711 175651 162401 298963 316792 283125
2238 283125 243919 254914 236811 228939 261113 233969 220514 215510 213189 181777 304962 268628
2226 268628 211638 194953 240986 361353 359775 376079 237093 246213 224371 74219 135792
2215 135792 270889 345518 417673 434271 291324 221107 266567 404854 492463 553593 620169
2204 620169 512418 588705 588028 506871 548981 660985 650456 599735 496889 566817 662528
$$ packed form
2284A09643R349P3531j42960J0128J03381n372m4009K8977J2914M8761q3036l4191
2272H7116n3477K1807j422J8676L0944o7019M4137M4310k764N8610j06647Q8962
2260A63233N872j11132M4581m522J37295q2634M0588K6910J4107j18977J9616
2249A34937M0101p4034m8456O5881j11376R6658P1940j3250J36562J7829l3667
2238B83125l9206J0995j8103p872L2174k7144j3455n004k321l1412J23185l6334
2226B68628n6990j6685M6033J20367j578J6304j38986R120k1842j50152O1573
2215A35792J35097P4629P2155J6598j42947p0217M5460J38287Q7609O1130O6576
2204F20169j07751P6287o77q1157M2110J12004j0529n0721j02846O9928R5711
$$ plain form
2193 662528 608926 627478 656046 710233 713645 829442 807133 719041 610850 620050 659181 731032
2181 731032 808859 918012 1049312 919409 947446 1029588 994322 955649 1056170 1091895 1098493
2170 1098493 1113395 1093513 1097222 1125483 1281049 1241423 1214339 1227052 1349673 1311487 1321235
2159 1321235 1369123 1448610 1500880 1562971 1796962 1815743 1901443 2015256 2101910 2215718 2277935
2148 2277935 2328339 2427846 2509429 2599253 2683316 2708297 2840046 2889570 2929666 3129566 3326612
2137 3326612 3520215 3686307 3896814 4159940 4416023 4730446 5069029 5496392 5906226 6293676
2127 6293676 6628391 7092851 7502128 8078357 8773101 9699575 10740683 12112468 13738438
2118 13738438 15860100 18674372 22496465 27572073 34718450 39503702 36261585 30977518
$$ packed form
2193F62528n3602J8552K8568N4187L412J15797k2309q8092j08191R200L9131P1851
2181G31032P7827J09153J31300j29903K8037Q2142l5266l8673J00521L5725O598
2170A098493J4902j9882L709K8261J55566l9626k7084J2713J22621l8186R748
2159A321235M7888P9487N2270O2091K33991J8781Q5700J13813Q6654J13808O2217
2148B277935N0404R9507Q1583Q9824Q4063K4981J31749M9524M0096J99900J97046
2137C326612J93603J66092K10507K63126K56083L14423L38583M27363M09834L87450
2127F293676L34715M64460M09277N76229O94744R26474J041108J371785J625970
2118A3738438K121662K814272L822093N075608P146377M785252l242117n284067
$$ plain form
2110 30977518 25909041 20979124 16953646 13864942 11422990 9481403 8169696 7148426
2102 7148426 6469042 5978574 5505759 5280194 5103723 4750626 4276222 4019548 3751511 3277745
2092 3277745 3037643 2813492 2645553 2538485 2454102 2452417 2268738 2087477 2109802 2061219
2082 2061219 1903083 1722861 1735764 1751841 1756620 1607487 1431766 1368244 1192097 1121401 1120798
2071 1120798 1100358 1101471 1082589 1027581 1075326 1045944 1099869 1136045 1069347 980142 811785
2060 811785 830968 799576 806063 802666 681561 634796 728406 629184 565597 449842 461891 549170
2048 549170 531748 452848 434220 433487 500515 513628 518372 570934 569214 394321 412011 473376
2036 473376 302714 323385 339605 392638 390792 309852 361070 296627 267846 346126 159501
$$ packed form
2110C0977518n068477m929917m025478l088704k441952j941587j311707j021270
2102G148426o79384m90468m72815k25565j76471l53097m74404k56674k68037m73766
2092C277745k40102k24151j67939j07068q4383j685j83679j81261K2325m8583
2082B061219j58136j80222J2903J6077M779j49133j75721o3522j76147p0696o03
2071A120798k0440J113j8882n5008M7745k9382N3925L6176o6698q9205j68357
2060H11785J9183l1392O487l397j21105m6765R3610r9222o3587j15755J2049Q7279
2048E49170j7422p8900j8628p33O7028J3113M744N2562j720j74893J7690O1365
2036D73376j70662K0671J6220N3033j846q0940N1218o4443k8781P8280j86625
$$ plain form
2025 159501 149686 260101 337351 380793 251080 146626 176588 172726 192164 314251 175368
2014 175368 111482 154346 204835 108617 174714 129674 76862 78261 189980 180928 107951 146454
2002 146454 128569 110788 80499 102753 93542 111600 108560 115104 52943 45965 96183 39237
1990 39237 38172 147495 97190 10108 54174 115982 138505 169160 61502 35270 85830 168517
1978 168517 174122 113859 46737 101662 126870 64049 37837 54798 98886 122148 79410 179085
1966 179085 186090 66382 26376 -132918 -11284 66460 116565 189972 124427 90841 70570
1955 70570 61412 -61480 -82682 2350 4313 93339 250457 287946 315842 190752 96437 113886
1943 113886 123636 75058 44853 131161 45112 -52533 -1419 2442 15388 5920 -93178 -87344
$$ packed form
2025A59501r815J10415P7250M3442j29713j04454K9962l862J9438J22087j38883
2014A75368o3886M2864N0489r6218O6097m5040n2812J399J11719r052p2977L8503
2002A46454j7885j7781l0289K2254r211J8058l040O544o2161o978N0218n6946
1990C9237j065J09323n0305q7082M4066O1808K2523L0655j07658k6232N0560Q2687
1978A68517N605o0263o7122N4925K5208o2821k6212J6961M4088K3262m2738R9675
1966A79085P005j19708m0006j59294J21634P7744N0105P3407o5545l3586k0271
1955G0570r158j22892k1202Q5032J963Q9026J57118L7489K7896j25090r4315J7449
1943A13886R750m8578l0205Q6308q6049r7645N1114L861J2946r468r9098N834
$$ plain form
1931 -87344 1117 37701 125286 80668 -25831 20202 50886 38497 46762 -50390 -9340 -39292
1919 -39292 -84485 -51555 -64944 -25350 45437 52066 -69367 27837 60836 77732 -11253 -73357
1907 -73357 -16752 -76247 -154800 -73680 43038 -11413 -81786 -41514 67020 -110289 -150120
1896 -150120 -151552 -58238 26541 -24761 -81886 -127063 -205954 -117422 11943 102377 15364 -56697
1884 -56697 -22370 47004 86459 12929 28519 -11108 -31342 -117577 -75942 -6013 -92799 -45456
1872 -45456 31115 33764 101736 93116 131243 72441 -484 51770 64903 -9311 -52248 -83925
1860 -83925 -30191 -127948 -175772 -262064 -114198 31071 1545 52713 -2233 24503 -70408
1849 -70408 -20816 -50662 -70997 21042 147853 272773 303502 214866 157907 151631 33730
$$ packed form
1931h7344Q8461L6584Q7585m4618j06499M6033L0684j2389Q265r7152M1050k9952
1919c9292m5193L2930j3389L9594P0787O629j21433R7204L2999J6896q8985o2104
1907g3357N6605n9495p8553Q1120J16718n4451p0373M0272J08534j77309l9831
1896a50120j432R3314Q4779n1302n7125m5177p8891Q8532J29365R0434q7013p2061
1884e6697L4327O9374L9455p3530J5590l9627k0234q6235M1635O9929q6786M7343
1872d5456P6571K649O7972q620L8127n8802p2925N2254J3133p4214m2937l1677
1860h3925N3734r7757m7824q6292J47866J45269k9526N1168n4946K6736r4911
1849g0408M9592k9846k0335R2039J26811J24920L0729q8636n6959o276j17901
$$ plain form
1838 33730 38886 -40722 -42531 -57018 23515 -90530 -186768 -103499 -5083 45291 18608 36400
1826 36400 -119054 -57198 -72074 -163010 -109830 -14783 -34013 19721 33365 -22628 -11016 -38725
1814 -38725 -9555 -66562 -93714 -126111 -167348 -106775 -124596 -85313 -65368 -76300 -39551 -194936
1802 -194936 -143042 -84547 -92341 -153031 -155908 -109376 -104389 -131923 -92354 6148 60838 35308
1790 35308 -30042 34363 -53629 -121894 -108258 -48179 -47725 -192966 -239030 -185053 -108428 -111151
1778 -111151 -70749 -74792 42840 -23783 -19731 73656 98076 -37882 -87374 30560 -172024
1767 -172024 36632 23338 -136308 -64472 25527 -81335 -144592 -127013 -57446 -58895 -37525
1756 -37525 -22655 -63138 8600 9806 -66803 -133118 -175032 -164317 -39472 -56976 -39496 13387
$$ packed form
1838C3730N156p9608j809j4487Q0533j14045r6238Q3269R8416N0374k6683J7792
1826C6400j55454O1856j4876r0936N3180R5047j9230N3734J3644n5993J1612k7709
1814c8725K9170n7007k7152l2397m1237O0573j7821L9283J9945j0932L6749j55385
1802a94936N1894N8495p794o0690k877M6532M987k7534L9569R8502N4690k5530
1790C5308o5350O4405q7992o8265J3636O0079M54j45241m6064N3977P6625k723
1778a11151M0402m043J17632o6623M052R3387K4420j35958m9492J17934k02584
1767a72024K08656j3294j59646P1836Q9999j06862o3257J7579O9567j449K1370
1756c7525J4870m0483P1738J206p6609o6315m1914J0715J24845j7504J7480N2883
$$ plain form
1744 13387 -1464 -70868 -27684 15152 14744 -33669 120540 47290 -27020 116030 53515 -15879
1732 -15879 -38909 -80319 -39461 -34146 -128918 -58411 -128082 -146757 -160278 -125585 -192212 -242354
1720 -242354 -172541 -131677 -89629 -56258 -93736 -129992 -124383 -179796 -199076 -205941 -290914 -183310
1708 -183310 -79160 -30350 -32172 6878 -73333 -227119 -124064 36317 19888 42289 56299
1697 56299 -84917 -26219 106996 16338 -62200 -153438 -158703 -134625 -105663 -18268 -26349 -142972
1685 -142972 -213480 -232006 -164589 -65004 -79493 -63211 -78878 -130140 -137341 87 -12357 -3518
1673 -3518 17567 -20153 -22303 -68416 -43957 157080 89786 -151841 -124766 6832 -41153 -20046
1661 -20046 3024 -66598 -37512 -165473 -164161 -14959 -142641 -129447 -134061 -50951 -76777 -62625
$$ packed form
1744A3387j4851o9404M3184M2836m08m8413J54209p3250p4310J43050o2515o9394
1732a5879k3030m1410M0858N315r4772P0507o9671j8675j3521L4693o6627n0142
1720b42354O9813M0864M2048L3371l7478l6256N609n5413j9280o865q4973J07604
1708a83310J04150M8810j822L9050q0211j53786J03055J60381j6429K2401J4010
1697E6299j41216N8698J33215r0658p8538r1238n265K4078K8962Q7395q081j16623
1685a42972p0508j8526O7417R9585j4489J6282j5667n1262p201J37428j2444Q839
1673c518K1085l7720k150m6113K4459K01037o7294k41627K7075J31598m7985K1107
1661b0046K3070o9622K9086j27961J312J49202j27682J3194m614Q3110k5826J4152
$$ plain form
1649 -62625 -4937 -63388 -171287 -201572 -56399 13862 -412 -9944 -34630 -92843 -210542
1638 -210542 -253910 -182655 -100391 -164049 -249349 -194261 -117430 -144906 -147383 -48869 -75990 -102669
1626 -102669 -165627 -177987 -218708 -200229 -61266 -71364 -28986 -4335 -99868 -120368 -44718
1615 -44718 -42343 -71551 -30614 -110277 -176147 -19623 -69239 -97311 -4254 -61585 7896 -69218
1603 -69218 -43263 -89528 -83307 -80872 -75382 -100930 -108069 -127178 -217110 -169931 -111824 -155854 -162100
1590 -162100 -167917 -175053 -83703 -135948 -137551 -156603 -116359 -130723 -204945 -174243 -68066 -81360
1578 -81360 -142681 -94551 -74243 -171893 -187825 -170282 -226323 -262311 -193918 -253326 -157644 -94304
1566 -94304 -108225 -63513 37603 84230 1490 -40620 -153469 -191837 -202511 -247229 -218008
$$ packed form
1649f2625N7688n8451j07899l0285J45173P0261j4274r532k4686n8213j17699
1638b10542m3368P1255Q2264o3658q5300N5088P6831k7476k477R8514k7121k6679
1626a02669o2958j2360m0721J8479J38963j0098M2378K4651r5533k0500P5650
1615d4718K375k9208M0937p9663o5870J56524m9616k8072R3057n7331O9481p7114
1603f9218K5955m6265O221K435N490k5548p139j9109q9932M7179N8107m4030o246
1590a62100n817p136R1350n2245j603j9052M0244j4364p4222L0702J06177j3294
1578h1360o1321M8130K0308r7650j5932J7543n6041l5988O8393n9408R5682O3340
1566i4304j3921M4712J01116M6627q2740m2110j12849l8368j0674m4718K9221
$$ plain form
1555 -218008 -127402 -65184 -95276 -93440 -14160 -95776 -298477 -148974 -26532 -71977 71229
1544 71229 -20613 -132932 -48730 57834 25068 -36908 -189741 -57457 -15783 -146218 -152437
1533 -152437 -117872 -152659 -156147 26528 -65137 -185264 -112105 -98326 -147511 -167513 -181106
1522 -181106 -149955 -2224 -20057 -9673 28395 6334 -96289 -20878 -81823 -89407 -100106
1511 -100106 -55721 -79466 -189158 -164536 -111464 -183991 -140606 -186105 -216290 -106146 -159151
1500 -159151 -107391 -28117 -166606 -184947 -57262 -56660 -1806 -63409 -42733 -90142 -205550
1489 -205550 -147403 -97519 -46981 15477 -43671 -195097 -111972 -79711 -96157 -80128 -132333
1478 -132333 -132471 -245739 -42938 -66542 -152321 -191912 -118412 -932 -88910 -175290 -97558
$$ packed form
1555b18008R0606O2218l0092J836P9280q1616k02701J49503J22442m5445J43206
1544G1229r1842j12319Q4202J06564l2766o1976j52833J32284M1674j30435o219
1533a52437L4565l4787l488J82675r1665j20127P3159J3779m9185k0002j3593
1522a81106L1151J47731j7833J0384L8068k2061j02623P5411o0945p584j0699
1511a00106M4385k3745j09692K4622N3072p2527M3385m5499l0185J10144n3005
1500a59151N1760P9274j38489j8341J27685O02N4854o1603K0676m7409j15408
1489b05550N8147M9884N0538O2458n9148j51426Q3125L2261j6446J6029n2205
1478a32333j38j13268K02801k3604q5779l9591P3500J17480q7978q6380P7732
$$ plain form
1467 -97558 -30092 -71388 -99828 -60431 -127839 -53170 -89373 -82115 -72702 -149678 -102872 34527
1455 34527 -10797 -47386 1048 -55741 -128332 -125241 -104664 57250 23361 -74149 -197540 -157491
1443 -157491 -227886 -168566 3173 -79795 -113542 -12282 -105204 3069 -76339 -256047 -164877
1432 -164877 -76109 -66271 -165577 -208879 -360307 -174475 -126256 -73107 -45123 -718 -113584
1421 -113584 -174974 3983 13036 -203153 -282763 -294039 -104583 -48266 76946 32759 -45179
1410 -45179 -112637 -50398 -106368 -134460 -84949 -39894 -60071 -115970 -116287 -202316 -121564 -33390
1398 -33390 -36296 -82943 -29677 -48893 -146840 -66601 -247 -72176 -63978 15672 -11725 -30587
1386 -30587 23593 81057 136976 -11861 -92936 -121713 -126247 -160629 -153678 -170372 -69020 -113870
$$ packed form
1467i7558O7466m1296k8440L9397o7408P4669l6203P258R413p6976M6806J37399
1455C4527m5324l6589M8434n6789p2591L091K0577J61914l3889r7510j23391M0049
1443a57491p0395N9320J71739q2968l3747J01260r2922J08273p9408j79708R1170
1432a64877Q8768R838r9306m3302j51428J85832M8219N3149K7984M4405j12866
1421a13584o1390J78957R053k16189p9610j1276J89456N6317J25212m4187p7938
1410d5179o7458O2239n5970k8092M9511M5055k0177n5899l17q6029Q0752Q8174
1398c3390k906m6647N3266j9216r7947Q0239O6354p1929Q198P9650k7397j8862
1386c0587N4180N7464N5919j48837q1075k8777m534l4382O951j6694J01352m4850
$$ plain form
1374 -113870 -85463 -68049 -17698 22071 9419 -100612 -64505 -77592 -106662 -111575 -206233 -149134
1362 -149134 -153979 -180769 -76647 -18400 -22250 47721 -111278 -16672 4004 -95282 -8417 19560
1350 19560 -41466 -17876 -148774 -208700 -157421 -84302 -170228 -239080 -127369 -47836 -14546
1339 -14546 78445 -59706 -25767 -81627 -53590 8814 -53619 -8250 -29066 -89531 -103643 -30609
1327 -30609 -58779 -112799 -110326 -167216 -182583 42156 46330 -23175 75333 116896 31031 -22171
1315 -22171 -95282 -22381 -44014 -43708 11228 -134687 -177984 -127635 -115989 -202278 -168038 -210546
1303 -210546 -189721 -209172 -107791 -88578 -193405 -187833 -69806 -26296 -121308 -149901 -174502
1292 -174502 -106881 -85008 -64207 -130629 -66753 -144984 -125148 -106315 -64380 -124898 -57595 8011
$$ packed form
1374a13870K8407J7414N0351L9769j2652j10031L6107j3087k9070m913r4658N7099
1362a49134m845k6790J04122N8247l850O9971j58999R4606K0676r9286Q6865K7977
1350A9560o1026K3590j30898n9926N1279P3119q5926o8852J11711P9533L3290
1339a4546R2991j38151L3939n5860K8037O2404o2433M5369k0816o0465j4112P3034
1327c0609k8170n4020K473n6890j5367K24739M174o9505R8508M1563q5865n3202
1315b2171p3111P2901k1633L06N4936j45915m3297N0349J1646q6289L4240m2508
1303b10546K0825j9451J01381J9213j04827N572J18027M3510r5012k8593k4601
1292a74502O7621K1873K0801o6422O3876p8231J9836J8833M1935o0518O7303O5606
$$ plain form
1280 8011 91675 73311 53791 104240 30855 -166199 -31981 -17048 84334 82218 -45027
1269 -45027 -46667 -128548 -142067 -126368 -115580 -141129 -191481 -220216 -136950 -14513 -32293 -65798
1257 -65798 -55394 -79125 -154183 -159219 -43949 -171815 -71427 -19420 -58900 -146501 -143159 -114748
1245 -114748 -107278 -151631 -60726 -1435 -61488 -73456 -50716 -169317 -78571 -26117 -132645
1234 -132645 -81464 -1887 -30500 -84106 -106969 -68333 4623 29671 -12383 -34307 -38803 -104285
1222 -104285 -98417 -35217 38328 149784 -12035 -57504 34535 122965 71581 -42009 -65559
1211 -65559 -54650 29135 -52557 23615 11709 -39621 -53469 -44688 24109 15090 56702 -9134
1199 -9134 -29050 29434 15443 -18803 15418 3066 -14354 17626 -77034 -129660 -116743 -210604
$$ packed form
1280H011Q3664j8364j9520N0449p3385j97054J34218J4933J01382k116j27245
1269d5027j640q1881j3519J5699J0788k5549n0352k8735Q3266J22437j7780l3505
1257f5798J0404k3731p5058n036J15270j27866J00388N2007l9480q7601L342K8411
1245a14748P470m4353R0905N9291o0053j1968K2740j18601R0746N2454j06528
1234a32645N1181P9577k8613n3606k2863L8636P2956K5048m2054k1924m496o5482
1222a04285N868O3200P3545J11456j61819m5469R2039Q8430n1384j13590k3550
1211f5559J0909Q3785q1692P6172j1906n1330j3848Q781O8797r019M1612o5836
1199i134j9916N8484j3991l4246L4221j2352j7420L1980r4660n2626J2917r3861
$$ plain form
1187 -210604 -221059 -226312 -353462 -307055 -129792 -35805 -18908 -69623 -126680 -88124 -25404
1176 -25404 -118336 -159213 -93777 -150154 -111306 -121204 -139750 -61523 30740 -29877 -42582 -16726
1164 -16726 -128677 -64883 52715 72061 28382 -76340 -45495 -145797 -26548 -13224 29316
1153 29316 11066 -144985 -94869 68313 24566 -26802 15204 -69477 -38748 -77453 33217
1142 33217 83563 22546 -106264 -116411 -58380 -143239 -62134 9114 -72685 -58508 1571 26085
1130 26085 101616 70279 -45707 111981 99894 -21113 -13072 67114 -27528 -88206 -199340
1119 -199340 -105647 -16007 -28003 -23286 -152941 -81260 -42406 -75379 -55025 -91983 -138965 -10892
1107 -10892 -4355 76880 56695 -9660 -700 -145852 -110793 14044 -65669 -72818 -55392 -97262
$$ packed form
1187b10604j0455n253j27150M6407J77263R3987J6897n0715n7057L8556O2720
1176b5404r2932m0877O5436n6377L8848r898j8546P8227R2263o0617j2705K5856
1164a6726j11951O3794J17598J9346m3679j04722L0845j00302J19249J3324M2540
1153B9316j8250j56051N0116J63182m3747n1368M2006q4681L0729l8705J10670
1142C3217N0346o1017j28810j0147N8031q4859Q1105P1248q1799J4177O0079K4514
1130B6085P5531l1337j15986J57688j2087j21007Q041Q0186r4642o0678j11134
1119a99340R3693Q9640j1996M717j29655P1681L8854l2973K0354l6958m6982J28073
1107a0892O537Q1235k0185o6355Q960j45152L5059J24837p9713p149J7426m1870
$$ plain form
1095 -97262 -181460 -74056 -5676 -79555 -161989 -172403 -86188 -24837 121017 113970 26473 -95697
1083 -95697 -90864 -86212 -162230 -218105 -125813 -170814 -128101 -38430 -119986 -33505 -16540 -32074
1071 -32074 11733 33471 -35740 -37784 -30322 -14875 -74165 -93476 -107414 -37071 -100065 -218183
1059 -218183 -108183 -68406 -38118 -122510 -146781 -180538 -102369 -96937 -127468 -75750 -161606 -164472
1047 -164472 -182520 -117234 -57129 -67172 -62262 -95843 -136908 -132868 -35584 -57588 -193418 -132814
1035 -132814 -57244 -26081 -93552 -33608 10675 52817 25119 -74127 -73056 -96898 36010 70284
1023 70284 -23212 -57839 -138221 -219011 -150833 -109548 -171644 -286175 -194160 -116861 -95856 -101245
1011 -101245 -91889 -62487 36376 122069 -2229 -87849 14997 10416 -62503 -88233 -41503 9963
$$ packed form
1095i7262q4198J07404O8380p3879q2434j0414Q6215O1351J45854p047q7497j22170
1083i5697M833M652p6018n5875R2292m5001M2713Q9671q1556Q6481J6965j5534
1071c2074M3807K1738o9211k044P462J5447n9290j9311j3938P0343o2994j18118
1059b18183J10000L9777L0288q4392k4271l3757P8169N432l0531N1718q5856k866
1047a64472j8048O5286O0105j0043M910l3581m1065M040R7284k2004j35830O0604
1035a32814P5570L1163o7471N9944M4283M2142k7698r9246J071k3842J32908L4274
1023G0284r3496l4627q0382q0790O8178M1285o2096j14531R2015P7299K1005n389
1011a01245R356K9402R8863Q5693j24298q5620J02846m581p2919k5730M6730N1466
$$ plain form
999 9963 -18823 101757 7973 -27306 -10234 -30616 -166205 -341783 -149950 -56735 -3594
988 -3594 -2595 -43936 -53583 1797 -25205 -99786 -224675 -153779 -145479 -91473 -68388 -147474 -94069
975 -94069 -86511 -28869 -118392 -66282 43070 19515 7289 -25550 106019 85683 26238 136428
963 136428 49039 64118 57342 48318 -70225 -88207 -54597 19545 -45371 -58963 -66739 -33159
951 -33159 59704 186124 158653 114001 56831 -13909 -55003 -42346 80030 -8425 24019 28288
939 28288 53488 80795 77202 -14131 -65459 32543 -33282 -97566 -145831 -195755 -60780 -23209
927 -23209 -48447 -23926 -66355 -25062 7015 -86104 -14337 -77572 -53165 72928 9837 -44609
915 -44609 -35986 -109290 -70840 72854 45518 -13536 -76028 -79379 -16894 -77642 26988 21783
$$ packed form
999I963k8786J20580r3784l5279J7072k0382j35589j75578J91833R3215N3141
988c594R99m1341r647N5380k7002p4581j24889P0896Q300N4006K3085p9086N3405
975i4069P558N7642q9523N2110J09352k3555j2226l2839J31569k0336n9445J10190
963A36428q7389J5079o776r024j18543j7982L3610P4142o4916j3592p776L3580
951c3159R2863J26420k7471m4652n7170p0740m1094J2657J22376q8455L2444M269
939B8288K5200K7307l593r1333n1328R8002o5825o4284m8265m9924J34975L7571
927b3209k5238K4521m2429M1293L2077r3119P1767o3235K4407J26093o3091n4446
915d4609Q623p3304L8450J43694k7336n9054o2492l351O2485o0748J04630n205
$$ plain form
903 21783 -112027 -126130 -25039 62855 57269 3269 111237 163867 209674 127795 -26091
892 -26091 -45087 -123130 -36535 -130429 -82453 -126282 -141073 -69155 -31857 43802 73336 -1898
880 -1898 93553 79742 107964 -25066 -6266 27141 -65141 -9189 82481 92418 94804 182996
868 182996 199144 145411 78300 17224 44137 164149 26412 63792 83826 73966 53445 122999
856 122999 163607 131472 100252 24577 -24154 -18646 -50031 61205 110535 94015 151452 117658
844 117658 11073 92128 84419 9406 15494 89828 102502 233120 82554 103609 64508 41922
832 41922 -13019 87955 178169 120940 178721 78207 117297 128742 131495 156993 -20116 -104779
820 -104779 -71248 10575 154486 78102 46557 68932 104487 45947 -52488 -117080 -166209 -142447
$$ packed form
903B1783j33810j4103J01091Q7894n586n4000J07968N2630M5807q1879j53886
892b6091j8996p8043Q6595r3894M7976m3829j4791P1918L7298P5659K9534p5234
880a898R5451j3811K8222j33030J8800L3407r2282N5952R1670R937K386Q8192
868A82996J6148n3733o7111o1076K6913J20012j37737L7380K0034r860k0521O9554
856A22999M0608l2135l1220p5675m8731N508l1385J11236M9330j6520N7437l3794
844A17658j06585Q1055p709p5013O088P4334J2674J30618j50566K1055l9101k2586
832D1922n4941J00974R0214n7229N7781j00514L9090J1445K753K5498j77109q4663
820a04779L3531Q1823J43911p6384l1545K2375L5555n8540r8435o4592m9129K3762
$$ plain form
808 -142447 -33624 -104471 -26222 9488 18039 -92489 -93811 -1545 -25476 -89159 -7558 -45372
796 -45372 -38075 -404 -117456 -50758 -44562 80195 168875 69074 70880 60393 -24108 -113702
784 -113702 -88848 -105224 -11061 -27802 34482 73701 31546 -114488 -232708 -135551 -75447
773 -75447 76031 99582 70853 78291 168207 155224 101630 -11097 -40983 178554 33068
762 33068 -54236 4834 131906 167238 99865 67803 -2264 6419 25002 9232 -53240 -20491
750 -20491 47976 63409 31679 -10974 91171 123330 159726 72555 -7815 -18318 -46039 -30032
738 -30032 -41086 31144 28982 -71029 -71683 37890 24188 49237 31332 109128 37100 90768
726 90768 51708 86944 5417 -94863 10968 116001 142647 -29168 3327 72253 60532
$$ packed form
808a42447J08823p0847P8249L5710Q551j10528j322R2266k3931o3683Q1601l7814
796d5372P297L7671j17052O6698O196J24757Q8680r9801J806j0487q4501q9594
784a13702K4854j6376R4163j6741O2284L9219m2155j46034j18220R7157O0104
773g5447J51478K3551k8729P438Q9916j2983n3594j12727k9886K19537j45486
762C3068q7304N9070J27072L5332o7373l2062p0067Q683J8583j5770o2472L2749
750b0491O8467J5433l1730m2653J02145L2159L6396q7171q0370j0503k7721J6007
738c0032j1054P2230k162j00011o54J09573j3702K5049j7905P7796p2028N3668
726I0768l9060L5236q1527j00280J05831J05033K6646j71815L2495O8926j1721
$$ plain form
715 60532 -29474 21666 104538 154577 27963 80946 143285 154803 145972 92251 9424 10763
703 10763 -16671 124876 93286 -22641 189632 133988 174353 125734 -70248 22382 -64886
692 -64886 -78793 43733 25708 35232 58808 143762 59022 3435 -17077 41123 4984 19861
680 19861 61285 120806 92001 84247 113661 60313 8869 128064 72437 -18696 21636 170621
668 170621 217992 152066 -5787 13974 45024 -5111 -53270 -38004 -21487 29364 49943 -69553
656 -69553 -93926 -36967 -85781 -80695 42953 -62135 -16299 -14859 142118 131402 48775 3738
644 3738 -44763 40194 138313 149367 109861 194718 -19857 -12877 101371 73052 63798 12710
632 12710 77062 113395 -31346 -65811 74353 83814 142526 84464 38917 19236 -17129 7820
$$ packed form
715F0532r0006N1140Q2872N0039j26614N2983O2339J1518q831n3721q2827J339
703A0763k7434J41547l1590j15927K12273n5644M0365m8619j95982R2630q7268
692f4886j3907J22526j8025R524K3576Q4954q4740n5587k0512N8200l6139J4877
680A9861M1424N9521k8805p754K9414n3348n1444J19195n5627r1133M0332J48985
668A70621M7371o5926j57853J9761L1050n0135m8159J5266J6517N0851K0579j19496
656f9553k4373N6959m8814N086J23648j05088M5836J440J56977j0716q2627m5037
644C738m8501Q4957R8119J1054l9506Q4857k14575O980J14248k8319r254n1088
632A2710O4352L6333j44741l4465J40164R461N8712n8062m5547j9681l6365K4949
$$ plain form
620 7820 73272 194241 170842 -3211 50129 55921 4170 155323 152929 35142 66623 86968
608 86968 187598 142877 140165 235994 212169 120311 8534 -48321 -76475 -30494 52609 16860
596 16860 110738 127696 117399 216815 122438 123391 97514 145438 161023 74224 147850 143974 157670
583 157670 190518 95804 96263 98119 74897 75352 79672 -25850 -40903 -9118 -66743 -62379 1875
570 1875 159572 100919 136428 71222 113813 205604 185466 91883 75973 47461 73918 54104
558 54104 170986 216480 188405 102929 -71834 -88173 41719 209649 198102 110977 73137
547 73137 54804 -51040 -99232 -100958 -3913 82750 106762 35224 -37911 -50776 48128 114710
535 114710 138744 68948 89660 1905 -1912 4459 29914 -22146 4447 70868 115562 97744
$$ packed form
620G820O5452J20969k3399j74053N3340N792n1751J51153k394j17787L1481K0345
608H6968J00630m4721k712R5829k3825r1858j11777n6855k8154M5981Q3103l5749
596A6860R3878J6958j0297R9416r4377R53k5877M7924J5585q6799P3626l876J3696
583A57670L2848r4714M59J856k3222M55M320j05522j5053L1785n7625M364O4254
570A875J57697n8653L5509o5206M2591R1791k0138r3583j5910k8512K6457j9814
558E4104J16882M5494k8075q5476j74763j6339J29892J67930j1547q7125l7840
547G3137j8333j05844m8192j726R7045Q6663K4012p1538p3135j2865R8904O6582
535A14710K4034o9796K0712q7755l817O371K5455n2060K6593O6421M4694j7818
$$ plain form
523 97744 36980 21253 143462 13620 -60649 154473 185558 139232 134114 68250 63980 71002
511 71002 25606 106350 120357 88172 190454 236519 141981 136300 198695 103836 138113 39222
499 39222 -31753 70354 125302 8053 -424 58857 108372 144911 90563 -59405 -32612 43804
487 43804 106264 103456 73170 154681 91516 16471 50078 61928 173804 189927 149142 179519
475 179519 95682 163630 128363 164075 125907 75335 45208 100008 116347 145040 145027 257688
463 257688 301579 198308 114963 108363 34140 154745 288624 276109 205144 236890 201504
452 201504 129449 159038 118292 25020 66729 83183 115756 154241 208681 161232 105634 88904
440 88904 215841 165417 41401 87584 48684 -1789 9543 104929 169253 48256 193327
$$ packed form
523I7744o0764j5727J22209j29842p4269K15122L1085m6326n118o5864m270P022
511G1002m5396Q0744J4007l2185J02282M6065r4538n681O2395r4859L4277r8891
499C9222p0975J02107N4948j17249q477N9281M9515L6539n4348j49968K6793P6416
487D3804O2460k808l0286Q1511o3165p5045L3607J1850J11876J6123m0785L0377
475A79519q3837O7948l5267L5712l8168n0572l0127N4800J6339K8693j3J12661
463B57688M3891j03271q3345o600p4223J20605J33879j2515p0965L1746l5386
452B01504p2055K9589m0746r3272M1709J6454L2573L8485N4440m7449n5598j6730
440H8904J26937n0424j24016M6183l8900n0473J1332R5386O4324j20997J45071
$$ plain form
429 193327 164280 76702 68630 20823 139053 238171 260518 198008 266764 159244 -29902
418 -29902 -36848 104620 168762 175166 171643 217638 206336 226717 159220 70509 -56578 5062
406 5062 -61599 10266 91916 170056 244718 163376 144949 148133 126270 129080 173201 140066 86624
393 86624 130027 193676 187027 110383 182372 181312 280076 421034 317491 85214 41391 -17235
381 -17235 98727 80818 69516 164792 115609 153841 115522 193664 82679 81395 108763 80687
369 80687 161062 223913 255753 153968 88481 44913 108235 274391 173258 143575 164894
358 164894 173486 191621 67796 123553 257720 129887 -6468 51011 147179 156349 146057
347 146057 207038 144002 94169 -15230 22556 134398 110811 -31158 32317 153952 146854
$$ packed form
429A93327k9047q7578q072m7807J18230R9118K2347o2510O8756j07520j89146
418b9902o946J41468O4142O404l523M5995j1302K0381o7497q8711j27087O1640
406E062o6661P1865Q1650P8140P4662q1342j8427L184k1863K810M4121l3135n3442
393H6624M3403O3649o649p6644P1989j060R8764J40958j03543k32277m3823n8626
381a7235J15962j7909j1302R5276m9183L8232l8319P8142j10985j284K7368k8076
369H0687Q0375O2851L1840j01785o5487m3568O3322J66156j01133k9683K1319
358A64894Q592J8135j23825N5757J34167j27833j36355N7479R6168R170j0292
347A46057O0981o3036m9833j09399L7786J11842k3587j41969O3475J21635p098
$$ plain form
336 146854 152907 75042 53543 -90225 173985 117736 74621 167964 127088 150327 148088 159668
324 159668 169763 114472 142149 110848 40612 31465 105117 213292 218080 124467 8605 61993
312 61993 50526 64704 49481 13130 43227 90082 -122 101170 207721 267630 266920 202436
300 202436 158409 207384 250131 239380 271119 204021 217764 278310 209507 176748 114095 152616
288 152616 200721 223849 215854 85008 150570 119592 130753 68332 63638 69759 178937 155457
276 155457 114793 178759 161989 172442 126273 119766 62729 51771 92257 28794 52389 220113
264 220113 165626 72703 69095 205219 277022 307909 109909 230594 200032 187264 152809
253 152809 79530 208335 120796 187253 101514 118939 162658 164530 108944 152017 184212 163598
$$ packed form
336A46854O053p7865k1499j43768K64210n6249m3115R3343m0876K3239k239J1580
324A59668J0095n5291K7677l1301p0236r147P3652J08175M788r3613j15862N3388
312F1993j1467J4178j5223l6351L0097M6855r0204J01292J06551N9909p10o4484
300B02436m4027M8975M2747j0751L1739o7098J3743O0546o8803l2759o2653L8521
288A52616M8105K3128p995j30846O5562l0978J1161o2421m694O121J09178k3480
276A55457m0664O3966j6770J0453m6169o507n7037j0958M0486o3463K3595J67724
264B20113n4487r2923l608J36124P1803L0887j98000J20685l0562j2768l4455
253A52809p3279J28805q7539O6457q5739J7425M3719J872n5586M3073L2195k0614
$$ plain form
241 163598 235554 283456 62469 64284 193914 265039 244457 249382 200314 122641 145986 46300
229 46300 77198 220891 170838 133888 139230 197450 215015 139001 182713 90069 127196 212214
217 212214 139686 42270 14363 -22247 42429 46727 64222 146899 70762 173 128974 162592
205 162592 193503 261875 286337 207233 171013 81319 166557 164014 85606 52516 10990 69756
193 69756 124668 199900 162705 238983 110371 195727 325346 236702 132652 208504 299985
182 299985 185352 138478 158727 86163 117969 143790 216587 140366 196093 250123 135385
171 135385 82150 138647 220485 99608 154355 202128 270182 270579 241553 68619 89487 145123
159 145123 108316 149377 184933 191012 240872 234301 273162 213889 154175 159712 160749 133111 124282
$$ packed form
241A63598P1956M7902k20987J815J29630P1125k0582M925m9068p7673K3345r9686
229D6300L0898J43693n0053l6950N342N8220J7565p6014M3712r2644L7127Q5018
217B12214p2528r7416k7907l6610O4676M298J7495Q2677p6137p0589J28801L3618
205A62592L0911O8372K4462p9104l6220q9694Q5238k543p8408l3090m1526N8766
193F9756N4912P5232l7195P6278j28612Q5356J29619q8644j04050P5852R1481
182B99985j14633m6874K0249p2564L1806K5821P2797p6221N5727N4030j14738
171A35385n3235N6497Q1838j20877N4747M7773O8054L97k9026j72934K0868N5636
159A45123l6807M1061L5556O079M9860o571L8861n9273n9714N537J037k7638q829
$$ plain form
146 124282 276238 164730 66912 246044 213077 84883 142915 194663 115884 38718 170510
135 170510 308545 299889 224085 110511 48045 91204 134038 160118 200678 163279 145880 180257
123 180257 210826 149385 73331 131351 101727 44179 73191 69319 93477 160898 260566 240935
$$ packed form
146A24282J51956j11508r7818J79132l2967j28194N8032N1748p8779p7166J31792
135A70510J38035q656p5804j13574o2466M3159M2834K6080M0560l7399j7399L4377
123A80257L0569o1441p6054N8020k9624n7548K9012l872K4158O7421R9668j9631
$$ [...]
##END NTUPLES=NMR SPECTRUM
##END=
