##TITLE=1H_CA-9207-1
 CDCl3
 8 sc, 
 26.10.2023
##JCAMPDX= 6.0         $$ Bruker NMR JCAMP-DX V2.0
##DATA TYPE= NMR SPECTRUM
##DATA CLASS= NTUPLES
##ORIGIN= UXNMR, Bruker Analytische Messtechnik GmbH
##OWNER= root
$$ XWIN-NMR		Version 3.5
$$ Thu Oct 26 16:01:31 2023 Russian Standard Time (UT+4h)  she@DPX200
##.OBSERVE FREQUENCY= 200.13135
##.OBSERVE NUCLEUS= ^1H
##.ACQUISITION MODE= SIMULTANEOUS
##.ACQUISITION SCHEME= undefined
##.AVERAGES= 8
##.DIGITISER RES= 18
##SPECTROMETER/DATA SYSTEM= spect
##.PULSE SEQUENCE= zg30
##.SOLVENT NAME= CDCl3
##.SHIFT REFERENCE= (INTERNAL, CDCl3, 0, 15.7326)
##AUDIT TRAIL= $$ (NUMBER, WHEN, WHO, WHERE, WHAT)
$$ ##TITLE= Audit trail, XWIN-NMR		Version 3.5
$$ ##JCAMPDX= 5.01
$$ ##ORIGIN= Bruker BioSpin GmbH
$$ ##OWNER= she
$$ F:/spectra/data/she/nmr/H-F/1/pdata/1/auditp.txt
$$ ##AUDIT TRAIL=  $$ (NUMBER, WHEN, WHO, WHERE, WHAT)
(   1,<2023-10-26 16:00:01.68 +0400>,<she>,<DPX200>,
      <created by zg, POWCHK disabled, PULCHK disabled
       configuration hash MD5:
       00 E9 B6 7A A2 85 ED C7 34 08 36 98 17 FE 4E 26
       data hash MD5: 16K
       9E 28 03 A8 B4 66 E6 3F 8E 68 3A BF F8 48 43 93>)
(   2,<2023-10-26 16:00:05.48 +0400>,<she>,<DPX200>,
      <Start of raw data processing
       efp BC_mod = 2 LB = 0.24 FT_mod = 6 PKNL = 1 PHC0 = -23506.36 PHC1 = 7.85272 SI = 16K 
       data hash MD5: 16K
       A6 E9 18 64 49 21 82 C9 C1 1B 0C 25 46 D7 26 A2>)
(   3,<2023-10-26 16:00:25.84 +0400>,<she>,<DPX200>,
      <pk PHC0 = -1.278764 PHC1 = 3 
       data hash MD5: 16K
       16 8A 1E 87 9C 8E 9A 23 0E 58 20 8A 1A 66 51 C6>)
(   4,<2023-10-26 16:00:28.92 +0400>,<she>,<DPX200>,
      <abs ABSG = 5 
       data hash MD5: 16K
       1B EC AF 59 B9 0D 24 96 BC 4F C5 9B AA DB 7E 3F>)
(   5,<2023-10-26 16:00:43.78 +0400>,<she>,<DPX200>,
      <pk PHC0 = -0.9016461 PHC1 = 2 
       data hash MD5: 16K
       1A 40 25 22 E8 6C 9C 5B 13 7B FF BF B0 F2 63 22>)
(   6,<2023-10-26 16:00:48.21 +0400>,<she>,<DPX200>,
      <abs ABSG = 5 
       data hash MD5: 16K
       63 28 33 89 80 19 B6 94 DD D2 90 C7 DD BE 4A FA>)
$$ ##END=
$$ 
$$ hash MD5
$$ 4F C1 70 70 7C BE 6B 3F 8C 93 BF D2 C0 97 89 B0
##$RELAX= 
##$RELAX= 
##$RELAX= 
##$RELAX= 
##$RELAX= 
##$RELAX= 
$$ Bruker specific parameters
$$ --------------------------
##$DU= <F:/spectra>
##$EXPNO= 1
##$NAME= <H-F>
##$PROCNO= 1
##$TYPE= <nmr>
##$USER= <she>
##$AMP= (0..31)
100 100 100 100 100 100 100 100 100 100 100 100 100 100 100 100 100 100 
100 100 100 100 100 100 100 100 100 100 100 100 100 100 
##$AQSEQ= 0
##$AQ_mod= 1
##$AUNM= <au_zg>
##$AUTOPOS= <>
##$BF1= 200.13
##$BF2= 200.13
##$BF3= 200.13
##$BF4= 200.13
##$BF5= 200.13
##$BF6= 200.13
##$BF7= 200.13
##$BF8= 200.13
##$BYTORDA= 1
##$CFDGTYP= 0
##$CFRGTYP= 5
##$CHEMSTR= <none>
##$CNST= (0..31)
1 1 145 1 1 1 1 1 1 1 1 1 1 1 1 1 1 1 1 1 1 1 1 1 1 1 1 1 1 1 1 1 
##$CPDPRG= <>
##$CPDPRG1= <>
##$CPDPRG2= <>
##$CPDPRG3= <>
##$CPDPRG4= <mlev>
##$CPDPRG5= <mlev>
##$CPDPRG6= <mlev>
##$CPDPRG7= <mlev>
##$CPDPRG8= <mlev>
$$ [...]
##$SUBNAM3= <"">
##$SUBNAM4= <"">
##$SUBNAM5= <"">
##$SUBNAM6= <"">
##$SUBNAM7= <"">
##$SUBNAM8= <"">
##$SUBNAM9= <"">
##$SW= 18.05172834244
##$SWIBOX= (0..15)
0 0 2 0 0 0 0 0 0 0 0 0 0 0 0 0 
##$SW_h= 3612.71676300578
##$TD= 16384
##$TD0= 1
##$TE= 0
##$TE2= 300
##$TE3= 300
##$TEG= 300
##$TL= (0..7)
0 120 120 120 120 120 120 120 
##$TP= (0..7)
150 150 150 150 150 150 150 150 
##$TP07= 0
##$TPNAME0= <>
##$TPNAME1= <>
##$TPNAME2= <>
##$TPNAME3= <>
##$TPNAME4= <>
##$TPNAME5= <>
##$TPNAME6= <>
##$TPNAME7= <>
##$TPOAL= (0..7)
0.5 0.5 0.5 0.5 0.5 0.5 0.5 0.5 
##$TPOFFS= (0..7)
0 0 0 0 0 0 0 0 
##$TUNHIN= 0
##$TUNHOUT= 0
##$TUNXOUT= 0
##$USERA1= <user>
##$USERA2= <user>
##$USERA3= <user>
##$USERA4= <user>
##$USERA5= <user>
##$V9= 5
##$VALIST= <valist>
##$VCLIST= <CCCCCCCCCCCCCCC>
##$VD= 0
##$VDLIST= <DDDDDDDDDDDDDDD>
##$VPLIST= <PPPPPPPPPPPPPPP>
##$VTLIST= <TTTTTTTTTTTTTTT>
##$WBST= 1024
##$WBSW= 4
##$XGAIN= (0..3)
0 0 0 0 
##$XL= 0
##$YL= 0
##$YMAX_a= 359386
##$YMIN_a= -446896
##$ZGOPTNS= <>
##$ZL1= 120
##$ZL2= 120
##$ZL3= 120
##$ZL4= 120
##$ABSF1= 15.73367
##$ABSF2= -2.318179
##$ABSG= 5
##$ABSL= 3
##$ALPHA= 0
##$AQORDER= 0
##$ASSFAC= 0
##$ASSFACI= 0
##$ASSFACX= 0
##$ASSWID= 0
##$AUNMP= <proc_1d>
##$AZFE= 0.1
##$AZFW= 0.1
##$BCFW= 0
##$BC_mod= 2
##$BYTORDP= 0
##$COROFFS= 0
##$CY= -3
##$DATMOD= 1
##$DC= 0
##$DFILT= <>
##$DTYPP= 0
##$F1P= 0
##$F2P= 0
##$FCOR= 1
##$FTSIZE= 16384
##$FT_mod= 6
##$GAMMA= 0
##$GB= 0
##$INTBC= 1
##$INTSCL= 3.70164e-10
##$ISEN= 128
##$LB= 0.24
##$LEV0= 0
##$LPBIN= 0
##$MAXI= 10000
##$MC2= 0
##$MEAN= 0
##$ME_mod= 0
##$MI= 1.114404
##$NCOEF= 0
##$NC_proc= -7
##$NLEV= 6
##$NOISF1= 3.799351
##$NOISF2= 2.8
##$NSP= 0
##$NTH_PI= 0
##$NZP= 0
##$OFFSET= 15.73257
##$PC= 1
##$PHC0= -23508.54
##$PHC1= 12.85272
##$PH_mod= 1
##$PKNL= yes
##$PPARMOD= 0
##$PSCAL= 0
##$PSIGN= 0
##$REVERSE= no
##$SF= 200.13000779988
##$SI= 16384
##$SIGF1= 3
##$SIGF2= 2
##$SINO= 5.538805
##$SIOLD= 16384
##$SREGLST= <1H.CDCl3>
##$SSB= 0
##$STSI= 16384
##$STSR= 0
##$SW_p= 3612.71676300578
##$SYMM= 0
##$S_DEV= 0
##$TDeff= 16384
##$TDoff= 0
##$TI= <>
##$TILT= no
##$TM1= 0
##$TM2= 0
##$TOPLEV= 0
##$USERP1= <user>
##$USERP2= <user>
##$USERP3= <user>
##$USERP4= <user>
##$USERP5= <user>
##$WDW= 1
##$XDIM= 16384
##$YMAX_p= 299833582
##$YMIN_p= -687191
$$ End of Bruker specific parameters
$$ ---------------------------------
##NTUPLES= NMR SPECTRUM
##VAR_NAME=  FREQUENCY,     SPECTRUM/REAL,   SPECTRUM/IMAG
##SYMBOL=    X,             R,               I
##VAR_TYPE=  INDEPENDENT,   DEPENDENT,       DEPENDENT
##VAR_FORM=  AFFN,          ASDF,            ASDF
##VAR_DIM=   16384,         16384,           16384
##UNITS=     HZ,            ARBITRARY UNITS, ARBITRARY UNITS
##FACTOR=    0.220516191357247, 1,           1
##FIRST=     3148.55929567625, 0,            0
##LAST=      -464.157467329529, 0,           0
##MIN=       -464.157467329529, -687191,     0
##MAX=       3148.55929567625, 299833582,    0
$$ Real data points
##PAGE= N=1
##DATA TABLE= (X++(R..R)), XYDATA
$$ [...]
$$ plain form
6087 662678 780300 903619 926409 847056 736946 766515 612091 472031 773229 985616
6077 985616 983117 899265 1008934 1185644 1126822 1049493 1228393 919722 921787 1278313 1191624
6066 1191624 1057601 1153302 949352 979284 837648 1067035 1230035 1225243 1252196 986590
6056 986590 926475 1043226 1364755 1255226 1053668 1097813 1232624 1240890 1246061 1097870 1121405
6045 1121405 1176184 1245296 1492017 1658284 1522852 1566776 1537737 1544431 1676394 1802501 1918837
6034 1918837 1863430 1897640 1741257 1938219 1872477 1752176 1917757 1833812 1821472 1852932 1943534
6023 1943534 2192990 2398007 2282111 2095495 2210160 2484952 2426964 2439364 2649777 2536448
6013 2536448 2446734 2311304 2549718 2416134 2467857 2628844 2519993 2633786 2858607 2729684
$$ packed form
6087F62678J17622J23319K2790p9353j10110K9569j54424j40060L01198K12387
6077I85616k499q3852J09669J76710n8822p7329J78900l08671K065L56526q6689
6066A191624j34023R5701k03950K9932j41636K29387J63000m792K6953k65606
6056I86590o0115J16751L21529j09529k01558M4145J34811Q266N171j48191K3535
6045A121405N4779O9112K46721J66267j35432M3924k9039O694J31963J26107J16336
6034A918837n5407L4210j56383J96962o5742j20301J65581q3945j2340L1460R0602
6023A943534K49456K05017j15896j86616J14665K74792n7988J2400K10413j13329
6013B536448q9714j35430K38414j33584N1723J60987j08851J13793K24821j28923
$$ plain form
6003 2729684 2827387 2963944 2966956 2946713 2870261 2878139 2842122 2836752 2606394 2840985 2766943
5992 2766943 2649692 2738274 2841155 2906264 2831467 2733339 2552783 2442780 2358668 2396159 2347561
5981 2347561 2502798 2775730 2982360 2960122 2733190 2913937 3179144 3226123 3101599 3001614
5971 3001614 2840252 2665572 2539730 2391802 2373102 2626089 2537742 2358155 2361231 2209512
5961 2209512 2295483 2431509 2424527 2783106 2791970 2610872 2591372 2837709 3116424 3098519 3043649
5950 3043649 2949168 3083640 2807192 2677429 2698051 2653028 2744926 2711508 2636815 2449206 2280889
5939 2280889 2140623 2439885 2612755 2433517 2369198 2581050 2408470 2588815 2456537 2625630
5929 2625630 2833536 2654747 2453726 2607423 2684421 3096884 3193638 3241286 3130477 2966058
$$ packed form
6003B729684R7703J36557L012k0243p6452P878l6017n370k30358K34591p4042
5992B766943j17251Q8582J02881O5109p4797r8128j80556j10003q4112L7491m8598
5981B347561J55237K72932K06630k2238k26932J80747K65207M6979j24524r9985
5971C001614j61362j74680j25842j47928j8700K52987q8347j79587L076j51719
5961B209512Q5971J36026o982L58579Q864j81098j9500K46337K78715j7905n4870
5950C043649r4481J34472k76448j29763K0622m5023R1898l3418p4693j87609j68317
5939B280889j40266K99262J72870j79238o4319K11852j72580J80345j32278J69093
5929B625630K07906j78789k01021J53697P6998M12463R6754M7648j10809j64419
$$ plain form
5919 2966058 2917749 2910239 2927871 2706637 2690845 2769872 2671250 2586369 2795712 2795303 2601282
5908 2601282 2648523 3068519 3102715 2976972 2910241 2834543 2901513 2994898 3104823 3168918 2933185
5897 2933185 2921284 2901334 2939558 2800702 2953593 2935813 2984911 2899212 2903683 2928385 3034274
5886 3034274 3124479 3190758 2921269 3179978 3330314 3439733 3437638 3199896 3460224 3460681 3434563
5875 3434563 3656581 3871011 3907892 3704054 3812843 4050244 4197207 4102334 4189764 4544287
5865 4544287 5065110 5188080 5402270 5614466 5743537 6112336 6605814 7170569 7823499 8071760
5855 8071760 8388242 8314039 8395065 8509900 8219117 8151027 7776507 7565397 7567333 7440446
5845 7440446 6994391 6991765 7087926 7401807 7622170 7689488 8069118 8447048 8787293 8907029
$$ packed form
5919B966058m8309p510J7632k21234j5792P9027r8622q4881K09343m09j94021
5908B601282M7241M19996L4196j25743o6731p5698O6970R3385J09925O4095k35733
5897B933185j1901j9950L8224j38856J52891j7780M9098q5699M471K4702J05889
5886C034274R0205O6279k69489K58709J50336J09419k095k37742K60328M57k6118
5875C434563K22018K14430L6881k03838J08789K37401J46963r4873Q7430L54523
5865D544287N20823J22970K14190K12196J29071L68799M93478N64755O52930K48261
5855H071760L16482p4203Q1026J14835k90783o8090l74520k11110J936j26887
5845G440446m46055k626R6161L13881K20363O7318L79630L77930L40245J19736
$$ plain form
5835 8907029 9048650 9198733 9488008 9808891 9991381 10083080 10041071 9876413 9586606 9422535
5825 9422535 9131399 8904341 8950769 8729444 8618820 8308045 8065546 7895932 7879479 8031428
5815 8031428 7880865 7989248 7961039 8096207 7970756 7808771 7495181 7318748 7175616 7183586
5805 7183586 7159436 7137621 6954887 7254264 7583284 7858028 7725758 7811773 8127978 7935424
5795 7935424 7531374 7337854 7413907 7712821 7777748 7897607 7909631 8053201 8088055 8293780
5785 8293780 8481826 8687348 8862929 8909822 8979542 9131630 9175937 9256115 9780057 9890994
5775 9890994 10062823 10239582 10841290 11092993 11103632 11356556 11582205 12113248 12467437 12875817
5765 12875817 13144552 13411445 13860525 14251796 14713208 15002758 15126366 15417802 16057969
$$ packed form
5835H907029J41621J50083K89275L20883J82490R1699m2009j64658k89807j64071
5825I422535k91136k27058M6428k21325j10624l10775k42499j69614j6453J51949
5815H031428j50563J08383k8209J35168j25451j61985l13590j76433j43132P970
5805G183586k4150k1815j82734K99377L29020K74744j32270Q6015L16205j92554
5795G935424m04050j93520P6053K98914O4927J19859J2024J43570L4854K05725
5785H293780J88046K05522J75581M6893O9720J52088M4307Q0178N23942J10937
5775I890994J71829J76759O01708K51703J0639K52924K25649N31043L54189M08380
5765A2875817K68735K66893M49080L91271M61412K89550J23608K91436O40167
$$ plain form
5756 16057969 16573115 16987204 17436796 17878412 18509518 19145277 19704969 20514078 21107784
5747 21107784 21829381 22622535 23450327 24072599 24846949 25349287 26046542 26464904 26464996 26269578
5737 26269578 25688883 25156336 24708126 24192822 23523568 23081439 22489271 22027908 21889786
5728 21889786 21708575 21369801 21329264 21464820 21377273 21608895 21776973 21884355 21891300 22109189
5718 22109189 22080258 22223306 22846390 23599619 24154442 24750408 25596594 26701944 27365058
5709 27365058 27884465 28886587 30022282 31338423 32590115 34020450 35512203 37280867
5701 37280867 39161930 41210807 43204838 45430739 47859833 50220330 52218870 53550125
5693 53550125 54286671 53980214 53369239 52479837 51081087 49859716 48780735 48322533 47979619
$$ packed form
5756A6057969N15146M14089M49592M41616O31106O35759N59692Q09109N93706
5747B1107784P21597P93154Q27792O22272P74350N02338O97255M18362R2j95418
5737B6269578n80695n32547m48210n15304o69254m42129n92168m61363j38122
5728B1889786j81211l38774m0537J35556q7547K31622J68078J07382O945K17889
5718B2109189k8931J43048O23084P53229N54823N95966Q46186J105350O63114
5709B7365058N19407J002122J135695J316141J251692J430335J491753J768664
5701C7280867J881063K048877J994031K225901K429094K360497J998540J331255
5693E3550125P36546l06457o10975q89402j398750j221371j078981m58202l42914
$$ plain form
5684 47979619 47439898 47250482 47169701 46923165 46986349 46997599 46768145 46798308 46770625 46802335
5674 46802335 46894009 47226183 47731497 48612203 49499751 50675976 51906048 53171955 54870564
5665 54870564 56017924 56871160 57099489 56941995 56354168 54904403 53163183 51566185 49947722
5656 49947722 48320990 46706858 45292612 44259492 43186321 42458524 41733303 40954119 40679882
5647 40679882 40487003 40582517 40663022 41127638 41634612 42134798 43226139 44144791 45385061
5638 45385061 47459875 49426081 51405493 53488182 55904200 58268991 60506306 62768898
5630 62768898 63769241 63687392 62889084 60854226 58231977 55630692 52545282 49523949 47157775
5621 47157775 44885222 42768371 41214206 39449727 37991611 36788243 35830303 34917825
$$ packed form
5684D7979619n39721j89416q0781k46536O3184J1250k29454L0163k7683L1710
5674D6802335R1674L32174N05314Q80706Q87548J176225J230072J265907J698609
5665E4870564J147360Q53236K28329j57494n87827j449765j741220j596998j618463
5656D9947722j626732j614132j414246j033120j073171p27797p25221p79184k74237
5647D0679882j92879R5514Q0505M64616N06974N00186J091341R18652J240270
5638D5385061K074814J966206J979412K082689K416018K364791K237315K262592
5630F2768898J000343q1849p98308k034858k622249k601285l085410l021333k366174
5621D7157775k272553k116851j554165j764479j458116j203368r57940r12478
$$ plain form
5613 34917825 34220634 33835881 33246902 32790834 32770914 32429731 32090027 32102357 32403561 32722223
5603 32722223 32883836 33446599 33944244 34767143 35621008 36665393 38089566 39577517 41352276
5594 41352276 43125855 44910433 46471992 48078544 49660415 50968473 52086616 53007246
5586 53007246 53819423 54584020 55539093 56059615 56414753 56511647 56642646 56530714 56003407 55429730
5576 55429730 55001684 54660062 54445451 54374826 54399269 54119366 53783494 52901208 51633285 50550569
5566 50550569 49315658 48068900 46887223 45760861 44908048 44167768 43689085 43051749 42003084
5557 42003084 40909929 39918929 38815514 37612087 36272353 35169892 34874889 33999615 33111238
5548 33111238 32672251 31950401 31608560 31526282 31285244 31031434 30926082 30623366 30090764 29492942
$$ packed form
5613C4917825o97191l84753n88979m56068j9920l41183l39704J2330L01204L18662
5603C2722223J61613N62763M97645Q22899Q53865J044385J424173J487951J774759
5594D1352276J773579J784578J561559J606552J581871J308058J118143R20630
5586E3007246Q12177P64597R55073N20522L55138R6894J30999j11932n27307n73677
5576E5429730m28046l41622k14611p0625K4443k79903l35872q82286j267923j082716
5566E0550569j234911j246758j181677j126362q52813p40280m78683o37336j048665
5557D2003084j093155r91000j103415j203427j339734j102461k95003q75274q88377
5548C3111238m38987p21850l41841q2278k41038k53810j05352l02716n32602n97822
$$ plain form
5538 29492942 28919865 28197000 27026353 26151058 25361065 24985571 24621449 24297792 24099658
5529 24099658 23754826 23149342 22912266 22921517 22481733 22357747 22107527 21674705 21255122 21022509
5519 21022509 20627029 19995811 19423713 18857967 18350466 17944252 17601168 17514498 17285948 16894962
5509 16894962 16669397 16249114 15887351 15490976 15007805 14648422 14356099 13906610 13837033 13584740
5499 13584740 13235083 13051616 12962412 12723626 12482645 12422275 12092128 11872476 11896827 11591459
5489 11591459 11370352 11184373 10955938 10561611 10332132 9823153 9618798 9453430 9268038
5480 9268038 9390493 9342453 9152174 8947294 8711774 8854553 8899953 8727486 8839026 8816390
5470 8816390 8466187 8528691 8886706 9035196 9169571 9262734 9118382 9129149 8871207 8743683
$$ packed form
5538B9492942n73077p22865j170647q75295p89993l75494l64122l23657j98134
5529B4099658l44832o05484k37076R251m39784j23986k50220m32822m19583k32613
5519B1022509l95480o31218n72098n65746n07501m06214l43084q6670k28550l90986
5509A6894962k25565m20283l61763l96375m83171l59383k92323m49489o9577k52293
5499A3584740l49657j83467q9204k38786k40981o0370l30147k19652K4351l05368
5489A1591459k21107j85979k28435l94327k29479n08979k04355j65368j85392
5480I268038J22455m8040j90279k04880k35520J42779M5400j72467J11540k2636
5470H816390l50203O2504L58015J48490J34375R3163j44352J0767k57942j27524
$$ plain form
5460 8743683 9227521 9450294 9513899 9609706 9636140 9783831 10133698 9856965 10023843 10065653
5450 10065653 10014217 10051776 10133377 10132291 10027888 10043147 9964456 9780518 9885301 9674391 9478261
5439 9478261 9692676 9717016 9665041 9817850 9636607 9743477 10032132 10032060 10030539 10027316 9845263
5428 9845263 9947944 9964048 9835905 9920213 10071468 10116531 10235323 10424225 10537273 10567141
5418 10567141 10926578 11114127 11064228 11258791 11569478 11733924 11782516 12147770 12424871 12398973
5408 12398973 12796372 13241905 13202495 13422676 13804141 13994604 14275100 14805256 15289813 15804348
5398 15804348 16456296 16912656 17445655 18109306 18954888 19781627 20547461 21019837 21995022
5389 21995022 23138902 24014946 25248687 26249007 27460925 28703266 30068096 31201251
$$ packed form
5460H743683M83838K22773O3605R5807K6434J47691L49867k76733J66878M1810
5450A0065653n1436L7559Q1601j086j04403J5259p8691j83938J04783k10910j96130
5439I478261K14415K4340n1975J52809j81243J06870K88655p2j521l223j82053
5428I845263J02681J6104j28143Q4308J51255M5063J18792J88902J13048K9868
5418A0567141L59437J87549m9899J94563L10687J64446M8592L65254K77101k5898
5408A2398973L97399M45533l9410K20181L81465J90463K80496N30156M84557N14535
5398A5804348O51948M56360N32999O63651Q45582Q26739P65834M72376R75185
5389B1995022J143880Q76044J233741J000320J211918J242341J364830J133155
$$ plain form
5381 31201251 32190164 32870111 33439691 33746255 33986675 34386221 34657155 34867010 34930694 34775447
5371 34775447 34566610 34147532 33903216 33653417 33375622 32945322 32581263 32428696 32401837 32274909
5361 32274909 32080171 31783721 31306394 30971549 30786243 30653913 30520587 30183211 30045508
5352 30045508 29952854 29836846 29726511 29631033 29932394 30189008 30489216 30959571 31721734 32441288
5342 32441288 33006238 34235330 35335986 36481476 38236814 39846007 41658266 43422040
5334 43422040 45606115 48208755 51223926 54489661 57727278 61805066 65943050 70404516
5326 70404516 74822883 79392345 84121031 88610074 92782594 96279146 99582340 102128269
5318 102128269 103683664 104436898 104531147 104452726 104524715 104276212 103893671 103392165 102782713 101862175
$$ packed form
5381C1201251R88913O79947N69580L06564K40420L99546K70934K09855O3684j55247
5371C4775447k08837m19078k44316k49799k77795m30300l64059j52567k6859j26928
5361C2274909j94738k96450m77327l34845j85306j32330j33326l37376j37703
5352C0045508r2654j16008j10335r5478L01361K56614L00208M70355P62163P19554
5342C2441288N64950J229092J100656J145490J755338J609193J812259J763774
5334D3422040K184075K602640L015171L265735L237617M077788M137984M461466
5326G0404516M418367M569462M728686M489043M172520L496552L303194K545929
5318A02128269J555395P53234R4249p8421P1989k48503l82541n01506o09452r20538
$$ plain form
5308 101862175 100811073 99419123 97141475 94070808 90557506 86492580 82273991 77802270
5300 77802270 73065271 68436078 64172951 59887928 55906732 52335227 48975107 45791585
5292 45791585 42983114 40615639 38579251 36701536 35398959 33770397 32539979 31375832
5284 31375832 29950580 28980846 27738558 26726725 25688691 24640748 23652587 22722289 21887613
5275 21887613 21155610 20475830 19851601 19308771 18699707 18262269 18200466 17824931 17524163 17207851
5265 17207851 16820239 16596862 16728207 16662628 16620421 16587060 16682009 16549513 16411671 16348216
5255 16348216 16594656 16656142 16686630 16893172 17347926 17597970 17737880 18162675 18089843 17929090
5245 17929090 17712678 17318022 16806085 16123171 15479816 14946636 14449894 13792650 13398861
$$ packed form
5308A01862175j051102j391950k277648l070667l513302m064926m218589m471721
5300G7802270m736999m629193m263127m285023l981196l571505l360120l183522
5292D5791585k808471k367475k036388j877715j302577j628562j230418j164147
5284C1375832j425252r69734j242288j011833j038034j047943r88161r30298q34676
5275B1887613p32003o79780o24229n42830o09064m37438o1803l75535l00768l16312
5265A7207851l87612k23377J31345o5579m2207l3361R4949j32496j37842o3455
5255A6348216K46440O1486L0488K06542M54754K50044J39910M24795p2832j60753
5245A7929090k16412l94656n11937o82914o43355n33180m96742o57244l93789
$$ plain form
5236 13398861 12855259 12125049 11649195 11112100 10695684 10366788 9971973 9602678 9440977
5227 9440977 9240369 8959125 8623055 8259793 8366326 8188819 7975679 8078531 7728818 7704497
5217 7704497 7747776 7591477 7336070 7014616 6670931 6822772 6720927 6795548 7047545 7141284
5207 7141284 7189160 7351062 7279090 7312740 7460819 7487863 7450975 7491429 7430415 7412238 7443378
5196 7443378 7369642 7383337 7254677 7441779 7440289 7491241 7750316 7657924 7370007 7241792 7112674
5185 7112674 7008092 6966606 6678290 6441060 6233644 6008980 6013767 6005294 5857647 5871256 5578292
5174 5578292 5286539 5354280 5354076 4969690 4902372 4930027 4876524 4740829 4775136 4794040 4739084
5163 4739084 4580349 4418275 4381576 4232195 4110166 4036413 3831075 3756098 3811358 3704353
$$ packed form
5236A3398861n43602p30210m75854n37095m16416l28896l94815l69295j61701
5227I440977k00608k81244l36070l63262J06533j77507k13140J02852l49713k4321
5217G704497M3279j56299k55407l21454l43685J51841j01845P4621K51997R3739
5207G141284M7876J61902p1972L3650J48079K7044l6888M0454o1014j8177L1140
5196G443378p3736J3695j28660J87102j490N0952K59075r2392k87917j28215j29118
5185G112674j04582m1486k88316k37230k07416k24664M787q473j47647J3609k92964
5174E578292k91753O7741k04l84386o7318K7655n3503j35695L4307J8904n4956
5163D739084j58735j62074l6699j49381j22029p3753k05338p4977N5260j07005
$$ plain form
5153 3704353 3524117 3320260 3434053 3509951 3264196 3357911 3508586 3508116 3554108 3422511 3384075
5142 3384075 3410573 3350331 3266301 3323458 3577841 3617878 3380053 3675994 3527407 3483879 3430858
5131 3430858 3374691 3407321 3353368 3350500 3392711 3253305 3418545 3603109 3575214 3257149 3097728
5120 3097728 3154215 3149235 3389589 3572663 3517278 3548104 3494732 3222061 3220426 3344285 3304192
5109 3304192 3261773 3279338 3307008 3374861 3356697 3344068 3362200 3256511 3232846 3316306 3516684
5098 3516684 3537044 3398554 3358706 3438902 3623312 3753515 3819200 3748414 3714126 3769625 4158021
5087 4158021 4355380 4380678 4513092 4696520 4648687 4783115 4732767 4874925 5209581 5241390
5077 5241390 5259793 5186254 5402583 5627266 5767917 5637171 5776922 6049521 6009504 5972074
$$ packed form
5153C704353j80236k03857J13793P5898k45755R3715J50675m70M5992j31597l8436
5142C384075K6498o0242q4030N7157K54383M0037k37825K95941j48587m3528n3021
5131C430858n6167L2630n3953k868M2211j39406J65240J84564k7895l18065j59421
5120C097728N6487m980K40354J83074n5385L0826n3372k72671j635J23859m0093
5109C304192m2419J7565K7670O7853j8164j2629J8132j05689k3665Q3460K00378
5098C516684K0360j38490l9848Q0196J84410J30203O5685p0786l4288N5499L88396
5087D158021J97359K5298J32414J83428m7833J34428n0348J42158L34656L1809
5077E241390J8403p3539K16329K24683J40651j30746J39751K72599m0017l7430
$$ plain form
5067 5972074 5819955 5605981 5556059 5794196 5884259 5657469 5711379 5594700 5526910 5557272
5057 5557272 5581762 5511913 5472122 5716881 5574366 5503347 5511203 5488481 5529102 5449805 5197545
5046 5197545 5450570 5483994 4957949 4866786 4748400 4572819 4553528 4743411 4676721 4427930
5036 4427930 4232541 4434595 4420856 4360466 4323930 4238179 4420504 4400709 4359235 4474702 4709013
5025 4709013 4716031 4797732 4897842 5018238 5098367 5542045 5508993 5483869 5508954 5549205 5667733
5014 5667733 5646754 5665696 5843238 5722907 5543827 5456703 5516715 5439416 5168269 5277339
5004 5277339 5263090 5288137 5319072 5401413 5484526 5331410 4927848 4970185 5071602 5000078 5019387
4993 5019387 5234850 5536944 5564987 5511228 5604269 5591009 5742972 5939558 6020512 6332017
$$ packed form
5067E972074j52119k13974m9922K38137R0063k26790N3910j16679o7790L0362
5057E557272K4490o9849l9791K44759j42515p1019P856k2722M0621p9297k52260
5046E197545K53025L3424n26045r1163j18386j75581j9291J89883o6690k48791
5036D427930j95389K02054j3739o0390l6536q5751J82325j9795m1474J15467K34311
5025D709013P018Q1701J00110J20396Q0129M43678l3052k5124K5085M0251J18528
5014E667733k0979J8942J77542j20331j79080q7124O0012p7299k71147J09070
5004E277339j4249K5047L0935Q2341Q3113j53116m03562M2337J01417p1524J9309
4993E019387K15463L02094K8043n3759R3041j3260J51963J96586Q0954L11505
$$ plain form
4983 6332017 6273163 6395047 6704030 6683078 6817743 6674293 6526450 6347912 6509029 6547528
4973 6547528 6222715 6232246 5948979 5643599 5718526 5604309 5075649 4766635 4777975 4466141
4963 4466141 4406373 4392647 4453880 4490243 4359601 4432342 4456482 4313458 4327886 4337466 4199253
4952 4199253 4294825 4057718 4156531 4280076 4368561 4180258 4182715 4003518 3907610 4099282 4145697
4941 4145697 4151505 4094960 4096173 3979590 4104732 4376174 4333356 4402838 4784787 4730757 4596195
4930 4596195 4559016 4543555 4597483 4511793 4756450 5017043 5124942 5243941 5397961 5401396 5374255
4919 5374255 5426083 5260571 5406431 5482919 5341276 5420983 5503162 5331116 5005701 5399256
4909 5399256 5111511 4955075 5185857 4882142 4713579 4710392 4651419 4599431 4697765 4604080 4374071
$$ packed form
4983F332017n8854J21884L08983k0952J34665j43450j47843j78538J61117L8499
4973F547528l24813R531k83267l05380P4927j14217n28660l09014J1340l11834
4963D466141n9768j3726O1233L6363j30642P2741K4140j43024J4428R580j38213
4952D199253R5572k37107R8813J23545Q8485j88303K457j79197r5908J91672M6415
4941D145697N808n6545J213j16583J25142K71442m2818O9482L81949n4030j34562
4930D596195l7179j5461N3928q5690K44657K60593J07899J18999J54020L435k7141
4919E374255N1828j65512J45860P6488j41643P9707Q2179j72046l25415L93555
4909E399256k87745j56436K30782l03715j68563l187n8973n1988R8334r3685k30009
$$ plain form
4898 4374071 4550036 4784191 4431963 4560374 4665354 4676724 4406371 4604718 4682780 4580681
4888 4580681 4555920 4594189 4648130 4657255 4844546 5035408 4993365 4933883 4981231 5192497 5084064
4877 5084064 5224150 5371983 5426219 5642761 5813199 5853661 5640887 5675389 5837594 5667223
4867 5667223 5536709 5772044 5979211 5962505 5928304 5900972 6046823 6057084 5804750 5783675
4857 5783675 5774091 5828908 6042992 6223459 6446015 6312636 6336672 6438427 6586876 6730161
4847 6730161 6737516 6982322 7012940 6932618 6853662 7008048 7285002 7384619 7248601 7360273 7429963
4836 7429963 7557009 7635959 7737458 7894050 7915405 7754396 7480136 7652615 7582010 7567969
4826 7567969 7778431 7643764 7606855 7688603 7661440 7888751 8096673 8219948 8410403 8519260
$$ packed form
4898D374071J75965K34155l52228J28411J04980J1370k70353J98347P8062j02099
4888D580681k4761L8269N3941R125J87291J90862m2043n9482M7348K11266j08433
4877E084064J40086J47833N4236K16542J70438M0462k12774L4502J62205j70371
4867E667223j30514K35335K07167j6706l4201k7332J45851J0261k52334k1075
4857E783675r584N4817K14084J80467K22556j33379K4036J01755J48449J43285
4847F730161P355K44806L0618q0322p8956J54386K76954R9617j36018J11672O9690
4836G429963J27046P8950J01499J56592K1355j61009k74260J72479p0605j4041
4826G567969K10462j34667l6909Q1748k7163K27311K07922J23275J90455J08857
$$ plain form
4816 8519260 8510701 8620547 8950913 9121778 9277689 9410349 9421362 9554548 9956877 10268291
4806 10268291 10254947 10492427 10720138 10698314 10920901 11155957 11520919 11796653 11934826 12035430
4796 12035430 12278420 12512777 12717066 13253572 13780674 14228876 14784389 15699781 16675003
4787 16675003 17643252 18655893 19588701 20788911 22196728 23858669 26123162 29285612
4779 29285612 33884554 39665476 45943414 50988277 51965243 49641269 44841588 38870937
4771 38870937 33704302 30222440 27859695 26055130 24705866 23766362 22942611 22736878 22545870
4762 22545870 22179496 22065572 22066120 22061935 21896527 21805289 21900586 21808097 22068868 22229933 22744350
4751 22744350 22989084 23159163 23576204 23955745 24326506 24631553 24865536 25255014 25841185
$$ packed form
4816H519260q559J09846L30366J70865J55911J32660J1013J33186M02329L11414
4806A0268291j3344K37480K27711k1824K22587K35056L64962K75734J38173J00604
4796A2035430K42990K34357K04289N36506N27102M48202N55513R15392R75222
4787A6675003R68249J012641R32808J200210J407817J661941K264493L162450
4779B9285612M598942N780922O277938N044863R76966k323974m799681n970651
4771C8870937n166635l481862k362745j804565j349264r39504q23751k05733j91008
4762B2545870l66374j13924N48m185j65408r1238R5297r2489K60771J61065N14417
4751B2744350K44734J70079M17041L79541L70761L05047K33983L89478N86171
$$ plain form
4742 25841185 26112578 26160029 26622729 26789966 26676569 26870752 26974332 27133391 27264780 27416315
4732 27416315 27646091 27861749 28165828 28248102 28616797 29358844 30197076 31243923 32195537
4723 32195537 33453086 34691704 36572665 38356501 40338833 42784992 45705351 49524929
4715 49524929 54463788 60213007 65661207 68654882 68904780 67461535 63836529 58510796
4707 58510796 53961808 50653515 48573619 47049050 46073260 45324043 44524205 44216376 43829371
4698 43829371 43493467 43081360 42639398 42595755 42352353 42214715 41955918 41482639 41259465 41434005
4688 41434005 41187007 41104138 41178117 41491024 42097783 42866627 43582107 44237672 45273701 46401165
4678 46401165 47454413 48494935 49502972 50353093 51416931 52330276 53272222 54286920 55095328
$$ packed form
4742B5841185K71393M7451M62700J67237j13397J94183J03580J59059J31389J51535
4732B7416315K29776K15658L04079Q2274L68695P42047Q38232J046847R51614
4723C2195537J257549J238618J880961J783836J982332K446159K920359L819578
4715D9524929M938859N749219N448200K993675K49898j443245l625006n325733
4707E8510796m548988l308293k079896j524569r75790p49217p99838l07829l87005
4698D3829371l35904m12107m41962m3643k43402j37638k58797m73279k23174J74540
4688D1434005k46998q2869P3979L12907O06759P68844P15480O55565J036029J127464
4678D6401165J053248J040522J008037Q50121J063838R13345R41946J014698Q08408
$$ plain form
4669 55095328 55789660 55985457 56620003 56905519 56856378 56637293 56011329 55318786 54276762
4660 54276762 53369641 52684394 51638503 50545329 49736128 48980337 48703473 48507794 47994647
4651 47994647 48055070 47883036 47918704 48027716 48236223 48656247 49252150 49875223 50441080 50883987
4641 50883987 51079686 51100527 50938845 50682821 50081356 49477832 48686874 47730244 46909501 46235709
4631 46235709 45530282 45183306 44605006 44221979 43774562 43359565 42742669 42260830 42077419
4622 42077419 41967391 41798672 41406174 41008184 41125057 41037340 41240428 41519040 41650232 42091607
4612 42091607 42782418 43529460 44156773 45089648 45801764 46692042 47637381 48182659 48932279
4603 48932279 49494958 49890300 50134301 50227398 49761783 49285941 48781087 48693097 48271099 47205765
$$ packed form
4669E5095328O94332J95797O34546K85516m9141k19085o25964o92543j042024
4660E4276762r07121o85247j045891j093174q09201p55791k76864j95679n13147
4651D7994647O0423j72034L5668J09012K08507M20024N95903O23073N65857M42907
4641E0883987J95699K0841j61682k56024o01465o03524p90958r56630q20743o73792
4631D6235709p05427l46976n78300l83027m47417m14997o16896m81839j83411
4622D2077419j10028j68719l92498l97990J16873q7717K03088K78612J31192M41375
4612D2091607O90811P47042O27313R32875P12116Q90278R45339N45278P49620
4603D8932279N62679L95342K44001R3097m65615m75842n04854q7990m21998j065334
$$ plain form
4593 47205765 46451964 45931502 45165159 44819134 44446606 44053206 44163430 44263411 44166298 44364437
4583 44364437 44593654 44817206 45035859 45368234 45585523 45844418 45884726 45598788 45240664 44966281
4573 44966281 44416267 43735591 43084971 42256833 41380423 40966777 40406206 39731910 39494437
4564 39494437 39399067 39383802 38854893 38816379 38727532 38652874 38354418 38208331 38019689 37782232
4554 37782232 37416872 37035730 36948918 36767887 36608794 36619644 36829716 36855001 36908038 37316663
4544 37316663 37686538 38465937 38902370 39927099 41189886 42272283 43108265 43938958 44392206
4535 44392206 44545292 44620420 44688779 45124045 45283708 45793998 46012462 46015960 46136562 46339861
4525 46339861 46581702 46532951 46210203 45883993 45697223 45430328 45258813 45101356 45415694 45442761
$$ packed form
4593D7205765p53801n20462p66343l46025l72528l93400J10224R9981r7113J98139
4583D4364437K29217K23552K18653L32375K17289K58895M0308k85938l58124k74383
4573D4966281n50014o80676o50620q28138q76410m13646n60571o74296k37473
4564C9494437r5370j5265n28909l8514q8847p4658k98456j46087j88642k37457
4554C7782232l65360l81142q6812j81031j59093J0850K10072K5285N3037M08625
4544C7316663L69875P79399M36433J024729J262787J082397Q35982Q30693M53248
4535D4392206J53086P5128O8359M35266J59663N10290K18464L498J20602K03299
4525D6339861K41841m8751l22748l26210j86770k66895j71515j57457L14338K7067
$$ plain form
4515 45442761 45657379 46384261 47306247 48428335 49656515 51149627 53015911 54623990 55970679
4506 55970679 57417166 58484187 58935239 59180556 59062501 58542577 58018083 57561781 57351951
4497 57351951 57215313 57050128 57019326 57269153 57467807 57832166 58125716 58793005 59587123 60844630
4487 60844630 61884750 63103478 64223997 65277185 66218435 66841844 67155888 67213670 66913245
4478 66913245 66342653 65817135 64706892 63493523 62494153 61209278 59955035 58737824 57773176
4469 57773176 57333654 57028936 56819816 57067977 57616452 58628654 59642876 61052558 62367356
4460 62367356 63736055 65171546 66692481 68381056 69697076 70817787 71288408 71641967
4452 71641967 71753096 72167999 72473298 73008842 73605612 74665987 75624619 77000424 78036940
$$ packed form
4515D5442761K14618P26882R21986J122088J228180J493112J866284J608079J346689
4506E5970679J446487J067021M51052K45317j18055n19924n24494m56302k09830
4497E7351951j36638j65185l0802K49827J98654L64359K93550O67289P94118J257507
4487F0844630J040120J218728J120519J053188R41250O23409L14044N7782l00425
4478F6913245n70592n25518j110243j213369r99370j284875j254243j217211r64648
4469E7773176m39522l04718k09120K48161N48475J012202J014222J409682J314798
4460F2367356J368699J435491J520935J688575J316020J120711M70621L53559
4452G1641967J11129M14903L05299N35544N96770J060375R58632J375805J036516
$$ plain form
4443 78036940 79101401 80051105 80615969 81359908 82019886 82422271 83031210 83782918 84818603
4434 84818603 86089784 87415027 89013604 90079156 91070039 91630427 91317037 90003682 87644710
4425 87644710 85051134 82384049 79141877 75959705 73392885 71251980 69813789 68681915
4417 68681915 67886253 67606382 67662342 68147351 69093153 70718310 72389212 74811715 78294881
4408 78294881 82177395 86244337 90258420 93049277 94671739 94719202 93286210 91620962
4400 91620962 89561389 88167053 87394759 86503572 85663859 84265369 82247566 80164717 78364479
4391 78364479 76902918 75486409 74150670 72710261 71420916 70216245 69186712 68447453
4383 68447453 68075859 68215863 68388977 68599886 68484486 68145817 67273554 65875823 64365013
$$ packed form
4443G8036940J064461R49704N64864P43939O59978M02385O08939P51708J035685
4434H4818603J271181J325243J598577J065552R90883N60388l13390j313355k358972
4425H7644710k593576k667085l242172l182172k566820k140905j438191j131874
4417F8681915p95662k79871N5960M85009R45802J625157J670902K422503L483166
4408G8294881L882514M066942M014083K790857J622462M7463j432992j665248
4400I1620962k059573j394336p72294q91187q39713j398490k017803k082849j800238
4391G8364479j461561j416509j335739j440409j289345j204671j029533p39259
4383F8447453l71594J40004J73114K10909j15400l38669q72263j397731j510810
$$ plain form
4374 64365013 62839837 61316217 59871177 58628279 57343860 56282774 55322571 54425019
4366 54425019 53439466 52856783 52578969 52433073 52506718 52771066 53200041 53903964 54617166 55041103
4356 55041103 55631908 55917781 56138339 56030782 55347489 54277268 53253922 51868785 50566167
4347 50566167 49245404 48179162 47161501 46307727 45659510 45329224 45095576 45030921 44830910
4338 44830910 44587081 44120098 43820170 43248575 42680102 42138494 41336236 40954612 40458768
4329 40458768 40003630 39655904 39583643 39873513 39944471 40117669 40447237 40675230 40764890 41135009
4319 41135009 41749118 42211624 42693956 42991549 43645306 44324083 45055192 45834106 46654009
4310 46654009 47685316 48813848 49748476 50966428 52180126 53513481 54757699 55669018
$$ packed form
4374F4365013j525176j523620j445040j242898j284419j061086r60203q97552
4366E4425019r85553n82683k77814j45896P3645K64348M28975P03923P13202M23937
4356E5041103N90805K85873K20558j07557o83293j070221j023346j385137j302618
4347E0566167j320763j066242j017661q53774o48217l30286k33648o4655k00011
4338D4830910k43829m66983k99928n71595n68473n41608q02258l81624m95844
4329D0458768m55138l47726p2261K89870P0958J73198L29568K27993Q9660L70119
4319D1135009O14109M62506M82332K97593O53757O78777P31109P78914Q19903
4310D6654009J031307J128532R34628J217952J213698J333355J244218R11319
$$ plain form
4302 55669018 56588023 57553852 58515254 59256586 60401957 61777156 63078600 64869492 66934506
4293 66934506 69382764 72434104 75992258 80078927 84667824 90088319 96638336 103698083
4285 103698083 111685946 120415152 130231092 141984103 155999534 172028968 191240944
4278 191240944 213668468 238373382 262962863 283076345 293961165 291282556 275512372
4271 275512372 251095712 223970571 197835764 174321604 154080871 137118901 122866622
4264 122866622 110694891 100847566 92600206 85616248 79909495 74883405 69926375 65691759
4256 65691759 61984429 58651363 55889912 53285596 50808639 48541566 46497660 44498040
4248 44498040 42562034 41016601 39477431 37868794 36577861 35240142 33939270 33045907
$$ packed form
4302E5669018R19005R65829R61402P41332J145371J375199J301444J790892K065014
4293F6934506K448258L051340L558154M086669M588897N420495O550017P059747
4285A03698083P987863Q729206R815940J1753011J4015431J6029434J9211976
4278A91240944K2427524K4704914K4589481K0113482J0884820k678609j5770184
4271B75512372k4416660k7125141k6134807k3514160k0240733j6961970j4252279
4264A22866622j2171731r847325q247360o983958n706753n026090m957030m234616
4256F5691759l707330l333066k761451k604316k476957k267073k043906j999620
4248D4498040j936006j545433j539170j608637j290933j337719j300872q93363
$$ plain form
4240 33045907 32308708 31733261 31066950 30521534 30310131 30025539 29872789 29810977 29511349 29189432
4230 29189432 28912461 28305836 27474580 26546803 25681862 24953185 24208540 23314773 22481658
4221 22481658 21829139 21155794 20644631 20368553 19895493 19469289 19198225 18999856 18550596
4212 18550596 18383089 18270810 17968714 17755397 17738260 17650020 17808412 17726459 17508828 17586460
4202 17586460 17402105 17353825 17128081 16994387 16891383 16652051 16448880 16081295 15851380 15850101
4192 15850101 15565274 15450490 15260694 15161678 15155876 14973947 14905207 14981748 14608672 14367648
4182 14367648 14348030 14123402 13994019 13728156 13713964 13608527 13531438 13390885 13010624 13045042
4172 13045042 13268804 13047581 12758973 12897700 12892889 12904070 13103124 13012859 13053512 13440861
$$ packed form
4240C3045907p37199n75447o66311n45416k11403k84592j52750o1812k99628l21917
4230B9189432k76971o06625q31256r27777q64941p28677p44645q93767q33115
4221B2481658o52519o73345n11163k76078m73060m26204k71064j98369m49260
4212A8550596j67507j12279l02096k13317j7137q8240J58392q1953k17631P7632
4202A7586460j84355m8280k25744j33694j03004k39332k03171l67585k29915j279
4192A5850101k84827j14784j89796r9016n802j81929o8740P6541l73076k41024
4182A4367648j9618k24628j29383k65863j4192j05437p7089j40553l80261L4418
4172A3045042K23762k21223k88608J38727m811J1181J99054r0265M0653L87349
$$ plain form
4162 13440861 13565055 13801954 13872542 14167274 14401952 14215613 13553835 13237967 13231228 12873198
4152 12873198 12854481 12821966 12654897 12798880 13316786 13270565 13189791 13117844 13275163 13594081
4142 13594081 13774783 14058818 14728867 15242422 15547925 16295626 16501258 16410575 15907886 14985526
4132 14985526 14498315 14384041 14056486 13478327 13313278 13006425 12951901 12941604 13034976 12909173
4122 12909173 12706400 12484815 12322076 12153506 11947489 11696638 11718875 11366928 11240362 11141785
4112 11141785 11047467 10962838 10590270 10418537 10472998 10508328 10474292 10605051 10490456 10406155
4102 10406155 10438998 10321089 10642305 10563106 10579038 10616058 10486344 10580166 10526599 10524938 10583204
4091 10583204 10616504 10640272 10994703 10971894 11055764 11214780 11070381 11138710 11277967 11333097
$$ packed form
4162A3440861J24194K36899P0588K94732K34678j86339o61778l15868o739l58030
4152A2873198j8717l2515j67069J43983N17906m6221q0774p1947J57319L18918
4142A3594081J80702K84035O70049N13555L05503P47701K05632r0683n02689r22360
4132A4985526m87211j14274l27555n78159j65049l06853n4524j0297R3372j25803
4122A2909173k02773k21585j62739j68570k06017k50851K2237l51947j26566r8577
4112A1141785r4318q4629l72568j71733N4461L5330l4036J30759j14595q4301
4102A0406155L2843j17909L21216p9199J5932L7020j29714R3822n3567j661N8266
4091A0583204L3300K3768L54431k2809Q3870J59016j44399O8329J39257N5130
$$ plain form
4081 11333097 11459532 11645989 11506995 11612006 11517953 11770160 12415332 12378128 12472024 12643414
4071 12643414 12864554 12829914 13115972 13260562 13365950 13566810 13729267 13954659 14188396 14108864
4061 14108864 14347521 14609380 15070185 15188576 15374532 15535636 16040289 16675142 17177831
4052 17177831 17504985 17983497 18613180 19212588 19606040 19866371 20020350 20156899 20285623
4043 20285623 20222812 20223298 20179311 19957983 20123659 20560880 20529804 20535234 20885823 20913987 21004090
4032 21004090 21333864 21677618 21895064 22091648 22609482 22968942 23493093 24108239 24618639
4023 24618639 25036885 25286328 25787798 26312500 26888426 27614943 28152209 28782821 29713548
4014 29713548 30629496 30885261 31283166 31602062 32465555 33213888 33921545 34787592 35155461
$$ packed form
4081A1333097J26435J86457j38994J05011r4053K52207O45172l7204R3896J71390
4071A2643414K21140l4640K86058J44590J05388K00860J62457K25392K33737p9532
4061A4108864K38657K61859M60805J18391J85956J61104N04653O34853N02689
4052A7177831L27154M78512O29683N99408L93452K60331J53979J36549J28724
4043B0285623o2811M86m3987k21328J65676M37221l1076N430L50589K8164R0103
4032B1004090L29774L43754K17446J96584N17834L59460N24151O15146N10400
4023B4618639M18246K49443N01470N24702N75926P26517N37266O30612R30727
4014B9713548R15948K55765L97905L18896Q63493P48333P07657Q66047L67869
$$ plain form
4005 35155461 36154045 37239978 38239007 39343865 40471244 41475767 42597792 43854067
3997 43854067 44931867 46058427 46745256 47745352 48773930 49645413 49980403 50175595 50131319
3988 50131319 49944056 49690967 49455282 49397443 49282100 49244797 49137220 48992603 49063445 49123237
3978 49123237 49208955 49438163 49710061 50095467 50440679 50590335 50786775 51157477 51782133 52248137
3968 52248137 52472495 52531316 52540419 52861402 52905644 52976384 53258426 53567137 54143988 54466238
3958 54466238 54914929 55201699 55613027 55962275 56729613 57485184 58134771 59227183 60496246
3949 60496246 61853780 63085364 64620260 66143114 67884847 69425589 71567871 73448839
3941 73448839 75712490 78057026 80224925 82651948 85048237 87250372 89895378 92592098
$$ packed form
4005C5155461R98584J085933R99029J104858J127379J004523J122025J256275
3997D3854067J077800J126560O86829J000096J028578Q71483L34990J95192m4276
3988E0131319j87263k53089k35685n7839j15343l7303j07577j44617P0842N9792
3978D9123237Q5718K29208K71898L85406L45212J49656J96440L70702O24656M66004
3968E2248137K24358N8821R103L20983M4242P0740K82042L08711N76851L22250
3958E4466238M48691K86770M11328L49248P67338P55571O49587J092412J269063
3949F0496246J357534J231584J534896J522854J741733J540742K142282J880968
3941G3448839K263651K344536K167899K427023K396289K202135K645006K696720
$$ plain form
3933 92592098 95426503 98359675 101028520 104006917 106747473 109323287 111907794 114368287
3925 114368287 116752894 119026712 121147858 123220332 124921574 126516442 128325676 129779951
3917 129779951 131242417 132440246 133262635 133538753 133567804 133532090 132904599 132086738 131120845
3908 131120845 129704077 127908352 126023462 124322278 122669258 120603005 118391112 116008075
3900 116008075 113803783 111036418 108063255 104991224 101852379 98505441 94927173 91708212
3892 91708212 88310155 85231357 81839628 78303969 75348220 72280928 69433832 66210861
3884 66210861 63432456 60764136 57941671 55302119 52865100 50389597 47857540 45399923
3876 45399923 43070496 41169605 39302878 37518287 36103160 34722307 33001918 31559260
$$ packed form
3933I2592098K834405K933172K668845K978397K740556K575814K584507K460493
3925A14368287K384607K273818K121146K072474J701242J594868J809234J454275
3917A29779951J462466J197829Q22389K76118K9051l5714o27491q17861r65893
3908A31120845j416768j795725j884890j701184j653020k066253k211893k383037
3900A16008075k204292k767365k973163l072031l138845l346938l578268l218961
3892I1708212l398057l078798l391729l535659k955749l067292k847096l222971
3884F6210861k778405k668320k822465k639552k437019k475503k532057k457617
3876D5399923k329427j900891j866727j784591j415127j380853j720389j442658
$$ plain form
3868 31559260 30141302 28907136 27972259 26802642 25640820 24737452 23994955 23081449 22147975
3859 22147975 21717565 20942697 20192400 19828445 19139577 18702767 18240973 17826315 17440326
3850 17440326 16995670 16620917 16054969 15919275 15949072 15526172 15115265 14854883 14596906 13954193
3840 13954193 13558787 13412685 13309746 13261613 13094237 13062400 12808999 12586835 12233893 12251482
3830 12251482 12360030 11919576 11771978 11653587 11363105 11110899 11114527 11108151 10972992 10942531
3820 10942531 11109431 11061835 10827322 10402545 10260151 10334955 10212658 10249176 10200676 9821827
3810 9821827 9773589 9854960 9766779 9623810 9640938 9644379 9507783 9644602 9783348 9784806 9769633
3799 9769633 9718530 9509144 9635830 9897263 9822835 9470518 9439599 9543530 9556674 9189127
$$ packed form
3868C1559260j417958j234166r34877j169617j161822r03368p42497r13506r33474
3859B2147975m30410p74868p50297l63955o88868m36810m61794m14658l85989
3850A7440326m44656l74753n65948j35694K9797m22900m10907k60382k57977o42713
3840A3954193l95406j46102j02939m8133j67376l1837k53401k22164l52942J7589
3830A2251482J08548m40454j47598j18391k90482k52206L628o376j35159l0461
3820A0942531J66900m7596k34513m24777j42394P4804j22297L6518m8500l78849
3810I821827m8238Q1371q8181j42969J7128L441j36596J36819J38746J458j5173
3799I769633n1103k09386J26686K61433p4428l52317l0919J03931J3144l67547
$$ plain form
3789 9189127 9226849 9278661 9305720 9476358 9787807 9609048 9336657 9348440 9388097 9208731
3779 9208731 9381270 9384767 9250682 9321053 9379093 9190777 9308355 9390959 9572685 9651980 9714434
3768 9714434 9454573 9367519 9647546 9833937 9969577 10034064 10111584 10302546 10449961 10537378
3758 10537378 10748686 10815989 11106363 10944391 11073587 11270570 11402836 11552778 11729775 11790682
3748 11790682 11936034 11945059 11847840 12244694 12302863 12186458 12435383 12633015 12697010 12550001
3738 12550001 12424309 12418947 12603680 12515005 12637184 12735395 12821709 12807489 13031668 12821734
3728 12821734 12982616 12839779 12637685 12650662 12789135 12921895 12980796 13058770 13168299 13310228
3718 13310228 13212500 13072646 13072764 13442717 13560445 13785250 13915997 14042419 14250549 14694185
$$ packed form
3789I189127L7722N1812K7059J70638L11449j78759k72391J1783L9657j79366
3779I208731J72539L497j34085P0371N8040j88316J17578Q2604J81726P9295O2454
3768I714434k59861q7054K80027J86391J35640O4487P7520J90962J47415Q7417
3758A0537378K11308O7303K90374j61972J29196J96983J32266J49942J76997O0907
3748A1790682J45352R025r7219L96854N8169j16405K48925J97632O3995j47009
3738A2550001j25692n362J84733q8675J22179R8211Q6314j4220K24179k09934
3728A2821734J60882j42837k02094J2977J38473J32760N8901P7974J09529J41929
3718A3310228r7728j39854J18L69953J17728K24805J30747J26422K08130M43636
$$ plain form
3708 14694185 14819449 14628041 14942447 15286875 15593211 16095574 16246244 16360954 16578557
3699 16578557 16737702 16846301 17325445 17872660 18253039 18358926 18727594 18945434 19240250
3690 19240250 19491857 19736971 19911511 20182885 20769080 21036052 21191339 21415709 21888335
3681 21888335 21974813 22342789 22582643 22657720 22664746 23218159 23561077 23696261 23873678 24238019
3671 24238019 24505754 24850612 25301890 25512453 25889108 26381395 26991463 27353593 27776535
3662 27776535 28233422 29009676 29337992 29828844 30474969 30986270 31655314 32388711 33148848
3653 33148848 33858125 34714788 35453092 36265089 37309551 38276935 39175480 40225662 41527954
3644 41527954 42815396 43982264 45071222 46218479 47534207 48624997 49886088 51182082
$$ packed form
3708A4694185J25264j91408L14406L44428L06336N02363J50670J14710K17603
3699A6578557J59145J08599M79144N47215L80379J05887L68668K17840K94816
3690A9240250K51607K45114J74540K71374N86195K66972J55287K24370M72626
3681B1888335Q6478L67976K39854P5077P026N53413L42918J35184J77417L64341
3671B4238019K67735L44858M51278K10563L76655M92287O10068L62130M22942
3662B7776535M56887P76254L28316M90852O46125N11301O69044P33397P60137
3653C3148848P09277Q56663P38304Q11997J044462R67384Q98545J050182J302292
3644D1527954J287442J166868J088958J147257J315728J090790J261091J295994
$$ plain form
3636 51182082 52255060 53549984 55023120 56487194 58254390 59696381 61156996 63056263
3628 63056263 64809941 66390673 67888021 69296146 70878555 72545130 73963376 75135169
3620 75135169 76365389 77554108 78788381 80321690 81655720 82835939 84013012 85359547
3612 85359547 86568751 87776766 88602608 89255262 89951298 90622525 91177030 91870353 92266978
3603 92266978 93189432 93818866 94484494 95157847 95909547 96923071 98007612 99195026 100196387
3594 100196387 101229788 102425419 103863685 105352698 106882920 108728608 110685359 112889148
3586 112889148 115419878 118280077 121349168 124361077 127931630 131213289 134920836 139070890
3578 139070890 142748524 146641282 150431100 154454172 159065701 163361647 167902722 172430710
$$ packed form
3636E1182082J072978J294924J473136J464074J767196J441991J460615J899267
3628F3056263J753678J580732J497348J408125J582409J666575J418246J171793
3620G5135169J230220J188719J234273J533309J334030J180219J177073J346535
3612H5359547J209204J208015Q25842O52654O96036O71227N54505O93323L96625
3603I2266978R22454O29434O65628O73353P51700J013524J084541J187414J001361
3594A00196387J033401J195631J438266J489013J530222J845688J956751K203789
3586A12889148K530730K860199L069091L011909L570553L281659L707547M150054
3578A39070890L677634L892758L789818M023072M611529M295946M541075M527988
$$ plain form
3570 172430710 176889615 181190798 185557667 189658797 193435313 196736911 199838379 202561829
3562 202561829 204976633 207360825 209395904 210895250 212099655 213000137 213462699 213872793
3554 213872793 213507784 212888001 211825096 210221691 208158187 205788161 203424543 200390991
3546 200390991 197054922 194045772 190969273 187637772 184317651 181389105 178548639 175404012
3538 175404012 172663048 170305908 168504314 166522390 165059461 163749267 162765079 162223377
3530 162223377 161838109 161708032 161778617 162138066 162691734 163422756 164278123 165089010 165960230
3521 165960230 167053102 168257161 169329492 170468316 171833640 172586512 173538141 174623237
3513 174623237 175275924 175789261 175627292 175053384 174456492 173046210 171102830 168937163 166605503
$$ packed form
3570A72430710M458905M301183M366869M101130L776516L301598L101468K723450
3562B02561829K414804K384192K035079J499346J204405R00482M62562M10094
3554B13872793l65009o19783j062905j603405k063504k370026k363618l033552
3546B00390991l336069l009150l076499l331501l320121k928546k840466l144627
3538A75404012k740964k357140j801594j981924j462929j310194r84188n41702
3530A62223377l85268j30077P0585L59449N53668P31022Q55367Q10887Q71220
3521A65960230J092872J204059J072331J138824J365324P52872R51629J085096
3513A74623237O52687N13337j61969n73908n96892j410282j943380k165667k331660
$$ plain form
3504 166605503 163788622 160529563 157137939 153686809 150132417 146559659 143084278 139400715
3496 139400715 135555239 132220366 128670868 124865264 121371143 117816968 114177589 110966084
3488 110966084 107474772 104138768 101070754 98222880 95513266 92898618 90538089 88622246
3480 88622246 86908723 85454982 84419264 83471015 82758804 82471377 82090386 81871195 81759672
3471 81759672 81725546 81606748 81314342 81112588 81142765 80908559 80802574 80812434 80794349 80839308
3461 80839308 80828978 81003485 80910298 81245664 81621673 81386759 81163912 80815034 80382556 79649668
3451 79649668 79080413 78672340 77682753 76817460 75841108 75175523 74667886 74120884 73325693
3442 73325693 72980576 72362344 71634206 71060769 70407561 69414882 68835888 68309397 67799014
$$ packed form
3504A66605503k816881l259059l391624l451130l554392l572758l475381l683563
3496A39400715l845476l334873l549498l805604l494121l554175l639379l211505
3488A10966084l491312l336004l068014k847874k709614k614648k360529j915843
3480H8622246j713523j453741j035718r48249p12211k87427l80991k19191j11523
3471H1759672l4126j18798k92406k01754L0177k34206j05985R860j8085M4959
3461H0839308j0330J74507r3187L35366L76009k34914k22847l48878m32478p32888
3451G9649668n69255m08073r89587q65293r76352o65585n07637n47002p95191
3442G3325693l45117o18232p28138n73437o53208r92679n78994n26491n10383
$$ plain form
3433 67799014 67011029 66262238 65503898 65050094 64451791 64060699 63819223 63358490 63327504 63090540
3423 63090540 63408507 63479265 63422808 63735847 64210722 64445536 64624847 65021881 65779504 66363769
3413 66363769 66885967 67577106 68156203 68929023 69953320 71117698 72245849 73725943 75364413
3404 75364413 76940675 78650406 80789948 83121738 85506375 88317653 91467780 94876313
3396 94876313 98917359 103297899 108007902 113090547 118771594 125050069 132009083 139603457
3388 139603457 147750061 156490667 165986850 176181653 186850828 198145103 209271327
3381 209271327 220933139 232476789 243623638 253924997 263786784 272626802 280421998
3374 280421998 287033950 292016455 295588814 298190590 299488193 299833582 299108662 297386884
$$ packed form
3433F7799014p87985p48791p58340m53804n98303l91092k41476m60733l0986k36964
3423F3090540L17967P0758n6457L13039M74875K34814J79311L97034P57623N84265
3413F6363769N22198O91139N79097P72820J024297J164378J128151J480094J638470
3404G5364413J576262J709731K139542K331790K384637K811278L150127L408533
3396I4876313M041046M380540M710003N082645N681047O278475O959014P594374
3388A39603457Q146604Q740606R496183J0194803J0669175J1294275J1126224
3381B09271327J1661812J1543650J1146849J0301359R861787Q840018P795196
3374B80421998O611952M982505L572359K601776J297603L45389p24920j721778
$$ plain form
3366 297386884 294780509 290652869 285645020 279551564 272568937 264533069 255518602 245533847
3358 245533847 234967710 223794807 212266335 200346930 188426179 176855275 165849272
3351 165849272 155408815 145674167 136265078 127657418 119484084 111812287 105066650 98890600
3343 98890600 93159436 87838641 82980067 78571692 74926622 71325697 68235517 65227753
3335 65227753 62578735 60466863 58438127 56660819 54853045 53257133 51885586 50763282
3327 50763282 49759598 48825499 47821072 46810005 46000591 45303415 44692198 43878410 43209894
3318 43209894 42335613 41870577 41389854 40778575 39952956 39047591 38364123 37782544 37212370
3309 37212370 36634967 36145019 35494845 34587341 33905452 33413327 32664157 31911393 31229971
$$ packed form
3366B97386884k606375m127640n007849o093456o982627q035868r014467r984755
3358B45533847j0566137j1172903j1528472j1919405j1920751j1570904j1006003
3351A65849272j0440457r734648r409089q607660q173334p671797o745637o176050
3343I8890600n731164n320795m858574m408375l645070l600925l090180l007764
3335F5227753k649018k111872k028736j777308j807774j595912j371547j122304
3327E0763282j003684r34099j004427j011067q09414o97176o11217q13788o68516
3318D3209894q74281m65036m80723o11279q25619r05365o83468n81579n70174
3309C7212370n77403m89948o50174r07504o81889m92125p49170p52764o81422
$$ plain form
3300 31229971 30369721 29639645 28976425 28314470 27471610 26622354 25754566 25107411 24327117
3291 24327117 23726685 23171316 22592901 22113584 21230908 20793481 20650541 20455771 19757370
3282 19757370 19476732 19103020 18845812 18587829 18055741 18100892 17854912 17478480 17426220 17275192
3272 17275192 17061471 16791014 16723551 16762814 16437967 16144869 16132313 15967647 15872581 15838174
3262 15838174 15993994 15834923 15719085 15772735 15695487 15659563 15733676 15775389 16049657 16081534
3252 16081534 16009541 16393193 16668967 16747573 16949830 17261372 17280306 17322836 17311262 17119781
3242 17119781 17069684 16673733 16029268 15326287 14486264 14203017 13961090 13395776 13179395 12936551
3232 12936551 12311380 12137809 12139850 11683977 11566701 11562781 11368424 11031509 10856123 10433984
$$ packed form
3300C1229971q60250p30076o63220o61955q42860q49256q67788o47155p80294
3291B4327117o00432n55369n78415m79317q82676m37427j42940j94770o98401
3282A9757370k80638l73712k57208k57983n32088M5151k45980l76432n2260j51028
3272A7275192k13721k70457o7463L9263l24847k93098j2556j64666r5066l4407
3262A5838174J55820j59071j15838N3650p7248l5924P4113M1713K74268L1877
3252A6081534p1993L83652K75774P8606K02257L11542J8934M2530j1574j91481
3242A7119781n0097l95951o44465p02981q40023k83247k41927n65314k16381k42844
3232A2936551o25171j73571K041m55873j17276l920j94357l36915j75386m22139
$$ plain form
3222 10433984 10255221 10286199 10127025 9797731 9663803 9747936 9796189 9397204 9241675 9153235
3212 9153235 9024058 9235787 8892907 8827968 8903716 8814797 8886178 8695953 8584704 8616037
3202 8616037 8505816 8275818 8180291 8208317 8180117 8337564 8283652 8075217 7834991 7717808
3192 7717808 7538802 7372668 7532017 7421697 7295308 7247238 7111339 7157139 7071197 7115131
3182 7115131 6784820 6752155 6655870 6476343 6493706 6342086 6288183 6221226 5987518 6052970 6086203
3171 6086203 5986772 5963824 6158224 6139161 5983627 6034949 6207456 6060056 5793986 5802223 5610422
3160 5610422 5667634 5833644 5557611 5513482 5570522 5298464 5317884 5066988 4966401 4998687
3150 4998687 5127560 5399792 5204930 5112816 4955185 4873143 4804947 4986693 4927293 5119387
$$ packed form
3222A0433984j78763L0978j59174l29294j33928Q4133M8253l98985j55529q8440
3212I153235j29177K11729l42880o4939P5748q8919P1381j90225j11249L1333
3202H616037j10221k29998r5527K8026k8200J57447n3912k08435k40226j17183
3192G717808j79006j66134J59349j10320j26389m8070j35899M5800q5942M3934
3182G115131l30311l2665r6285j79527J7363j51620n3903o6957k33708O5452L3233
3171F086203r9431k2948J94400j9063j55534N1322J72507j47400k66070Q237j91801
3160E610422N7212J66010k76033m4129N7040k72058J9420k50896j00587L2286
3150D998687J28873K72232j94862r2114j57631q2042o8196J81746n9400J92094
$$ plain form
3140 5119387 5059324 4771341 4991183 4805426 4686560 4688076 4764782 4529481 4321839 4196261
3130 4196261 4602010 4626715 4540733 4593984 4675371 4692664 4528051 4481609 4528743 4508099 4470368
3119 4470368 4269517 4398053 4487182 4318069 4489337 4304238 4260311 4263440 4167545 4062848
3109 4062848 3939662 3978310 4079625 4108944 4160969 4495359 4490495 4342684 4370647 4209556 4301781
3098 4301781 4557532 4621152 4552549 4706061 4529812 4508551 4676596 4564595 4393098 4744501
3088 4744501 4719465 4766707 4844788 4774783 4861744 4941605 5067279 4809364 4605203 4527698 4664377
3077 4664377 4632686 4751772 4742660 4686059 4670349 4793171 4761489 4550485 4516151 4459810 4335895
3066 4335895 4269811 4313165 4261326 4257025 4020355 3917396 4012376 4003298 3623008 3684909 3696537
$$ packed form
3140E119387o0063k87983K19842j85757j18866J516P6706k35301k07642j25578
3130D196261M05749K4705q5982N3251Q1387J7293j64613m6442M7134k0644l7731
3119D470368k00851J28536Q9129j69113J71268j85099m3927L129r5895j04697
3109D062848j23186L8648J01315K9319N2025L34390m864j47811K7963j61091R2225
3098D301781K55751O3620o8603J53512j76249k1261J68045j12001j71497L51403
3088D744501k5036M7242P8081p0005Q6961P9861J25674k57915k04161p7505J36679
3077D664377l1691J19086r112n6601j5710J22822l1682k11004l4334n6341j23915
3066D335895o6084M3354n1839m301k36670j02959R4980r078l80290O1901J1628
$$ plain form
3055 3696537 3653420 3427975 3327062 3404082 3663314 3702702 3287501 3172510 3315631 3439740
3045 3439740 3501616 3133407 3138013 3171393 3001375 3160563 3087770 3287309 3446353 3215577
3035 3215577 3288826 3202290 3079214 3283943 3081809 2968342 3118825 2956309 2955598 3019460 2880254
3024 2880254 3065966 3066710 2991314 3070706 3412205 3085095 3116684 2987999 3166595 3320800 3215791
3013 3215791 3190801 3159727 3189268 3194338 3615302 3603770 3263116 3169395 3447151 3526462 3311589
3002 3311589 3427700 3644843 3367235 3294054 3501255 3458137 3554313 3474282 3580008 3461885
2992 3461885 3438950 3388361 3547140 3287330 3081651 3249784 3262352 3048845 2931001 3071651
2982 3071651 2994755 3236730 3402907 3487233 3520352 3600983 3619834 3519482 3683188 3775061 3755133
$$ packed form
3055C696537m3117k25445j00913P7020K59232L9388m15201j14991J43121J24109
3045C439740O1876l68209M606L3380j70018J59188p2793J99539J59044k30776
3035C215577P3249q6536j23076K04729k02134j13467J50483j62516p11O3862j39206
3024B880254J85712P44p5396P9392L41499l27110L1589j28685J78596J54205j05009
3013C215791k4990l1074K9541N070M20964j1532l40654r3721K77756P9311k14873
3002C311589J16111K17143k77608p3181K07201m3118R6176q0031J05726j18123
2992C461885k2935n0589J58779k59810k05679J68133J2568k13507j17844J40650
2982C071651p6896K41975J66177Q4326L3119Q0631J8851j00352J63706R1873j9928
$$ plain form
2971 3755133 3726444 3910369 4128833 4278120 4265408 4300002 4344279 4254292 4257733 4199025 4103346
2960 4103346 3986824 4011849 3848450 3815862 3576920 3656207 3592431 3690432 3663601 3275203 3177519
2949 3177519 3232086 3193308 3097931 2983808 3104232 3041181 3098670 3365320 3392496 3493707 3600871
2938 3600871 3759376 3536823 3760991 3788924 3895681 3999210 3989039 4070638 4064792 4156109 3899370
2927 3899370 3718990 3886879 3934934 3830978 3817781 3687982 3685020 3532253 3185660 3157378
2917 3157378 3465196 3375486 3354870 3076488 3015840 3031284 3116017 3139158 3167357 3277876 3247426
2906 3247426 3430640 3479569 3384017 3304041 3392992 3338276 3229528 3099248 2955246 2976225 2892542
2895 2892542 3022277 3093043 3132306 2958086 2977671 3009776 2854185 2940531 3048001 2991194 3019620
$$ packed form
2971C755133k8689J83925K18464J49287j2712L4594M4277q9987L441n8708r5679
2960D103346j16522K5025j63399l2588k38942P9287o3776R8001k6831l88398r7684
2949C177519N4567l8778r5377j14123J20424o3051N7489K66650K7176J01211J07164
2938C600871J58505k22553K24168K7933J06757J03529j0171Q1599n846R1317k56739
2927C899370j80380J67889M8055j03956j3197j29799k962j52767l46593k8282
2917C157378L07818q9710k0616k78382o0648J5444Q4733K3141K8199J10519l0450
2906C247426J83214M8929r5552p9976Q8951n4716j08748j30280j44002K0979q3683
2895B892542J29735P0766L9263j74220J9585L2105j55591Q6346J07470n6807K8426
$$ plain form
2884 3019620 2945919 2922582 3036536 2998495 3283279 3187557 2988504 3101254 2925093 2784763
2874 2784763 2768444 2756699 2716870 2745562 2909293 3001439 2918941 2913403 2952660 2767785 2812074
2863 2812074 2901733 2802561 2818971 2623899 2722997 2631925 2441174 2491895 2726114 2852055 2783400
2852 2783400 2471543 2284958 2425930 2182502 2203500 2246840 2228099 2386183 2171843 1923868
2842 1923868 1886513 1867799 1934856 1778021 1788893 1892855 2086479 1962017 1894222 1916408 1898898
2831 1898898 1764451 1732004 1672965 1694423 1864355 1855215 1822103 1868549 1636965 1470006 1362848
2820 1362848 1567064 1671880 1503963 1483870 1806572 2032817 1908348 1702443 1470063 1388509
2810 1388509 1483476 1443751 1466924 1592128 1407025 1405695 1163821 1080241 1077772 1181147 1254098
$$ packed form
2884C019620p3701k3337J13954l8041K84784r5722j99053J12750j76161j40330
2874B784763j6319j1745l9829K8692J63731R2146q2498n538L9257j84875M4289
2863B812074Q9659r9172J6410j95072R9098r1072j90751N0721K34219J25941o8655
2852B783400l11857j86585J40972k43428K0998M3340j8741J58084k14340k47975
2842A923868l7355j8714O7057j56835J0872J03962J93624j24462o7795K2186j7510
2831A898898j34447l2447n9039K1458J69932r140l3112M6446k31584j66959j07158
2820A362848K04216J04816j67917k0093L22702K26245j24469k05905k32380q1554
2810A388509R4967l9725K3173J25204j85103j330k41874q3580k469J03375P2951
$$ plain form
2799 1254098 1228881 1206642 1261921 1233110 1079659 1068270 1039834 1105363 1331548 1455742 1109501
2788 1109501 1191084 945384 1075355 1203828 1314333 1388211 1264367 1060757 1099711 1356577
2778 1356577 1088763 1011810 1235521 1001315 1034597 1099676 993972 1078854 1170441 1034502
2768 1034502 942541 1029801 1169936 1038758 1031681 1152102 1249601 1178849 1201508 1287457 1011184
2757 1011184 1064747 1107571 1242217 1138901 965198 999683 1126622 1076591 887873 830139
2747 830139 727374 620318 918684 939230 958946 803955 822851 732017 884181 968374 881820
2736 881820 934043 1099518 1080284 1012619 1030175 992889 1051748 1029423 922671 963554 983920
2725 983920 911123 734313 781258 1159384 985787 842778 1205865 1307215 1101170 982642
$$ packed form
2799A254098k5217k2239N5279k8811j53451j1389k8436O5529K26185J24194l46241
2788A109501Q1583k45700J29971J28473J10505P3878j23844k03610L8954K56866
2778A356577k67814p6953K23711k34206L3282O5079j05704Q4882R1587j35939
2768A034502r1961Q7260J40135j31178p077J20421R7499p0752K2659Q5949k76273
2757A011184N3563M2824J34646j03316j73703L4485J26939n0031j88718n7734
2747H30139j02765j07056K98366K0546J9716j54991J8896r0834J52164Q4193q6554
2736H81820N2223J65475j9234o7665J7556l7286N8859k2325j06752M0883K0366
2725I83920p2797j76810M6945L78126j73597j43009L63087J01350k06045j18528
$$ plain form
2715 982642 947928 977107 1029361 773831 710517 844609 893179 600960 656884 615225 851558
2704 851558 932448 987247 818866 640410 726844 763393 906472 837307 781181 871464 730632
2693 730632 663532 702541 607820 590640 709272 864279 823614 1001682 972437 707067 786156
2682 786156 1099699 890777 636305 626300 640455 725305 671516 834863 886264 750652 1143420
2671 1143420 1074121 1081188 922890 899607 965223 752716 674767 907037 999389 1298719 1196766
2660 1196766 910853 980729 841618 948436 1056156 901786 994640 816726 913809 1063451
2650 1063451 1104645 835585 943326 1090385 1077445 1016085 930109 998105 904488 754697 889884
2639 889884 976383 805591 1048903 1181029 1286476 911131 813855 1105035 1170843 1183589
$$ packed form
2715I82642l4714K9179N2254k55530o3314J34092M8570k92219N5924m1659K36333
2704H51558Q0890N4799j68381j78456Q6434L6549J43079o9165n6126R0283j40832
2693G30632o7100L9009r4721j7180J18632J55007m0665J78068k9245k65370P9089
2682G86156L13543k08922k54472j0005J4155Q4850n3789J63347N1401j35612L92768
2671A143420o9299P067j58298k3283O5616k12507p7949K32270R2352K99330j01953
2660A196766k85913O9876j39111J06818J07720j54370R2854j77914R7083J49642
2650A063451M1194k69060J07741J47059j2940o1360q5976O7996r3617j49791J35187
2639H89884Q6499j70792K43312J32126J05447l75345r7276K91180O5808J2746
$$ plain form
2629 1183589 1267861 1366797 1357127 1223941 1184246 1255069 1219615 1360215 1266117 1207931 1268659
2618 1268659 1192224 1237205 1178765 1020030 1202710 1265212 1236626 1290036 975864 953361 1062458
2607 1062458 1072574 873953 1100942 1119511 1080585 1244288 1276983 1210831 1450286 1239860
2597 1239860 1246397 1308106 1299446 1339642 1110635 1198697 1321704 1174053 1187037 1190167 1180117
2586 1180117 1290904 1173982 1259174 1250005 1395231 1304376 1201988 1237556 1117988 1182216 1358123
2575 1358123 1186659 1125597 869661 793703 890825 982554 894890 859485 1059891 1109370 1119452
2564 1119452 1192646 1080279 930851 996036 991044 1075854 929435 1169410 1207984 1124133 1170055
2553 1170055 1045778 1056627 1187328 1122127 1237054 1120801 952066 972663 866030 914340
$$ packed form
2629A183589Q4272R8936r670j33186l9695P0823l5454J40600r4098n8186O0728
2618A268659p6435M4981n8440j58735J82680O2502k8586N3410l14172k2503J09097
2607A062458J0116j98621K26989J8569l8926J63703L2695o6152K39455k10426
2597A239860O537O1709q660M0196k29007Q8062J23007j47651J2984L130j0050
2586A180117J10787j16922Q5192r169J45226r0855j02388L5568j19568O4228J75907
2575A358123j71464o1062k55936p5958R7122R1729q7664l5405K00406M9479J0082
2564A119452P3194j12367j49428O5185m992Q4810j46419K39975L8574q3851M5922
2553A170055j24277J0849J30701o5201J14927j16253j68735K0597j06633M8310
$$ plain form
2543 914340 799452 697261 580523 913164 1027496 940285 805535 888408 944991 981844
2533 981844 948816 920424 1000538 907250 986612 862309 866216 813925 803778 835078 561791
2522 561791 717427 1146066 658326 417530 641693 845699 733175 715372 769491 637366
2512 637366 842503 856577 683562 553268 725293 656234 403004 517755 771767 915705
2502 915705 690558 531981 633215 319095 305017 312473 483208 274687 437395 521624
2492 521624 486203 370741 367257 258824 123150 259555 115537 174880 141242 317190 332615
2481 332615 486995 608282 538127 388996 482971 316436 171501 264936 433780 344542
2471 344542 429857 560452 499041 260877 194525 193352 170994 337789 350698 275932 95374
$$ packed form
2543I14340j14888j02191j16738L32641J14332q7211j34750Q2873N6583L6853
2533I81844l3028k8392Q0114r3288P9362j24303L907n2291j0147L1300k73287
2522E61791J55636M28639m87740k40796K24163K04006j12524j7803N4119j32125
2512F37366K05137J4074j73015j30294J72025o9059k53230J14751K54012J43938
2502I15705k25147j58577J01234l14120j4078P456J70735k08521J62708Q4229
2492E21624l5421j15462l484j08433j35674J36405j44018N9343l3638J75948J5425
2481C32615J54380J21287p0155j49131R3975j66535j44935R3435J68844q9238
2471C44542Q5315J30595o1411k38164o6352j173k2358J66795J2909p4766j80558
$$ plain form
2460 95374 284461 432191 250058 307100 457161 221630 4757 147113 240447 309119
2450 309119 380977 209115 -31904 -274459 -90853 59471 154825 110963 231849 196479
2440 196479 -33614 58746 89357 59494 255371 426241 376624 352056 461599 314820 244483
2429 244483 312288 309919 460005 366207 411756 150943 258827 393382 406791 437651 288056
2418 288056 163784 379152 213462 261235 225659 219912 255185 77572 7471 79372 21161
2407 21161 301597 211218 77825 161212 201519 404994 291003 411302 273615 139152
2397 139152 139680 291184 248990 252024 128839 -30512 -10427 5186 226470 248235 258955
2386 258955 76609 104693 224336 91596 394071 429694 393352 369276 413283 378353 379889
$$ packed form
2460I5374J89087J47730j82133N7042J50061k35531k16873J42356R3334O8672
2450C09119P1858j71862k41019k42555J83606J50324R5354m3862J20886l5370
2440A96479k30093R2360L0611k9863J95877J70870m9617k4568J09543j46779p0337
2429B44483O7805k369J50086r3798M5549k60813J07884J34555J3409L0860j49595
2418B88056j24272K15368j65690M7773l5576n747L5273j77613p0101P1901n8211
2407B1161K80436r0379j33393Q3387M0307K03475j13991J20299j37687j34463
2397A39152N28J51504m2194L034j23185j59351K0085J5613K21284K1765J0720
2386B58955j82346K8084J19643j32740L02475L5623l6342k4076M4007l4930J536
$$ plain form
2375 379889 341945 192137 511936 696477 762512 512656 350307 261959 80790 257501
2365 257501 116083 -104506 -76375 -4792 207257 306349 280177 169840 290293 436650
2355 436650 260489 -44540 -114201 118865 48567 312869 329192 212561 12022 326696
2345 326696 572007 517265 475704 598234 301350 167853 206682 155749 62612 153299 154874
2334 154874 -7201 237991 379256 214070 151540 294123 345703 229289 247936 191959
2324 191959 148769 269896 395798 324979 427185 149773 208663 215203 83190 425656 426421
2313 426421 418596 317506 207984 512632 451718 290299 409982 171905 68389 415658
2303 415658 487566 529691 557877 340525 157404 -8122 -115967 -37802 193495 246351 240564
$$ packed form
2375C79889l7944j49808L19799J84541O6035k49856j62349q8348j81169J76711
2365B57501j41418k20589K8131P1583K12049R9092k6172j10337J20453J46357
2355D36650j76161l05029o9661K33066p0298K64302J6323j16631k00539L14674
2345C26696K45311n4742m1561J22530k96884j33497L8829n0933r3137R0687J575
2334A54874j62075K45192J41265j65186o2530J42583N1580j16414J8647n5977
2324A91959m3190J21127J25902p0819J02206k77412N8890O540j32013L42466P65
2313D26421p825j01090j09522L04648o0914j61419J19683k38077j03516L47269
2303D15658P1908M2125K8186k17352j83121j65526j07845P8165K31297N2856n787
$$ plain form
2292 240564 119074 128736 325660 470721 238080 288982 347977 379661 341996 508367 293537
2281 293537 237427 155574 114982 314563 285911 25756 175382 339554 511713 524739 587751
2270 587751 362637 284627 243927 544133 490055 335732 538625 717969 678639 583125 430046
2259 430046 219967 282620 278151 382035 410078 197583 214289 270467 333580 306657 434563
2248 434563 376800 152855 389520 388111 574802 788463 479021 275636 183123 154881 126596
2237 126596 91561 225382 503292 487170 389515 459715 412314 274745 286416 594491 525931
2226 525931 362281 488500 502383 362689 313857 241172 264392 242922 415815 533004 496089
2215 496089 377647 828432 717209 637332 587079 610918 827438 832827 787828 822781 860586
$$ packed form
2292B40564j21490R662J96924J45061k32641N0902N8995L1684l7665J66371k14830
2281B93537n6110q1853m0592J99581k8652k60155J49626J64172J72159J3026O3012
2270E87751k25114p8010m0700L00206n4078j54323K02893J79344l9330r5514j53079
2259D30046k10079O2653m469J03884K8043k12495J6706N6178O3113k6923J27906
2248D34563n7763k23945K36665j409J86691K13661l09442k03385r2513k8242k8285
2237A26596l5035J33821K77910j6122r7655P0200m7401j37569J1671L08075o8560
2226E25931j63650J26219J3883j39694m8832p2685K3220k1470J72893J17189l6915
2215D96089j18442M50785j11223p9877n0253K3839K16520N389m4999L4953L7805
$$ plain form
2204 860586 796127 650280 722130 685782 644198 940287 949670 861622 961843 1284473 1084349
2193 1084349 918395 1149281 1072785 1202287 1169670 1005793 980483 1174866 1327645 1579339
2183 1579339 1576535 1703022 1767887 1886828 1697695 1607202 1787001 1577146 1556353 1453598
2173 1453598 1644920 1911754 1834672 1775897 2041588 1973171 2097121 2257214 2286413 2235398
2163 2235398 2045857 2153808 2289844 2478104 2488620 2681046 2659351 2568729 2669537 2890334
2153 2890334 2987776 3017781 3205501 3142717 3203152 3384152 3601293 3639043 3813114 4045507
2143 4045507 4189032 4426009 4646436 4908674 5168457 5515121 5448007 5400746 5579377 5777343
2133 5777343 5892475 6037381 6262166 6626051 7017110 7556968 7831572 8190502 8889502 9411097
$$ packed form
2204H60586o4459j45847P1850l6348m1584K96089R383q8048J00221L22630k00124
2193A084349j65954K30886p6496J29502l2617j63877k5310J94383J52779K51694
2183A579339k804J26487O4865J18941j89133r0493J79799k09855k0793j02755
2173A453598J91322K66834p7082n8775K65691o8417J23950J60093K9199n1015
2163B235398j89541J07951J36036J88260J0516J92426k1695r0622J00808K20797
2153B890334R7442L0005J87720o2784O0435J81000K17141L7750J74071K32393
2143D045507J43525K36977K20427K62238K59783L46664o7114m7261J78631J97966
2133E777343J15132J44906K24785L63885L91059N39858K74604L58930O99000N21595
$$ plain form
2123 9411097 10293585 11071175 12299664 13228565 13743457 14684112 16041774 17707237 19302615
2114 19302615 21080625 23205503 26128560 30264413 36372713 44496876 56963683 72051160
2106 72051160 86297293 90796363 76827472 57619034 44411870 36145837 29745124 24744118
2098 24744118 20954988 18015767 15717690 14115721 13088546 12253795 11896559 11244352 10487598
2089 10487598 9784463 8664820 8234353 7697389 7358614 6882855 6441756 5897678 5694752
2080 5694752 5340932 5082272 4683887 4362075 4129323 3719832 3466724 3116558 3404406 3184776
2070 3184776 2889052 2981564 2927335 2796512 2671524 2587950 2413294 2555512 2421280 2487145
2060 2487145 2784004 2531086 2363160 2158783 2136935 2155020 1897514 1793864 1729794 1333433
$$ packed form
2123I411097Q82488P77590J228489R28901N14892R40655J357662J665463J595378
2114A9302615J778010K124878K923057M135853O108300Q124163J2466807J5087477
2106G2051160J4246133M499070j3968891j9208438j3207164q266033o400713n001006
2098B4744118l789130k939221k298077j601969j027175q34751l57236o52207p56754
2089A0487598p03135j119643m30467n36964l38775m75759m41099n44078k02926
2080E694752l53820k58660l98385l21812k32752m09491k53108l50166K87848k19630
2070C184776k95724R2512n4229j30823j24988q3574j74656J42218j34232O5865
2060B487145K96859k52918j67926k04377k1848J8085k57506j03650o4070l96361
$$ plain form
2050 1333433 1539927 1601058 1669870 1541150 1560195 1223255 1201442 1258616 1084478 1054004 1143155
2039 1143155 1200711 1149791 1134377 933101 992276 890669 629283 721764 675382 521959 462032
2028 462032 836311 883097 967806 751408 545868 645202 895887 772077 718303 778252 892044
2017 892044 795581 622945 674163 414027 546851 678858 530094 519280 536726 530450 414395
2006 414395 547032 666729 332721 577029 558577 165950 170380 476690 390186 330341 558035
1995 558035 601983 774285 697074 792613 673092 670038 583510 418068 447207 325366 259545
1984 259545 184660 295684 501145 447292 561074 669414 622212 511693 316397 384534
1974 384534 329443 447327 362395 316607 479903 457319 534767 416478 301302 378048 312868
$$ packed form
2050A333433K06494O1131O8812j28720J9045l36940k1813N7174j74138l0474Q9151
2039A143155N7556n0920j5414k01276N9175j01607k61386R2481m6382j53423n9927
2028D62032L74279M6786Q4709k16398k05540R9334K50685j23810n3774N9949J13792
2017H92044r6463j72636N1218k60136J32824J32007j48764j0814J7446o276j16055
2006D14395J32637J19697l34008K44308j8452l92627M430L06310q6504n9845K27694
1995E58035M3948J72302p7211R5539j19521l054q6528j65442K9139j21841o5821
1984B59545p4885J11024K05461n3853J13782J08340m7202j10519j95296O8137
1974C84534n5091J17884q4932m5788J63296k2584P7448j18289j15176P6746o5180
$$ plain form
1963 312868 207883 224090 423784 333013 426752 575138 465407 338184 468055 246051
1953 246051 266155 309518 363054 196792 46896 224405 175467 -16205 4330 167833 231947
1942 231947 126777 207611 112131 52495 186500 93307 46867 -160593 107169 272286 166547
1931 166547 539647 435376 332635 358769 296662 189390 -43638 -144071 17118 53054
1921 53054 44088 155708 146499 148998 39370 -7050 -158573 -196443 69709 146085 173076 49057
1909 49057 34362 7263 -104157 -20244 321598 281743 220991 144676 59681 64678 -47995
1898 -47995 -135795 -181746 31509 301347 178943 258559 -19776 -65976 194584 109140 95055
1887 95055 159409 -105085 -58723 126772 488234 342807 8957 234947 95682 303623
$$ packed form
1963C12868j04985J6207J99694r0771R3739J48386j09731j27223J29871k22004
1953B46051K0104M3363N3536j66262j49896J77509m8938j91672K0535J63503O4114
1942B31947j05170Q0834r5480n9636J34005r3193m6440k07460K67762J65117j05739
1931A66547L73100j04271j02741K6134o2107j07272k33028j00433J61189L5936
1921E3054q966J11620r209K499j09628m6420j51523l7870K66152P6376K6991j24019
1909D9057j4695k7099j11420Q3913L41842l9855o0752p6315q4995M997j12673
1898d7995q7800m5951K13255K69838j22404P9616k78335m6200K60560q5444j4085
1887I5055O4354k64494M6362J85495L61462j45427l33850K25990j39265K07941
$$ plain form
1877 303623 367376 241628 292696 182463 -46068 -69389 106477 24760 -20167 -176392 -322283
1866 -322283 -256142 -86906 176213 -14825 129260 143018 -25389 -128548 67857 -30758
1856 -30758 80737 -15542 -104683 -255150 -101153 -138155 30036 62421 27583 76780 264815
1845 264815 -41208 -92829 33671 221521 362408 101468 133763 499187 675174 593425
1835 593425 702368 598539 310346 183574 -37811 97604 151550 70905 396214 189041
1825 189041 99769 215700 -113748 33307 301718 232982 15487 70669 -227261 -249077
1815 -249077 -113406 -87432 34839 -313051 -338143 -187037 -95404 16043 -106540 -90129
1805 -90129 -78442 -3933 -72167 -122996 66898 222188 104983 -60609 46408 -12816 -6718
$$ packed form
1877C03623O3753j25748N1068j10233k28531k3321J75866q1717m4927j56225j45891
1866c22283O6141J69236K63119j91038J44085J3758j68407j03159J96405r8615
1856c0758J11495r6279q9141j50467J53997l7002J68191L2385l4838M9197J88035
1845B64815l06023n1621J26500J87850J40887k60940L2295L65424J75987q1749
1835E93425J08943j03829k88193j26772k21385J35415N3946q0645L25309k07173
1825A89041q9272J15931l29448J47055K68411o8736k17495N5182k97930k1816
1815b49077J35671K5974J22271l47890k5092J51106R1633J11447j22583J6411
1805i0129J1687P4509o8234n0829J89894J55290j17205j65592J07017n9224O098
$$ plain form
1794 -6718 106172 57686 -23717 23866 -102021 110824 95964 198981 -97318 12223 53521
1783 53521 129077 38760 -4409 -229117 -262957 -223445 -264922 -340192 -72347 12766 99988
1772 99988 188039 107816 8678 79296 151189 -42646 -153808 55324 -28303 -184441 -98107
1761 -98107 -68611 -91769 -145102 -171445 -84434 -294766 -207526 -67336 -43025 -117059 71067
1750 71067 -84457 -126673 -73317 -391276 -190654 61317 47349 -45063 -172318 -293290 96432
1739 96432 179211 61414 -109883 15417 142332 -50156 57212 110321 30448 -13924 -68187
1728 -68187 81589 -253287 -337757 -133741 40471 -84951 3316 -74087 44129 95653 45402
1717 45402 237800 260096 195344 100331 95062 210324 125813 -66947 22339 -119004 32497
$$ packed form
1794f718J12890m8486q1403M7583j25887K12845j4860J03017k96299J09541M1298
1783E3521P5556r0317m3169k24708l3840L9512m1477p5270K67845Q5113Q7222
1772I9988Q8051q0223r9138P0618P1893j93835j11162K09132q3627j56138Q6334
1761i8107K9496k3158n3333k6343Q7011k10332Q7240J40190K4311p4034J88126
1750G1067j55524m2216N3356l17959K00622K51971j3968r2412j27255j20972L89722
1739I6432Q2779j17797j71297J25300J26915j92488J07368N3109p9873m4372n4263
1728f8187J49776l34876q4470K04016J74212j25422Q8267p7403J18216N1524n0251
1717D5402J92398K2296o4752r5013n269J15262q4511j92760Q9286j41343J51501
$$ plain form
1706 32497 45478 -218464 -61577 105936 3646 -130961 -173433 -78785 -157484 -206806 -125972
1695 -125972 -40304 -122768 -395167 -467285 -456995 -206701 -43226 33260 -90529 -268086 -218203
1684 -218203 -155910 -351389 -223837 40944 193282 -138073 -206391 187674 109773 -121635
1674 -121635 -120300 105483 -16042 -45529 -92659 -163728 -21962 -7875 -74913 -53781 -335917
1663 -335917 -379800 -228488 -239735 -172373 -232304 -211906 -344351 -131788 -106217 -160877 -412438
1652 -412438 -336783 -298227 -45691 146119 118791 -34410 -109924 -175233 -130497 -99617 -188063
1641 -188063 -301265 -211508 -161839 23025 -67234 -279466 -182145 -249107 -261900 -83438 -100824
1630 -100824 -51424 53409 -203832 -288204 -231805 -83748 -83419 -13400 -220519 -249628 -203199
$$ packed form
1706C2497J2981k63942J56887J67513j02290j34607m2472R4648p8699m9322Q0834
1695a25972Q5668q2464k72399p2118J0290K50294J63475P6486j23789j77557M9883
1684b18203O2293j95479J27552K64781J52338l31355o8318L94065p7901k31408
1674a21635J335K25783j21525k9487m7130p1069J41766J4087o7038K1132k82136
1663c35917m3883J51312j1247O7362n9931K0398j32445K12563K5571n4660k51561
1652d12438P5655L8556K52536J91810k7328j53201p5514o5309M4736L0880q8446
1641a88063j13202Q9757M9669J84864r0259k12232R7321o6962j2793J78462j7386
1630a00824M9400J04833k57241q4372N6399J48057L29P0019k07119k9109M6429
$$ plain form
1619 -203199 135968 179428 257348 131753 32014 118525 -75160 -100135 -114279 -140082 -189920
1608 -189920 -209287 -90497 13861 -165850 -216925 -105019 -132163 -255839 -156950 -330508
1598 -330508 -365440 17000 -73413 184555 249602 12456 34535 -3272 -93588 16548 -103463
1587 -103463 -243964 -182700 -38716 -51510 -107009 146572 71303 -284112 -153025 -194469 -97136
1576 -97136 -178445 -100937 -44117 -85308 -40144 40619 54181 77052 -46634 -240531 -164284
1565 -164284 -293951 -106811 -9349 3026 159194 83283 16763 -84375 -144789 -43587 208986
1554 208986 171499 117930 107563 43365 -70809 -92236 -27745 -246036 -212105 37658 -147068
1543 -147068 -329599 -97721 -183311 -24093 -154119 -177888 -20408 -33114 105152 -94254
$$ packed form
1619b03199L39167M3460P7920j25595r9739Q6511j93685k4975j4144k5803m9838
1608a89920j9367J18790J04358j79711n1075J11906k7144j23676R8889j73558
1598c30508l4932L82440r0413K57968O5047k37146K2079l7807r0316J10136j20011
1587a03463j40501O1264J43984j2794n5499K53581p5269l55415J31087m1444R7333
1576i7136q1309P7508N6820m1191M5164Q0763J3562K2871j23686j93897P6247
1565a64284j29667J87140R7462J2375J56168p5911o6520j01138o0414J01202K52573
1554B08986l7487n3569j0367o4198j14174k1427O4491k18291L3931K49763j84726
1543a47068j82531K31878q5590J59218j30026k3769J57480j2706J38266j99406
$$ plain form
1533 -94254 -73763 -63332 -142179 -104121 -206441 104859 27345 75127 317125 324988 93356
1522 93356 -15582 74216 -38003 -61449 -83446 -73836 -376653 -526551 -294084 -53381 -71691
1511 -71691 118074 120352 47163 18748 -58069 -52854 57794 -168174 -224824 -317838 -199984
1500 -199984 -150519 -297688 -256356 -306043 -213538 -16328 -3370 50092 -291661 -322536 -96958
1489 -96958 -363462 -245910 -169350 99645 -57892 -132915 -54679 -20600 69949 -37766 -98569
1478 -98569 -13387 -13082 -33257 70912 15688 31939 268940 -13190 -151932 -211857 -233868
1467 -233868 -222798 -38774 -135354 -168839 -100956 -81012 155773 197604 222387 -52955 -113376
1456 -113376 -36246 -170802 -26096 -219685 -195390 -116204 -226783 -93314 -234425 -372448
$$ packed form
1533i4254K0491J0431p8847L8058j02320L11300p7514M7782K41998P863k31632
1522I3356j08938Q9798j12219k3446k1997R610l02817j49898K32467K40703j8310
1511g1691J89765K278p3189k8415p6817N215J10648k25968n6650r3014J17854
1500a99984M9465j47169M1332m9687R2505J97210J2958N3462l41753l0875K25578
1489i6958k66504J17552P6560K68995j57537p5023P8236L4079R0549j07715o0803
1478i8569Q5182L05k0175J04169n5224J6251K37001k82130j38742n9925k2011
1467b33868J1070J84024r6580l3485O7883J9944K36785M1831K4783k75342o0421
1456a13376P7130j34556J44706j93589K4295P9186j10579J33469j41111j38023
$$ plain form
1446 -372448 -368607 -194564 -160091 -164320 -163000 140760 56588 -236145 87784 225046 279285
1435 279285 377519 103416 -145509 -239975 -127426 -9834 -15561 31375 -105989 -5916 90572
1424 90572 246764 155570 -7127 -140815 -96690 64226 17991 50951 -34911 -133946 -35444
1413 -35444 -154045 110526 33385 46833 151169 154581 -40389 -75861 -83009 28241 4414
1402 4414 -272767 -57471 199387 88006 -977 223750 107791 -3503 105405 182774
1392 182774 129001 163194 128479 71980 -47588 72683 43241 205246 275891 159837 75150
1381 75150 -229254 -260666 -90600 -264667 -390306 -140935 66383 -83121 -106538 -129079
1371 -129079 -106339 -6396 93100 305597 280003 116 28456 -143978 -103845 79880 -14034
$$ packed form
1446c72448L841J74043L4473m229J320L03760q4172k92733L23929J37262N4239
1435B79285R8234k74103k48925r4466J12549J17592n727M6936j37364J00073R6488
1424I0572J56192r1194j62697j33688M4125J60916m6235L2960q5862r9035R8502
1413c5444j18601K64571p7141J3448J04336L412j94970l5472p148J11250k3827
1402D414k77181K15296K56858j11381q8983K24727j15959j11294J08908P7369
1392A82774n3773L4193l4715n6499j19568J20271k9442J62005P0645j16054q4687
1381G5150l04404l1412J70066j74067j25639K49371K07318j49504k3417k2541
1371a29079K2740R9943R9496K12497k5594k79887K8340j72434M0133J83725r3914
$$ plain form
1360 -14034 -20490 -79900 -290657 -338407 -447926 -556536 -217497 -72778 -47726 -6191 -110497
1349 -110497 -154219 -265965 -308926 -221414 -95326 -216382 -190519 -96264 51692 -34856 86118
1338 86118 218193 72660 -237819 -229976 -10293 -73355 -362197 -314983 -140575 -211152 -272103
1327 -272103 -181938 -169087 64659 -148288 -26663 174639 70280 16712 -109991 -223800
1317 -223800 -123773 101697 -180600 -196195 -19209 -105217 -109610 155432 35235 -109248
1307 -109248 -282440 -80852 96270 -112983 35455 89988 139262 187315 87825 -240345
1297 -240345 -187916 -123715 65841 104865 -133239 -16396 25952 -21595 13692 -49688 -277285
1286 -277285 -302054 -28626 -301 -364194 -418202 -303419 -135173 -81244 -63883 -124771 -12241
$$ packed form
1360a4034o456n9410k10757m7750j09519j08610L39039J44719K5052M1535j04306
1349a10497m3722j11746m2961Q7512J26088j21056K5863R4255J47956q6548J20974
1338H6118J32075j45533l10479P843K19683o3062k88842M7214J74408p0577o0951
1327b72103R0165J2851K33746k12947J21625K01302j04359n3568j26703j13809
1317b23800J00027K25470k82297j5595J76986q6008m393K65042j20197j44483
1307a09248j73192K01588J77122k09253J48438N4533M9274M8053r9490l28170
1297b40345N2429O4201J89556L9024k38104J16843M2348m7547L5287o3380k27597
1286b77285k4769K73428K8325l63893n4008J14783J68246N3929J7361o0888J12530
$$ plain form
1275 -12241 79983 275141 407073 179425 -32899 -12442 -60222 46262 13338 31064 50791
1264 50791 -52677 14474 280970 82869 4762 -167121 58455 -145150 -41660 -31631
1254 -31631 -59554 -93435 3477 112657 175727 210197 66192 37405 28905 -40013 -323880
1243 -323880 -138917 -69285 -22328 87858 -39794 -246459 -190880 -35126 170779 330881
1233 330881 191927 395151 331490 -136696 -187842 -36876 -20676 115948 11139 -85793
1223 -85793 101524 -53231 -172984 -318512 -241564 -255965 -213101 -18589 -165555 -254095 -221437
1212 -221437 -168300 -220263 -278604 -208198 -221957 -155095 -10911 -147102 -286225 -36369 -149015
1201 -149015 -232219 -235417 -257007 -387034 -332671 -290150 -484438 -412005 -329183 -410348 -246840
$$ packed form
1275a2241R2224J95158J31932k27648k12324K0457m7780J06484l2924J7726J9727
1264E0791j03468O7151K66496j98101p8107j71883K25576k03605J03490J0029
1254c1631k7923l3881R6912J09180O3070L4470j44005k8787q500o8918k83867
1243c23880J84963O9632M6957J10186j27652k06665N5579J55754K05905J60102
1233C30881j38954K03224o3661m68186n1146J50966J6200J36624j04809r6932
1223h5793J87317j54755j19753j45528P6948j4401M2864J94512j46966q8540L2658
1212b21437N3137n1963n8341P0406j3759O6862J44184j36191j39123K49856j12646
1201a49015q3204l198k1590j30027N4363M2521j94288P2433Q2822q1165J63508
$$ plain form
1190 -246840 -243554 -92210 -157905 -146344 -42453 45241 -160572 115437 32633 -81303 -76356
1179 -76356 -68511 116587 96900 89510 -198378 -95932 157032 17282 -175906 -170520 -139497
1168 -139497 115855 121910 171135 3786 1205 158418 66386 88763 109038 11998 115662
1157 115662 -41476 -253680 -363142 -124982 -75096 9635 -138281 -442884 -212320 -96966
1147 -96966 -104876 -136574 -167166 -131465 3899 -166278 194384 97706 -66960 1269 -60429
1136 -60429 -249619 -381232 -341049 -137499 95534 -170040 -393356 -228506 -161366 -56329
1126 -56329 -179933 -140639 -110539 -129838 -56449 -63100 -126969 37726 71695 -66098 130322
1115 130322 17791 -164411 -176353 -56172 4802 -93912 -153449 23972 72255 -59537 -76585
$$ packed form
1190b46840L286J51344o5695J1561J03891Q7694k05813K76009q2804j13936M947
1179g6356P845J85098j9687p390k87888J02446K52964j39750j93188N386L1023
1168a39497K55352O055M9225j67349k581J57213r2032K2377K0275r7040J03664
1157A15662j57138k12204j09462K38160M9886Q4731j47916l04603K30564J15354
1147i6966p910l1698l0592L5701J35364j70177L60662r6678j64666O8229o1698
1136f0429j89190j31613M0183K03550K33033k65574k23316J64850O7140J05037
1126e6329j23604L9294L0100j9299P3389o651o3869J64695L3969j37793J96420
1115A30322j12531j82202j1942J20181O0974r8714n9537J77421M8283j31792j7048
$$ plain form
1104 -76585 -26121 26079 -14978 -122840 -127723 -10299 -47096 -61484 -253004 -434058 -160247
1093 -160247 -34712 -18386 -95569 -166266 -206796 -69574 -107967 -327375 -525627 -312973 61645
1082 61645 18276 -58682 -90160 -8074 -52052 -71179 216156 12423 -259913 -208444 -118249
1071 -118249 -109519 -276895 -284820 -2300 160598 73729 -140791 112916 16202 -163830 -233506
1060 -233506 -149730 -54688 -162519 110130 83456 -140662 -92048 -179119 -6347 52315 180029
1049 180029 -56011 -203926 -88737 -177830 -108086 -72815 -103099 -122672 145747 174747 198412
1038 198412 148109 21278 -6102 -52082 61543 -63998 -104681 11952 -123271 -275659
1028 -275659 3833 -176212 -85967 75833 280882 384860 67891 128825 290887 346360
$$ packed form
1104g6585N0464N2200m1057j07862m883J17424l6797j4388j91520j81054K73811
1093a60247J25535J6326p7183p0697m0530J37222l8393k19408j98252K12654L74618
1082F1645m3369p6958l1478Q2086m3978j9127K87335k03733k72336N1469R0195
1071a18249Q730j67376p925K82520J62898q6869k14520K53707r6714j80032o9676
1060b33506Q3776R5042j07831K72649k6674k24118M8614q7071J72772N8662J27714
1049A80029k36040j47915J15189q9093O9744L5271l0284j9573K68419K9000K3665
1038A98412n0303j26831k7380m5980J13625j25541m0683J16633j35223j52388
1028b75659K79492j80045R0245J61800K05049J03978l16969O0934J62062N5473
$$ plain form
1018 346360 527675 304201 68443 -63397 -63344 98511 97287 -12270 -51246 104149 -235021
1007 -235021 -181698 -63074 22626 -223875 -72593 -93322 14371 117111 63868 127150 14219
996 14219 -199095 -172639 78936 29463 -54010 49218 348787 355088 108248 57732 46725
985 46725 -25322 -141023 -74535 -216569 -212953 12163 -21168 -173299 -99447 -166750 -286040
974 -286040 -307667 -64121 24508 104670 -13018 93803 151662 -29216 -59597 -178814 -154581
963 -154581 -122004 -175811 -36 -33306 -69166 -129688 -270015 -268373 -181574 -18014 -14261 -7839
951 -7839 -202419 -267705 -137088 68407 118046 186397 -13982 -24976 -65343 -89361 -134136
940 -134136 -91506 -192298 -159860 -15807 -81056 -140740 23833 34224 -238688 130880 184480
$$ packed form
1018C46360J81315k23474k35758j31840N3J61855j224j09557l8976J55395l39170
1007b35021N3323J18624Q5700k46501J51282k0729J07693J02740n3243O3282j12931
996A4219k13314K6456K51575m9473q3473J03228K99569O301k46840n0516j1007
985D6725p2047j15701O6488j42034L616K25116l3331j52131P3852o7303j19290
974b86040k1627K43546Q8629Q0162j17688J06821N7859j80878l0381j19217K4233
963a54581L2577n3807J75775l3270l5860o0522j40327J642Q6799J63560L753O422
951g839j94580o5286J30617K05495M9639O8351k00379j0994m0367k4018m4775
940a34136M2630j00792L2438J44053o5249n9684J64573J0391k72912L69568N3600
$$ plain form
929 184480 -3400 90850 -76332 -127817 -395822 -30094 -67301 -324517 -111566 -94213 -106260
918 -106260 177754 132464 7542 42550 17592 -50142 103709 18582 -63058 74081 -6952
907 -6952 -6449 258626 373004 66205 -9004 -146077 -101374 -46331 62593 27603 -31093 -84068
895 -84068 -317437 -360183 -380063 -378423 -90646 -18329 -18352 14985 -49857 -30583 195257 56692
883 56692 -276566 -117880 -56110 75745 132718 -58242 -87735 -86246 14366 39907 123944
872 123944 171985 368 -385243 -267560 -289768 -286731 42980 109971 224631 175937 17751
861 17751 -149816 -137221 2719 56853 179757 -77459 -82980 133031 71875 -61106 -58247
850 -58247 -94695 -5545 62937 10123 -9153 -155195 -211924 -312623 -393236 -277514 -146517
$$ packed form
929A84480j87880R4250j67182n1485k68005L65728l7207k57216K12951J7353j2047
918a06260K84014m5290j24922L5008k4958o7734J53851q5127q1640J37139q1033
907f952N03K65075J14378l06799p5209j37073M4703N5043J08924l4990n8696n2975
895h4068k33369m2746j9880J640K87777P2317k3L3337o4842J9274K25840j38565
883E6692l33258J58686O1770J31855N6973j90960k9493J489J00612K5541Q4037
872A23944M8041j71617l85611J17683k2208L037L29711O6991J14660m8694j58186
861A7751j67567J2595J39940N4134J22904k57216n521K16011o1156j32981K859
850e8247l6448Q9150O8482n2814j9276j46042n6729j00699q0613J15722J30997
$$ plain form
839 -146517 -102494 -233121 -239332 -52614 159971 144732 123739 35661 212052 248923 -36840
828 -36840 46935 69540 255545 -117723 -49201 193037 46215 -120015 -37945 -19464 -63686
817 -63686 -49554 -106485 -50088 -54663 84780 63450 52432 -55625 3403 44645 -125364 1596
805 1596 66994 -166962 -203472 9852 48043 189022 43487 93248 227788 -6527 30994
794 30994 119823 240965 -94158 111755 74179 85934 227683 106231 192500 159187 15297
783 15297 -46474 -8771 -292628 -276224 -151855 121290 321241 265585 -3748 -105813 58849
772 58849 118986 60312 141460 175069 16554 -59236 -2989 6875 75477 21609 257554 428848
760 428848 267451 247096 187953 -71856 -69295 154359 141190 79341 105652 255355 63378
$$ packed form
839a46517M4023j30627o211J86718K12585j5239k0993q8078J76391L6871k85763
828c6840Q3775K2605J86005l73268O8522K42238j46822j66230Q2070J8481m4222
817f3686J4132n6931N6397m575J39443k1330j1018j08057N9028M1242j70009J26960
805A596O5398k33956l6510K13324L8191J40979j45535M9761J34540k34315L7521
794C0994Q8829J21142l35123K05913l7576J1755J41749j21452Q6269l3313j43890
783A5297o1771L7703k83857J6404J24369K73145J99951n5656k69333j02065J64662
772E8849O0137n8674Q1148L3609j58515p5790N6247R864O8602n3868K35945J71294
760D28848j61397k0355n9143k59809K561K23654j3169o1849K6311J49703j91977
$$ plain form
749 63378 -43394 91610 18049 101333 279853 77395 -75845 -215084 -86894 11591 28612
738 28612 57710 -28787 181484 124896 168478 9346 -67609 -7660 -177736 101922 94228
727 94228 51096 21787 16048 -81853 2700 128689 46969 -63151 -276754 -23137 -129175
716 -129175 -180666 -56678 -83928 -83260 83966 91237 -74165 -150857 -122947 -153612 -111896 -181488
704 -181488 99678 -42653 -114124 -138153 80402 -120330 -373065 -79314 161890 73882
694 73882 -164872 129542 -231610 -139955 153536 145511 -32704 -90020 149921 167697 222492
683 222492 126691 106272 149310 275686 64273 -158323 -158018 -5671 221823 169767 -217840
672 -217840 -119502 134679 57856 199553 302380 353069 191474 154773 209549 293956 131633
$$ packed form
749F3378j06772J35004p3561Q3284J78520k02458j53240j39239J28190R8485J7021
738B8612K9098q6497K10271n6588M3582j59132p6955N9949j70076K79658p694
727I4228m3132k9309n739r7901Q4553J25989q1720j10120k13603K53617j06038
716a29175n1491J23988k7250O68J67226P271j65402p6692K7910l0665M1716o9592
704a81488K81166j42331p1471k4029K18555k00732k52735K93751K41204q8008
694G3882k38754K94414l61152R1655K93491q025j78215n7316K39941J7776N4795
683B22492r5801k0419M3038J26376k11413k22596L05J52347K27494n2056l87607
672b17840R8338K54181p6823J41697J02827N0689j61595l6701N4776Q4407j62323
$$ plain form
661 131633 341322 163300 117090 100172 175192 271486 56347 -56177 140436 46382 -98087
650 -98087 -3272 139422 64704 91090 120501 118000 87808 76644 132417 275043 302350 146043
638 146043 76155 168317 113468 93631 964 99867 253611 334598 18353 -59552 25306
627 25306 194732 294343 -75431 -10862 -75228 -67114 149533 212737 74853 60453 188683
616 188683 179236 -109855 28823 176912 -4153 -14637 164767 296206 224133 266426 300151
605 300151 167251 -3629 -23061 78694 26539 226172 108858 11490 196346 357414
595 357414 391574 312508 94505 195372 276265 295603 311197 393162 210314 150973 81483
584 81483 2727 199292 154968 116164 257701 288378 264932 150775 14890 200444 85279
$$ packed form
661A31633K09689j78022m6210j6918P5020R6294k15139j12524J96613r4054j44469
650i8087R4815J42694p4718K6386K9411k501l0192j1164N5773J42626K7307j56307
638A46043o9888R2162n4849j9837r2667R8903J53744Q0987l16245p7905Q4858
627B5306J69426R9611l69774O4569o4366Q114K16647O3204j37884j4400J28230
616A88683r447k89091J38678J48089j81065j0484J79404J31439p2073M2293L3725
605C00151j32900j70880j9432J01755n2155J99633j17314r7368J84856J61068
595C57414L4160p9066k18003J00867Q0893J9338J5594Q1965j82848n9341o9490
584H1483p8756J96565m4324l8804J41537L0677k3446j14157j35885J85554j15165
$$ plain form
573 85279 197675 277352 179834 77340 39590 125600 -26819 45336 -26575 78259 -37659
562 -37659 -47069 144598 146529 38949 44439 127850 207354 298472 239185 212466 268506 92698
550 92698 65324 262160 12273 51688 323181 159704 -31132 65084 -218748 -157996 118994
539 118994 12319 -244299 -201435 -68260 -187157 -49853 75231 53463 -84845 -184852
529 -184852 -274758 -27736 236865 155070 177012 226459 -7625 -1522 155863 19538 245638
518 245638 342705 337929 211088 250907 248693 8414 59472 -41427 10224 -119160 -99743
507 -99743 39701 -18593 70279 33442 -141764 -133598 -91886 48701 241265 243132 64824
496 64824 241835 191883 -31166 -236747 -125360 44646 39512 42634 -33466 -21715 79298
$$ packed form
573H5279J12396P9677r7518j02494l7750Q6010j52419P2155p1911J04834j15918
562c7659r410J91667J931j07580N490Q3411P9504R1118n9287k6719N6040j75808
550I2698k7374J96836k49887L9415K71493j63477j90836R6216k83832O0752K76990
539A18994j06675k56618M2864J33175j18897J37304J25084k1768j38308j00007
529a84852q9906K47022K64601q1795K1942M9447k34084O103J57385j36325K26100
518B45638R7067m776j26841L9819k214k40279N1058j00899N1651j29384J9417
507i9743J39444n8294Q8872l6837j75206Q166M1712J40587J92564J867j78308
496F4824J77011m9952k23049k05581J11387J70006n134L122p6100J1751J01013
$$ plain form
485 79298 236173 156567 -278173 -92470 118467 170485 98530 -173732 -265162 -75433 49234
474 49234 120291 273522 106220 168797 79133 -106654 7 -13234 44154 131875 -94996
463 -94996 -47124 -216054 -101580 139045 44629 -53568 163815 87143 -54104 -86351 -157601
452 -157601 -38120 -17999 -70414 -116950 -172445 -101414 -42032 232344 160549 223884 135967
441 135967 7029 180317 91783 177500 30056 8199 167974 164000 120738 -112320 -134081
430 -134081 66433 126327 -20767 -80042 -116240 123052 154267 47245 143839 328913 -51547
419 -51547 -220370 -82383 -14959 115830 52826 97773 20644 -254465 76083 92051 126975
408 126975 239358 144045 -50621 -211338 -35659 35092 -296 -54561 62364 90608 -68355
$$ packed form
485G9298J56875p9606m34740J85703K10937N2018p1955k72262r1430J89729J24667
474D9234P1057J53231j67302O2577q9664j85787J06661j3241N7388Q7721k26871
463i4996M7872j68930J14474K40625r4416r8197K17383p6672j41247l2247p1250
452a57601J19481K0121n2415m6536n5495P1031N9382K74376p1795O3335q7917
441A35967j28938J73288q8534Q5717j47444k1857J59775l974m3262k33058k1761
430a34081K00514N9894j47094n9275l6198K39292L1215j07022R6594J85074l80460
419e1547j68823J37987O7424J30789o3004M4947p7129k75109L30548J5968L4924
408A26975J12383r5313j94666j60717J75679P0751l5388n4265J16925K8244j58963
$$ plain form
397 -68355 7326 40294 -37017 -63004 -74720 -283497 -150169 -88600 19553 -153806 -293508
386 -293508 -102135 86464 -8511 -49537 -108531 -120182 -176581 -189416 15353 7800 -216434
375 -216434 -155234 -61037 -131827 136055 16385 6879 -53569 -37145 -7269 425955 298820
364 298820 131762 143014 277041 282377 128345 4127 92741 -4610 -32873 -26072 93965
353 93965 -131737 29055 129685 131805 -72791 25968 -9849 -73237 -139869 -36376 -214103
342 -214103 -260777 61414 -120009 -272818 -175100 -231567 -174162 114888 -29761 79341 9616
331 9616 -92328 152184 180677 62978 -162654 -416664 -378368 -124031 -139317 -283094 -36761
320 -36761 -15803 149992 130169 9381 -145626 -337631 -396320 -113364 -153698 -214288 -59436
$$ packed form
397f8355P5681L2968p7311k5987j1716k08777J33328O1569J08153j73359j39702
386b93508J91373J88599r4975m1026n8994j1651n6399j2835K04769p553k24234
375b16434O1200R4197p0790K67882j19670r506o0448J6424K9876M33224j27135
364B98820j67058J1252J34027N336j54032j24218Q8614r7351k8263O801J20037
353I3965k25702J60792J00630K120k04596R8759l5817o3388o6632J03493j77727
342b14103m6674L22191j81423j52809R7718n6467N7405K89050j44649J09102o9725
331I616j01944K44512K8493j17699k25632k54010L8296K54337j5286j43777K46333
320c6761K0958J65795j9823j20788j55007j92005n8689K82956m0334o0590J54852
$$ plain form
309 -59436 -86633 127913 67616 -44160 55820 231756 120302 71487 85505 178250 23656
298 23656 -84441 8732 -5246 -34135 88040 -120103 20029 23599 113892 82119 -27808
$$ packed form
309e9436k7197K14546o0297j11776R9980J75936j11454m8815J4018R2745j54594
298B3656j08097R3173j3978k8889J22175k08143J40132L570R0293l1773j09927
$$ [...]
##END NTUPLES=NMR SPECTRUM
##END=
