##TITLE=1H_CA-9206-2
 CDCl3
 8 sc, 
 26.10.2023
##JCAMPDX= 6.0         $$ Bruker NMR JCAMP-DX V2.0
##DATA TYPE= NMR SPECTRUM
##DATA CLASS= NTUPLES
##ORIGIN= UXNMR, Bruker Analytische Messtechnik GmbH
##OWNER= root
$$ XWIN-NMR		Version 3.5
$$ Thu Oct 26 15:00:59 2023 Russian Standard Time (UT+4h)  she@DPX200
##.OBSERVE FREQUENCY= 200.13135
##.OBSERVE NUCLEUS= ^1H
##.ACQUISITION MODE= SIMULTANEOUS
##.ACQUISITION SCHEME= undefined
##.AVERAGES= 8
##.DIGITISER RES= 18
##SPECTROMETER/DATA SYSTEM= spect
##.PULSE SEQUENCE= zg30
##.SOLVENT NAME= CDCl3
##.SHIFT REFERENCE= (INTERNAL, CDCl3, 0, 15.7337)
##AUDIT TRAIL= $$ (NUMBER, WHEN, WHO, WHERE, WHAT)
$$ ##TITLE= Audit trail, XWIN-NMR		Version 3.5
$$ ##JCAMPDX= 5.01
$$ ##ORIGIN= Bruker BioSpin GmbH
$$ ##OWNER= she
$$ F:/spectra/data/she/nmr/H-F/1/pdata/1/auditp.txt
$$ ##AUDIT TRAIL=  $$ (NUMBER, WHEN, WHO, WHERE, WHAT)
(   1,<2023-10-26 15:00:02.20 +0400>,<she>,<DPX200>,
      <created by zg, POWCHK disabled, PULCHK disabled
       configuration hash MD5:
       00 E9 B6 7A A2 85 ED C7 34 08 36 98 17 FE 4E 26
       data hash MD5: 16K
       DF B3 81 E8 49 0E C4 CE BB F0 E5 F7 93 44 33 79>)
(   2,<2023-10-26 15:00:04.53 +0400>,<she>,<DPX200>,
      <Start of raw data processing
       efp BC_mod = 2 LB = 0.24 FT_mod = 6 PKNL = 1 PHC0 = -23508.33 PHC1 = 11.05272 SI = 16K 
       data hash MD5: 16K
       86 54 C4 66 D1 C8 CA 12 1F 16 D9 98 D4 58 4C 18>)
(   3,<2023-10-26 15:00:19.73 +0400>,<she>,<DPX200>,
      <pk PHC0 = -1.852581 PHC1 = 2.8 
       data hash MD5: 16K
       E8 EA 84 AA A7 05 6C 59 69 A9 0A 01 6A 61 5A A3>)
(   4,<2023-10-26 15:00:23.17 +0400>,<she>,<DPX200>,
      <abs ABSG = 5 
       data hash MD5: 16K
       A5 6D CA A2 42 E8 C0 8D 02 65 25 6C 38 54 A5 CF>)
$$ ##END=
$$ 
$$ hash MD5
$$ 55 6A 00 6A 31 50 5C F0 50 4F 6D 13 9B 1C 84 4F
##$RELAX= 
##$RELAX= 
##$RELAX= 
##$RELAX= 
##$RELAX= 
##$RELAX= 
$$ Bruker specific parameters
$$ --------------------------
##$DU= <F:/spectra>
##$EXPNO= 1
##$NAME= <H-F>
##$PROCNO= 1
##$TYPE= <nmr>
##$USER= <she>
##$AMP= (0..31)
100 100 100 100 100 100 100 100 100 100 100 100 100 100 100 100 100 100 
100 100 100 100 100 100 100 100 100 100 100 100 100 100 
##$AQSEQ= 0
##$AQ_mod= 1
##$AUNM= <au_zg>
##$AUTOPOS= <>
##$BF1= 200.13
##$BF2= 200.13
##$BF3= 200.13
##$BF4= 200.13
##$BF5= 200.13
##$BF6= 200.13
##$BF7= 200.13
##$BF8= 200.13
##$BYTORDA= 1
##$CFDGTYP= 0
##$CFRGTYP= 5
##$CHEMSTR= <none>
##$CNST= (0..31)
1 1 145 1 1 1 1 1 1 1 1 1 1 1 1 1 1 1 1 1 1 1 1 1 1 1 1 1 1 1 1 1 
##$CPDPRG= <>
##$CPDPRG1= <>
##$CPDPRG2= <>
##$CPDPRG3= <>
##$CPDPRG4= <mlev>
##$CPDPRG5= <mlev>
##$CPDPRG6= <mlev>
##$CPDPRG7= <mlev>
##$CPDPRG8= <mlev>
##$CPDPRGB= <>
##$CPDPRGT= <>
##$D= (0..31)
0 1.2 0 0 0 0 0 0 0 0.06 0 0.03 0 0 0 0 0.0002 0 0 0 0 0 0 0 0 0 0 0 0 
0 0 0 
##$DATE= 1698318001
##$DBL= (0..7)
120 120 120 120 120 120 120 120 
##$DBP= (0..7)
150 150 150 150 150 150 150 150 
##$DBP07= 0
##$DBPNAM0= <>
##$DBPNAM1= <>
##$DBPNAM2= <>
##$DBPNAM3= <>
##$DBPNAM4= <>
$$ [...]
##$SUBNAM3= <"">
##$SUBNAM4= <"">
##$SUBNAM5= <"">
##$SUBNAM6= <"">
##$SUBNAM7= <"">
##$SUBNAM8= <"">
##$SUBNAM9= <"">
##$SW= 18.05172834244
##$SWIBOX= (0..15)
0 0 2 0 0 0 0 0 0 0 0 0 0 0 0 0 
##$SW_h= 3612.71676300578
##$TD= 16384
##$TD0= 1
##$TE= 0
##$TE2= 300
##$TE3= 300
##$TEG= 300
##$TL= (0..7)
0 120 120 120 120 120 120 120 
##$TP= (0..7)
150 150 150 150 150 150 150 150 
##$TP07= 0
##$TPNAME0= <>
##$TPNAME1= <>
##$TPNAME2= <>
##$TPNAME3= <>
##$TPNAME4= <>
##$TPNAME5= <>
##$TPNAME6= <>
##$TPNAME7= <>
##$TPOAL= (0..7)
0.5 0.5 0.5 0.5 0.5 0.5 0.5 0.5 
##$TPOFFS= (0..7)
0 0 0 0 0 0 0 0 
##$TUNHIN= 0
##$TUNHOUT= 0
##$TUNXOUT= 0
##$USERA1= <user>
##$USERA2= <user>
##$USERA3= <user>
##$USERA4= <user>
##$USERA5= <user>
##$V9= 5
##$VALIST= <valist>
##$VCLIST= <CCCCCCCCCCCCCCC>
##$VD= 0
##$VDLIST= <DDDDDDDDDDDDDDD>
##$VPLIST= <PPPPPPPPPPPPPPP>
##$VTLIST= <TTTTTTTTTTTTTTT>
##$WBST= 1024
##$WBSW= 4
##$XGAIN= (0..3)
0 0 0 0 
##$XL= 0
##$YL= 0
##$YMAX_a= 114413
##$YMIN_a= -152272
##$ZGOPTNS= <>
##$ZL1= 120
##$ZL2= 120
##$ZL3= 120
##$ZL4= 120
##$ABSF1= 15.6378
##$ABSF2= -2.414047
##$ABSG= 5
##$ABSL= 3
##$ALPHA= 0
##$AQORDER= 0
##$ASSFAC= 0
##$ASSFACI= 0
##$ASSFACX= 0
##$ASSWID= 0
##$AUNMP= <proc_1d>
##$AZFE= 0.1
##$AZFW= 0.1
##$BCFW= 0
##$BC_mod= 2
##$BYTORDP= 0
##$COROFFS= 0
##$CY= -3
##$DATMOD= 1
##$DC= 0
##$DFILT= <>
##$DTYPP= 0
##$F1P= 0
##$F2P= 0
##$FCOR= 1
##$FTSIZE= 16384
##$FT_mod= 6
##$GAMMA= 0
##$GB= 0
##$INTBC= 1
##$INTSCL= 3.70164e-10
##$ISEN= 128
##$LB= 0.24
##$LEV0= 0
##$LPBIN= 0
##$MAXI= 10000
##$MC2= 0
##$MEAN= 0
##$ME_mod= 0
##$MI= 1.114404
##$NCOEF= 0
##$NC_proc= -7
##$NLEV= 6
##$NOISF1= 3.799351
##$NOISF2= 2.8
##$NSP= 0
##$NTH_PI= 0
##$NZP= 0
##$OFFSET= 15.73367
##$PC= 1
##$PHC0= -23510.18
##$PHC1= 13.85272
##$PH_mod= 1
##$PKNL= yes
##$PPARMOD= 0
##$PSCAL= 0
##$PSIGN= 0
##$REVERSE= no
##$SF= 200.13000757832
##$SI= 16384
##$SIGF1= 3
##$SIGF2= 2
##$SINO= 5.538805
##$SIOLD= 16384
##$SREGLST= <1H.CDCl3>
##$SSB= 0
##$STSI= 16384
##$STSR= 0
##$SW_p= 3612.71676300578
##$SYMM= 0
##$S_DEV= 0
##$TDeff= 16384
##$TDoff= 0
##$TI= <>
##$TILT= no
##$TM1= 0
##$TM2= 0
##$TOPLEV= 0
##$USERP1= <user>
##$USERP2= <user>
##$USERP3= <user>
##$USERP4= <user>
##$USERP5= <user>
##$WDW= 1
##$XDIM= 16384
##$YMAX_p= 277301299
##$YMIN_p= -641962
$$ End of Bruker specific parameters
$$ ---------------------------------
##NTUPLES= NMR SPECTRUM
##VAR_NAME=  FREQUENCY,     SPECTRUM/REAL,   SPECTRUM/IMAG
##SYMBOL=    X,             R,               I
##VAR_TYPE=  INDEPENDENT,   DEPENDENT,       DEPENDENT
##VAR_FORM=  AFFN,          ASDF,            ASDF
##VAR_DIM=   16384,         16384,           16384
##UNITS=     HZ,            ARBITRARY UNITS, ARBITRARY UNITS
##FACTOR=    0.220516191357247, 1,           1
##FIRST=     3148.77954330133, 0,            0
##LAST=      -463.937219704449, 0,           0
##MIN=       -463.937219704449, -641962,     0
##MAX=       3148.77954330133, 277301299,    0
$$ Real data points
##PAGE= N=1
##DATA TABLE= (X++(R..R)), XYDATA
$$ [...]
8091 -82448 -72137 -236272 -268830 -147179 -178670 -85703 -271295 -287538 -278805 -254303 -204516
8080 -204516 -93278 -11438 -139613 -303200 -173211 -62620 -127502 -50393 -118404 -267244
8070 -267244 -381735 -221529 -418362 -317416 -238364 -318425 -201162 -195996 -95334 -18257 54912
8059 54912 1810 -315737 -358865 -121972 -62898 -150836 -98653 -262828 -401445 -317260 -329278
8048 -329278 -380209 -289963 -292633 -275072 -152220 -205969 -388476 -272737 -348880 -575021 -443275
8037 -443275 -313449 -145387 -277973 -375910 -191553 -311745 -332075 -437009 -438385 -396474 -436378
8026 -436378 -353682 -182686 -173949 -225190 -175740 -167534 -456862 -433422 -211998 -382198 -122757
8015 -122757 125556 -4527 137044 8725 13250 -138812 -297410 -358874 -232242 -112002
8005 -112002 -299570 -191090 -220121 -171304 -86417 -202990 -328854 33620 53084 -11571 -185292
7994 -185292 -185302 -163971 -36932 -147209 -106314 -180091 -319435 -326108 -310453 -179751 -82975 -254489
7982 -254489 -415433 -552055 -544935 -478151 -347701 -301810 -431368 -537955 -234366 -201676 -343704
7971 -343704 -211674 -222858 -274936 -365921 -395468 -319833 -236280 -236983 -142332 -146614 -517274 -498753
7959 -498753 -392466 -478467 -273756 -275997 -363286 -356142 -287211 -356100 -138911 -120865 -43646
7948 -43646 -60142 -72661 -157330 -18025 30511 186702 44761 103794 145156 29067 5450
7937 5450 -83445 -101886 -230901 -100965 -167251 -69654 -41214 -193173 -463610 -464219 -410144 -174371
7925 -174371 -169305 -300523 -106442 -97879 -95253 -303302 -98940 -165820 -278876 -348065 -258390
7914 -258390 -285865 -409328 -437992 -362183 -170902 -137720 -115498 -85776 26846 -151691 -302942
7903 -302942 -261547 -290225 -266877 -273618 -338588 -41446 -52189 -18162 45410 44774 -97445 -111720
7891 -111720 -1043 -18597 -156381 -246753 -339094 -352014 -380561 -274873 -144355 -241298 -269764
7880 -269764 -142660 -64565 -171913 -314099 -356679 -135637 -45310 -116973 -254880 -152610
7870 -152610 -63213 18597 102859 -45431 -865 -89517 -86551 63426 102688 96342 44824 -275575
7858 -275575 -290290 -152453 -250298 -232053 -189265 -121776 -121910 -93449 -295433 -40110 -89160
7847 -89160 -88633 -210679 -168655 -174314 -417713 -369358 -355184 -155950 -54104 155762 84093
7836 84093 -88940 -114273 -93623 -183519 -209281 -235768 -363571 -351252 -135555 -142575 -163412
7825 -163412 -206829 -168002 -310292 -425711 -158688 126256 -54853 -87164 -87390 -165055 -137582
7814 -137582 14789 -39824 84928 44080 163652 -20309 -469382 -478817 -469027 -292825 -285390
7803 -285390 -270531 -388580 -233851 -212100 -314347 -341451 -226003 -206980 -176584 -154436 -122598
7792 -122598 -264849 -329098 -107681 -254728 -265064 -4343 -279532 -330203 -186374 -291122
7782 -291122 -353400 -299148 -244998 -165412 -274252 -222804 -329853 -447569 -356343 -112607 -285347
7771 -285347 -451002 -432750 -237757 -238632 -327525 -208813 -207534 -281568 -325601 -477364 -364787
7760 -364787 -371166 -209308 -70818 -125056 -217426 -114887 -222253 -446588 -235133 -400787
7750 -400787 -333469 -213909 -311816 -526841 -302795 -301208 -314027 -294255 -384723 -262318 -287212
7739 -287212 -281487 -197175 -334961 -113948 -172247 -234334 -341270 -205866 6608 14095 -175036
7728 -175036 -124380 -284647 -304053 -279201 -141502 105359 41828 -120317 -92627 12618 79618
7717 79618 -25394 -179846 -287678 -277421 -136011 -41961 -127467 -219013 -122372 -144804 -39140
7706 -39140 72387 -213936 -472531 -467645 -252882 -308559 -420109 -451151 -443670 -193897 -160343
7695 -160343 -210943 -295316 -390789 -217678 -63931 -81813 -286878 -397652 -316282 -49341 29655
7684 29655 -262963 -282571 -164671 -446798 -468782 -331181 -390809 -286930 -219677 -222683 -412218
7673 -412218 -158700 -170903 -165008 -356072 -332703 -326686 -353294 -343148 -165264 -45980 -87996
7662 -87996 -182774 -129300 -32276 -155580 -154821 -63329 -229360 -267520 -189144 23472 -89443
7651 -89443 -139474 -120097 -3950 15328 42601 59603 -140954 -318585 -268607 -60122 -11630
7640 -11630 -107885 -210508 -331826 -156227 -130028 -275352 -165139 -103438 -129870 -110788 -239847
7629 -239847 -140909 -94409 -285457 -257615 -267279 -128846 -185423 -118639 -85048 -167897 -128749
7618 -128749 -208717 -200216 -215467 -279621 -332665 -37440 2000 -84661 -53324 -116347 -23127 -79309
7606 -79309 59105 -96481 -9117 -171501 -242349 -278120 -30724 -249164 -304179 -274155 -147132
7595 -147132 -75999 -117390 -164758 -230066 -270038 -168614 -71648 38639 -70527 -219720 -219036
7584 -219036 15790 60185 -29152 -189533 -262396 -274242 -329135 -36655 -136221 -164439 -121057
7573 -121057 -277462 -411039 -209465 -169749 -51858 -283725 -212298 17672 -155770 -234200
7563 -234200 -253799 -165184 -219020 -215698 -81775 -228616 -213958 -445605 -543636 -282156 -268670
7552 -268670 -154038 -47606 -64108 17406 -141280 -214240 -223327 -136639 -235428 -36550 -1934
7541 -1934 -41005 70924 85893 4711 73594 -42051 -156193 -15634 -4182 118881 13191
7530 13191 -77983 -266856 -128384 -156995 -166881 -134495 -232634 -453015 -335408 79197 -20514
7519 -20514 17790 19470 -150793 -306056 -350346 -353291 -36317 -35346 7185 245554 132956 -13577
7507 -13577 -98306 -135545 -85524 44574 -80897 -163097 -242407 -274376 -193798 10777 -99119
7496 -99119 -44652 -83156 -126564 -15718 -19086 -1997 -86597 -22549 -2239 -89134 -58694 -25498
7484 -25498 60632 24796 -58960 1615 59457 47588 200383 340834 102095 111395 271329
7473 271329 233222 30501 71382 85529 100824 48909 -52660 -108209 10489 134970 22624
7462 22624 -47138 -43345 -74094 4653 97265 212850 356210 354753 130470 -48966 -95203
7451 -95203 100988 80218 136983 119054 46990 30146 -73292 128908 48789 -95412 -175076
7440 -175076 -200998 -136754 54565 -77062 -174595 -16683 -94111 -11489 91338 -23124 21655
7429 21655 107028 -81523 -241188 -327012 -221864 52797 -59692 37236 78298 94693 -61709
7418 -61709 20812 49929 135003 -10944 -92287 -108089 -144594 -111344 71200 152413 36131
7407 36131 -43584 -102253 85954 313262 174235 303 143010 245506 50766 -154962
7397 -154962 -76152 85350 169147 32273 -89403 -101284 -81966 -223031 97570 164515 32465
7386 32465 -27872 -25540 -9041 36077 317740 230856 114572 88864 -1821 76871 33489 12871
7374 12871 10666 150855 179599 252824 172989 22450 -19010 149713 146333 257977 145216
7363 145216 192979 297463 269295 248157 89081 26908 122601 121323 58746 129264 129673 330142
7351 330142 508249 224805 149140 284854 255162 348911 374702 385737 246090 157329 193074
7340 193074 412647 531415 547421 250067 202773 472757 320538 356129 211298 164096
7330 164096 333814 282912 332305 458254 523244 459944 339432 266156 464428 580412 719875
7319 719875 778183 783055 626352 639825 853267 897193 839171 809226 711013 458710 534961
7308 534961 866813 979000 828803 624830 749932 804190 613898 611305 685307 758266 520362
7297 520362 511859 802137 1008779 959533 900554 1096114 985298 930234 1075127 993470 1139263
7286 1139263 1290269 1229604 1388794 1485522 1505851 1566108 1599998 1779068 1974512 1812106
7276 1812106 1849012 2076410 2377740 2492694 2547277 2640569 2565661 2690315 2803993 2975979
7266 2975979 3129502 3316298 3502907 3687482 3649392 3841703 4001366 4118295 4123278 4152017
7256 4152017 4073665 3991062 4174874 4176490 3968938 3762052 3642450 3695242 3657010 3502796 3451283
7245 3451283 3126160 3099346 2811888 2595651 2498038 2650463 2537678 2260009 2090267 1995136
7235 1995136 2049843 1856254 1628425 1699781 1756095 1728566 1850347 1767500 1610227 1567324 1456024
7224 1456024 1549615 1501720 1529319 1317563 1197185 1078910 1110184 1130391 1103177 1103807 1063234
7213 1063234 918942 1032640 1007761 1137087 1063565 828664 990700 1114250 1049415 927776
7203 927776 997326 1088592 1231095 1091822 1044313 1026144 1059109 1190904 1166581 1093600 1316917
7192 1316917 1243951 1209700 1174438 925157 947903 1143638 1151903 1227058 1096659 1153280 1082724
7181 1082724 1280671 1331407 1375486 1337502 1215167 1306826 1423619 1360275 1468979 1492274 1559314
7170 1559314 1644372 1443868 1398772 1549484 1558798 1828283 1791492 1686951 1722272 1646588 1559704
7159 1559704 1662087 1717610 1694054 1847499 1703218 1945396 2018146 1910825 1836953 1783022
7149 1783022 1902915 1903775 1853716 1996234 2138454 2034941 2181585 2218869 2186563 2197110 2159290
7138 2159290 2210046 2196082 2261698 2292584 2333581 2493905 2662206 2648190 2580253 2731176 2444652
7127 2444652 2522912 2692488 2719754 2867175 2788580 2812058 2819887 2830031 2915238 3226748 3499883
7116 3499883 3406826 3331593 3419883 3418953 3525522 3659440 3633272 3543720 3615404 3756464 3732875
7105 3732875 3897811 3752913 3719419 3831004 3996136 4168899 4089862 4302498 4355420 4597922
7095 4597922 4540458 4649589 4842339 4963304 4824428 4925427 5078170 5241131 5430185 5733562
7085 5733562 5821515 5934168 6074120 6307626 6574008 6702454 6974615 7145984 7376724 7718566
7075 7718566 8079474 8221071 8433943 8677095 9197431 9590092 10071964 10417292 10555448 10951792
7065 10951792 11461029 11843492 12113388 12369856 12555543 12736274 12920505 13097649 13211977
7056 13211977 13449369 13522221 13518262 13510917 13594173 13322228 13196954 12951419 12790308 12391504
7046 12391504 11963809 11610627 11359522 11022536 10480014 10141573 9711329 9272747 8854937
7037 8854937 8694154 8258974 7860343 7509500 7294940 7083621 6802985 6485615 6322802 6129242
7027 6129242 5728502 5467547 5226370 5042709 4873648 4576132 4578827 4578831 4302294 3887293 3751336
7016 3751336 3522579 3405481 3343149 3194651 3268552 3010206 2817454 2778959 2644569 2488711
7006 2488711 2516440 2456507 2533374 2471206 2408217 2305329 2226121 2085770 2015188 2010462 1977004
6995 1977004 1799779 1756109 1780715 1787801 1737449 1576230 1435043 1455347 1493002 1438626 1263293
6984 1263293 1527353 1582701 1310723 1421492 1346088 1172082 1222463 1142447 837337 915902
6974 915902 892213 874046 965072 1202205 1176707 861937 841852 1102047 1109233 1038461 949484
6963 949484 1229427 1169167 1272035 1213384 1102252 907161 1025840 1020604 901548 773419
6953 773419 888581 874319 814239 725518 864145 1002019 775044 780386 698709 542495 561152
6942 561152 613747 428502 484962 674222 620995 634692 533197 496921 605306 626801 576657
6931 576657 513662 521115 417422 593604 682032 591936 473601 356096 204381 471703 522458
6920 522458 519785 488816 276674 340941 462386 549757 449277 549672 293735 236482 265482
6909 265482 482619 461878 275453 207226 343481 322255 129832 218840 258336 280452 187555
6898 187555 77585 201015 201437 209434 427154 377570 351482 207468 254441 135711 159372
6887 159372 231721 264632 417135 629569 343707 391229 249343 148021 438236 278159
6877 278159 254850 487663 443545 327016 302779 285373 196644 521885 436962 182188 356325
6866 356325 357006 267521 421684 413362 464041 606946 402244 312404 305494 114671 380012
6855 380012 320572 251898 295051 304079 367673 409214 319586 173213 187443 524463 331314
6844 331314 427595 565589 579339 580367 493228 448154 273615 116393 58620 246597 273213
6833 273213 202089 266806 433159 341191 246224 353164 312780 216676 349451 186528 85842
6822 85842 235325 364751 250086 96150 293796 427325 400847 373723 273191 207379
6812 207379 294904 209072 30417 170573 166203 129131 146757 77829 -131707 64275 156917
6801 156917 280715 446484 434287 314074 267426 165528 106567 40939 157065 223563 256478
6790 256478 307039 455942 299144 235405 312372 377679 266870 136949 -86108 -169975 -254251
6779 -254251 -12089 259123 243391 167877 79825 194473 83303 50607 83480 316959 319529
6768 319529 63859 72 77203 151509 192822 261114 276841 285427 179270 99754 156997
6757 156997 14424 -37627 62783 28414 -198466 -15053 150651 121795 104781 104005 101653
6746 101653 78955 216911 78311 13172 42812 128389 107054 46394 -207863 -141359 76241
6735 76241 312325 315977 132291 225174 108251 66587 114778 113641 61020 -12584 55792 159623
6723 159623 154913 92016 186170 177667 73007 71195 -54418 -206305 -50261 165320 144758
6712 144758 69426 25208 146623 54768 -209137 -102502 30284 69786 170347 191194 132183
6701 132183 129837 34756 -91741 18324 91381 -149486 -159647 -76862 -168704 -45971 21164
6690 21164 -131698 -128564 -107342 -193434 -122822 -143895 77659 66301 49160 -162758 21070
6679 21070 -80349 -108877 -12594 -90975 36401 35167 75807 48373 -30289 -32743 -210362 -149752
6667 -149752 23789 22138 -18836 20732 119403 115829 -1014 -56850 46952 48326 -3848 60208
6655 60208 10717 101085 159902 -25883 -125246 35028 76437 -27690 53122 -16887 -7041
6644 -7041 134730 70224 31728 -65443 -70139 -100384 -323397 -196780 -15251 193232 41999
6633 41999 -10643 -128575 -6754 97523 -132010 -341601 -190251 -222638 -51169 -119580
6623 -119580 -80357 38373 -32857 -105400 -68559 29808 -36752 -160423 -252172 -32160 -170439
6612 -170439 -106547 10115 133602 43484 59954 128216 189563 100502 120915 95566 19926
6601 19926 -11116 163127 236661 249666 303818 173043 276234 334856 225887 49038 -40711
6590 -40711 108225 241441 380573 301508 312134 403802 296293 436514 543614 524640 681032
6579 681032 942994 892888 621888 812327 905124 757208 575693 398461 474036 427275
6569 427275 357116 391078 138976 105845 12517 143979 185256 83578 38210 107922 65323
6558 65323 53324 167245 42982 99162 127140 63801 -85687 130979 67455 131751 77664
6547 77664 -2099 31845 64127 -40250 7278 -11237 -129344 41870 46312 -193384 -225494
6536 -225494 -335090 -207359 -164855 -163127 -82569 9825 -108967 -170082 -421259 -452924 -269087
6525 -269087 -232288 -201702 -205115 -57121 -67867 -37659 -57679 -63771 -108752 -181676 -295675 -304715
6513 -304715 -30717 23732 -193378 -23275 -50004 -169430 -284059 -54783 -55954 15275 59096
6502 59096 -48075 -281755 -154262 -134971 -358672 -142174 -214378 -227534 -263672 -231799 -219538
6491 -219538 -108860 -137795 -22490 -137335 -196794 -193052 -53582 -87617 -148190 -246014 -170468
6480 -170468 42458 -175283 -392627 -274824 39824 -56788 -171229 -102262 -148294 -111266
6470 -111266 -68582 101880 65268 60208 -136118 -69817 -37874 46713 183104 -61423 -191133
6459 -191133 -207084 -61682 8896 -99112 -198676 -237559 -280195 -261211 -312698 -190995 -208344
6448 -208344 -208129 -219331 -169936 -261021 -214947 -175177 -267429 -330322 -206435 -94353 -51884 -80573
6436 -80573 32046 -78652 -294139 -236624 -271503 -409118 -97036 -204982 -246347 -59542
6426 -59542 -130763 -133217 -167523 -399347 -298694 -275083 -93290 -82200 -174283 -186356 -139143
6415 -139143 -235443 -147578 -131737 -305077 -241141 -159590 -249352 -351215 -348363 -415537 -278540
6404 -278540 -249950 42066 -62152 -58468 1171 -56932 13796 -10767 6793 168379 30853
6393 30853 -200475 -135944 -146537 -82341 23548 14208 -45228 -201045 -203273 13140 -54747
6382 -54747 -1340 14462 83662 -108608 -88226 -91944 -180304 -129669 -127178 -18741 -110371 -382304
6370 -382304 -356233 -150284 -77682 -209449 -268088 -165579 -258267 50969 -21041 -50147 -123709
6359 -123709 -117708 56820 -65401 -81713 36729 -79019 -205456 -291580 -173401 -153864 -241564
6348 -241564 -385932 -283482 -31521 -135474 -74139 -165136 -415338 -247453 -43768 51961
6338 51961 166509 188019 4831 145190 242160 143837 -103227 -90675 -66743 -106293 -58014
6327 -58014 -254992 -85720 -229953 -358915 -252930 17088 -37682 -158748 -195607 -231337
6317 -231337 -20932 -132573 39437 -35231 -221095 -146267 -273871 -352974 -208372 -149207
6307 -149207 -150075 -138784 -145069 -98776 -15054 -178961 -254241 -260750 -175616 -44687 -141370 -100840
6295 -100840 -76063 -56956 -73704 46803 86629 81804 136287 55035 -88194 -44612 -83757
6284 -83757 -194039 -239809 -188740 -95453 -34510 -7590 -71220 -108240 -244193 -214007 -99288
6273 -99288 6406 17519 -71546 -307364 -179838 -163461 -135250 -9046 25610 -146505 -76241
6262 -76241 23249 -148078 -210726 -184386 12113 -106831 -114535 -133805 -327126 -297997 -343355
6251 -343355 -203583 9252 104783 -106083 -156693 -174251 -293194 -221998 44433 101634 -132461
6240 -132461 -326064 -298454 -328807 -352783 -189353 -245278 -130422 -334545 -272555 -272954 -422439
6229 -422439 -398111 -312180 -49965 74296 -49346 -101207 -21168 11988 100144 -72944 -264994
6218 -264994 -286631 -446491 -295215 -186120 -165096 -117759 -226986 -274783 -272813 -165094 -207474
6207 -207474 -292529 -210096 -407357 -400085 -368733 -333628 -270174 -115711 -80463 -261381 -126804
6196 -126804 -10419 64342 254455 123906 77612 132530 205929 182922 -146278 -105518 -258926
6185 -258926 -337634 -156723 -64896 733 -161276 -282992 -170253 -57104 -225207 -351436
6175 -351436 -211892 37510 -58478 40088 -116359 -143421 -237519 -171903 -182537 -195392 -192162
6164 -192162 -273333 -305871 -354453 -164646 -314293 -311978 -230701 -366696 -187286 -68517 -274606
6153 -274606 -354116 -229020 -125919 -198468 -252794 -91317 -204727 -75342 -47520 -246569
6143 -246569 -244793 -51992 7339 -156926 -77397 -230198 -159095 87129 -34248 -68141 -96792
6132 -96792 -40970 -62038 -9699 59088 -343809 -258545 -172996 -143089 -54272 -74464 133484
6121 133484 344122 160132 95777 34506 -197651 -355730 -222733 19813 91855 -91033
6111 -91033 -228598 -181321 -69175 -167602 -101677 -150183 -182250 -311687 -185583 -92357 -54120
6100 -54120 -176400 -229195 -190299 -308892 -347823 -280433 -72752 135145 21087 7805 193406
6089 193406 -34781 -209856 -212871 -32032 -180024 -228157 -46769 -83996 -149489 -77132 -70268
6078 -70268 -222067 -91993 25126 3744 122905 51779 -230155 -173955 -156119 -108150 -125242
6067 -125242 -8461 7089 128947 165838 -28166 -93458 -206573 -128713 7763 -160565
6057 -160565 -143033 -112126 5541 101466 -52005 -54272 -84055 -108375 -117010 -164249 -79884 -122099
6045 -122099 -145867 -49823 -165181 -37137 -56771 -39423 -191653 -209584 81201 -39801 -94642
6034 -94642 -67099 -108520 -143592 -126470 -153742 -199160 -192630 -238973 -288132 -262736 -290224 -89264
6022 -89264 22093 -389124 -496676 -367890 -205166 -7684 23652 1971 -586 -77342 -254718
6011 -254718 -426527 -318036 -184076 -97392 -95369 -258577 -255746 -155746 -164505 -234372 -81404
6000 -81404 -5256 28474 -27530 -56922 72491 -47138 22266 -27328 -62551 -257286 -140295
5989 -140295 83510 -15233 -109966 -133004 -313981 -205119 -135923 -248677 8012 83962 -209251
5978 -209251 -244294 -234428 -235546 -115554 -77079 -24693 102893 62989 -35482 65900 18866
5967 18866 -150348 -29346 -127943 -67364 -9349 -50091 -52396 -115775 -165391 63809 143457
5956 143457 137144 34826 64290 93816 12934 50634 -32947 -19427 12594 -123552 -62777
5945 -62777 70129 96504 14849 -604 -33335 -89613 -253292 -106593 120626 160500 84503
5934 84503 -40419 68044 -57961 -41720 -53677 43180 151101 260175 166376 46928 -120551
5923 -120551 -37686 162511 59090 113919 -7525 -56362 -73974 -54297 -103597 -76094 -198334
5912 -198334 -126405 33673 81355 173619 206487 130833 129127 133034 -184492 -68371 -13391
5901 -13391 48261 98748 186533 204534 203034 60875 84295 54944 40259 -36187 102711 -65102
5889 -65102 -109885 -122654 -73860 -59591 23183 -76397 -188841 -81357 -56901 -210803 5524
5878 5524 -7513 96588 198004 65552 -13650 33372 162065 70353 269646 61791 113878
5867 113878 178461 -23293 -87027 -80211 138695 96778 204533 201161 -48750 -13249 19807
5856 19807 22312 -125565 -46887 -73320 14480 185656 241068 12080 142865 356950 287266
5845 287266 -13852 -41791 118963 29116 -44330 -1258 4484 95417 145991 22090 67238
5834 67238 129206 35202 -69698 121520 40336 75046 45601 139249 27488 56972 -101668
5823 -101668 -57008 -144815 -90723 30367 103995 114735 137856 158143 141564 73841 -21214
5812 -21214 46836 -69096 126379 14187 112156 35648 113338 3074 112827 232607 174553
5801 174553 148193 98010 84360 167952 152238 -50617 84272 131633 74582 49347 374
5790 374 159210 79687 -31644 -63199 224117 309867 112735 97020 185686 103222 221741
5779 221741 212463 192132 56140 194254 64098 118929 26111 -56575 26996 -141290 -29381
5768 -29381 46496 -75902 -74455 124687 214721 141558 -64734 32424 28227 157955 271915
5757 271915 171918 164971 92795 -185892 -101808 44693 80309 217752 98832 172403 155637
5746 155637 19055 115224 199425 173219 279202 333156 83108 100131 -65345 -171199 -35431
5735 -35431 -17053 41217 126607 168772 103823 210059 142831 68875 163328 207103 36254
5724 36254 -14358 113981 158715 62653 -64567 -34440 -198699 -142247 -37879 94268 265730
5713 265730 30744 -188899 -192381 -29427 -20124 -101015 -78411 -21986 6960 -3558 -159259
5702 -159259 -212233 -73655 3620 180399 183873 127065 -5653 -178237 -322468 -6440 206577
5691 206577 91579 45792 249318 -58000 -125548 -138352 108170 114568 -54279 89923 1461
5680 1461 -102400 -66166 -67527 -55016 18003 -161922 -177035 51705 -13821 -158667 -119501
5669 -119501 88466 84498 -63312 63651 108993 20148 66809 92658 169530 105164 -63933
5658 -63933 -244674 -192086 43241 329268 317588 206167 149053 153078 196664 183158 254408
5647 254408 373609 333981 189328 230416 246328 243590 272283 315003 327356 483765 375111
5636 375111 284484 328409 349264 216926 376111 304301 325638 282098 370804 271742 109043
5625 109043 134889 243061 478838 606478 515425 377083 621919 790010 571700 774243
5615 774243 782644 719379 758796 868063 918654 681492 760939 644832 823600 917487 725293
5604 725293 605708 588532 488512 543656 592736 550214 542747 594682 689519 647452 437633
5593 437633 482537 527590 680668 671773 799356 884079 913356 984753 734242 624827 669850
5582 669850 659942 374408 627033 884416 835894 628680 350248 515565 661690 467771
5572 467771 475667 373637 432694 449885 419842 524434 470157 400939 312184 349156 488173
5561 488173 545964 479927 555015 381036 306729 271166 346908 367820 197512 595080 691196
5550 691196 558366 522950 419925 339055 325540 434634 259421 141041 440287 350248
5540 350248 206018 315995 409366 230672 221184 274330 438583 474695 552345 481888 332182
5529 332182 379697 449881 316639 229841 201451 220573 363426 565425 608593 344553 294512
5518 294512 195161 315287 360191 248839 243996 217097 50841 230128 251542 126295 172535
5507 172535 277526 226156 84640 245890 395824 353205 451692 292013 215594 206051 406304
5496 406304 580095 474009 479344 601081 509304 655798 717023 670992 588707 383138 410251
5485 410251 383345 311566 230665 320985 365690 125957 82885 287302 366487 441394 398942
5474 398942 199928 174305 299423 467184 569508 541091 522039 423887 462730 384102 339239
5463 339239 272328 463970 481426 633119 827337 683326 617622 350227 383223 349349 375236
5452 375236 433188 561935 357778 309398 273626 223079 324996 121420 250797 359334
5442 359334 473203 465395 478380 389410 280131 192736 292654 176986 354866 529092 321455
5431 321455 382620 636331 374420 491852 667911 707887 693804 495601 492363 378911 340547
5420 340547 386190 310916 299768 166030 232502 298773 384190 506324 461718 424952 169205
5409 169205 164939 287046 367822 284867 220102 278916 409059 312094 255141 91969 120723
5398 120723 73626 169855 272727 138538 2403 -3063 25381 151509 254880 377153 355873
5387 355873 349670 278857 283516 75027 48190 147299 210860 77512 254887 248017 277095 211803
5375 211803 241324 317995 276607 235087 161231 315011 382419 322099 298758 379943 114824
5364 114824 60485 238161 415442 420127 341641 245768 246718 171947 197900 144376 161362 250145
5352 250145 437838 397433 254499 237691 61794 204701 261288 202325 223989 146254 241310
5341 241310 198248 378652 450587 248825 211629 271771 405906 415165 324212 465759 311061
5330 311061 171961 157570 377957 316920 425875 479423 383671 352042 212094 239328 100441
5319 100441 22792 303837 267779 239231 98493 67672 221098 194273 72108 129610 102631
5308 102631 61642 139726 148343 135406 139711 315425 430220 354027 519507 468275 345713
5297 345713 383625 364239 331613 260659 231978 86570 144615 287166 307344 72092 126534
5286 126534 250711 286226 336241 201385 175915 211686 125657 115665 197105 156969 141627
5275 141627 25984 -66423 59551 40052 115208 230280 276055 348836 334242 166911 229994
5264 229994 278159 468633 511831 422294 502907 431018 321677 398230 532790 428392 246500
5253 246500 194576 176608 261391 275905 292633 226036 161795 86895 160815 212010 -11610
5242 -11610 -65045 11220 184184 329259 428693 450186 120409 139816 34180 83639 378195
5231 378195 373749 154198 301571 425706 299075 114226 150478 196987 128167 79010 64768
5220 64768 98321 167860 167633 233328 371663 396233 358246 181047 225117 397809 507539
5209 507539 440258 401690 483309 423690 377888 509857 240162 149982 173504 57955 66752
5198 66752 86384 77404 57301 7809 308537 205370 207847 416891 515747 300533 373030
5187 373030 239219 136783 259211 301058 408084 353534 304608 341457 489192 373982
5177 373982 349672 486279 600373 491627 427571 384101 279816 440896 434188 307538 299075
5166 299075 335076 531881 581253 659493 664873 666464 762060 912452 777354 817882 740904
5155 740904 686088 860385 866355 858968 849762 785002 873816 965362 1149267 1190629 1166636 1260250
5143 1260250 1368329 1480117 1681002 1776471 1884198 2018738 2225039 2267846 2487861 2384120
5133 2384120 2516628 2563313 2440663 2386389 2227813 2293416 2058938 2014954 2070007 2170028
5123 2170028 1815261 1891511 2117412 2036026 2009160 2056880 2043846 2417340 2850767 3141758
5113 3141758 3131568 3103122 2967128 2954205 2846096 2793163 2563407 2264908 2238375 2016687
5103 2016687 1873018 1977974 2037232 2290356 2373357 2303316 2258602 2358424 2471240 2516918 2854799
5092 2854799 3065962 2935695 2884322 2752710 2586785 2458352 2577435 2585182 2449688 2504038
5082 2504038 2410266 2554385 2550956 2451185 2477459 2566431 2617079 2721140 2580346 2521279 2514427
5071 2514427 2768369 2722617 2574609 2499526 2331721 2023313 1748784 1680015 1832103 1509911
5061 1509911 1119630 1119617 1275757 1165338 1283056 1078184 934766 913547 844038 851100 857929
5050 857929 847448 689034 677633 670638 669008 681660 742086 586219 692244 761491 900623
5039 900623 880858 756332 660337 548397 669109 666187 512507 636155 787378 625206
5029 625206 469735 582579 560100 544126 574626 655201 568595 533033 624397 689070 582767
5018 582767 659349 601187 529243 681761 784023 556653 406071 389189 428423 497152 590602
5007 590602 731332 545521 542519 733219 624547 418699 567653 470373 325684 535862
4997 535862 439188 473238 442230 391549 444429 496060 419671 525779 659796 493574 448257
4986 448257 615030 644738 358507 400606 316405 212565 410085 170850 307697 289661
4976 289661 482096 522095 385710 362581 314285 385057 423511 389650 299259 335801 372930
4965 372930 482306 483624 503559 370483 208315 257432 538175 735683 614581 320227
4955 320227 510501 418845 515960 527823 518359 424539 328717 308873 489347 603191 686128
4944 686128 728439 562689 358518 247978 324184 482126 540331 480601 508046 316489 348517
4933 348517 324935 321404 510695 405154 289806 248602 246815 232799 343987 346103 374124
4922 374124 204337 365896 451859 549161 434277 468876 495181 457157 570566 569915 340094
4911 340094 230253 217189 46333 185559 400022 394703 382498 391534 551178 282599 27499
4900 27499 193954 394662 435220 173761 325591 387774 297367 306344 453352 365994 263127
4889 263127 509087 632760 398628 553801 473920 369300 241764 340164 462664 459397
4879 459397 357145 435678 446260 384813 307781 420712 307328 286617 247347 531735 781722
4868 781722 671011 463719 445766 529212 509697 659546 384169 293928 272836 216090 395416
4857 395416 455477 513976 532290 669337 779990 680954 662504 607472 668619 679872 584824
4846 584824 599325 610965 682752 666265 500576 597429 629453 870741 949279 579063 709587
4835 709587 871512 812198 837349 793969 780763 907407 1049805 1012045 1089627 1093375 958284
4824 958284 1035682 1199244 1200702 1141505 1210647 1186618 1133020 982961 928326 1079433 1178733
4813 1178733 1359236 1376287 1353553 1296620 1434595 1478138 1460184 1532895 1492146 1440038 1424959
4802 1424959 1505201 1492808 1588161 1827757 2058277 2130782 2370516 2326464 2521795 2815499
4792 2815499 3004205 3522597 4147438 4615937 5344343 6546285 7518573 8280031 8550154
4783 8550154 8169052 7214378 6073259 4957435 4048015 3365136 3178158 2997050 2713705
4774 2713705 2505304 2325699 2228409 2098928 2150221 2126542 1785214 1677649 1851626 1591849
4764 1591849 1527025 1584861 1375688 1301358 1274946 1491922 1487580 1450110 1578498 1528821 1530691
4753 1530691 1548202 1669070 1838276 1748413 1536821 1607138 1655926 1675686 1688193 1495083 1469762
4742 1469762 1681358 1815626 1636773 1605541 1862869 2080319 1937560 2073577 2130662 2287864
4732 2287864 2438467 2559571 2637992 2689080 2866119 3013761 3147371 3295001 3495803 3874678
4722 3874678 4483860 5208371 5964760 6880154 7808758 8152893 8090150 7758804 6951223 6033761
4712 6033761 4923342 4188458 3654234 3346255 3087213 2917533 2822659 2679507 2526011 2565354
4702 2565354 2632883 2414859 2163092 2044207 1745491 1675854 1722981 1596170 1617158 1364192
4692 1364192 1351188 1324371 1297022 1204461 1367501 1285656 1252786 1318976 1314623 1165795 1262103
4681 1262103 1272962 1187701 1025920 1021624 1145982 1049830 1093939 992337 974062 1209831 995068
4670 995068 1037745 1014215 1024008 1030355 998317 1107214 1124094 1074610 939093 1093257 1074781
4659 1074781 860554 909801 974876 1059866 1091008 1110931 1115827 1041286 1142955 1127307 1069821
4648 1069821 1019033 1033850 1108393 1226412 1228909 1317513 1296091 1168131 1085389 968163 1158479
4637 1158479 1139089 1043638 1058008 1086941 1068681 1132896 1072039 1182403 1095661 1093684 1259421
4626 1259421 1112246 1141926 1198668 1001796 1052857 1348822 1353642 1210390 1106399 1083122 1249374
4615 1249374 1374357 1196075 1178411 1117315 1151052 1302466 1376745 1330936 1418576 1246001 1189824
4604 1189824 1209544 1256385 1269558 1385470 1411882 1214600 1242758 1241431 1243872 1437260 1557311
4593 1557311 1591583 1446170 1652201 1736652 1548417 1573742 1552596 1448773 1543978 1616916 1535195
4582 1535195 1596623 1476998 1621805 1590331 1663709 1515294 1500239 1659014 1502824 1432873
4572 1432873 1436696 1679691 1613210 1565028 1722460 1653699 1484840 1456656 1539396 1489724 1508494
4561 1508494 1888142 1881414 1849857 1846968 1844537 1956135 1998447 2046730 1969017 1881068 2009448
4550 2009448 2041565 2184419 2062100 2051708 2074134 2051849 2091212 2198663 2033095 1972615 2077691
4539 2077691 2092569 2290348 2559573 2454698 2330639 2421380 2519390 2744334 2622529 2698267
4529 2698267 2699732 2704403 2875659 2839404 2838630 2751397 3035268 3294418 3233790 3469855 3501763
4518 3501763 3540124 3549081 3488293 3730602 3874443 4015541 4112167 3894457 3987242 4272510 4417131
4507 4417131 4141098 4335542 4444478 4615504 4592182 4636603 4849964 4935297 5191092 5290347
4497 5290347 5161217 5314325 5489813 5698978 6028913 6182941 6197161 6507894 6636668 6939773
4487 6939773 7037043 7276963 7626159 7892825 8260935 8512928 8941269 9379293 9936898 10450525
4477 10450525 11136975 11884100 12719816 13608635 14642022 15660218 17012795 18202356 19373353
4468 19373353 20188447 20669252 20750823 20757957 20847301 20546926 20360086 20053051 20032851 20222688
4458 20222688 20655238 21448846 22196761 22611049 22905313 23384932 24086257 24551365 24773358
4449 24773358 24943280 25309854 25821315 26124978 26372785 26214233 25987758 25861337 25663456
4440 25663456 25446569 24990757 24456959 23772466 23182200 22768147 22533915 22457903 22748803 23329658
4430 23329658 24081583 24904232 25826076 26671769 26976968 27307726 27401056 27547326 27589962 27842787
4420 27842787 28055055 28598973 28931401 29301855 29154080 28770784 28075949 27559665 27141354
4411 27141354 26648644 26316484 25497898 24170921 22668752 20965789 19417258 17814596 16664717
4402 16664717 15909858 15203169 14611159 13909896 13189940 12811121 12270284 11712810 11441590
4393 11441590 10921447 10503359 9887631 9623850 9251311 9031051 8858863 8774424 8585639 8592197
4383 8592197 8613789 8616832 8369557 8368956 8439924 8227633 8273455 8447464 8564150 8752893 8926688
4372 8926688 8783061 8693611 8880782 8892004 8950450 9172196 9290905 9468996 9852446 9939983
4362 9939983 10044132 10209064 10311340 10455596 10554095 10445112 10458020 10459596 10395653 10389616 10600729
4351 10600729 10683472 10757302 11054418 11414160 11743240 12120414 12528429 13018142 13576763 14307239
4341 14307239 14945136 15719104 16555005 17397073 18253905 19315895 20426677 21571699 22789738
4332 22789738 24244508 25959922 27364589 28654027 29577272 30200445 30471239 30887416 31458811
4323 31458811 32124191 32706085 32951158 32805104 32548582 32286579 31928837 31434065 31218432
4314 31218432 30774436 30282345 30037373 29478496 28753571 27871188 27061675 26483860 26073882
4305 26073882 25669096 25569717 25510046 25710601 26134652 26538636 26991317 27321049 27546208 27414782
4295 27414782 27356917 27562214 27644347 27427759 27046377 26484096 26150360 25837793 25538437 25170214
4285 25170214 24883276 24381689 23549385 22965627 22668124 22048160 21454358 21158480 21106924 21314266
4275 21314266 21432133 21312335 21167014 20781579 20209348 19605539 18680908 17683560 16511483
4266 16511483 15476890 14525562 13783162 12853485 12083899 11589345 10924453 10393447 10217570
4257 10217570 9860321 9674093 9455683 9184846 9034761 9000155 8925510 8532428 8249202 8140103
4247 8140103 8325573 8102846 8227924 8117114 7801068 7637036 7148629 7093849 6901651 6696540
4237 6696540 6444442 6244933 6232408 6161358 5877062 5779083 5850251 5972867 5879976 5774676
4227 5774676 6007751 5949439 6166639 6156841 6159823 6233143 6245859 6298199 6244353 5945774 5878281
4216 5878281 5921906 6008797 5906068 5940651 6080661 6052162 6111813 6024119 5959079 6024612 5797341
4205 5797341 5808996 5845874 5544886 5662612 5668541 5626825 5570095 5512355 5674876 5877767 5872697
4194 5872697 5998076 6087208 6007447 6306493 6475314 6704871 6633643 6798041 6885819 7051673
4184 7051673 7079441 6799449 6850586 7061843 6921960 6919986 7023855 7122222 7380940 7605606
4174 7605606 7737070 7794093 8018163 8177663 8167238 8149998 8083463 7928886 8001717 8080799 8132693
4163 8132693 8087798 8382164 8520074 8718948 8989373 9219460 9326091 9560783 9789933 9975538
4153 9975538 10151370 10276146 10303893 10551578 10631894 10617919 10580698 10335466 10295161 10197232 10295772
4142 10295772 10366512 10379358 10299547 10456055 10836601 11053138 11087264 11033667 11216143 11510240
4132 11510240 11683930 11687286 12054535 12288509 12934158 13203902 13547213 13765744 14190216 14626416
4122 14626416 14974277 15318881 15637359 15731852 15995054 16222849 16348841 16552389 16793516 17079405
4112 17079405 17499744 18137248 18633296 19139619 19697625 20279434 20677839 20997280 21616875
4103 21616875 22428895 23032076 23837894 24679088 25464220 25974736 26782890 27635286 28617821
4094 28617821 29721344 30863521 32076852 33411655 35165704 36904065 38688173 40944120
4086 40944120 43820658 47072071 50679924 54905327 60189689 66640179 74705110 84428022
4078 84428022 95553235 107285914 119139919 132804656 147282989 160918124 170958954
4071 170958954 170117533 155620203 135137697 115429170 99098848 86225576 76513212
4064 76513212 68920527 62966181 58326886 54767581 51904752 49860435 48513995 47108986
4056 47108986 45004389 42905609 40707403 38742851 37262812 36083385 35055142 34291040
4048 34291040 33959283 33525491 33501932 33673247 33434427 33303304 33235602 32831894 32653434 32249128
4038 32249128 31982495 31686669 31248106 30976814 31109728 31291819 31686137 32012618 32213002
4029 32213002 32633055 32591843 32235314 31982113 31403101 30318694 29543143 28811696 28072394
4020 28072394 27534444 27262965 26873255 26728138 26563100 26279597 26043129 25635622 25227524
4011 25227524 24618434 23936836 23122164 22104188 21161945 20310205 19576814 19031585 18493713
4002 18493713 18248530 17728240 17329491 16852439 16520040 16138755 15391040 14916496 14461545
3993 14461545 13744975 13393917 13034228 12602899 12251481 11830214 11626303 11298626 11175713
3984 11175713 10896709 10467084 10264126 10078849 9888047 9793374 9666010 9466297 9203818 8988545
3974 8988545 8840991 8783439 8658641 8674299 8669371 8554599 8504514 8553939 8716051 9084107 9514396
3963 9514396 9630276 9925304 10392933 10763998 11090205 11127895 10724504 10065984 9220801 8749096
3953 8749096 8616976 8232194 7878450 7732014 7833702 7454197 7244761 7114782 6827965 6621504
3943 6621504 6346914 6477794 6409314 6445434 6465750 6508836 6499674 6349414 6279858 6248792 6223668
3932 6223668 6461010 6448815 6286077 6256612 6192952 6319829 6571229 6736583 6871204 6741173
3922 6741173 6680832 6741996 6629389 6614947 6629164 6653348 6622383 6206940 6131028 6203368 6305370
3911 6305370 6370113 6262439 6211832 6099120 6198196 6102286 6289234 6322568 6100610 6279656
3901 6279656 6184393 6199517 6240817 5959568 5923922 5863112 5883980 6195303 6050481 6111500 6077171
3890 6077171 6050602 6242249 6468430 6542281 6539904 6522978 6641909 6758635 6526546 6545536 6697281
3879 6697281 6758348 6556709 6658689 6664545 6568606 6494658 6412524 6408990 6277315 6192542 6221100
3868 6221100 6311800 6256310 6346409 6557360 6634624 6676402 6668984 6787656 7202559 6972123 6927155
3857 6927155 6938857 6617127 6442526 6420423 6570845 6618735 6576487 6584433 6592377 6714970 6682136
3846 6682136 6612092 6703729 6834079 7017703 7030016 6996796 7063112 7068588 7082592 7220471 7248408
3835 7248408 7364597 7180406 7141624 7059106 7219934 7296558 7226517 7109886 7246529 7270927
3825 7270927 7374885 7345710 7193142 7541767 7641780 7546856 7755205 7539673 7688034 7667922
3815 7667922 7639727 7907826 8016655 7903547 7853783 7895854 7784639 7609599 7662819 7824267
3805 7824267 7906677 8116386 7812704 7786139 7925407 8181715 8133675 8130140 8181627 8377710 8354793
3794 8354793 8353846 8728848 8841705 9090607 9132775 9396387 9791195 9969480 10306948 10671801
3784 10671801 10681528 10965464 11252781 11380333 11441678 11602747 11809317 11934055 11910514 11966332
3774 11966332 12301154 12614346 13062280 13226787 13356838 13741247 14290175 14520102 14602153 15111591
3764 15111591 15381620 15645588 16130495 16727440 17164115 17773526 18709388 19696741 20543631
3755 20543631 21358800 22317484 23210003 23972355 24761789 25563496 26318803 27192769 27542138
3746 27542138 28075052 28772244 29435991 30170540 31096006 32083366 33445294 34980359 36459850
3737 36459850 38340323 40227048 42251222 44355538 46159074 48187240 49759779 50878625
3729 50878625 51862643 52188512 52019219 51659401 51047740 50286577 49369124 48519972 48044172
3720 48044172 47689809 47280720 47003424 46822751 46351281 45720998 45060146 44016847 42620280
3711 42620280 41036831 39344448 37207560 34921244 32774667 30392501 28297573 26459304
3703 26459304 24625635 23041538 21763172 20640681 19476360 18584073 17637632 16958912 16111361
3694 16111361 15409349 14961014 14403819 13919055 13662424 13407929 13203037 13018519 12672900
3685 12672900 12346253 12228031 12014629 11950809 11960062 11751821 11591405 11494656 11214344 11087634
3675 11087634 11074425 10836106 10781066 10829412 10820598 10568587 10439800 10177828 10293072 10366048
3665 10366048 10139933 10110029 10186969 10123464 10017169 9933602 9950929 10131094 9971396 9877536
3655 9877536 9830402 9794434 9723503 9705814 9739052 9586097 9589347 9760072 9670543 9886930 10125147
3644 10125147 9971231 9858117 9881575 10011825 10010022 10287712 10352758 10567870 10628708 10712433
3634 10712433 10972304 11093823 11296197 11244408 11373123 11407394 11490228 11832156 11942033 12014314
3624 12014314 12054457 12299909 12551099 12732556 12913846 13176212 13571303 13882977 14000657 14188714
3614 14188714 14598775 15089378 15500327 15864813 16452733 17132938 17724925 18274112 18986569
3605 18986569 19905837 20970357 21660734 22357291 23226036 23741419 24103645 24605110 25117043
3596 25117043 25263925 25598762 25933242 26094611 26235106 26699671 27107849 27664084 28082404
3587 28082404 28505081 29203442 30058395 30775556 31635473 33053322 34310038 35351439 36924103
3578 36924103 38390923 39895119 41470054 43113649 44477321 45764624 47271358 48570825
3570 48570825 49661860 50482707 50985469 51331560 51476572 51520278 51483909 51423532 51372041 51497325
3560 51497325 52007650 52512680 53408138 54658106 56557687 59139010 61932058 64838187 68463793
3551 68463793 72093187 75359571 78615635 81132631 83231078 84759448 85613056 86064444
3543 86064444 85995115 85538355 84681781 83842037 82613785 81202166 80008889 78677448 77069530
3534 77069530 75591499 73746707 71700363 69187258 66685183 64107011 61187080 58030130
3526 58030130 54935081 51822810 48779051 45629126 42764115 39958782 37252376 34939709
3518 34939709 32955720 31155485 29230147 27908660 26685000 25396978 24269268 23293139
3510 23293139 22643525 22013963 21344670 20808183 20219382 19751425 19201410 18842519 18590270
3501 18590270 18131074 17882546 17476802 16923927 16600546 16333134 15933094 15662399 15632468 15404234
3491 15404234 15269633 15172804 15111170 15286083 15366253 15222868 15098435 15221051 15290762 15322149
3481 15322149 15238049 15053884 15014337 14896765 14639795 14429869 14152291 13730754 13331336 12900624
3471 12900624 12409377 12096068 11494837 11067887 10830339 10399363 9983531 9730038 9540797
3462 9540797 9267058 8929739 8680315 8619850 8357105 8204553 7984212 7844861 8061102 8167226
3452 8167226 7933594 7678781 7846906 7728234 7605534 7518681 7421633 7320136 7296128 7462795
3442 7462795 7327742 7273833 7079030 6921463 7058045 6991085 7051696 7115965 6988512 7031359
3432 7031359 6958127 6974051 7124752 7049199 7120339 7286725 7246770 7105189 7030130 7105228 7055947
3421 7055947 7083125 7166885 7288530 7301220 7307612 7334572 7414644 7497433 7465399 7400308 7516686
3410 7516686 7667539 7789363 7864822 7792555 7894635 7915127 7895229 8001159 8126197 8160085
3400 8160085 8316848 8465478 8424566 8638076 8789170 8869802 9100454 9298790 9512600 9796122
3390 9796122 9950338 10271875 10350895 10594794 10812508 10958325 11161886 11522706 11936435 12263823
3380 12263823 12365718 12600027 13051121 13519803 13912961 14209908 14635680 15080870 15632115
3371 15632115 16007360 16531380 16991440 17441153 17970541 18331748 18342377 18403267 18559114 18523545
3361 18523545 18630702 18630013 18873076 18992165 19048190 19109146 19310916 19750830 19807637 19998353
3351 19998353 20254386 20208523 20226321 20235678 20511573 20648333 20647994 20801207 20812758 21015867 21325931
3340 21325931 21746594 22222226 22480438 22912566 23597921 24296162 24853924 25596538 26656401
3331 26656401 27432450 28357720 29310712 30207906 31207609 32015887 32929772 34119222 35421549
3322 35421549 36779108 38184118 39782357 41330872 43245247 45468530 47686432 49860127
3314 49860127 52087631 54125387 55822096 57472258 58914699 59962844 60903112 61474088
3306 61474088 61899893 62121008 62176250 62350198 62625438 63326889 64150753 65003973 65918425 66730152
3296 66730152 67786666 68556400 69162538 69807026 69857143 69895507 69670295 69199343 68789965 68408358
3286 68408358 67895859 67145888 66667480 65917540 65277153 64326146 63620503 62919909 61993918
3277 61993918 61230156 60531537 59958712 59178605 58246709 57186389 55920826 54267274 52391776
3268 52391776 50481580 48608597 46802225 44761299 42436415 40056571 37772277 35861343
3260 35861343 33965732 32349934 30835017 29402957 28081251 26811501 25401931 24593853
3252 24593853 23959530 23203440 22708175 22105108 21801995 21657892 21433446 21250885 21045085
3243 21045085 20580498 20169702 19873447 19603178 19475525 19219017 19213335 19172921 19137223 19198759
3233 19198759 19384781 19531925 19672284 20013337 20236184 20493924 20586561 20805654 20527186 20169149
3223 20169149 19805622 19559108 19480008 19306068 19099449 18735159 18516992 18359202 18212225 18297939
3213 18297939 17945826 17446561 17102082 16788662 16348673 15888133 15471016 15203167 14875474
3204 14875474 14522437 14445410 14059241 13755334 13720920 13612149 13541069 13679700 13678994 13683324 13647519
3193 13647519 13343410 13142936 12961320 12645467 12629789 12574219 12567307 12288674 12156949 12145721
3183 12145721 12094873 12035371 12171137 12357904 12439854 12629634 12712951 12903420 13035054 13299079
3173 13299079 13628928 13890332 14254498 14663225 15225492 16043272 16415562 16527700 16775363
3164 16775363 17177071 17644226 18223387 18806634 19244224 19930711 20672442 21178648 21968531
3155 21968531 22711073 23508973 24431170 24964351 25596408 26399530 27536554 28744623 29844929
3146 29844929 31170933 32783157 34455630 36670873 38935796 41505567 44098498 47093207
3138 47093207 50392965 53744553 56969970 60247182 63546168 66381333 68642929 70435637
3130 70435637 71649621 72199574 71683905 70376678 68249222 65453727 61934859 58093331
3122 58093331 53993102 49917813 45741646 41796659 38294981 35069365 32180619 29619478
3114 29619478 27542176 25625810 23846139 22140248 20911136 19626406 18526459 17423250
3106 17423250 16476496 15732174 14819163 14215050 13674131 12978237 12507671 11896230 11615461
3097 11615461 11079029 10703471 10458991 10133950 9806527 9446802 9320639 9002431 8671305
3088 8671305 8602206 8565465 8189671 7810177 7805449 7700754 7405781 7234989 7428822 7416224
3078 7416224 7417839 7066407 6908205 6731237 6601756 6625262 6729822 6385255 6248567 6105920
3068 6105920 6059549 5843592 5892221 5685532 5575186 5457369 5271383 5143951 4982569 5076909
3058 5076909 4926381 5014846 4847251 4524264 4555509 4666608 4632507 4540374 4308812 4328691
3048 4328691 4318720 4641148 4571528 4372241 4308973 4207690 4271442 4258671 4212036 4205066 3950270
3037 3950270 4108812 4194923 4265689 4115719 3986915 4024126 4017023 3892584 3832485 3907488 3710237
3026 3710237 3860371 3769215 3795353 3831982 3728544 3801516 3706461 3798520 3830444 3898658 3820889
3015 3820889 3589175 3527781 3794253 4018947 4078333 4033218 4107120 4314535 4154199 3868695
3005 3868695 3954079 4046052 4125358 4147465 4018703 4012025 4296821 4492961 4546042 4309006 4155768
2994 4155768 4277791 4276503 4303169 4351395 4556742 4728944 4602408 4813220 4759186 4463575
2984 4463575 4611844 4724012 4869994 4892002 4814444 4898723 4833861 4931226 4917776 4810475 4962650
2973 4962650 4951296 5018486 5181383 5116125 5178923 5246590 5253554 5408537 5621932 5647914 5940321
2962 5940321 5907704 5976040 6059710 6112831 6391914 6604383 6491988 6442356 6569448 6474918 6812257
2951 6812257 6981135 6994676 7294489 7466913 7640896 8019201 8306798 8360645 8631153 8924922
2941 8924922 9160610 9380078 9339364 9689278 9820556 9979970 10392041 10820779 10747140 11008789
2931 11008789 11347768 11605525 11794063 11871292 12179607 12506399 12932379 13354672 13560610 13791896
2921 13791896 14270402 14670832 15117402 15597798 15921636 16302607 16821993 17282044 17729546
2912 17729546 18191235 18583150 19359631 19947220 20464143 21104174 21800905 22314167 22931516
2903 22931516 23734611 24539354 25675715 26571391 27581523 28685059 29697273 30780893 32186999
2894 32186999 33607033 35149836 36888686 38481971 40696582 42834012 45120855 47662029
2886 47662029 50106874 52200148 54141977 55704274 57085584 58041985 58736703 59689165 60752169
2877 60752169 62442836 64430291 67050309 69929314 73628551 77881205 82482166 87934429
2869 87934429 94402147 102220475 111626184 122576243 135307844 149847739 165187613 179904093
2861 179904093 193335438 206157024 220113489 236411073 254433453 269947901 277301299
2854 277301299 271740835 253622784 227884558 200689863 175777183 154540960 136899276
2847 136899276 122377507 110521943 100165399 91318669 83726260 77135739 70965110 65746276
2839 65746276 61052935 56730872 52973949 49402344 46408422 43779955 41231788 39126696
2831 39126696 37306711 35778532 34166494 32696670 31506368 30268793 29007108 27618614
2823 27618614 26411696 25150618 23946249 22876380 21776463 20872222 20048399 19333124 18679298
2814 18679298 17880233 17262658 16743189 16348331 15841803 15359017 14705746 14087394 13641449
2805 13641449 13315834 12928635 12528124 12009849 11535315 11189011 10898514 10650148 10353023
2796 10353023 10008427 9843303 9571397 9372341 9201527 8840032 8665249 8392250 8129960
2787 8129960 8035254 7690365 7526631 7488370 7434452 7345307 7166417 7088499 6904154 6796813
2777 6796813 6584982 6462073 6354228 6265173 5969420 5930499 5754810 5675978 5659804 5590150
2767 5590150 5513696 5403569 5146580 5154823 4984312 4839350 4800131 4719386 4662158 4522766 4354767
2756 4354767 4380842 4349778 4036289 4046210 3975577 4050128 4110426 3977792 3795581 3783880 3513997
2745 3513997 3299587 3435912 3466547 3480126 3369465 3226781 3106640 3101508 2984793 3050320
2735 3050320 2996840 2962378 3102541 2993463 2795949 2514634 2540816 2543470 2623153 2557899 2486045
2724 2486045 2626275 2538696 2524310 2366663 2155839 2408975 2481761 2290482 2384287 2159816
2714 2159816 2106733 2321777 2356575 2262991 2237623 2248581 2274334 2152428 2042808 2119100 1922398
2703 1922398 1958996 2012010 1782597 1850120 1859841 1914641 2183162 2098361 1972977 1971321 2104000
2692 2104000 2066452 1863165 1785227 1734664 1679453 1645724 1697162 1653665 1603324 1621519 1467089
2681 1467089 1244231 1209019 1325935 1470798 1402374 1305286 1278713 1245469 1172851 945083 1091355
2670 1091355 1115161 1153648 945462 1019820 1034009 1192007 1136447 1234508 1285900 1240361 1008369
2659 1008369 1033484 943777 798018 897218 1032812 801463 861476 906466 703175 648072 703793
2648 703793 853444 800064 808658 803545 720209 703504 665209 607416 755012 763688 1066846 997478
2636 997478 882601 636645 764687 632066 843453 756492 644091 834791 710928 604011
2626 604011 605557 425682 505329 568060 520794 665388 661847 687892 813964 631485 720094
2615 720094 756717 779387 917322 965728 842400 903714 928281 1077430 1015359 1100106 980186
2604 980186 812375 802831 618838 841995 883410 887326 952362 1091271 943899 912242 965183
2593 965183 918131 924795 990634 893849 859604 902017 884606 894082 1039907 992832 1016091 1174965
2581 1174965 1179113 1280248 1338890 1333190 1259512 1336822 1436885 1606142 1705255 1792075 2002572
2570 2002572 1926172 1797111 1633557 1389875 1261749 1339316 1229558 1250732 1053564 973242
2560 973242 873571 570285 546871 681150 738324 493580 607973 720026 514237 359742
2550 359742 703877 671958 339703 368262 320085 452408 573217 317260 336256 361267 155540
2539 155540 91760 299977 466429 68562 174188 167438 301255 170536 104605 52570 -77904
2528 -77904 16269 292660 492136 422181 424493 166336 159460 206723 184721 189530 43445 113695
2516 113695 -38474 -43040 69377 139191 237822 256040 162389 58481 83786 16582 130661
2505 130661 336141 341198 253128 113902 98797 111564 48959 -4827 129868 276644 291637
2494 291637 274936 -12228 -75365 77749 122763 176753 174002 14501 184345 239048 201458
2483 201458 242858 312430 384866 371673 141285 -111726 -209218 -21010 81553 6785 -57254
2472 -57254 17593 -17100 -105926 -121836 -91807 174633 170621 150208 144455 75353 19284 -23046
2460 -23046 -123897 -173760 -243894 -140005 2086 -48634 -40134 -77046 53438 103049 200567
2449 200567 108577 14944 78287 138274 59882 62821 -8439 -19950 290636 198284 108801 126658
2437 126658 -190100 -38872 148933 294774 208955 -19562 20634 103061 261980 225507
2427 225507 292410 75099 224618 246174 -4560 16686 -50286 -9253 62112 194511 304451
2416 304451 174188 72815 225355 141726 148613 -95151 -73380 -124653 -12463 -14400 99025
2405 99025 258858 205850 212055 127759 45994 78933 263155 18010 -149784 125269 124842
2394 124842 124941 122752 97958 239625 48243 36108 11740 165132 126916 192920 99558 74736
2382 74736 96018 137675 148866 229657 171101 259100 101844 144240 247225 531475 592332
2371 592332 447464 343097 110613 -11420 45168 30220 -86046 -900 1193 -34294 50872
2360 50872 85969 46001 39515 -69079 127807 264961 286137 196963 212678 142587 -4357
2349 -4357 -109466 -53676 -77176 -40405 -143535 -202773 -195520 -73432 -29427 204541 83343
2338 83343 180061 203729 146729 196453 113627 114619 221851 51201 -83736 156881 65898
2327 65898 88975 59523 185635 180147 259989 204455 43367 -15299 37505 -9582 98048
2316 98048 -68996 -9415 69877 52712 25984 65152 9632 -208479 -62023 -13740 -32405
2305 -32405 -94061 86219 108938 335206 235505 1999 133431 117597 83930 277441 247877
2294 247877 194794 331222 218947 -45637 83035 253577 274742 188209 216516 141918 -156642
2283 -156642 -144646 6978 291826 292618 85524 50566 81952 123357 108253 710 85325
2272 85325 27142 -20544 63969 187649 110083 -59505 -32955 160065 36429 63395 340467
2261 340467 327902 353422 347925 268316 75308 203445 272701 183722 130572 303584 398504
2250 398504 195600 405226 437453 116480 107855 127736 252676 206915 61662 221008 465239
2239 465239 447308 344967 389431 395321 384536 354351 306840 271502 258505 438606 434785 264745
2227 264745 486126 519378 587319 679267 625973 620931 388251 305919 395312 389673 445666 523170
2215 523170 665750 667913 659882 527846 386583 494777 512192 482923 466534 496433 424347
2204 424347 381887 366935 606922 581674 666577 697636 775734 826924 745054 994377 859686
2193 859686 757571 944474 950809 789172 938766 1002019 1227979 1239302 1177547 1181560 1334801
2182 1334801 1174602 1076208 1205643 1345221 1359301 1315591 1489407 1429200 1532152 1411177
2172 1411177 1433735 1592419 1518417 1582612 1661145 1746264 1882917 1895482 1880648 1893011 1874017
2161 1874017 1805960 1882983 2228918 2180965 2264423 2313366 2310740 2501487 2621834 2739293 2709477
2150 2709477 2806278 2806860 3083447 3106135 3214568 3393765 3680357 3915703 4072577 3919684
2140 3919684 3919816 3991680 4141856 4370187 4486998 4753878 5067270 4977929 5103115 5444718
2130 5444718 5809009 6313106 6451625 6724751 6990163 7313837 7810805 8393875 9177475 10047725
2120 10047725 10840164 11356275 11806723 12390910 13162429 14414363 16294227 18403980 21185385
2111 21185385 24491180 29121122 35170982 43206027 53115041 65042938 72393231 64300223
2103 64300223 51239439 40240067 32155928 26383897 21962126 19099457 16652931 14783658
2095 14783658 13037747 11854499 11130613 10468128 10073569 9536922 8655497 7863026 7288489
2086 7288489 6579894 6099500 5558573 5116935 4899442 4418167 4187182 3960217 3886602 3724710
2076 3724710 3580131 3476561 3213263 2966578 2755628 2634380 2417730 2236968 2205279 2170869
2066 2170869 2268150 2137143 1994793 1855212 1873550 1724905 1814616 1697442 1600398 1621647
2056 1621647 1521904 1402281 1438367 1189293 1151557 990336 838073 996993 927815 852044
2046 852044 1074796 1018866 790213 937304 1024282 813150 664365 814878 965212 780586
2036 780586 840590 696374 479866 428793 707440 648909 475576 574569 688011 639548 672185
2025 672185 619212 506846 721762 745570 524769 375582 504504 531206 446495 449010 528745
2014 528745 507551 447387 454384 538597 514474 293156 342274 452618 462637 418448 314612
2003 314612 465781 535509 482711 275243 184062 148810 332341 328303 401158 424506 292689
1992 292689 499746 446171 313974 155692 185675 435532 405695 365382 201707 249659 237955
1981 237955 109758 214500 155293 184665 244580 242329 204178 361413 368653 403081 259792
1970 259792 93774 278878 200824 287921 229942 193710 161383 157610 145724 183197 197241
1959 197241 245586 103802 119909 173287 19028 17208 252791 236600 238321 95830 60293
1948 60293 7447 -135070 -126093 -12204 61669 165955 75695 100756 39018 -117418 -49050
1937 -49050 73685 76830 18531 -49804 -31063 58625 72929 31722 76956 61709 3915 -91787
1925 -91787 16203 -11849 -65302 -84327 -218269 30868 28208 35204 140720 96120 25568
1914 25568 -42425 -18127 57700 -40219 64310 -46146 88417 11253 -55419 142184 176565
1903 176565 10882 73724 -1155 19787 107949 125513 169839 64540 40067 236857 275823
1892 275823 93881 -144078 42941 177873 -84065 -117976 -145437 15097 162146 124275
1882 124275 54549 -90419 -37309 152560 169805 82749 11003 66284 -164148 -101419 74445
1871 74445 115560 9043 -63691 73747 85032 -12691 -143722 -306685 -191944 -114303 -140502
1860 -140502 -179966 -142750 100375 -12709 41305 -53909 -152484 -150547 -73960 -45868 93326
1849 93326 -239530 -72512 168035 83717 -28894 32127 123743 113331 199925 74397 181659
1838 181659 277630 403451 381272 464882 534421 445636 267577 90171 167687 105840 -33799
1827 -33799 -77753 -55086 22691 101488 146533 -110154 -222134 14996 64629 -24165 -137898
1816 -137898 -85561 79273 22680 -45707 -84146 -129740 -149797 -116645 -96852 35266 13378
1805 13378 -6935 296073 225675 65211 -97070 -52804 27072 -113618 -184524 -230730 -37457
1794 -37457 -123943 -237359 -358703 -192419 -138805 -134655 -74610 -183591 -236108 -73698 -73003
1783 -73003 -160 -14671 -830 -16918 -38445 98206 166151 -125442 -163886 91127 47025
1772 47025 122593 153091 53167 -27733 57066 20574 37524 48684 -50309 -163912 -214458 -170946
1760 -170946 -13824 -99651 -23868 -76881 -204710 -167278 -71188 -4575 -69157 63942 -106420
1749 -106420 -136931 -224622 -226631 -201299 -131569 -80202 -37807 -204722 -223547 -131013 -255789
1738 -255789 -298644 -219003 -118168 -144198 -108618 -99207 -189167 -315642 -268807 -195646 -116252
1727 -116252 -225554 -187714 -7927 -63831 51416 76456 17183 -9345 -71507 -88711 -32134
1716 -32134 48865 -73170 -200590 17591 55509 -140910 -176973 -136713 -239819 -341211 -133524
1705 -133524 -101629 -103510 -212448 -239873 -147354 -230203 -82145 175752 44269 37188 -99191
1694 -99191 68868 38340 -134402 -106234 -255759 -336552 -105248 33741 -124973 -193604 -82451
1683 -82451 120420 20603 2457 -119815 -186165 -170028 -54492 34774 -68312 -76458 -8912
1672 -8912 -140258 -97248 33156 -92741 -36982 102085 -27803 -200643 -175382 -27646 -46058
1661 -46058 41750 -69700 -101064 34187 -42647 -152372 -194162 -86600 102431 27328 9542
1650 9542 17497 -278499 -80763 -31964 -209826 -113152 -26313 7685 165882 136329 -95740
1639 -95740 -404310 -258740 82864 6776 -56894 -53465 -125361 -64952 192926 244866 -46539
1628 -46539 -25850 -128839 -285333 -324768 -84752 -83508 173786 267914 168498 98524 139750
1617 139750 -50241 -120742 -219082 -345595 -250439 -307986 -180642 -179459 -140338 -190630 -230317
1606 -230317 -30386 -96210 -287926 -277283 -186244 -189223 -113854 -83718 -215665 -173881 -131973
1595 -131973 -31080 48907 66559 163237 104463 -53928 -180359 -48772 167839 133199 178478
1584 178478 -21431 -13668 19103 -26350 -131984 -51540 -223872 -117891 -160474 -31750 -37696
1573 -37696 143573 119629 64139 -9852 -35100 -85845 26449 155409 -88040 -73643 73563
1562 73563 162893 194765 180900 -92156 -123137 -89477 -74169 -184664 -231965 -108926 -138097
1551 -138097 -230514 -204368 -256957 -225949 -193302 -296317 -383463 -326137 -239798 -50550 -81999
1540 -81999 -80298 -27855 14898 29661 -46032 -65328 -12557 -159052 -46623 -92015 -91433 85630
1528 85630 -75787 -113118 -119179 -78482 -8248 -112824 -235312 -142575 -256724 -183537 -87131
1517 -87131 -118177 -255468 -303237 -207510 -96707 27464 -48999 -233846 -134222 -271935 -412231
1506 -412231 -392047 -412703 -232047 -153350 55120 -36091 -38867 -28573 -105460 -48983 -35423
1495 -35423 -34176 -28837 -92154 -324968 -112780 66699 157237 -64201 -304794 -163541 -59353
1484 -59353 59224 -61554 81582 9095 -68455 -110914 -218382 -244958 -207538 -141995 -81885
1473 -81885 -158007 -9245 94349 -13810 -233538 -382199 -366860 -242754 3187 25394
1463 25394 -20381 166717 31739 23103 -86758 -172580 -199419 -183957 -20784 -102653 -90090
1452 -90090 -47091 -37183 9698 -15079 50693 -108650 -98359 -107556 -166288 -30429 -234353 -237340
1440 -237340 -224210 -263319 -195559 -86098 -194202 -153667 -270540 -194970 175724 73441 -182843
1429 -182843 -281535 -247071 -27999 -151104 -278643 -245576 -113358 -31886 35347 101248 88398
1418 88398 39048 70747 -57069 -131627 -44676 -45518 -225304 -257963 -173673 -56804 -58521 -238370
1406 -238370 -202019 -273730 -83699 -201437 -334756 -170283 -95168 117036 265447 172158
1396 172158 -21141 -152284 -54812 -177215 -180081 -52522 -70714 -49994 -35226 -166979 -49134
1385 -49134 -24921 -155199 9764 -105786 -129835 -90769 -174786 -235507 -204588 -166234 -89774
1374 -89774 -45432 -38782 160629 164627 31185 -88396 -44467 -82686 -263710 -143936 -14642
1363 -14642 -67662 -13682 -83213 -173728 -143726 -106838 -107457 -331831 -191947 -239495 -87391 -48590
1351 -48590 -148805 -258297 -265012 -237493 -283838 -312856 -168967 -2297 -92933 -154375 -112936
1340 -112936 -57572 158716 198792 93791 -48797 -139433 -251437 -272203 -318011 -149142 -57128
1329 -57128 -319201 -290537 -170213 -147842 -185869 -62060 -365784 -230410 -190874 -59873 40654
1318 40654 -15202 57774 -111808 -110839 99557 -135559 -198497 27286 -95214 -176518 -136394
1307 -136394 -70736 66529 -29360 -173113 -11546 -50287 -59786 -14424 129206 204950 115849
1296 115849 -119258 -180633 -213578 -68717 16370 -35576 -291642 -137853 4201 -58092 -22595
1285 -22595 -128444 -76122 -186069 -183830 -30827 -3664 -67123 -96853 -233119 -131914 -117672
1274 -117672 55755 -7872 -117956 -210905 82591 87114 31533 -43966 -90125 1243 66707
1263 66707 30338 -17603 -1236 -78948 -51401 -57516 -15070 -51460 -145085 -116584 -38041 33108
1251 33108 2485 -7532 32368 35682 35074 -20586 92667 102323 -13353 -100368 -90181 -167002
1239 -167002 -168397 -164421 -180710 -48640 -58267 -117747 -305022 -369806 -79068 -140941 46510
1228 46510 117363 -107 -10748 42200 125761 9786 -216355 -160291 5972 75776 139331
1217 139331 127456 -14410 -180129 -63022 -110498 -260856 17255 41592 -90837 -113439
1207 -113439 -250749 -372274 -256368 -88619 -109370 -297875 -377819 -358830 -315199 -84771
1197 -84771 -25645 -101739 -114727 -59615 -35644 -80327 -43125 -13876 -107936 -131039 -70421 -101975
1185 -101975 -115135 -115215 -310384 -200397 -196981 37735 108456 -144761 -23710 -42026 46106
1174 46106 12235 -5124 -136753 -179576 94162 -79077 -249517 -155252 -154188 25075 42900
1163 42900 126942 70238 -13069 -92729 -120706 36295 190090 262255 140308 20966 248284
1152 248284 81145 -177078 -161524 -247002 -211038 -38498 -63345 28862 -18927 -91446 168707
1141 168707 126211 69954 -66920 190121 128179 49983 40476 -9347 48886 -114258 -66013
1130 -66013 25446 -41781 -100030 66736 27547 167499 118856 159131 75336 -123812 -208793
1119 -208793 -257605 -179036 -82885 54916 -9579 -75467 -21695 114600 48181 110357 112073
1108 112073 57535 -20539 -29906 59358 178617 5908 -197743 -288733 -33032 -44 -1643
1097 -1643 11321 44800 41342 -43930 -64260 -29617 -127347 -89907 -126331 -18293 64850 -33120
1085 -33120 -119645 -89219 -75930 -99469 -192163 -141604 18532 -126838 140578 115293 -98875
1074 -98875 -86118 37042 -24699 1215 105590 141541 113640 66158 11498 -179218 -119178
1063 -119178 -43163 29570 161545 40924 4220 49998 -75076 1953 86503 50538 45414
1052 45414 146023 163682 53320 23660 -37743 94528 -91666 -118089 45393 -162173 -281880
1041 -281880 -309068 -206416 -196952 -274403 -68685 -196121 -117774 54768 -149405 -276090 -92149
1030 -92149 -44776 15503 33079 -17921 -14431 22213 83657 -13899 -30182 -103014 -192265 -3873
1018 -3873 162336 144009 263444 64655 65107 73142 207902 97579 -7015 267434 150545
1007 150545 64788 66507 55501 -51247 -13927 79535 538 70033 1384 -5459 35547 67638
995 67638 282456 316311 245854 103634 -118155 -106015 -193421 -205721 -5404 -42261 114886
984 114886 132998 5729 -67328 -117485 -285477 -238172 -228993 -129701 -8130 93584 -152144
973 -152144 -265747 -137100 43354 3438 -144807 4765 101858 5610 -18723 -70920 -100082
962 -100082 -36136 28604 96528 66445 71017 -32053 -84982 16341 -31946 6985 -79784 -46128
950 -46128 -18941 -114078 -159565 -128049 -166917 -100027 -203639 -317725 -220893 -161498 -57229
939 -57229 -20586 -2226 -40494 -33114 -13455 24817 -126774 -64997 -46278 43883 -127387 -41477
927 -41477 25889 -124675 -78192 -10017 162150 181005 105241 31719 18190 39766 37982 37303
915 37303 -4902 87061 -57714 -38664 -65408 -44251 -3058 -173983 -134770 209132 33270
904 33270 92268 96578 172011 95089 136764 288844 335690 110951 26173 3462 83017 12689
892 12689 7587 105980 -28960 178682 296347 139765 74421 -12766 -79888 86381 70918
881 70918 -26509 37519 91882 51267 53190 -60229 -171457 -219566 -50906 -21228 99695
870 99695 -31358 198345 199234 -8286 -29787 -9610 101702 163543 76712 67273 99100 28918
858 28918 -153197 53443 102506 247244 60567 -151812 -98179 -39827 61827 15845 149635
847 149635 93702 39365 -20426 122235 9591 45236 -28814 -95049 64057 73881 -21413
836 -21413 -132165 -83669 -230438 -175139 -195822 -63092 59377 101649 74814 99117 20510
825 20510 241140 139004 58128 98926 61040 -49953 -72765 -142952 -39202 -111246 -24168
814 -24168 32933 -19034 -23699 -76713 -31686 -8754 56055 -271697 -70481 -27553 246735 205267
802 205267 181982 162829 165475 49668 33561 202787 138065 52289 10560 118988 -5709
791 -5709 -158668 -122178 12082 70309 146277 3025 -58528 64374 46722 37535 -71064
780 -71064 72508 -236820 -177647 116349 114501 183934 39879 28468 88967 -5593 -96763
769 -96763 -147405 -84022 -24858 -32362 8678 198995 243405 159703 208394 -71288 -98091 -2334
757 -2334 -24464 62659 116250 84871 212708 213152 109234 35808 -89828 32475 39146 13940
745 13940 -14319 -174428 -57549 -15350 -69062 -162742 -105871 64002 32906 100830 -8277
734 -8277 -47541 140315 -29638 -17088 86470 104964 112725 -9192 2673 -106190 -77183
723 -77183 -10279 119180 10363 -76183 -29197 -82570 29779 188385 218512 88553 31173
712 31173 -98419 -47372 61652 94000 177346 418025 168125 23535 7618 74413 129139
701 129139 96811 -145812 -263897 -90808 91554 270103 241572 293467 181466 120703 195837
690 195837 21925 55512 193907 113373 15663 -38036 97534 -46736 17096 195395 116255
679 116255 25770 176302 190026 196148 178623 109956 22315 89126 33357 12899 99776 123965
667 123965 38886 17686 -22515 -101106 -140294 -151469 -998 -120242 -187051 -68065 -29678
656 -29678 76615 70127 97545 54761 -38896 87980 104449 9171 -115588 -104438 -42742 -186149
644 -186149 -164804 -44141 -81140 -5873 89820 129487 137982 40427 387491 388429 208649 93947
632 93947 88070 92010 72365 112546 117910 85219 27752 127287 55014 98093 140216 -1031
620 -1031 -132873 -75536 -35957 -28454 -105577 -153120 -51242 120047 -27314 114593 163058
609 163058 47534 -65216 49695 158802 192206 331441 239875 -38762 14295 191242
599 191242 119421 -8658 48222 2496 -145806 -31895 -193496 -328424 -162275 -31603
589 -31603 -75688 -66054 34418 35273 -66031 -21417 -57049 -192523 -164319 -117019 199183 83960
577 83960 10728 188637 121559 81877 -105831 -7252 66615 89158 133619 -141907 14618
566 14618 90372 112661 78855 105381 99125 101872 201500 146412 84187 57388 93039 152189
554 152189 15176 246003 348528 159313 165200 166017 121144 74256 108361 11973 17556 -33825
542 -33825 -7424 79683 153712 117271 19301 120559 12185 108360 78194 22121 145111
531 145111 -124474 -156107 -135808 -119405 -38911 -52867 -52408 94283 151419 134560 153199 214533
519 214533 199412 185207 -108786 -115727 115302 137770 -70649 61054 -15223 88731 188645
508 188645 49928 -93738 -56168 -14266 944 98795 173533 88946 -129826 32027 64357
497 64357 252347 81929 -59997 79140 131254 -2336 179475 217723 49891 82080 228399
486 228399 254212 202795 291876 177167 95903 65491 -46995 -123332 -72094 95544 295250
475 295250 105944 -58856 7719 108205 53375 128813 -33243 -106626 -34573 96941 113346
464 113346 119560 16 -64241 -141899 -276113 -168925 -85854 -195732 -166610 -41045 23338
453 23338 27199 188425 49782 -101299 94165 -10243 -219490 79474 101576 13651 197880
442 197880 136487 12030 306544 384424 142195 243798 75637 147547 182143 67136 106231
431 106231 346562 218552 137420 165132 247017 403004 289691 239509 279884 -8662 31620
420 31620 271936 526815 472184 223737 207260 273526 332602 164009 -172504 -208279 132054
409 132054 194263 153916 125624 141439 23175 -137542 -46051 86557 415844 248619 130011
398 130011 4883 149990 289096 189050 126307 157851 250324 154709 104030 64796 21787
387 21787 160274 175914 260043 63029 -89928 56931 61213 177121 239834 2054 215738
376 215738 207881 -778 -53278 158936 218994 315633 278120 216174 333935 29169 -172135
365 -172135 -51725 190762 141816 44499 3304 13615 213529 321050 244577 310847 80167
354 80167 39916 60453 171138 264221 159662 103852 152550 116720 37406 -7778 246207
343 246207 405326 414573 321638 282653 374501 171447 186375 278884 113037 -93379 -231809
332 -231809 23374 232514 262247 177618 335464 220362 63552 123282 323937 259704 149610
321 149610 15069 128655 149922 166556 59025 107651 180409 211397 -18419 -74069 214807
310 214807 10253 101313 -4482 -103257 112027 186 15358 153992 67088 229097 339292
299 339292 297820 300686 301390 67574 49579 192611 224940 204007 -4613 16051 -123545 -33972
287 -33972 61916 48857 181290 88959 113467 207198 245121 64468 9944 220760 187095
276 187095 111882 -65883 149331 181274 215961 165154 156368 409306 311297 117404 -44076
265 -44076 265104 324262 355820 163415 185069 287477 94675 70512 136969 157041 175857
254 175857 95169 -80117 74304 146923 59433 215209 66630 146035 43337 36053 139781
243 139781 263266 121993 176396 147336 194360 142703 329880 251655 234112 273669 127627
232 127627 313546 304469 148654 -58882 6571 -17091 144947 162192 124449 232897 188196
221 188196 210886 91806 118394 117702 143616 335132 226656 196505 337531 281472 68219
210 68219 80364 40191 134302 211955 192151 71843 83213 33179 -73076 98851 184441
199 184441 204449 122056 146643 208511 115059 160486 229156 314692 125552 189814 303692
188 303692 352265 231749 190347 148939 139250 67163 39743 88542 238145 242316 270647 204196
176 204196 141013 261328 -49152 -6052 -14085 88073 131729 138864 239651 269408 223852
165 223852 328235 158631 54088 250334 189580 173963 143469 255019 113064 -61085
155 -61085 -7006 329650 241569 319761 135770 -22038 199420 194997 291405 198037 64737
144 64737 127733 151013 160052 110479 70298 128250 239086 278488 226292 92606 169508 260063
132 260063 177320 83410 -7367 152004 182470 168373 92213 33868 60786 59757 56793 265507
120 265507 303215 327273 75505 42494 167391 197634 195035 209578 226196 327513 317437
109 317437 202452 312907 419764 308487 174235 205485 273137 189434 -24315 127959
99 127959 114887 208916 97356 114270 227374 294133 299819 206994 80137 116499 370105
88 370105 325561 299120 209900 161912 192604 145225 158808 68312 58202 49230 -94500 63750
76 63750 170473 209909 239517 123779 60995 25985 215379 223797 194550 124280 -43422 115525
64 115525 191572 136929 199562 313738 122338 131338 85664 107734 100946 138430 224414 241349
52 241349 316356 342760 244057 212899 187765 132209 147670 95645 101780 283091 306449 89437
40 89437 108898 78020 168750 212104 21878 159000 255473 353343 444232 349746 238527 238444
28 238444 254011 317599 211550 114494 188545 134205 -9539 -126624 -41193 129834 173477
17 173477 136645 80870 125887 120650 71124 179631 231932 246237 198924 172564 298622 246746
5 246746 162135 263305 275070 210385 242545
0 242545
$$ Imaginary data points
##PAGE= N=2
##DATA TABLE= (X++(I..I)), XYDATA
16383 -1450072 -1491991 -1447847 -1340272 -1353622 -1261071 -1160382 -1074425 -1197777 -1266227 -1123044
16373 -1123044 -1150907 -1116850 -1195159 -1097915 -951944 -914557 -1069016 -1062746 -1039624 -988021 -995111
16362 -995111 -1093807 -944133 -931199 -936454 -944330 -1034215 -885410 -918153 -889039 -782758 -765716
16351 -765716 -762363 -753109 -701267 -708133 -734716 -702348 -643439 -555790 -479815 -644793 -594261 -593084
16339 -593084 -561603 -646483 -571359 -538408 -572274 -385372 -308914 -319862 -377693 -338995 -465209
16328 -465209 -447799 -294650 -299842 -328852 -380703 -253970 -145377 -146855 -373762 -498991 -428901
16317 -428901 -450860 -356853 -244873 -216793 -180656 -141936 -226135 -92343 -36686 -130483 -7532
16306 -7532 104347 -19972 -29384 28942 -13339 1003 91199 49435 45094 241502 252169 333308
16294 333308 342139 255789 213326 298732 551736 619167 513389 519459 520847 478032 562257 457085
16282 457085 543167 568843 525470 543177 576209 501240 393797 570468 506620 397121 586578
16271 586578 641209 575984 467542 571560 583640 548459 450887 390291 545070 609408 717552
16260 717552 667683 629361 786990 608898 704241 813703 765328 705798 744582 720434 714087
16249 714087 660212 765318 854375 941682 879286 743790 876058 1024579 1060264 1065238 1076445
16238 1076445 1008848 1057159 814540 993169 993925 889661 922663 940617 1013601 1040649 1102869
16227 1102869 1046145 1153156 1087192 1035797 1163771 1192208 1293784 1292121 1288268 1227926 1160691
16216 1160691 1022512 1107032 1225021 1224870 1114602 1197070 1174775 1396631 1542946 1359170
16206 1359170 1254296 1175563 1177228 1100334 1171483 1180318 1263999 1283295 1131676 1021361 1145767
16195 1145767 1141579 1112962 1260475 1512627 1382324 1169683 1303076 1327529 1336485 1401587 1539855
16184 1539855 1599171 1448756 1398433 1490686 1469878 1366052 1305672 1222064 1311541 1432470 1490916
16173 1490916 1437913 1369856 1466064 1421336 1573851 1672556 1498652 1319920 1259790 1293962 1438419
16162 1438419 1457443 1578842 1465042 1470761 1560932 1346205 1419162 1767816 1803247 1646114
16152 1646114 1581228 1428084 1361878 1359821 1461748 1455547 1544121 1575624 1526765 1587634 1553963
16141 1553963 1563977 1361976 1383365 1330262 1382242 1381372 1434041 1575966 1583024 1536982 1580953
16130 1580953 1499657 1555429 1515553 1856753 1869299 1502504 1508690 1561321 1596351 1726209 1853809
16119 1853809 1612328 1685932 1743827 1774460 1840541 1705898 1640777 1853691 1810345 1672665
16109 1672665 1580158 1663636 1682778 1690503 1687995 1616250 1441823 1503999 1617768 1682832 1678571
16098 1678571 1881141 1714538 1850326 1936373 1829232 1925570 1871228 1950159 1793863 1594116
16088 1594116 1479941 1673656 1864969 1787333 1662255 1816293 1676097 1776674 1780013 1684442
16078 1684442 1831366 1577023 1519351 1683076 1622587 1395960 1575281 1648609 1631396 1709129
16068 1709129 1921598 1813309 1720382 1682861 1571355 1630609 1619181 1653284 1793222 1757259
16058 1757259 1745499 1586882 1745700 1837658 1814932 1701477 1770801 1812037 1657510 1767517
16048 1767517 1839630 1810879 1738470 1761531 1738259 1641343 1705071 1514835 1577186 1725258 1784448
16037 1784448 1683293 1738482 1711613 1601651 1530030 1586007 1732694 1707662 1733752 1742433 1707226
16026 1707226 1650948 1734303 1497987 1824838 1843781 1749087 1709653 1687027 1601502 1686853 1808459
16015 1808459 1717397 1599424 1600261 1673868 1579385 1489636 1680175 1640537 1562151 1599556 1632204
16004 1632204 1835694 1947936 1918355 1790979 1760303 2015068 1943344 1626547 1748402 1679502
15994 1679502 1640097 1791661 1816610 1904357 1938944 1814195 1934929 1848737 1642759 1617306
15984 1617306 1612903 1797923 1805444 1893769 1836762 1843129 1734187 1815151 1814977 1900220 1682085 1684837
15972 1684837 1794273 1745502 1777163 1765892 1894653 1691948 1621378 1663791 1646177 1658315 1689991
15961 1689991 1800392 1803195 1834300 1642435 1637153 1558183 1550801 1607723 1716018 1770539 1687452
15950 1687452 1604281 1655130 1743111 1901720 2014708 1848916 1845393 1669199 1712338 1731330 1866453
15939 1866453 1907144 1890425 1993067 1769133 1652443 1677886 1712806 1746319 1808783 1612516
15929 1612516 1593018 1745904 1737810 1618033 1661605 1735004 1794808 1780251 1555935 1738845 1659897
15918 1659897 1518602 1628867 1604411 1574513 1842750 1819019 1875904 1726938 1499613 1565403
15908 1565403 1832680 1801372 1887238 1730052 1689731 1688342 1612498 1475834 1505369 1636793 1578838
15897 1578838 1628976 1853724 1811153 1753697 1700089 1670206 1683939 1600275 1618394 1591198 1709989
15886 1709989 1639572 1688776 1753628 1806553 1847497 1836433 1771685 1660729 1692756 1724345 1667508
15875 1667508 1873539 2171065 1885226 1904792 1831097 1904915 1866201 1711604 1764413 1725122
15865 1725122 1772235 1745471 1626248 1808731 1850174 1899319 1695368 1640813 1738233 1607507
15855 1607507 1418322 1659287 1918980 1761652 1865203 1807113 1816039 1798690 1641776 1483323
15845 1483323 1486022 1441324 1620060 1659192 1726891 1734798 1836446 1727524 1703407 1588183 1520999
15834 1520999 1646313 1826226 1831231 1603856 1719170 1772142 1632419 1833828 1703482 1797307
15824 1797307 1797430 1585026 1456503 1508369 1629838 1808216 1697233 1463583 1610991 1870376
15814 1870376 1953902 1952113 1733431 1827861 1828484 1732907 1811605 1862674 1904014 1799260 1914198
15803 1914198 1952343 1896310 1826678 1919968 1844740 1763231 1659539 1708201 1642556 1605404 1503040
15792 1503040 1552854 1486296 1640163 1712095 1672984 1737005 1722067 1755791 1864597 1864934 1926324
15781 1926324 1759079 1705053 1688425 1680151 1860295 1859614 1748841 1618416 1654730 1801603 1743703
15770 1743703 1749889 1834878 1619062 1681368 1665501 1643850 1649598 1842730 1844141 1780943 1555912
15759 1555912 1632574 1770515 1770832 1858217 1873989 1875758 1747480 1692081 1739354 1882782 1816057
15748 1816057 1874744 1786840 1603984 1925337 1734471 1695027 1756238 1731102 1860364 1773896
15738 1773896 1655167 1808166 1664122 1680784 1763628 1765654 1763689 1840517 1896219 1892047 1840784
15727 1840784 1772849 1668996 1738755 1717138 1886483 1923086 1755653 1761488 1789877 1886964 1728127
15716 1728127 1764334 1599801 1666558 1775537 1712893 1729354 1942011 1881789 1734247 1565138
15706 1565138 1610926 1596252 1606666 1753695 1797316 1617188 1735886 1742370 1775430 1763731 1823483
15695 1823483 1776426 1601968 1764075 1836161 1732475 1870000 1845042 1683959 1634120 1900529
15685 1900529 1872129 1670860 1710492 1797336 1748939 1853388 1876046 1687654 1748730 1753533 1873582
15674 1873582 1813789 1762160 1803571 1841912 1628594 1799054 1954128 1828442 1934279 1896740
15664 1896740 1804152 1699331 1752753 1806452 1999713 2006034 2026813 1963412 1895294 1884895 1753352
15653 1753352 1725554 1568407 1867424 1776233 1711650 1796394 1687129 1603962 1489984 1728497
15643 1728497 2013226 1855102 1763283 1845902 1814934 1899647 1995435 1961116 1817195 1727192 1773425
15632 1773425 1746229 1775414 1769533 1735324 1729387 1624754 1736194 1767134 1558806 1681108 2039063
15621 2039063 1900713 1775067 1663873 1561837 1561135 1805747 1894334 1864804 1810067 1829263 1821569
15610 1821569 1918389 1953072 1868957 1976629 1989952 1946227 1896746 1877516 1803991 1774843 1707775
15599 1707775 1810179 1626047 1700666 1776062 1822760 1800469 1639355 1713367 1913314 1781559
15589 1781559 1779520 1897614 1831835 1781777 1821978 1871839 1618611 1777897 1860796 1802526 1868730
15578 1868730 1797357 1781431 1705455 1753023 1794895 1951255 1927069 1725589 1760171 1988477 1736855
15567 1736855 1836263 1989923 1970077 1909064 2055852 2083901 2041813 2015354 1920838 1842852 1861674
15556 1861674 2012086 1885983 1718337 1824698 1628894 1587907 1628020 1424438 1668126 1690622
15546 1690622 1682145 1730581 1637893 1556726 1597388 1673414 1747299 1805568 1777477 1804439 1708446
15535 1708446 1726240 1713574 1752513 1898472 1861623 1925080 1737942 1779852 1692494 1704927 1755032
15524 1755032 1730100 1746838 1835729 1722163 1691309 1811094 1772159 1651700 1782573 1869423
15514 1869423 1867052 1848814 1820259 1830924 1760413 1800822 2045567 1904299 1832934 1901278 1943651
15503 1943651 1910973 1800818 1793330 1831547 1734624 1737822 1830971 1891595 1974981 2048723 2038432
15492 2038432 1782780 1758123 1808497 1697006 1852728 2062955 1937345 2017122 1844465 1641300
15482 1641300 1874774 1928425 1931320 1871326 1730836 1776156 1826519 1734460 1972972 1923292 1914502
15471 1914502 1856072 1730094 1855105 1751822 1945655 1936980 1792040 1688152 1765313 1636772
15461 1636772 1831474 1895237 1910948 1758126 1707237 1883078 1900351 1756660 1818651 1844919
15451 1844919 1690867 1687416 1772902 1944836 1843438 1886214 2033397 2005256 1875739 1856994
15441 1856994 1906023 1835338 1777414 1930076 2002941 1858420 1778153 1909772 1831848 1861913 1761171
15430 1761171 1654832 1732397 1715653 1803102 1812435 1741928 1836443 1815138 1823456 1794289 1753182
15419 1753182 1714225 1989871 2037718 2112990 1967687 1935364 1854194 1756636 1791681 1807485 1914633
15408 1914633 1775258 1645838 1637259 1733379 1759761 1824289 1842621 1836600 1687594 1752096 1724348
15397 1724348 1783047 1717053 1566298 1657539 1713927 1523151 1627084 1761441 1764318 1833874 1885204
15386 1885204 1772391 1733056 2041995 1984753 1862149 1761720 1820706 1837102 1684886 1673208
15376 1673208 1592010 1804109 1970744 1919403 1877721 1796872 1932822 1928967 1874913 2092450 1845156
15365 1845156 1569456 1527677 1844921 1792862 1808015 1819726 1749791 1858987 1900014 2062966
15355 2062966 1971664 1856761 1917060 1879528 1870772 1889346 1836337 1699288 1763308 1813914 1740949
15344 1740949 1731645 1757742 1723444 1650966 1834094 1707380 1610118 1688576 1816407 1681476 1629629
15333 1629629 1820125 1901126 1875898 1872372 1670408 1813315 2067728 2004747 1789153 1588670
15323 1588670 1725074 1796154 1712517 1691789 1827005 1802938 1853390 1846875 1805232 1709302 1749223
15312 1749223 1868012 1892049 1953398 1830781 1888179 1841094 1921588 1858656 1852954 1919720 1861658
15301 1861658 2015605 1945966 1992050 2053945 2110333 1962973 1738402 1753736 1848999 1886243 1850399
15290 1850399 1758813 1901908 1774164 1572965 1879382 1911095 2055810 1926710 1898307 1942801
15280 1942801 1821106 1827346 1872673 1888144 1798821 1868960 1794725 1840184 1904997 1845747 1924417
15269 1924417 1848379 1901411 1998548 1879162 1769102 1823788 1766276 1810959 1877746 1874680 1937357
15258 1937357 1751896 1914945 1990965 1896979 1927134 2035119 1990261 2067588 2001141 1791392
15248 1791392 1807381 1710254 1617914 1732216 1856495 1782761 1747722 1715130 1824346 2015171
15238 2015171 2047039 2166915 1870253 1737819 1918597 1964220 2198833 2013769 1909516 1892596
15228 1892596 2001523 2071692 2102946 2113654 1854550 1953703 1865980 1797321 1970628 1961057 2020512
15217 2020512 2012159 2004771 1715929 1600890 1655051 1451669 1754921 1900335 1849732 1980659
15207 1980659 2033425 1939027 1857697 1971085 1826908 1767190 1891437 1914475 1896841 1801494 1792791
15196 1792791 1965544 1841325 2026335 2056992 1870192 1815421 1972999 2019707 2063644 2097408
15186 2097408 2037761 1959339 1831053 1838222 1736650 1832140 1847646 1756198 2055980 1989135 1877762
15175 1877762 1909585 1757678 1759092 1776128 1854608 1749144 1770228 1851213 1739500 1778491 2056465
15164 2056465 1963401 1952571 1995356 2083241 2089966 2014139 1936951 1863450 1927523 1967065 1862935
15153 1862935 1898490 1936935 1952112 1920644 1869018 2020765 1979724 1924715 1879282 1760467 1669998
15142 1669998 1671005 1785811 1794941 1770966 1723207 1781509 1784386 1830923 1812727 1803944 1762091 1751891
15130 1751891 1836312 1848748 2000650 1892687 1802971 1685540 1904973 1909814 1817560 1900429 1932592
15119 1932592 1890698 1843774 1891975 1949563 2082028 1991053 2079740 1977524 2059797 1734282 1712525
15108 1712525 1811563 1935267 1869927 1900239 1890199 1811221 1749063 1662330 1676501 1927443 2068505
15097 2068505 1991046 2141587 1990635 1987188 1852494 1975632 1896987 1904946 1877100 1951619 1983597
15086 1983597 1920777 1934994 1976164 1920301 1930513 1921248 1784794 2031205 1873287 1758191 1848373
15075 1848373 1903881 1932934 1813977 1766994 1866095 1746033 1702725 1917858 1960650 1812369
15065 1812369 1727977 1904735 1911659 1787839 1722812 1806513 1814863 1906085 1778368 1771693 1768782
15054 1768782 1775365 1790224 1848498 1988085 2076193 1874694 1973166 2024054 2023637 2017752 1946748 2010262
15042 2010262 2046771 2160169 2028736 2028838 1990121 2022935 2016343 2038462 1957094 1900381 1858545
15031 1858545 1764718 1928942 2103505 1982934 1754442 1866557 1943496 2037305 2036236 2138666
15021 2138666 2193630 2077430 1972534 1912199 1804102 1787669 1983458 1937477 1811129 1950519
15011 1950519 1902184 1809214 1796556 1954391 1939713 1989936 1859896 1753485 1623888 1787480
15001 1787480 1940568 1997172 1930050 1827728 1925513 1970268 1838155 1789484 2008577 1964719
14991 1964719 1977468 1898275 1758741 1721401 1806049 1841169 1868344 1870938 1977140 1755011 1926291
14980 1926291 1823178 1785123 1895878 1999244 2041864 1978554 2008972 2282319 2070435 1969553
14970 1969553 1969888 1978768 1866336 1933206 1759856 1690555 1745876 1930082 1884898 1814818 1876190
14959 1876190 1751893 1873482 1958623 2043555 1867739 1954273 1942560 1751556 1859588 2095746
14949 2095746 2024741 1932993 1860241 1849740 1820944 1899537 2028719 1782862 1724747 1958915 1874724
14938 1874724 1852791 1949618 1892453 1856268 1996430 2025472 1814274 1801110 1933019 1930640 1712142
14927 1712142 1721319 1719352 1724798 1956597 1857666 1747972 1794893 1954980 2005849 1968944 1963478
14916 1963478 2071543 1916125 1893843 1918037 2121982 1996159 1800566 1748051 1753241 1970857
14906 1970857 1963198 1876382 1802007 1772339 1725561 1916456 2038944 2057732 2074701 1922366 1956860
14895 1956860 2133529 2408972 2337988 2090043 2009760 1850897 1869891 1935710 1990549 2027279
14885 2027279 2071430 2020168 2009030 2200514 2291034 2123635 2042252 1995513 1932238 1848855 1775274
14874 1775274 1940892 1853022 1902318 1899933 1717420 1735452 1742663 1783319 1933915 1817428 1700495
14863 1700495 1808764 1930689 1730003 1870717 1824283 2073682 2119645 2065371 2061056 1803234
14853 1803234 1716076 1928550 1946937 2017490 2076612 1874073 1960519 1881919 1942285 2179685 2096752
14842 2096752 1956757 1941003 1870935 1960596 2001611 1712568 1836592 2118471 1829369 1803249
14832 1803249 1654396 1705226 1915267 2045986 2037586 2029676 2039104 2095617 2048290 1961155 1848041
14821 1848041 1868186 1833084 1899172 1982555 2089468 2046428 2037613 2032559 2141414 2131001 2057403
14810 2057403 2038885 2035202 1951658 1914953 1984326 1887600 1987953 2056394 1864535 1741575 1776268
14799 1776268 1662657 1790542 1935636 1772773 1930717 2110892 2255276 2175089 2152961 2100712
14789 2100712 2009039 2056157 1966929 1845387 1727006 1938942 2017270 2109843 1926698 1793815
14779 1793815 1875524 1826695 1814501 1840161 1789168 1820712 1862709 1740315 1676695 1741340 1826732
14768 1826732 1791925 1729884 1842713 1919626 1519033 1632200 1649229 1530679 1637208 1704429
14758 1704429 1769856 1777426 1732556 1906264 2126191 2108716 2107307 2035288 1978735 1984406 1907441
14747 1907441 1868629 2023860 2032822 1972019 2018907 2013778 1880382 1781807 1900266 2037904 1933799
14736 1933799 1908642 1823280 1996091 2035929 1960985 1690977 1785369 1889406 2078774 2039656
14726 2039656 1843224 1721330 1853421 2167632 2078442 2075019 2099832 2135634 1988081 1919452
14716 1919452 1937977 1873045 1753425 2031079 2091969 1865626 1826330 1875690 1761140 1774746
14706 1774746 1852352 1810741 1864586 1930024 1802548 1708359 1752089 1866399 1896287 2003747 2083332
14695 2083332 2182950 2156316 1923305 1786445 1658887 1792812 1970844 1982818 1920371 2081705
14685 2081705 1971760 1976336 2073140 2135188 1991718 2021290 2087265 1943923 2160664 2104479 1973629
14674 1973629 2040295 1961229 2054553 2043697 2037691 2099777 2243950 2223529 2072304 1922798 1977783
14663 1977783 2090805 1890495 1807914 1814863 2098485 2123331 2116646 2080202 1912420 2061104 1946059
14652 1946059 2011366 2128805 1994221 1948733 1971846 1932854 1927479 1900476 2070845 2165049 2130058
14641 2130058 1968999 1733161 1944668 1992655 1838195 2002284 2052016 1783336 1829786 1943956
14631 1943956 2097072 2141977 2053235 2003723 2119216 2034861 1962187 1859405 2000604 1974141
14621 1974141 2019785 2086094 2026516 2051413 2189575 2297751 2082712 2035467 1965346 1970425 1904922
14610 1904922 2042761 1935721 1883364 1924714 1954712 1993807 2060854 2173077 2061905 2149238
14600 2149238 2043471 2110562 2087285 2055677 2263718 2218741 1998510 2027343 2128277 2203848
14590 2203848 2236173 2190974 2099816 2111017 1960158 1848452 1952344 2031290 2071108 2062166 2077864
14579 2077864 2157913 2107919 1951148 1811583 1887483 1922706 1977787 2063740 2103448 2027240 1887311
14568 1887311 1863620 1870368 2044279 2239585 2121064 1956827 2008257 2175636 2023712 1787719
14558 1787719 2051098 2024168 2008130 2101957 2229373 2014328 1853776 1995596 1977651 1889916
14548 1889916 1947736 2078349 2014635 1971384 2086534 2015210 2023219 2044146 2147339 2148309 2096792
14537 2096792 2024717 1781018 1684383 1766487 2041266 2018103 2007188 2170969 2128794 2065970 2018268
14526 2018268 2123550 2100655 2149044 2153598 2162596 2138625 2116054 2156622 2049053 2050123 2249471
14515 2249471 2224343 2043919 2032145 2092040 2075742 1906189 1824763 1698608 1927215 1855465
14505 1855465 1905782 1808315 1992215 2040215 2024154 1995410 2054926 2136563 2252586 2201539 1987494
14494 1987494 2197953 2042346 1995144 2076213 2155718 2139399 2210150 1985529 1848348 1976965
14484 1976965 2006536 1907052 2026413 2072318 2137793 2064835 2087941 2204326 2372688 2227566
14474 2227566 2132980 2173976 2282535 2189319 2059513 1960115 2117122 2095263 2069845 2196265
14464 2196265 1992690 2125576 2235608 2017345 1973728 2028590 2017487 2181369 2184166 2116861
14454 2116861 2044074 2106435 2127015 2157203 2184759 2029699 1997961 2036146 1938209 1992685 2106485
14443 2106485 2022871 2039481 2229749 2170181 2080945 1904257 2008295 2186129 2091282 2106781
14433 2106781 2175895 2120776 1999868 1871075 1986577 2109937 2152565 2187451 2090196 2082116 1980035
14422 1980035 1943312 1873724 1950530 2140462 2093865 1996567 1974390 1907954 1814777 2035512 2168823
14411 2168823 2287517 2140201 1939238 2227840 2105387 1930942 1910296 2070842 2243915 2117509
14401 2117509 2173755 2300313 2258853 2080147 1942169 1977412 2163730 2294297 2171418 1980813
14391 1980813 2041829 2031982 2036358 2037296 1977377 2026028 2245117 2005503 2014057 2031106 2015705 2210087
14379 2210087 2151224 2238936 2395547 2151633 1921472 1666437 1750821 1855471 2036781 2074887
14369 2074887 2033074 2030355 2066220 2252377 2181906 2206909 2132225 2014797 1995835 2230338 2182568
14358 2182568 1891845 1977125 2037985 1937123 2099911 2180464 2028907 2080771 2052537 2174979
14348 2174979 2275790 2313381 2282464 2258495 2238555 1956288 2126736 2192205 2253475 2324747 2105250
14337 2105250 1956611 2015491 2043130 1960385 2181652 2118362 2070335 2163169 2168612 2194111 2105908
14326 2105908 2139553 2152595 2258629 2195488 2164424 2051028 2017643 1916453 1910883 1750699 1808973
14315 1808973 2096727 2237254 2153317 1992518 1834809 2001871 2064146 1953250 2155147 2117666
14305 2117666 2209285 2060354 1994019 2185297 2017813 2139684 2253960 2038439 1863755 1998224
14295 1998224 2058112 2084803 2107888 2172785 2156605 2139292 2071991 2054719 2187799 2133876 2117075
14284 2117075 2086878 2011561 2021138 1998023 2077124 1999487 2215536 2088214 2084630 2070575 2073247
14273 2073247 2337564 2254438 2121361 2021242 2029125 2059314 2097856 2035054 2156586 2212749 2153802
14262 2153802 2176211 2093349 2002172 1997725 1982857 2235990 2200693 2208323 2091617 1969606 2107874
14251 2107874 2162056 2227528 2104759 2021212 1990449 1997104 2185453 2022710 2128852 2166687 2105737
14240 2105737 1988278 2144187 2159377 2320299 2209153 2071401 2160234 2187242 2318109 2255660
14230 2255660 2140030 2101998 2132635 1965138 2155714 2207023 2275754 2334160 2242964 2177738 2165509
14219 2165509 2110762 2090106 2153779 2317772 2311310 2107957 2224988 2071613 1869466 1950111
14209 1950111 2141063 2204918 2265378 2279213 2385815 2269315 2033830 1894394 2113785 1983834
14199 1983834 1887628 1986001 2196510 2285398 2307504 2316240 2302710 2201656 2178511 2227464 1996703
14188 1996703 1973599 1940261 2112686 2228976 2085504 2072059 2033237 2100163 2128691 2090404 2114949
14177 2114949 2106679 2142783 1974174 1914617 1988346 2202437 2214651 2105701 2176266 2357023 2192890
14166 2192890 2154723 2231685 2294529 2075486 1989857 2076988 2131190 2073188 2079130 2159306 2128609
14155 2128609 2141435 2048694 2043019 2243298 2155105 2300961 2170534 2070923 2229030 2339575
14145 2339575 2311435 2187843 2193596 2306018 2425198 2150781 2071596 2217932 2230049 2333862
14135 2333862 2241107 2254957 2210528 1990190 2129354 2288915 2303643 2154218 2093851 2231794
14125 2231794 2118043 2209789 2161047 2179299 2047538 2216345 2518485 2314234 2042721 2048917
14115 2048917 2042507 2210294 2130989 2093732 2103280 2083355 2308008 2150835 1997186 2124325 2231346
14104 2231346 2205012 2220380 2057952 2086048 2126971 2026071 2185637 2444563 2265829 2299425
14094 2299425 2336468 2262216 2361534 2487645 2365813 2343215 2079285 1953206 2075254 2069334
14084 2069334 2223008 2159999 2084766 2127777 2064262 1874828 1881144 1951017 2033372 2299821 2194651
14073 2194651 2388917 2200541 2131811 1957900 1989189 1883865 1712977 1780663 2139479 2307703
14063 2307703 2272976 2441273 2606311 2477148 2413057 2267007 2293334 2310267 2099689 2249280
14053 2249280 2302854 2268321 2293703 2087038 2019143 2235859 2028223 2027036 2346753 2459576
14043 2459576 2444178 2297635 2237728 2347480 2294802 2226471 2439513 2499845 2434557 2567412
14033 2567412 2353525 2196254 2238620 2272457 2137016 2177985 2114067 2086530 2098279 1935637
14023 1935637 2055845 2184369 2315996 2421096 2266601 2193390 2224871 2233726 2200882 2142012
14013 2142012 2365239 2326962 2150827 2291933 2151226 2311898 2336680 2364784 2324811 2527239
14003 2527239 2432791 2328258 2234201 2117520 2248700 2252156 2346741 2316417 2213751 2193856 2169984
13992 2169984 2193136 2182965 2079816 2160685 2308100 2324805 2374571 2358533 2268066 2335122 2360344
13981 2360344 2071520 1942565 2177917 2253766 2093160 2168278 2344376 2219635 2110810 2340217
13971 2340217 2436434 2370498 2267703 2117766 2080402 2261869 2410537 2242346 2056950 2203651
13961 2203651 2347989 2216638 2117522 2229580 2465738 2345970 2217716 2240427 2141586 2119984
13951 2119984 1980826 2206596 2297978 2328693 2189427 1962889 2188978 2332779 2251162 2194187
13941 2194187 2222274 2244867 2340874 2358503 2294559 2304221 2221231 2221799 2266177 2041752 2161457
13930 2161457 2226826 2249213 2249519 2316539 2288918 2148935 2266822 2150826 2324436 2295490 2213552
13919 2213552 2251954 2264070 2231374 2045168 2067571 2209529 2564038 2474111 2253328 2283737
13909 2283737 2309210 2333098 2329843 2194204 2140569 2131271 2033744 2171086 2391458 2266764 2216966
13898 2216966 2272452 2259973 2216278 2180436 2181838 2079205 2161498 2209749 2223393 2363466 2325265
13887 2325265 2344253 2315180 2395995 2232003 2211138 2336178 2420470 2376137 2245800 2165903 2195727
13876 2195727 2244418 2232587 2146642 2154165 1905245 1915463 2110730 2045908 1971133 2214677 2350372
13865 2350372 2431639 2307389 2300611 2212132 2101068 2154974 2233973 2183115 2206677 2067427 2085064
13854 2085064 2210667 2341825 2302671 2207678 2245593 2229165 2231062 2166583 2230460 2246838 2250299
13843 2250299 2241103 2219069 2356498 2403602 2480695 2462772 2285328 2120679 2179584 2069392 2001707
$$ [...]
##END NTUPLES=NMR SPECTRUM
##END=
