##TITLE=1H_CA-9206-1
 CDCl3
 8 sc, 
 26.10.2023
##JCAMPDX= 6.0         $$ Bruker NMR JCAMP-DX V2.0
##DATA TYPE= NMR SPECTRUM
##DATA CLASS= NTUPLES
##ORIGIN= UXNMR, Bruker Analytische Messtechnik GmbH
##OWNER= root
$$ XWIN-NMR		Version 3.5
$$ Thu Oct 26 15:26:45 2023 Russian Standard Time (UT+4h)  she@DPX200
##.OBSERVE FREQUENCY= 200.13135
##.OBSERVE NUCLEUS= ^1H
##.ACQUISITION MODE= SIMULTANEOUS
##.ACQUISITION SCHEME= undefined
##.AVERAGES= 8
##.DIGITISER RES= 18
##SPECTROMETER/DATA SYSTEM= spect
##.PULSE SEQUENCE= zg30
##.SOLVENT NAME= CDCl3
##.SHIFT REFERENCE= (INTERNAL, CDCl3, 0, 15.7337)
##AUDIT TRAIL= $$ (NUMBER, WHEN, WHO, WHERE, WHAT)
$$ ##TITLE= Audit trail, XWIN-NMR		Version 3.5
$$ ##JCAMPDX= 5.01
$$ ##ORIGIN= Bruker BioSpin GmbH
$$ ##OWNER= she
$$ F:/spectra/data/she/nmr/H-F/1/pdata/1/auditp.txt
$$ ##AUDIT TRAIL=  $$ (NUMBER, WHEN, WHO, WHERE, WHAT)
(   1,<2023-10-26 15:25:38.28 +0400>,<she>,<DPX200>,
      <created by zg, POWCHK disabled, PULCHK disabled
       configuration hash MD5:
       00 E9 B6 7A A2 85 ED C7 34 08 36 98 17 FE 4E 26
       data hash MD5: 16K
       E4 8F F5 3B 3D DE 99 F2 C3 E9 C0 05 8A 28 AF 59>)
(   2,<2023-10-26 15:25:40.93 +0400>,<she>,<DPX200>,
      <Start of raw data processing
       efp BC_mod = 2 LB = 0.24 FT_mod = 6 PKNL = 1 PHC0 = -23510.18 PHC1 = 13.85272 SI = 16K 
       data hash MD5: 16K
       98 A2 D9 27 71 E4 D3 34 08 E0 8E E7 B7 76 89 70>)
(   3,<2023-10-26 15:25:57.95 +0400>,<she>,<DPX200>,
      <pk PHC0 = -1.599995 PHC1 = 0.5999999 
       data hash MD5: 16K
       49 96 2A 25 F8 61 B4 7B FD 14 3F 74 01 8D 5A 33>)
(   4,<2023-10-26 15:26:01.32 +0400>,<she>,<DPX200>,
      <abs ABSG = 5 
       data hash MD5: 16K
       BB 4C A4 79 A0 E6 DC D1 55 94 0B 33 17 5F CB B5>)
$$ ##END=
$$ 
$$ hash MD5
$$ 77 11 74 EE 9F E9 93 A3 13 FE 01 83 9F F6 89 37
##$RELAX= 
##$RELAX= 
##$RELAX= 
##$RELAX= 
##$RELAX= 
##$RELAX= 
$$ Bruker specific parameters
$$ --------------------------
##$DU= <F:/spectra>
##$EXPNO= 1
##$NAME= <H-F>
##$PROCNO= 1
##$TYPE= <nmr>
##$USER= <she>
##$AMP= (0..31)
100 100 100 100 100 100 100 100 100 100 100 100 100 100 100 100 100 100 
100 100 100 100 100 100 100 100 100 100 100 100 100 100 
##$AQSEQ= 0
##$AQ_mod= 1
##$AUNM= <au_zg>
##$AUTOPOS= <>
##$BF1= 200.13
##$BF2= 200.13
##$BF3= 200.13
##$BF4= 200.13
##$BF5= 200.13
##$BF6= 200.13
##$BF7= 200.13
##$BF8= 200.13
##$BYTORDA= 1
##$CFDGTYP= 0
##$CFRGTYP= 5
##$CHEMSTR= <none>
##$CNST= (0..31)
1 1 145 1 1 1 1 1 1 1 1 1 1 1 1 1 1 1 1 1 1 1 1 1 1 1 1 1 1 1 1 1 
##$CPDPRG= <>
##$CPDPRG1= <>
##$CPDPRG2= <>
##$CPDPRG3= <>
##$CPDPRG4= <mlev>
##$CPDPRG5= <mlev>
##$CPDPRG6= <mlev>
##$CPDPRG7= <mlev>
##$CPDPRG8= <mlev>
##$CPDPRGB= <>
##$CPDPRGT= <>
##$D= (0..31)
0 1.2 0 0 0 0 0 0 0 0.06 0 0.03 0 0 0 0 0.0002 0 0 0 0 0 0 0 0 0 0 0 0 
0 0 0 
##$DATE= 1698319537
##$DBL= (0..7)
120 120 120 120 120 120 120 120 
##$DBP= (0..7)
150 150 150 150 150 150 150 150 
##$DBP07= 0
##$DBPNAM0= <>
##$DBPNAM1= <>
##$DBPNAM2= <>
##$DBPNAM3= <>
##$DBPNAM4= <>
$$ [...]
##$SUBNAM3= <"">
##$SUBNAM4= <"">
##$SUBNAM5= <"">
##$SUBNAM6= <"">
##$SUBNAM7= <"">
##$SUBNAM8= <"">
##$SUBNAM9= <"">
##$SW= 18.05172834244
##$SWIBOX= (0..15)
0 0 2 0 0 0 0 0 0 0 0 0 0 0 0 0 
##$SW_h= 3612.71676300578
##$TD= 16384
##$TD0= 1
##$TE= 0
##$TE2= 300
##$TE3= 300
##$TEG= 300
##$TL= (0..7)
0 120 120 120 120 120 120 120 
##$TP= (0..7)
150 150 150 150 150 150 150 150 
##$TP07= 0
##$TPNAME0= <>
##$TPNAME1= <>
##$TPNAME2= <>
##$TPNAME3= <>
##$TPNAME4= <>
##$TPNAME5= <>
##$TPNAME6= <>
##$TPNAME7= <>
##$TPOAL= (0..7)
0.5 0.5 0.5 0.5 0.5 0.5 0.5 0.5 
##$TPOFFS= (0..7)
0 0 0 0 0 0 0 0 
##$TUNHIN= 0
##$TUNHOUT= 0
##$TUNXOUT= 0
##$USERA1= <user>
##$USERA2= <user>
##$USERA3= <user>
##$USERA4= <user>
##$USERA5= <user>
##$V9= 5
##$VALIST= <valist>
##$VCLIST= <CCCCCCCCCCCCCCC>
##$VD= 0
##$VDLIST= <DDDDDDDDDDDDDDD>
##$VPLIST= <PPPPPPPPPPPPPPP>
##$VTLIST= <TTTTTTTTTTTTTTT>
##$WBST= 1024
##$WBSW= 4
##$XGAIN= (0..3)
0 0 0 0 
##$XL= 0
##$YL= 0
##$YMAX_a= 110639
##$YMIN_a= -154601
##$ZGOPTNS= <>
##$ZL1= 120
##$ZL2= 120
##$ZL3= 120
##$ZL4= 120
##$ABSF1= 15.73367
##$ABSF2= -2.318179
##$ABSG= 5
##$ABSL= 3
##$ALPHA= 0
##$AQORDER= 0
##$ASSFAC= 0
##$ASSFACI= 0
##$ASSFACX= 0
##$ASSWID= 0
##$AUNMP= <proc_1d>
##$AZFE= 0.1
##$AZFW= 0.1
##$BCFW= 0
##$BC_mod= 2
##$BYTORDP= 0
##$COROFFS= 0
##$CY= -3
##$DATMOD= 1
##$DC= 0
##$DFILT= <>
##$DTYPP= 0
##$F1P= 0
##$F2P= 0
##$FCOR= 1
##$FTSIZE= 16384
##$FT_mod= 6
##$GAMMA= 0
##$GB= 0
##$INTBC= 1
##$INTSCL= 3.70164e-10
##$ISEN= 128
##$LB= 0.24
##$LEV0= 0
##$LPBIN= 0
##$MAXI= 10000
##$MC2= 0
##$MEAN= 0
##$ME_mod= 0
##$MI= 1.114404
##$NCOEF= 0
##$NC_proc= -8
##$NLEV= 6
##$NOISF1= 3.799351
##$NOISF2= 2.8
##$NSP= 0
##$NTH_PI= 0
##$NZP= 0
##$OFFSET= 15.73367
##$PC= 1
##$PHC0= -23511.78
##$PHC1= 14.45272
##$PH_mod= 1
##$PKNL= yes
##$PPARMOD= 0
##$PSCAL= 0
##$PSIGN= 0
##$REVERSE= no
##$SF= 200.130007578849
##$SI= 16384
##$SIGF1= 3
##$SIGF2= 2
##$SINO= 5.538805
##$SIOLD= 16384
##$SREGLST= <1H.CDCl3>
##$SSB= 0
##$STSI= 16384
##$STSR= 0
##$SW_p= 3612.71676300578
##$SYMM= 0
##$S_DEV= 0
##$TDeff= 16384
##$TDoff= 0
##$TI= <>
##$TILT= no
##$TM1= 0
##$TM2= 0
##$TOPLEV= 0
##$USERP1= <user>
##$USERP2= <user>
##$USERP3= <user>
##$USERP4= <user>
##$USERP5= <user>
##$WDW= 1
##$XDIM= 16384
##$YMAX_p= 341495196
##$YMIN_p= -3597126
$$ End of Bruker specific parameters
$$ ---------------------------------
##NTUPLES= NMR SPECTRUM
##VAR_NAME=  FREQUENCY,     SPECTRUM/REAL,   SPECTRUM/IMAG
##SYMBOL=    X,             R,               I
##VAR_TYPE=  INDEPENDENT,   DEPENDENT,       DEPENDENT
##VAR_FORM=  AFFN,          ASDF,            ASDF
##VAR_DIM=   16384,         16384,           16384
##UNITS=     HZ,            ARBITRARY UNITS, ARBITRARY UNITS
##FACTOR=    0.220516191357247, 1,           1
##FIRST=     3148.77954330965, 0,            0
##LAST=      -463.937219696126, 0,           0
##MIN=       -463.937219696126, -3597126,    0
##MAX=       3148.77954330965, 341495196,    0
$$ Real data points
##PAGE= N=1
##DATA TABLE= (X++(R..R)), XYDATA
$$ [...]
$$ plain form
5669 756038 142598 324080 756195 795361 919336 1121469 714863 897754 992639 992623 694009
5658 694009 479939 536363 598824 456336 475695 471850 1103937 1119049 1275091 1183899 733274
5647 733274 827046 810939 540550 863345 966944 697237 677722 816157 617507 547975
5637 547975 713646 913802 1123239 724533 452941 710257 890316 433204 541545 585804
5627 585804 918493 1170232 907712 738388 913485 1051756 1220569 913495 967466 924955
5617 924955 1141415 973417 854106 982486 1053566 1186057 1347880 1439274 1185413 1084026
5607 1084026 1155667 1078805 654312 809415 1009479 881676 855076 808664 705829 422616
5597 422616 940979 1334875 1194034 1143908 980480 556434 458373 972961 1386744 1430262
$$ packed form
5669G56038o13440J81482M32115L9166J23975K02133m06606J82891R4885j6k98614
5658F94009k14070N6424O2461j42488J9359l845O32087J5112J56042r1192m50625
5647G33274R3772j6107k70389L22795J03599k69707j9515J38435j98650o9532
5637E47975J65671K00156K09437l98706k71592K57316J80059m57112J08341M4259
5627E85804L32689K51739k62520j69324J75097J38271J68813l07074N3971m2511
5617I24955K16460j67998j19311J28380P1080J32491J61823R1394k53861j01387
5607A084026P1641p6862m24493J55103K00064j27803k6600m6412j02835k83213
5597D22616N18363L93896j40841n0126j63428m24046r8061N14588M13783M3518
$$ plain form
5587 1430262 1062126 1135782 1241141 1149945 822592 879960 1201829 993106 901253 581252
5577 581252 587769 490753 1103766 1558294 1449876 1027453 865128 1043070 1008304 1209443
5567 1209443 1173198 1153287 1085586 1074088 812969 921839 1334216 1313122 1303981 1272043 863732
5556 863732 882894 1048217 1170375 1300054 1279824 1496441 1797038 1633030 1447383 1499870
5546 1499870 1646391 1948786 1925449 1667685 2092189 2237422 2270647 2045236 1801111 2109739
5536 2109739 2399886 2329105 2077830 2128790 2499697 2619407 2852260 2473390 2039837 2220862
5526 2220862 2639614 2745726 2960038 2767917 2451683 2503423 2758306 2712482 2839374 3152891
5516 3152891 2910458 3017874 2936641 3017451 3046601 2809088 3226893 3474339 3847720 4165178
$$ packed form
5587A430262l68136P3656J05359r1196l27353N7368L21869k08723r1853l20001
5577E81252O517r7016O13013M54528j08418m22423j62325J77942l4766K01139
5567A209443l6245j9911o7701j1498k61119J08870M12377k1094r141l1938m08311
5556H63732J9162J65323J22158J29679k0230K16617L00597j64008j85647N2487
5546A499870J46521L02395k3337k57764M24504J45233L3225k25411k44125L08628
5536B109739K90147p0781k51275N0960L70907J19710K32853l78870m33553J81025
5526B220862M18752J06112K14312j92121l16234N1740K54883m5824J26892L13517
5516C152891k42433J07416q1233Q0810K9150k37513M17805K47446L73381L17458
$$ plain form
5506 4165178 4377108 4272984 4093234 4974618 4816309 4266892 3866273 3567212 3263625 2689877
5496 2689877 2554127 2607529 2535234 2904341 2972490 2689361 2728723 2336550 2365915 2774519
5486 2774519 2474690 2238658 2192442 2235672 2538348 2318350 2258832 2652466 2782489 2624491
5476 2624491 2540784 2328309 2910801 2914107 2619891 2244264 1815195 1602744 2021342 2434540
5466 2434540 1711993 1906917 2062509 1970668 1707532 1327931 1530301 1574602 1019239 1037451
5456 1037451 1051327 941426 792083 955798 1176010 1420386 1593559 1565710 1300290 1315580
5446 1315580 1310710 1096176 805592 1211930 1166405 933388 807254 899720 1381863 1134673
5436 1134673 1587937 1732535 1376318 1360585 1532794 1616039 1272504 795862 964519 1295347
$$ packed form
5506D165178K11930j04124j79750Q81384j58309n49417m00619k99061l03587n73748
5496B689877j35750N3402p2295L69107O8149k83129L9362l92173K9365M08604
5486B774519k99829k36032m6216M3230L02676k19998n9518L93634J30023j57998
5476B624491q3707k12475N82492L306k94216l75627m29069k12451M18598M13198
5466B434540p22547J94924J55592r1841k63136l79601K02370M4301n55363J8212
5456A037451J3876j09901j49343J63715K20212K44376J73173k7849k65420J5290
5446A315580m870k14534k90584M06338m5525k33017j26134R2466M82143k47190
5436A134673M53264J44598l56217j5733J72209Q3245l43535m76642J68657L30828
$$ plain form
5426 1295347 1317471 1520469 1265090 1264966 1183510 943028 970309 837506 1003269 845646 656116
5415 656116 910789 1330897 894023 943795 1230978 1458170 1466832 1432471 1478718 997971 1130875
5404 1130875 1041876 933914 1188032 1377361 1483510 1352769 1243095 1684331 1978050 1745789
5394 1745789 1637878 1475336 1670084 1790811 1390801 1658012 1703013 1312703 1332737 1337247
5384 1337247 1172809 1454449 1393975 1405659 1606300 1464330 1305513 1178713 929226 902595
5374 902595 1166419 998302 1301574 1418244 1502550 1661656 1846145 1661753 1651372 1662524
5364 1662524 1801322 1833683 1638093 1630853 1638505 1537450 1369927 1291452 1275714 1537599 1528893
5353 1528893 1248652 1228891 1387858 1479942 1673566 1570959 1578488 1448680 1438061 1320025
$$ packed form
5426A295347K2124K02998k55379j24q1456k40482K7281j32803J65763j57623j89530
5415F56116K54673M20108m36874M9772K87183K27192Q662l4361M6247m80747J32904
5404A130875q8999j07962K54118J89329J06149j30741j09674M41236K93719k32261
5394A745789j07911j62542J94748J20727m00010K67211M5001l90310K0034M510
5384A337247j64438K81640o0474J1684K00641j41970j58817j26800k49487k6631
5374I02595K63824j68117L03272J16670Q4306J59106J84489j84392j0381J1152
5364A662524J38798L2361j95590p240P652j01055j67523p8475j5738K61885q706
5353A528893k80241j9761J58967R2084J93624j02607P529j29808j0619j18036
$$ plain form
5343 1320025 1827414 1959923 2010527 1748475 1579599 1864075 2195979 2495921 2029545 1425490
5333 1425490 1540101 1554219 1703811 1557378 1338811 1597836 1223212 1380799 1366727 1222068
5323 1222068 1581490 1820663 1904174 1816707 1299203 1358941 1370328 1268526 1144423 1560641
5313 1560641 1441691 1326686 1468976 1394290 1435859 1433381 1424092 1340655 903978 866420 854575
5302 854575 609638 1084992 1298430 1167336 1272208 1351074 1174353 1423571 1980086 1284703
5292 1284703 1488761 1482433 1287395 1298441 1365031 1346836 1195424 1155051 1294744 1044432 853495
5281 853495 1457304 1468257 1417034 1206173 1252235 972064 1074030 1435069 1398656 1372404 1850961
5270 1850961 1321550 1419652 1767356 1687529 1526143 1501785 1383888 1517518 1400699 1456458
$$ packed form
5343A320025N07389J32509N0604k62052j68876K84476L31904K99942m66376o04055
5333A425490J14611J4118J49592j46433k18567K59025l74624J57587j4072j44659
5323A222068L59422K39173Q3511q7467n17504N9738J1387j01802j24103M16218
5313A560641j18950j15005J42290p4686M1569k478r289q3437m36677l7558j1845
5302H54575k44937M75354K13438j31094J04872P8866j76721K49218N56515o95383
5292A284703K04058o328j95038J1046O6590j8195j51412m0373J39693k50312j90937
5281H53495O03809J0953n1223k10861M6062k80171J01966L61039l6413k6252M78557
5270A850961n29411R8102L47704p9827j61386k4358j17897J33630j16819N5759
$$ plain form
5260 1456458 1268805 1094576 1371838 1323116 1359304 1298241 1115407 986079 1104215 1356027
5250 1356027 1388154 1564315 1519212 1329037 1580587 1358981 1313110 1033202 1023632 1163861
5240 1163861 830729 810237 756414 879037 666287 772511 1038341 1088078 1135295 471634
5230 471634 911869 1453930 1361953 1018017 831059 937202 1214021 1021151 906896 1013882
5220 1013882 743237 988521 947102 1065432 1244280 1229730 1204755 1292547 1585014 1419546
5210 1419546 1366590 1406861 1386244 1455470 1502712 1617157 1268856 1149974 1345719 1154372
5200 1154372 1172268 1380703 1025985 1340300 1584770 887644 881846 975959 1163087 1261658
5190 1261658 1314403 1641449 1498637 1325350 1271430 1074321 1159234 1312828 1273242 1176854
$$ packed form
5260A456458j87653j74229K77262m8722L6188o1063j82834j29328J18136K51812
5250A356027L2127J76161m5103j90175K51550k21606m5871k79908r570J40229
5240A163861l33132k0492n3823J22623k12750J06224K65830M9737M7217o63661
5230D71634M40235N42061r1977l43936j86958J06143K76819j92870j14255J06986
5220A013882k70645K45284m1419J18330J78848j4550k4975Q7792K92467j65468
5210A419546n2956M0271k0617O9226M7242J14445l48301j18882J95745j91347
5200A154372J7896K08435l54718L14315K44470o97126n798R4113J87128R8571
5190A261658N2745L27046j42812j73287n3920j97109Q4913J53594l9586r6388
$$ plain form
5180 1176854 1279068 1631738 1579479 1605432 2144981 2258827 1853654 1517868 1525913 1574744
5170 1574744 1618765 1496138 1721026 1787339 1879243 1878682 2007996 1800522 1821347 1711664 1552009
5159 1552009 2096037 2165517 1716450 2034311 2299116 2049470 2038287 1902453 2028908 2230696
5149 2230696 2354920 2274395 2210660 2342813 2710244 3116302 2828466 2674627 2803959 3141339
5139 3141339 3033044 3199843 3309996 3402237 3432518 3830839 3950444 3899451 4042515 3708215
5129 3708215 4132611 4178099 3880901 4114689 4114343 3810040 4490108 5008994 4618889 4317707
5119 4317707 4730078 4996270 5299563 5174168 5464787 6035709 6491073 6976428 7625574 7871698
5109 7871698 8345793 8571273 8511503 8161760 7690915 7344498 7400930 7140564 7030796 7038338
$$ packed form
5180A176854J02214L52670n2259K5953N39549J13846m05173l35786Q045M8831
5170A574744M4021j22627K24888O6313R1904n61J29314k07474K0825j09683j59655
5159A552009N44028O9480m49067L17861K64805k49646j1183j35834J26455K01788
5149B230696J24224q0525o3735J32153L67431M06058k87836j53839J29332L37380
5139C141339j08295J66799J10153R2241L0281L98321J19605n0993J43064l34300
5129C708215M24396M5488k97198K33788l46l04303O80068N18886l90105l01182
5119D317707M12371K66192L03293j25395K90619N70922M55364M85355O49146K46124
5109G871698M74095K25480n9770l49743m70845l46417N6432k60366j09768P542
$$ plain form
5099 7038338 7528729 7614021 7668413 7988913 8282922 8653971 8969892 9379894 9633960 9644446
5089 9644446 9215591 9016027 8465282 8180787 7695605 7390748 7027766 6709009 6854961 6102843
5079 6102843 5973159 6452944 6405044 6297292 6517353 6658771 6245712 6394106 6570573 6811430
5069 6811430 6737232 7151078 7413528 7773927 7707588 7799045 8432300 8600575 9524485 10065962
5059 10065962 10337336 10123323 10307422 10222513 9681721 9641562 9254475 8985752 8986945 9108189
5049 9108189 9067358 9002714 9588469 10093869 9980251 10273463 9995853 9593442 9171749 9005552
5039 9005552 8763955 8315947 8298943 8333179 8766653 9068711 9468629 9817335 9842257 10329720
5029 10329720 10561725 10212255 9916854 9770902 9414870 8801483 8595144 8693271 8263483 8511017
$$ packed form
5099G038338M90391Q5292N4392L20500K94009L71049L15921M10002K54066J0486
5089I644446m28855j99564n50745k84495m85182l04857l62982l18757J45952p52118
5079F102843j29684M79785m7900j07752K20061J41418m13059J48394J76467K40857
5069F811430p4198M13846K62450L60399o6339R1457O33255J68275R23910N41477
5059A0065962K71374k14013J84099q4909n40792m0159l87087k68723J193J21244
5049I108189m0831o4644N85755N05400j13618K93212k77610m02411m21693j66197
5039I005552k41597m48008j7004L4236M33474L02058L99918L48706K4922M87463
5029A0329720K32005l49470k95401j45952l56032o13387k06339R8127m29788K47534
$$ plain form
5019 8511017 8874106 9328883 10041334 10355658 9681964 9062250 8886038 7882227 7258971
5010 7258971 6666901 6356603 6297597 5757971 5637016 5484629 5110798 4813291 5031645 4973262
5000 4973262 4971350 5097644 5160990 4752316 4476268 4814302 4847526 5029093 5397884 5531890
4990 5531890 5665756 5762591 6074108 6509146 7146064 7304864 7991929 8918865 9419816 9712871
4980 9712871 9930147 9756489 9210859 9608431 9397890 9113973 8666584 9091149 9154503 9351067
4970 9351067 9150332 8635759 7829863 7274735 6443340 6061520 5668821 4778002 4388972 3799979
4960 3799979 3359012 3176757 3078901 2935554 2874287 2732627 2515628 2683188 2902123 2512471
4950 2512471 2228904 2369352 2484991 2597065 2512850 2406339 2886407 2960506 2648385 2128217
$$ packed form
5019H511017L63089M54777P12451L14324o73694o19714j76212j003811o23256
5010G258971n92070l10298n9006n39626j20955j52387l73831k97507K18354n8383
5000D973262j912J26294O3346m08674k76048L38034L3224J81567L68791J34006
4990E531890J33866R6835L11517M35038O36918J58800O87065R26936N00951K93055
4980I712871K17276j73658n45630L97572k10541k83917m47389M24565O3354J96564
4970I351067k00735n14573q05896n55128q31395l81820l92699q90819l89030n88993
4960C799979m40967j82255r7856j43347o1267j41660k16999J67560K18935l89652
4950B512471k83567J40448J15639J12074q4215j06511M80068P4099l12121n20168
$$ plain form
4940 2128217 2092053 2503600 2484765 2344410 2076818 2009842 2145840 2125560 2143978 1975749
4930 1975749 2002399 1889322 2036050 1835376 1574512 1712052 1832351 1886960 2157316 1995925
4920 1995925 2367762 2492528 2493643 2022031 2088531 2093791 2633031 2185907 1994618 1836143
4910 1836143 1775399 1876215 2108192 2320016 1834017 1820159 2148473 2740833 2534654 2466058
4900 2466058 2250333 2455500 2468080 2160790 1895447 1957611 2282311 2306477 2008118 2058437
4890 2058437 2443844 2930874 2396380 2186051 2072312 2482010 2392813 2653997 2689480 2511991
4880 2511991 2407864 2387237 2591070 2678449 2462499 2384895 2117084 1947402 1996533 2431622
4870 2431622 2231305 2243309 2340918 2495301 2553149 2666993 2601974 2500451 2660434 2687905
$$ packed form
4940B128217l6164M11547j8835j40355k67592o6976J35998k0280J8418j68229
4930A975749K6650j13077J46728k00674k60864J37540J20299N4609K70356j61391
4920A995925L71837J24766J115m71612O6500N260N39240m47124j91289j58475
4910A836143o0744J00816K31977K11824m85999j3858L28314N92360k06179o8596
4900B466058k15725K05167J2580l07290k65343O2164L24700K4166k98359N0319
4890B058437L85407M87030n34494k10329j13739M09698q9197K61184L5483j77489
4880B511991j04127k0627K03833Q7379k15950p7604k67811j69682M9131M35089
4870B431622k00317J2004R7609J54383N7848J13844o5019j01523J59983K7471
$$ plain form
4860 2687905 2231266 2580115 3103308 3098430 2971311 2660287 2564537 2501747 2868318 2736481
4850 2736481 2998657 3137515 2727958 2658733 2979683 2993105 2962958 3059977 2980966 3070093 3432443
4839 3432443 3160698 3165673 3026693 3134760 3290943 3471525 2997709 3055316 3445379 3480472
4829 3480472 3389690 3595151 3234244 3363706 4084293 3968288 3386445 3733461 3525829 3537118
4819 3537118 3802752 3840893 3823735 3956777 3985691 4109679 3999461 4170664 4149400 3693516
4809 3693516 4086289 4045031 3443343 3719847 3883930 4056308 3870751 3990994 4420399 4283917
4799 4283917 4429744 4240539 4555245 4717123 4960962 4912046 5480894 5715917 5880545 6445132
4789 6445132 7123590 7534739 8515319 9134860 10132625 11442601 13088168 14692501 15432265
$$ packed form
4860B687905m56639L48849N23193m878j27119l11024r5750o2790L66571j31837
4850B736481K62176J38858m09557o9225L20950J3422l0147R7019p9011Q9127L62350
4839C432443k71745M975j38980J08067J56183J80582m73816N7607L90063L5093
4829C480472r0782K05461l60907J29462P20587j16005n81843L47016k07632J1289
4819C537118K65634L8141j7158J33042K8914J23988j10218J71203k1264m55884
4809C693516L92773m1258o01688K76504J64083J72378j85557J20243M29405j36482
4799D283917J45827j89205L14706J61878K43839m8916N68848K35023J64628N64587
4789F445132O78458M11149R80580O19541R97765J309976J645567J604333P39764
$$ plain form
4780 15432265 15080841 14378710 12418212 10311038 8498377 7658574 6969485 6289072 5857734
4771 5857734 5165857 4739493 4323988 4366628 4053295 4157177 4616822 4127730 3861003 4082733
4761 4082733 4101303 4163277 3519734 3330293 3335172 3433313 3602644 3864213 3459967 3792683
4751 3792683 4012814 3875424 3907762 4041619 3694210 3888353 3841067 3913273 4125319 4236997
4741 4236997 4259978 4602672 4593754 4798586 4700404 4532112 5003002 5091428 5473087 5893658
4731 5893658 6307864 6458021 6799494 7175223 7930309 8126193 8204295 8366394 8655799 8476942
4721 8476942 8635411 9238930 9660480 10826977 11992506 13274687 14758921 14950243 14671756
4712 14671756 14521191 13208975 11156441 9819611 8496338 7578067 7025975 6937031 6737761
$$ packed form
4780A5432265l51424p02131j960498k107174j812661q39803o89089o80413m31338
4771E857734o91877m26364m15505M2640l13333J03882M59645m89092k66727K21730
4761D082733J8570O1974o43543j89441M879R8141J69331K61569m04246L32716
4751C792683K20131j37390L2338J33857l47409J94143m7286P2206K12046J11678
4741D236997K2981L42694q918K04832r8182j68292M70890Q8426L81659M20571
4731E893658M14206J50157L41473L75729P55086J95884P8102J62099K89405j78857
4721H476942J58469O03519M21550J166497J165529J282181J484234J91322k78487
4712A4671756j50565j312216k052534j336830j323273r18271n52092q8944j99270
$$ plain form
4703 6737761 6655331 7011572 7085620 7143011 7187606 6848450 6333409 5907888 5345600 5255491
4693 5255491 4969877 4126062 4307652 4492671 4419138 4288490 3972943 4173323 4103015 3779276
4683 3779276 3535386 3620504 3376031 3820306 3736215 3459239 2752025 2507134 2890735 3096843
4673 3096843 2871890 2904027 2788278 2931855 3323720 3157445 3194865 3067067 3198281 2808637
4663 2808637 3047661 2843854 2679125 2849271 2325593 2042973 2265369 2260461 2250061 2379664
4653 2379664 2517912 2599990 2750475 2714800 2878109 2697127 2626174 2440003 2267923 2207513
4643 2207513 2049212 2397585 2316449 2044055 2548475 2705859 2414680 2083746 2439180 2506345
4633 2506345 2390938 2083445 2406119 2452320 2526469 2283460 2231661 2647800 2403145 1959130
$$ packed form
4703F737761q2430L56241P4048N7391M4595l39156n15041m25521n62288r0109
4693E255491k85614q43815J81590J85019p3533j30648l15547K00380p0308l23739
4683C779276k43890Q5118k44473M44275q4091k76976p07214k44891L83601K06108
4673C096843k24953L2137j15749J43577L91865j66275L7420j27798J31214l89644
4663B808637K39024k03807j64729J70146n23678k82620K22396m908j0400J29603
4653B379664J38248Q2078J50485l5675J63309j80982p0953j86171j72080o0410
4643B207513j58301L48373q1136k72394N04420J57384k91179l30934L55434O7165
4633B506345j15407l07493L22674M6201P4149k43009n1799M16139k44655m44015
$$ plain form
4623 1959130 2016565 2853420 2707652 2759552 2668855 2392284 2555787 2849290 2422811 2636518
4613 2636518 2476065 2144515 2166081 2368668 2210145 2159086 2490650 2378963 2396675 2497564
4603 2497564 2315742 2293499 2434474 2552602 2514526 2709655 2869214 2829432 2565614 2581299
4593 2581299 2724290 2498095 2720638 2763509 2321023 2050143 2261935 2540945 2304725 2223096
4583 2223096 2417610 2613206 2692748 2573411 2784266 2639113 2198019 1753935 1929522 2081095
4573 2081095 2504027 2491492 2461081 2863872 3024100 2783647 2832344 2901563 2557627 2376630
4563 2376630 2463219 2816232 2555800 2382251 2630579 2834850 2499185 2799412 2969472 2715510
4553 2715510 2858469 2865956 3185067 3488665 3193977 3386480 3180001 3130197 3314796 2932009
$$ packed form
4623A959130N7435Q36855j45768N1900r0697k76571J63503K93503m26479K13707
4613B636518j60453l31550K1566K02587j58523n1059L31564j11687J7712J00889
4603B497564j81822k2243J40975J18128l8076J95129J59559l9782k63818J5685
4593B581299J42991k26195K22543M2871m42486k70880K11792K79010k36220q1629
4583B223096J94514J95596P9542j19337K10855j45153m41094m44084J75587J51573
4573B081095M22932j2535l0411M02791J60228k40453M8697O9219l43936j80997
4563B376630Q6589L53013k60432j73549K48328K04271l35665L00227J70060k53962
4553B715510J42959P487L19111L03598k94688J92503k06479m9804J84599l82787
$$ plain form
4543 2932009 3085696 3288344 3364873 3297431 3385093 3327672 3387818 3726508 3352103 3363201 3924965
4532 3924965 3549379 3452349 3760967 3873120 4354355 4418826 4030592 3619381 3882674 4156500
4522 4156500 4493825 4084163 3728381 3595073 3848501 4133935 4200534 4409601 4235965 4424943
4512 4424943 4321120 4602538 4385432 4405419 4788162 4477847 4342778 4017689 4415771 5008470
4502 5008470 4891925 4873696 5169043 5468627 5855739 5851462 6158345 5998477 6092133 6273220
4492 6273220 6623986 6953715 6847624 6677872 6828279 7205542 7331113 7770793 7850676 8194591
4482 8194591 8447328 9006529 8996045 9282829 9555409 10101285 10575608 11032095 11753421 12122259
4472 12122259 13077134 13867177 14403440 14597537 15228637 15778781 15890527 15834327 15816705 15809505
$$ packed form
4543B932009J53687K02648P6529o7442Q7662n7421O0146L38690l74405J1098N61764
4532C924965l75586r7030L08618J12153M81235O4471l88234m11211K63293K73826
4522D156500L37325m09662l55782j33308K53428K85434O6599K09067j73636J88978
4512D424943j03823K81418k17106J9987L82743l10315j35069l25089L98082N92699
4502E008470j16545j8229K95347K99584L87112m277L06883j59868R3656J81087
4492F273220L50766L29729j06091j69752J50407L77263J25571M39680P9883L43915
4482H194591K52737N59201j0484K86784K72580N45876M74323M56487P21326L68838
4472A2122259R54875P90043N36263J94097O31100N50144J11746n6200j7622p200
$$ plain form
4462 15809505 15725741 16068483 16266805 16146354 16563928 17036337 17098529 16941080 17528908 18068278
4452 18068278 18516624 18580786 18355135 18674386 18524659 18978874 19237206 19366544 19295523 19068534
4442 19068534 18843930 18571282 18191893 18065954 17787315 17483576 17520374 17236066 16934083 17122622
4432 17122622 17073624 17612173 18218545 18873834 19287517 19598633 20216081 20472948 20837546 21016108
4422 21016108 21541155 21697877 21994041 22230495 22083516 22340899 22332168 21849912 21698438 21117648
4412 21117648 20573383 20423214 19886669 19017429 18301408 17241490 16188591 15398079 14529253
4403 14529253 13820422 13196877 12759891 12130130 11771910 11282757 11532841 11369690 10748431
4394 10748431 10313615 10611068 10366633 10138182 9730191 9501563 9719738 9386116 9404234 9271235
$$ packed form
4462A5809505q3764L42742J98322j20451M17574M72409O2192j57449N87828N39370
4452A8068278M48346O4162k25651L19251j49727M54215K58332J29338p1021k26989
4442A9068534k24604k72648l79389j25939k78639l03739L6798k84308l01983J88539
4432A7122622m8998N38549O06372O55289M13683L11116O17448K56867L64598J78562
4422B1016108N25047J56722K96164K36454j46979K57383q731m82256j51474n80790
4412B1117648n44265j50169n36545q69240p16021j059918j052899p90512q68826
4403A4529253p08831o23545m36986o29761l58220m89153K50084j63151o21259
4394A0748431m34816K97453k44435k28451m07991k28628K18175l33622J8118j32999
$$ plain form
4384 9271235 8858494 8902241 9038148 8856473 9217076 9251270 9398139 9424925 9434483 9738536
4374 9738536 9921134 9951486 10120197 10364356 10556913 11056626 11109902 11201002 11389492 11354828
4364 11354828 11548915 11853414 11685012 11759924 11844502 11421078 11306757 11628569 11818344 11633400
4354 11633400 11734920 11719113 11937608 12055904 12046183 12329906 12792889 13185845 13663385 14138874
4344 14138874 14473214 15216083 15598556 16025807 16804723 17458197 18235301 18833279 19955213
4335 19955213 20724701 21740157 22700138 23459798 24124794 24676985 25041826 25312252 25668463
4326 25668463 26144337 26394731 26523505 26725476 26893413 26457919 26642569 26337471 25637539
4317 25637539 25884535 25663920 25338015 24930023 24909320 24659316 24041356 23474275 23062569 22946659
$$ packed form
4384I271235m12741M3747J35907j81675L60603L4194J46869K6786R558L04053
4374I738536J82598L0352J68711K44159J92557M99713N3276R1100J88490l4664
4364A1354828J94087L04499j68402P4912Q4578m23424j14321L21812J89775j84944
4354A1633400J01520j5807K18495J18296r721K83723M62983L92956M77540M75489
4344A4138874L34340P42869L82473M27251P78916O53474P77104N97978J121934
4335A9955213P69488J015456R59981P59660O64996N52191L64841K70426L56211
4326B5668463M75874K50394J28774K01971J67937m35494J84650l05098o99932
4317B5637539K46996k20615l25905m07992k0703k50004o17960n67081m11706j15910
$$ plain form
4307 22946659 22888370 23413888 23481263 23915255 24308538 24441598 24855238 24653081 24772430 24823192
4297 24823192 24710473 24542382 24745941 24857319 24391947 24114891 23705683 23719433 23838351 23636624
4287 23636624 23409150 23345651 23421267 23454359 23007351 23350273 23098409 22877933 22731226 22027342
4277 22027342 21847344 21352008 21152938 21028325 20586078 20159091 19915002 19063352 18358238
4268 18358238 17683053 17026970 16311749 15723291 15730978 15265952 14776859 14602882 14999706 14610623
4258 14610623 14725047 14833815 14858782 14974619 15018944 15610163 16034148 15747716 16033713 17014571
4248 17014571 17001971 17674033 18246979 18029067 17266935 17279947 16775568 16504829 16588050 16588000 16285080
4237 16285080 16507201 17298545 18018168 18088963 18346960 18273280 17338873 17066418 16503106 16084252
$$ packed form
4307B2946659n8289N25518O7375M33992L93283J33060M13640k02157J19349N0762
4297B4823192j12719j68091K03559J11378m65372k77056m09208J3750J18918k01727
4287B3636624k27474o3499P5616L3092m47008L42922k51864k20476j46707p03884
4277B2027342j79998m95336j99070j24613m42247m26987k44089q51650p05114
4268A8358238o75185o56083p15221n88458P687m65026m89093j73977L96824l89083
4258A4610623J14424J08768K4967J15837M4325N91219M23985k86432K85997R80858
4248A7014571j2600O72062N72946k17912p62132J3012n04379k70739Q3221n0l02920
4237A6285080K22121P91344P19623P0795K57997p3680r34407k72455n63312m18854
$$ plain form
4227 16084252 15343204 14898901 14849795 14609619 14319322 13858124 14097227 14244991 14162908 14119758
4217 14119758 14588757 14464314 14777413 14377768 14582535 15126643 15474007 15797067 16049378
4208 16049378 16203748 16180059 16706724 16712184 17547541 18049704 18709213 19492677 19943739 19718707
4198 19718707 19664967 19993977 20247235 20700552 20937651 21960637 22858506 23403243 24429930
4189 24429930 25859217 26670388 27026539 27729864 27844024 28342371 28547019 28432341 29592570
4180 29592570 29945553 30061336 29751150 29473316 29671419 30098246 31023874 32235237 33533528
4171 33533528 34807751 35685389 36740232 37255430 36683609 36127366 34863902 33665167 32232516
4162 32232516 30885074 30519453 29756854 28853051 28672715 28509141 28703126 28512462 29397337
$$ packed form
4227A6084252p41048m44303m9106k40176k90297m61198K39103J47764q2083m3150
4217A4119758M68999j24443L13099l99645K04767N44108L47364L23060K52311
4208A6049378J54370k3689N26665N460Q35357N02163O59509P83464M51062k25032
4198A9718707n3740L29010K53258M53317K37099J022986Q97869N44737J026687
4189B4429930J429287Q11171L56151P03325J14160M98347K04648j14678J160229
4180B9592570L52983J15783l10186k77834J98103M26827R25628J211363J298291
4171C3533528J274223Q77638J054843N15198n71821n56243j263464j198735j432651
4162C2232516j347442l65621p62599r03803j80336j63574J93985j90664Q84875
$$ plain form
4153 29397337 30060169 30729627 31965298 32719076 32971842 33882147 34522712 34540410 34488001 33866280
4143 33866280 33130670 32867615 32987391 33376563 34212694 35456716 36689423 38122711 39823522
4134 39823522 41027199 42638645 43645849 44586305 44716390 45045459 45030391 45174651 45427394
4125 45427394 44855375 43901771 43185365 42232771 41970928 41850484 41391363 41977393 42324476
4116 42324476 42161267 42193269 42915210 43201793 43859729 44627776 45157677 45634764 46626981 47912423
4106 47912423 49639704 50269938 51181655 52340087 52912478 53444821 54063838 55168548 56864478
4097 56864478 58056207 59553339 61804915 64985651 68037945 71132366 74624672 78294988
4089 78294988 82641861 87294110 92328415 98242481 105717546 114961475 126334390 140677370
$$ packed form
4153B9397337O62832O69458J235671P53778K52766R10305O40565J7698n2409o21721
4143C3866280p35610k63055J19776L89172Q36131J244022J232707J433288J700811
4134C9823522J203677J611446J007204R40456J30085L29069j5068J44260K52743
4125D5427394n72019r53604p16406r52594k61843j20444m59121N86030L47083
4116D2324476j63209L2002P21941K86583O57936P68047N29901M77087R92217J285442
4106D7912423J727281O30234R11717J158432N72391N32343O19017J104710J695930
4097E6864478J191729J497132K251576L180736L052294L094421L492306L670316
4089G8294988M346873M652249N034305N914066P475065R243929J1372915J4342980
$$ plain form
4081 140677370 156883765 174638046 193515792 211541094 218087295 213270701 207547486
4074 207547486 207140072 212410711 221155419 232422693 244506231 242583041 216666290 185988637
4066 185988637 159361379 138788781 124230128 113406820 105197456 98797731 94206347
4059 94206347 90220580 86522474 82807456 79381736 76138919 73259841 70703982 68703969
4051 68703969 67397289 66233957 65197590 64656661 64301466 63903266 63619355 63551729 62977031
4042 62977031 62219371 61147597 60233561 59163075 58157446 58182934 58287338 58803053 59530114
4033 59530114 60796330 62455113 64874648 66665104 67577695 67761064 65618579 62301415
4025 62301415 58490043 55778835 53546381 51516347 50208581 48631106 47447442 46639520
$$ packed form
4081A40677370J6206395J7754281J8877746J8025302O546201m816594n723215
4074B07547486m07414N270639Q744708J1267274J2083538j923190k5916751l0677653
4066A85988637k6627258k0572598j4558653j0823308q209364o399725m591384
4059I4206347l985767l698106l715018l425720l242817k879078k555859k000013
4051F8703969j306680j163332j036367n40929l55195l98200k83911o7626n74698
4042F2977031p57660j071774r14036j070486j005629K5488J04404N15715P27061
4033E9530114J266216J658783K419535J790456R12591J83369k142485l317164
4025F2301415l811372k711208k232454k030034j307766j577475j183664q07922
$$ plain form
4017 46639520 46014923 45851199 45515275 45184282 44804660 44133423 43397001 42230981 41743769
4008 41743769 41062033 40430573 39897841 39524055 38696244 38042618 37595356 37524354 37121407 36253505
3998 36253505 35756175 35132144 34149253 33363273 32854788 32537855 31961115 31402001 30667692
3989 30667692 29814259 28815492 28363069 27707540 27491690 27106614 26881028 26626029 26147184
3980 26147184 25897551 25584237 25643769 25562742 25498665 25216484 25539806 25411470 25653159 25917339
3970 25917339 26334943 27376622 28060348 29252662 30764901 32164522 33686150 34401400 33188359
3961 33188359 31333760 29725076 27740917 26055306 25112007 24559816 24200092 23794591 23759750
3952 23759750 23985634 24409655 24187132 24047645 23670830 22908919 22193516 21276994 20843268
$$ packed form
4017D6639520o24597j63724l35924l30993l79622o71237p36422j166020m87212
4008D1743769o81736o31460n32732l73786q27811o53626m47262p1002m02947q67902
3998C6253505m97330o24031r82891p85980n08485l16933n76740n59114p34309
3989C0667692q53433r98767m52423o55529k15850l85076k25586k54999m78845
3980B6147184k49633l13314N9532q1027o4077k82181L23322j28336K41689K64180
3970B5917339M17604J041679O83726J192314J512239J399621J521628P15250j213041
3961C3188359j854599j608684j984159j685611r43299n52191l59724m05501l4841
3952B3759750K25884M24021k22523j39487l76815p61911p15403r16522m33726
$$ plain form
3943 20843268 19924326 19537595 19340682 19190167 19002373 19031206 18816567 19145092 19130297 19723735
3933 19723735 19826630 20048207 20620831 21302996 22265283 23119334 24483805 25845899 27013141
3924 27013141 28414856 30312954 31973581 33259014 33829712 34362409 33918357 32144007 29939292
3915 29939292 27443942 25567273 23786059 22404973 20970831 19636001 19091027 18426320
3907 18426320 17795276 17168943 17127342 16934241 16599075 16020800 15812629 15955996 16238875 16086470
3897 16086470 16051237 15715654 15752935 15743009 15644150 15701345 15598015 15545057 14799432 15014698 15358859
3886 15358859 15375758 15312096 15187001 15118920 15272144 16008070 16147309 15770726 16006963 15835446
3876 15835446 15635640 15651926 15780460 16074865 16114860 16094556 15756884 15969745 16490907 16068078
$$ packed form
3943B0843268r18942l86731j96913j50515j87794K8833k14639L28525j4795N93438
3933A9723735J02895K21577N72624O82165R62287Q54051J364471J362094J167242
3924B7013141J401715J898098J660627J285433N70698N32697m44052j774350k204715
3915B9939292k495350j876669j781214j381086j434142j334830n44974o64707
3907A8426320o31044o26333m1601j93101l35166n78275k08171J43367K82879j52405
3897A6086470l5233l35583L7281r926r8859N7195j03330n2958p45625K15266L44161
3886A5358859J6899o3662j25095o8081J53224P35926J39239l76583K36237j71517
3876A5835446j99806J6286J28534K94405L9995k0304l37672K12861N21162m22829
$$ plain form
3866 16068078 15877123 15855358 16440156 16396897 16476526 16896344 17057872 16787256 17652323 17811481
3856 17811481 17569107 17914700 18138150 17650480 17524533 17806890 17496677 17997820 18530657
3847 18530657 18664962 18351849 18939020 18730593 18575101 19241358 19369395 19386545 19746321 19717544
3837 19717544 19841547 19696393 19757528 20182403 20587110 21154144 21488482 21892626 22435367 22890732
3827 22890732 23287043 23172023 23037419 23233931 23401659 23675850 23946047 24478453 24674675
3818 24674675 24884885 25273489 25872663 26291488 26512056 26792631 26908394 26915968 27086996 27227796
3808 27227796 27384671 27747826 28040765 28370251 28733682 29038737 29791974 30576618 31096663
3799 31096663 31670254 31986176 32321806 32291319 33178341 33760602 34150301 35227168 36547668
$$ packed form
3866A6068078j90955k1765N84798m3259P9629M19818J61528k70616Q65067J59158
3856A7811481k42374L45593K23450m87670j25947K82357l10213N01143N32837
3847A8530657J34305l13113N87171k08427j55492O66257J28037J7150L59776k8777
3837A9717544J24003j45154O1135M24875M04707N67034L34338M04144N42741M55365
3827B2890732L96311j15020j34604J96512J67728K74191K70197N32406J96222
3818B4674675K10210L88604N99174M18825K20568K80575J15763P574J71028J40800
3808B7227796J56875L63155K92939L29486L63431L05055P53237P84644N20045
3799C1096663N73591L15922L35630l0487Q87022N82261L89699J076867J320500
$$ plain form
3790 36547668 37794343 39170009 41309948 43259469 44912173 46713315 48702221 50837231
3782 50837231 53444499 55716332 57933944 60651837 63197564 65431146 67017439 68652026
3774 68652026 70434435 71897036 73163270 74807229 76234267 77759235 78422209 79473983
3766 79473983 80064900 80073601 79468598 79203636 78357539 77515405 76520171 75379392 74522763 73611209
3756 73611209 73006909 72032009 70926159 70044085 69399866 68228695 67627477 67042403 66844742
3747 66844742 66107061 65787758 65093647 64139333 63366479 62384474 61928010 61905903 62287734 62668924
3737 62668924 63441262 64110982 64918291 65892987 66836036 67082428 66941471 66555653 65712428
3728 65712428 64933701 63318437 61951984 60867894 59995674 59370471 58487008 57909071 57548613
$$ packed form
3790C6547668J246675J375666K139939J949521J652704J801142J988906K135010
3782E0837231K607268K271833K217612K717893K545727K233582J586293J634587
3774F8652026J782409J462601J266234J643959J427038J524968O62974J051774
3766G9473983N90917Q701o05003k64962q46097q42134r95234j140779q56629r11554
3756G3611209o04300r74900j105850q82074o44219j171171o01218n85074j97661
3747F6844742p37681l19303o94111r54314p72854r82005m56464k2107L81831L81190
3737F2668924P72338O69720Q07309R74696R43049K46392j40957l85818q43225
3728F5712428p78727j615264j366453j084090q72220o25203q83463n77937l60458
$$ plain form
3719 57548613 57645361 57450279 56998550 56733325 56223176 55980923 55206339 54067269 53250685
3710 53250685 51888330 50258298 48430696 46774190 45253515 44213320 43744467 43208973
3702 43208973 42711891 42554418 42662465 42772111 43028177 43396707 43718577 43279192 43485926
3693 43485926 43030474 43235736 43151792 42769291 43460967 44208562 45237005 46023538 46897009
3684 46897009 47681798 48573414 49492686 50260834 50628281 50785996 50794460 50463348 50281294 49910529
3674 49910529 49316022 48221543 47904290 47880937 47850322 47701800 47318626 47076510 46872617 46366971
3664 46366971 45953761 45766417 44800266 43465304 42249623 41091844 39656039 38301187 37352439
3655 37352439 36097851 35112572 34414770 34094139 34050014 33845721 33533818 33183379 32800815
$$ packed form
3719E7548613R6748j95082m51729k65225n10149k42253p74584j139070q16584
3710E3250685j362355j630032j827602j656506j520675j040195m68853n35494
3702D3208973m97082j57473J08047J09646K56066L68530L21870m39385K06734
3693D3485926m55452K05262q3944l82501O91676P47595J028443P86533Q73471
3684D6897009P84789Q91616R19272P68148L67447J57715Q464l31112j82054l70765
3674D9910529n94507j094479l17253k3353l0615j48522l83174k42116k03893n05646
3664D6366971m13210j87344r66151j334962j215681j157779j435805j354852r48748
3655C7352439j254588r85279o97802l20631m4125k04293l11903l50439l82564
$$ plain form
3646 32800815 32754337 33304956 33689439 33633246 33624080 33845358 34061470 34368022 34675840 34842153
3636 34842153 34914430 34994463 35273829 35784925 36459959 36822313 37013107 37761550 38631392 39189799
3626 39189799 39382110 40232954 41161474 41964862 43072198 44064458 45220663 46379183 47660104
3617 47660104 49416964 51724603 53541887 55981632 58352754 61723795 65360073 68786064
3609 68786064 73159926 77692964 82493497 88401598 94665484 101295706 107829272 114547055
3601 114547055 120767674 126278935 132309761 137276983 141645229 144770968 147082402 148427035
3593 148427035 148314436 147300364 144749757 140997545 137088402 132139046 127261852 121965577
3585 121965577 116627454 111440515 106312866 101599857 97555375 93349636 89619400 86276414
$$ packed form
3646C2800815m6478N50619L84483n6193r166K21278K16112L06552L07818J66313
3636C4842153P2277Q0033K79366N11096O75034L62354J90794P48443Q69842N58407
3626C9189799J92311Q50844R28520Q03388J107336R92260J156205J158520J280921
3617D7660104J756860K307639J817284K439745K371122L371041L636278L425991
3609F8786064M373862M533038M800533N908101O263886O630222O533566O717783
3601A14547055O220619N511261O030826M967222M368246L125739K311434J344633
3593A48427035j12599j014072k550607l752212l909143m949356m877194n296275
3585A21965577n338123n186939n127649m713009m044482m205739l730236l342986
$$ plain form
3577 86276414 83151998 80311043 77865048 75871256 74304486 72923370 71761879 70974805
3569 70974805 70410117 69731271 69456476 69079448 68704439 68869510 69184612 69216097 69579478 70204671
3559 70204671 70988823 72173752 73710736 75094989 76719492 78320493 79689830 80973065
3551 80973065 82509324 83373193 83680062 83761260 83432106 82730452 82102409 80928049 79770728
3542 79770728 78964208 77775251 77009283 76252772 75498875 74355467 72992352 71786233 70403391
3533 70403391 68941420 67333214 65796053 63832719 62049207 60194534 58877230 57705407
3525 57705407 56414570 55469040 54467793 54085094 53632541 53367446 54170252 54883637 55741220
3516 55741220 57318272 58828628 60888252 62217538 64401060 66390644 68535343 70683545
$$ packed form
3577H6276414l124416k840955k445995j993792j566770j381116j161491p87074
3569G0974805n64688o78846k74795l77028l75009J65071L15102L1485L63381O25193
3559G0204671P84152J184929J536984J384253J624503J601001J369337J283235
3551H0973065J536259Q63869L06869Q1198l29154p01654o28043j174360j157321
3542G9770728q06520j188957p65968p56511p53897j143408j363115j206119j382842
3533G0403391j461971j608206j537161j963334j783512j854673j317304j171823
3525E7705407j290837r45530j001247l82699m52553k65095Q02806P13385Q57583
3516E5741220J577052J510356K059624J329286K183522J989584K144699K148202
$$ plain form
3508 70683545 72335046 73610729 74193495 74456572 74291219 73669770 72860027 71305053 69217820
3499 69217820 66744851 64122189 61286863 58182968 55376283 52483686 49497151 46638051
3491 46638051 43618604 41981409 39938245 37970794 36466157 35183547 33636370 32495986
3483 32495986 31349116 30097882 29264888 28196543 27315239 26481702 25949918 25432010 24932005
3474 24932005 24134763 23450877 22918991 22382924 21482080 21081277 21172700 20434189 20164963 19985982
3464 19985982 19698419 19762517 19610368 18862548 18540579 18905508 18623488 18328104 18192097 18315265
3454 18315265 18111546 17732000 17829148 18049302 18333600 18258287 17595185 17370841 17551325 17754922
3444 17754922 17501709 17222631 17272214 17745420 17509584 16935238 16992696 16976209 16876667 16693666
$$ packed form
3508G0683545J651501J275683N82766K63077j65353o21449q09743j554974k087233
3499F9217820k472969k622662k835326l103895k806685k892597k986535k859100
3491D6638051l019447j637195k043164j967451j504637j282610j547177j140384
3483C2495986j146870j251234q32994j068345q81304q33537n31784n17908n00005
3474B4932005p97242o83886n31886n36067r00844m00803R1423p38511k69226j78981
3464A9985982k87563O4098j52149p47820l21969L64929k82020k95384j36007J23168
3454A8315265k03719l79546R7148K20154K84298p5313o63102k24344J80484K03597
3444A7754922k53213k79078M9583M73206k35836n74346N7458j6487r9542j83001
$$ plain form
3434 16693666 16378717 16463481 16638647 16622254 17307368 17373970 16852136 16975393 17278729 17682204
3424 17682204 17721047 17846120 18274240 18674337 18856357 19382643 19778594 19782674 20148881 20803982
3414 20803982 21687606 22758333 23785112 24755210 25987912 27295015 28771428 30357227
3406 30357227 32659477 34719617 35763260 34898985 33259280 32215479 31533658 31349950 31345786
3397 31345786 30795572 30399999 30330462 30461231 31006596 31022253 30936878 30474848 30631226 31094721
3387 31094721 31140857 31278459 31277802 31865057 32116117 32071549 32550404 31984981 32280652 32579920
3377 32579920 32310744 32360242 32261487 32121232 32238785 32680772 33380794 33880528 34209184 34820793
3367 34820793 35601736 35895893 36115749 36840315 37424996 38051066 39086118 39921308 40883508
$$ packed form
3434A6693666l14949Q4764J75166j6393O85114O6602n21834J23257L03336M03475
3424A7682204L8843J25073M28120M00097J82020N26286L95951M080L66207O55101
3414B0803982Q83624J070727J026779R70098J232702J307103J476413J585799
3406C0357227K302250K060140J043643q64275j639705j043801o81821j83708m164
3397C1345786n50214l95573o9537J30769N45365J5657q5375m62030J56378M63495
3387C1094721M6136J37602o57N87255K51060m4568M78855n65423K95671K99268
3377C2579920k69176M9498r8755j40255J17553M41987P00022M99734L28656O11609
3367C4820793P80943K94157K19856P24566N84681O26070J035052Q35190R62200
$$ plain form
3358 40883508 41955777 43523995 44801489 46229685 47619563 49318888 51403117 53072925
3350 53072925 55276401 57450832 59813119 62232489 64428993 66533879 68642318 70476382
3342 70476382 72257187 73509380 74417560 75672385 76614635 77280315 77696560 78022387 78427416
3333 78427416 79328612 79967093 80840613 81298670 81644884 82358758 82970554 83687395 84468891
3324 84468891 85199543 85403655 85622008 86299562 87274774 88048110 89470420 91342359 93412803
3315 93412803 95610130 98178443 100430798 102880935 105227801 107399257 108862760 110494088
3307 110494088 112238942 113737632 114543671 115065209 115840547 116160593 116865722 117902652 118510855
3298 118510855 119170136 119241639 118769925 118123583 117536250 116449488 114720521 113076629 111170968
$$ packed form
3358D0883508J072269J568218J277494J428196J389878J699325K084229J669808
3350E3072925K203476K174431K362287K419370K196504K104886K108439J834064
3342G0476382J780805J252193R08180J254825R42250O65680M16245L25827M05029
3333G8427416R01196O38481Q73520M58057L46214P13874O11796P16841P81496
3324H4468891P30652K04112K18353O77554R75212P73336J422310J871939K070444
3315I3412803K197327K568313K252355K450137K346866K171456J463503J631328
3307A10494088J744854J498690Q06039N21538P75338L20046P05129J036930O08203
3298A18510855O59281P1503m71714o46342n87333j086762j728967j643892j905661
$$ plain form
3289 111170968 109172910 107355590 105305681 102908256 101014042 98939445 97109874 95335627
3281 95335627 93426105 91956953 90610817 89107211 87926571 86740160 85519089 84814552
3273 84814552 83732127 82941496 81997025 81244005 80570467 78882599 77047890 75641127 74933360
3264 74933360 73524394 71782058 70230729 68886960 67863615 67348286 66639043 66007267 65460104
3255 65460104 65102311 64653372 64419977 63549405 62747285 62407695 61690801 61466980 60575780
3246 60575780 59870993 59014225 58052361 57095006 55646154 53955421 52531413 51163252 49783710
3237 49783710 48492862 47491409 46714222 45655356 44576152 44140937 43233184 41752039 41233116
3228 41233116 40633212 39919903 39550294 38954847 38621299 38459845 38249439 37757758 37352574
$$ packed form
3289A11170968j998058j817320k049909k397425j894214k074597j829571j774247
3281I5335627j909522j469152j346136j503606j180640j186411j221071p04537
3273H4814552j082425p90631r44471p53020o73538j687868j834709j406763p07767
3264G4933360j408966j742336j551329j343769j023345n15329p09243o31776n47163
3255F5460104l57793m48939k33395q70572q02120l39590p16894k23821q91200
3246F0575780p04787q56768r61864r57355j448852j690733j424008j368161j379542
3237D9783710j290848j001453p77187j058866j079204m35215r07753j481145n18923
3228D1233116n99904p13309l69609n95447l33548j61454k10406m91681m05184
$$ plain form
3219 37352574 37066516 36769009 36543759 36811087 36997808 36752501 36570520 36384523 36310174 35517060
3209 35517060 35187110 34332076 33341591 33001567 32349041 31736418 31280666 30748120 30990054
3200 30990054 30812505 30640333 30837396 30229674 29908535 30421799 30419094 29900105 30051427 30369102
3190 30369102 30236772 30361488 30539967 30682803 30825586 31087732 31266182 31503632 32387246
3181 32387246 32780955 33234737 33979632 35389845 36596674 37484724 38986282 40752470 42557381
3172 42557381 44619498 46991684 49886341 52693270 55508875 58713751 62647850 65714022
3164 65714022 68800995 72037430 75257486 77994406 81001111 83464752 85598087 86790883
3156 86790883 87906007 88167266 87703643 86849039 84699707 82058370 78922058 75764851 72907385
$$ packed form
3219C7352574k86058k97507k25250K67328J86721k45307j81981j85997p4349p93114
3209C5517060l29950q55034r90485l40024o52526o12623m55752n32546K41934
3200C0990054j77549j72172J97063o07722l21139N13264k705n18989J51322L17675
3190C0369102j32330J24716J78479J42836J42783K62146J78450K37450Q83614
3181C2387246L93709M53782P44895J410213J206829Q88050J501558J766188J804911
3172D2557381K062117K372186K894657K806929K815605L204876L934099L066172
3164F5714022L086973L236435L220056K736920L006705K463641K133335J192796
3156H6790883J115124K61259m63623q54604k149332k641337l136312l157207k857466
$$ plain form
3147 72907385 70296196 67668314 65168762 63329363 62495397 61889644 62393067 62722017 63512259
3138 63512259 64943379 66253329 67643228 69766555 71015691 72260975 73448731 74873247
3130 74873247 75296751 75642050 75115210 74219682 72882687 71567534 69769290 67646747 65773665
3121 65773665 63815697 62169147 60339420 58702428 57556734 56267545 54913645 54080234
3113 54080234 52852232 51820682 50588949 48965965 47085133 44928426 42720398 40683904
3105 40683904 39000069 37052560 34825232 32848246 31310591 29550958 28238662 27392993
3097 27392993 25944641 24992413 23844801 22810409 21992530 21173925 20725628 20308980 19629331
3088 19629331 19123937 18269214 17650071 17369239 16490781 16150231 15878775 15335147 15237759 14815904
$$ packed form
3147G2907385k611189k627882k499552j839399q33966o05753N03423L28950P90242
3138F3512259J431120J309950J389899K123327J249136J245284J187756J424516
3130G4873247M23504L45299n26840q95528j336995j315153j798244k122543j873082
3121F5773665j957968j646550j829727j636992j145694j289189j353900q33411
3113E4080234j228002j031550j231733j622984j880832k156707k208028k036494
3105D0683904j683835j947509k227328j976986j537655j759633j312296q45669
3097B7392993j448352r52228j147612j034392q17879q18605m48297m16648o79649
3088A9629331n05394q54723o19143k80832q78458l40550k71456n43628r7388m21855
$$ plain form
3078 14815904 14416839 14634392 14536289 14191628 13739152 13341072 13248634 12637524 12966308 12709158
3068 12709158 12858401 12931675 12396848 12366080 12539006 12158143 11889746 12219835 12096759 11937265
3058 11937265 11709184 11228196 11302686 11149073 11158333 10965660 10891517 10769429 10943989 10972557
3048 10972557 10681753 10416468 9964099 9730607 9887666 10252077 9873321 10110309 10033754 9915636
3038 9915636 9862086 9800615 9778740 9780033 9789363 9913128 9562231 9584230 9689444 9651153 9441187
3027 9441187 9306355 9498270 9710689 9400643 9154234 8935774 9018744 9054563 9145719 9027452
3017 9027452 9231338 9663487 9783648 9900823 9647672 9515181 9404268 9699235 10115235 10221603
3007 10221603 9746548 9908921 10018976 10031426 10035190 9911955 10153917 10091436 10356930 10502824
$$ packed form
3078A4815904l99065K17553r8103l44661m52476l98080r2438o11110L28784k57150
3068A2709158J49243P3274n34827l0768J72926l80863k68397L30089j23076j59494
3058A1937265k28081m80988P4490j53613R260j92673p4143j22088J74560K8568
3048A0972557k90804k65285m52369k33492J57059L64411l78756K36988p6555j18118
3038I915636n3550o1471k1875J293R330J23765l50897K1999J05214l8291k09966
3027I441187j34832J91915K12419l10046k46409k18460Q2970L5819R1156j18267
3017I027452K03886M32149J20161J17175k53151j32491j10913K94967M16000J06368
3007A0221603m75055J62373J10055J2450L764j23235K41962o2481K65494J45894
$$ plain form
2997 10502824 10986097 11059409 10816224 11061122 11064057 11549272 11772596 11980734 11879036 11867820
2987 11867820 11731220 12018795 12473857 12824305 13098053 13335645 13554431 13321693 13685296
2978 13685296 14053657 13987656 14211308 14391617 14544361 14763093 14893341 14902755 14814661 15053325
2968 15053325 15490406 15901099 16193986 16225729 16860496 16949281 17049604 17643919 18201152 18614970
2958 18614970 18573286 19419005 19948117 20056382 20295373 20646123 21078315 20819803 21030161 21284463
2948 21284463 21733128 22119031 22403121 23346101 23773790 24121035 24427542 24719604 25340591
2939 25340591 26379791 26779999 27444630 28289804 28707403 29668774 30656117 31506761 32638923
2930 32638923 33381835 34311698 35278314 35970885 37317708 38335381 39285557 40227002 40820655
$$ packed form
2997A0502824M83273P3312k43185K44898K935M85215K23324K08138j01698j1216
2987A1867820j36600K87575M55062L50448K73748K37592K18786k32738L63603
2978A3685296L68361o6001K23652J80309J52744K18732J30248R414q8094K38664
2968A5053325M37081M10693K92887L1743O34767Q8785J00323N94315N57233M13818
2958A8614970m1684Q45719N29112J08265K38991L50750M32192k58512K10358K54302
2948B1284463M48665L85903K84090R42980M27689L47245L06507K92062O20987
2939B5340591J039200M00208O64631Q45174M17599R61371R87343Q50644J132162
2930C2638923P42912R29863R66616O92571J346823J017673R50176R41445N93653
$$ plain form
2921 40820655 41921979 43280528 44810822 45830082 47179070 48121450 49722958 50637483
2913 50637483 51888478 53621460 55201516 57282759 59256858 61649358 63814663 66359370
2905 66359370 69383438 72407109 75678031 79651170 83989475 88668877 93820639 99784936
2897 99784936 106164304 113613101 122131655 131374047 142230442 154396945 168065279 184549794
2889 184549794 203669563 225758937 251198988 277718824 304575543 327276268 341495196
2882 341495196 340878625 321919517 292585929 260255147 230788834 206774618 188462697
2875 188462697 174388141 164303792 157343777 152514523 149767356 149587453 150041797 152169278
2867 152169278 156189691 161502810 168483574 176764900 186611907 198863667 212669950 227779273
$$ packed form
2921D0820655J101324J358549J530294J019260J348988R42380J601508R14525
2913E0637483J250995J732982J580056K081243J974099K392500K165305K544707
2905F6359370L024068L023671L270922L973139M338305M679402N151762N964297
2897I9784936O379368P448797Q518554R242392J0856395J2166503J3668334J6484515
2889A84549794J9119769K2089374K5440051K6519836K6856719K2700725J4218928
2882C41495196o16571j8959108k9333588l2330782k9466313k4014216j8311921
2875A88462697j4074556j0084349o960015m829254k747167j79903M54344K127481
2867A52169278M020413N313119O980764Q281326R847007J2251760J3806283J5109323
$$ plain form
2859 227779273 242813959 256663048 267315370 273560710 272169337 262336469 247558974
2852 247558974 232116917 218048283 207267794 199385697 194107142 190560661 188022101 186241049
2844 186241049 183734100 179426648 172578029 163218690 151072653 137886516 124363005 111823929
2836 111823929 101365405 92687137 84692526 78368690 72996473 68116578 63769646 60430753
2828 60430753 57124112 54098928 51393346 49044073 46918422 44857306 42414289 40624201
2820 40624201 38826153 37431481 35985758 35029273 33199640 31855291 30789043 29723700
2812 29723700 29135308 28370983 27787553 27319634 26839001 26334053 26040972 25732608 25391835
2803 25391835 24723231 23926170 22921613 22300610 21578749 21336565 20716104 20060073 19251791
$$ packed form
2859B27779273J5034686J3849089J0652322O245340j391373r832868j4777495
2852B47558974j5442057j4068634j0780489p882097n278555l546481k538560j781052
2844A86241049k506949m307452o848619r359339j2146037j3186137j3523511j2539076
2836A11823929j0458524q678268p994611o323836n372217m879895m346932l338893
2828F0430753l306641l025184k705582k349273k125651k061116k443017j790088
2820D0624201j798048j394672j445723r56485j829633j344349j066248j065343
2812B9723700n88392p64325n83430m67919m80633n04948k93081l08364l40773
2803B5391835o68604p97061j004557o21003p21861k42184o20461o56031q08282
$$ plain form
2794 19251791 18300272 17550147 16582247 16161690 15544387 14744303 14055619 13858732 13452281
2785 13452281 12922639 12379125 12243511 11947348 11570633 11751462 11127523 10879783 11066652
2776 11066652 11123741 10644024 10329200 10020364 9729127 9420003 9254032 9297580 8894571 8815910
2766 8815910 8440098 8165879 7748871 7652691 7936008 7826956 7548460 7236854 7127335 7153329
2756 7153329 7159646 6988348 7157912 6722595 6413102 6367531 6250413 6044069 5949638 5659726
2746 5659726 5431392 5468818 5471245 5183155 5345519 5041316 4672366 5163267 5059964 4928771
2736 4928771 4856347 4829452 4743057 4675687 4447981 4344195 4377501 3882696 3984698 4245344
2726 4245344 3594827 3460145 3858442 3900158 3922593 4041489 3915486 3499585 3590172 3581906
$$ packed form
2794A9251791r51519p50125r67900m20557o17303q00084o88684j96887m06451
2785A3452281n29642n43514j35614k96163l76715J80829o23939k47740J86869
2776A1066652N7089m79717l14824l08836k91237l09124j65971M3548m03009p8661
2766H815910l75812k74219m17008r6180K83317j09052k78496l11606j09519K5994
2756G153329O317j71298J69564m35317l09493m5571j17118k06344r4431k89912
2746E659726k28334L7426K427k88090J62364l04203l68950M90901j03303j31193
2736D928771p2424k6895q6395o7370k27706j03786L3306m94805J02002K60646
2726D245344o50517j34682L98297M1716K2435J18896j26003m15901R0587q266
$$ plain form
2716 3581906 3552637 3788338 3833673 3847964 3182582 3138027 3388791 3087659 3270845 3326098
2706 3326098 3291281 2877556 2717882 2799191 3204534 3300187 3178335 3011122 2739322 2587176
2696 2587176 2431395 2759040 3059214 3059872 2589442 2309250 2224840 2559480 2386364 2422471
2686 2422471 2171243 2151292 2530133 2263326 2109812 2125491 2118508 1970299 2074994 2374484
2676 2374484 2275690 2107297 2286198 2195555 2374290 2065199 2088630 1880700 1793101 1916189
2666 1916189 1907174 1733298 1777281 1841483 1729345 1683525 1729615 1312230 1493313 1404060 1484628
2655 1484628 1686110 1564297 1666376 1714351 2030260 2025829 1540462 1357021 1278912 886284
2645 886284 820791 1135144 1398546 1318852 1289818 1117436 1164416 1095785 1257333 1152520 889904
$$ packed form
2716C581906k9269K35701M5335J4291o65382m4555K50764l01132J83186N5253
2706C326098l4817m13725j59674Q1309M05343R5653j21852j67213k71800j52146
2696B587176j55781L27645L00174O58m70430k80192q4410L34640j73116L6107
2686B422471k51228j9951L78841k66807j53514J5679o983j48209J04695K99490
2676B374484r8794j68393J78901r0643J78735l09091K3431k07930q7599J23088
2666A916189r015j73876M3983O4202j12138m5820M6090m17385J81083q9253Q0568
2655A484628K01482j21813J02079M7975L15909m431m85367j83441p8109l92628
2645H86284o5493L14353K63402p9694k9034j72382M6980o8631J61548j04813k62616
$$ plain form
2634 889904 1288341 1534243 1456808 1668354 1627995 1315056 1147629 1110439 1281954 1295955
2624 1295955 1363394 1564574 1370364 1400928 1533116 1406788 1620779 1615791 1328187 1377528
2614 1377528 1401412 1463302 1659926 1560920 1439681 1757465 1767050 1924063 2182728 2224303 1637896
2603 1637896 1844537 2271628 2451263 2494360 2530544 2454156 2530994 2129502 1699305 1783758
2593 1783758 1720926 1313248 1563000 1522976 1910082 1804004 1740235 1956884 1406835 1198288
2583 1198288 1428396 1489627 1858728 1681587 1816734 1831302 1493253 1729616 1681024 1969553
2573 1969553 2246095 2006767 1823058 1714779 1633961 1772342 1904519 1669865 1383178 1505087
2563 1505087 1335125 1359515 1532507 1205680 1412961 1523547 1678896 1902831 1154834 1084630
$$ packed form
2634H89904L98437K45902p7435K11546m0359l12939j67427l7190J71515J4001
2624A295955O7439K01180j94210L0564J32188j26328K13991m988k87604M9341
2614A377528K3884O1890J96624r9006j21239L17784R585J57013K58665M1575n86407
2603A637896K06641M27091J79635M3097L6184p6388P6838m01492m30197Q4453
2593A783758o2832m07678K49752m0024L87106j06078o3769K16649n50049k08547
2583A198288K30108O1231L69101j77141J35147J4568l38049K36363m8592K88529
2573A969553K76542k39328j83709j08279q0818J38381J32177k34654k86687J21909
2563A505087j69962K4390J72992l26827K07281J10586J55349K23935p47997p0204
$$ plain form
2553 1084630 1018562 1122828 1052711 1701908 1221209 791653 1108898 1079308 1076800 790871
2543 790871 786104 808720 752601 514229 719993 596692 736947 596330 436469 328432
2533 328432 573459 977745 718786 429661 268446 399774 286713 377099 454406 518313
2523 518313 328079 716943 515463 415934 437112 235475 -55534 -23414 235433 6187
2513 6187 -34097 322650 471759 699830 654014 623014 541468 369120 457623 602809 477818
2502 477818 561508 150526 239891 228062 357472 379436 104122 223398 54734 296059
2492 296059 45134 305592 178037 147428 253849 313931 553376 273093 583076 296458
2482 296458 311279 457051 397564 575267 698561 715429 469888 194222 175600 -263532
$$ packed form
2553A084630o6068J04266p0117O49197m80699m29556L17245k9590k508k85929
2543G90871m767K2616n6119k38372K05764j23301J40255j40617j59861j08037
2533C28432K45027M04286k58959k89125j61215J31328j13061R0386P7307O3907
2523E18313j90234L88864k01480r9529K1178k01637k91009L2120K58847k29246
2513F187m0284L56747J49109K28071m5816l1000q1546j72348Q8503J45186j24991
2502D77818Q3690m10982Q9365j1829J29410K1964k75314J19276j68664K41325
2492B96059k50925K60458j27555l0609J06421O0082K39445k80283L09983k86618
2482B96458J4821J45772n9487J77703J23294J6868k45541k75666j8622m39132
$$ plain form
2472 -263532 64738 154196 266803 241455 338242 255713 226676 215664 165224 158874 243540
2461 243540 62854 -133086 141710 -139048 42868 -176191 -13292 13919 397166 334182
2451 334182 -33871 -334263 -179768 120911 181439 477851 399455 382034 188529 -24599
2441 -24599 213758 193294 291315 330320 339444 332972 36653 -83616 -63790 5889 216907
2430 216907 254471 224603 -97800 141950 419520 759566 335501 326977 365403 268447 161970
2419 161970 29305 234902 571270 179506 244581 87853 84407 26825 611401 429106
2409 429106 455649 188004 221942 606790 12545 199650 276154 657621 711829 232985
2399 232985 290115 186800 -50554 270986 315698 227985 85510 -34506 301944 553861
$$ packed form
2472b63532L28270Q9458J12607k5348R6787q2529k9037j1012n0440o350Q4666
2461B43540j80686j95940K74796k80758J81916k19059J62899K7211L83247o2984
2451C34182l68053l00392J54495L00679O0528K96412p8396j7421j93505k13128
2441b4599K38357k0464R8021L9005R124o472k96319j20269J9826O9679K11018
2430B16907L7564k9868l22403K39750K77570L40046m24065q524L8426r6956j06477
2419A61970j32665K05597L36368l91764O5075j56728l446n7582N84576j82295
2409D29106K6543k67645L3938L84848n94245J87105P6504L81467N4208m78844
2399B32985N7130j03315k37354L21540M4712q7713j42475j20016L36450K51917
$$ plain form
2389 553861 71610 533371 406429 305661 426719 262741 83137 230402 -113411 347422
2379 347422 377432 231286 394314 590142 551397 398413 472341 874077 1036017 1400930
2369 1400930 1286974 726967 456063 412436 664879 611598 415412 206668 151382 249586
2359 249586 506465 126970 -83323 -22551 292311 252889 398165 282695 463134 276771
2349 276771 393740 154597 -263632 147998 -121374 -112966 3603 -30471 205694 224675
2339 224675 269102 112083 230812 514174 567665 408520 545344 692806 350199 156990
2329 156990 191151 231306 72933 -124843 -338246 418633 138999 74163 457397 695617
2319 695617 431491 170223 126195 178644 69771 -249148 -201327 -638014 146288 459209
$$ packed form
2389E53861m82251M61761j26942j00768J21058j63978j79604J47265l43813M60833
2379C47422L0010j46146J63028J95828l8745j52984P3928M01736J61940L64913
2369A400930j13956n60007k70904m3627K52443n3281j96186k08744n5286R8204
2359B49586K56879l79495k10293O0772L14862l9422J45276j15470J80439j86363
2349B76771J16969k39143m18229M11630k69372Q408J16569l4074K36165J8981
2339B24675M4427j57019J18729K83362N3491j59145J36824J47462l42607j93209
2329A56990L4161M0155j58373j97776k13403P56879k79634o4836L83234K38220
2319F95617k64126k61268m4028N2449j08873l18919M7821m36687P84302L12921
$$ plain form
2309 459209 -21918 227384 216559 622080 335889 229671 584243 549537 516695 509220 640145
2298 640145 581615 733859 546646 313781 677657 797214 633471 573191 238919 192613
2288 192613 547317 640040 676517 356634 160161 316372 384291 170522 434656 471504
2278 471504 464260 433896 369969 447174 6888 183684 287022 370330 695728 455427 554416
2267 554416 680821 495788 617354 412257 649831 826389 968342 413515 210238 684773
2257 684773 785479 719086 514256 423663 628391 633642 541140 467817 544939 205084 416977
2246 416977 797887 819942 379792 101170 889799 660724 530112 797545 918522 775309
2236 775309 731314 475606 481869 622755 630199 855620 906385 959792 1192061 1064281 905253
$$ packed form
2309D59209m81127K49302j0825M05521k86191j06218L54572l4706l2842p475J30925
2298F40145n8530J52244j87213k32865L63876J19557j63743o0280l34272m6306
2288A92613L54704R2723L6477l19883j96473J56211O7919k13769K64134L6848
2278D71504p244l0364o3927P7205m40286J76796J03338Q3308L25398k40301R8989
2267E54416J26405j85033J21566k05097K37574J76558J41953n54827k03277M74535
2257F84773J00706o6393k04830r0593K04728N251r2502p3323P7122l39855K11893
2246D16977L80910K2055m40150k78622P88629k29075j30612K67433J20977j43213
2236G75309m3995k55708O263J40886P444K25421N0765N3407K32269j27780j59028
$$ plain form
2225 905253 1076094 1283356 1184502 1128227 1263160 1254833 1189469 1241353 1014633 1198356 1276379
2214 1276379 1686071 2067186 1696065 1543003 1844981 1493682 1150685 1390742 1648251 1660025
2204 1660025 1573908 1520804 1772713 1714962 1633923 2106815 2181390 2151252 2143712 2063217 2361460
2193 2361460 2597239 2277725 2316101 2199810 1852762 2093111 2228381 2250569 2323848 2407037
2183 2407037 2274024 1973381 2107307 2872179 3144651 2898831 3042196 3190194 3246326 3398485
2173 3398485 3181006 3411695 3438790 3295841 3387144 3397354 3424187 3658547 3676682 3588128 3704330
2162 3704330 3735913 4034823 3926443 4171301 4098427 4669882 4599712 5209027 5147099 5266960
2152 5266960 5462507 5729135 5979012 6052719 6409103 6777931 7212519 7363286 7441586 7822908
$$ packed form
2225I05253J70841K07262r8854n6275J34933q327o5364N1884k26720J83723P8023
2214A276379M09692L81115l71121j53062L01978l51299l42997K40057K57509J1774
2204A660025q6117n3104K51909n7751q1039M72892P4575l0138p540q0495K98243
2193B361460K35779l19514L8376j16291l47048K40349J35270K2188P3279Q3189
2183B407037j33013l00643J33926P64872K72472k45820J43365J47998N6132J52159
2173C398485k17479K30689K7095j42949R1303J0210K6833K34360J8135q8554J16202
2162C704330L1583K98910j08380K44858p2874N71455p0170O09315o1928J19861
2152E266960J95547K66628K49877P3707L56384L68828M34588J50767P8300L81322
$$ plain form
2142 7822908 8086493 8634459 8822117 9220752 9487164 9246506 9502368 10015649 10116339 10496952
2132 10496952 10930477 11479343 11874655 12740652 13144390 13905456 14460281 15570554 16623777
2123 16623777 17518429 18997319 20766759 22480616 24311362 25531951 27234510 29030359
2115 29030359 31337941 34794207 38785919 43042437 49292948 57721668 69101274 82928701
2107 82928701 97581328 112747392 135123067 143820594 118976882 92444229 71148909
2100 71148909 56564930 45793404 37889394 31349609 26799607 23725834 21376732 19985200
2092 19985200 18525734 17156319 16615437 16632273 15355525 13543452 12252778 11363802 10908988
2083 10908988 10313814 9344289 8357569 7620799 7662418 7262340 7264256 6858862 6373435 6204134
$$ packed form
2142G822908K63585N47966J87658L98635K66412k40658K55862N13281J00690L80613
2132A0496952M33525N48866L95312Q65997M03738P61066N54825J110273J053223
2123A6623777Q94652J478890J769440J713857J830746J220589J702559J795849
2115B9030359K307582L456266L991712M256518O250511Q428720J1379606J3827427
2107H2928701J4652627J5166064K2375675Q697527k4843712k6532653k1295320
2100G1148909j4583979j0771526p904010o539785m550002l073773k349102j391532
2092A9985200j459466j369415n40882J6836j276748j812073j290674q88976m54814
2083A0908988n95174r69525r86720p36770M1619m00078J916m05394m85427j69301
$$ plain form
2073 6204134 5878425 5657623 5304854 5116921 4894398 4452648 4238760 4097850 3887521 3919426
2063 3919426 3944772 3664764 3463596 3107824 3057054 3236360 2995439 2841742 2833361 2942979
2053 2942979 3018502 2758172 2426125 2376166 2082324 1843842 2101032 2360148 2293452 1454793
2043 1454793 1673274 1978370 2200577 1877114 1143727 1231961 1736900 1472338 1044320 1080197
2033 1080197 1276094 1221362 1337268 1186906 1092122 970658 699413 773114 1039801 993967
2023 993967 1031177 760981 990608 1025273 847410 648551 804336 852797 728818 651120
2013 651120 785873 980629 819397 724129 768892 655505 697440 470935 647595 593098
2003 593098 427253 524076 472474 48552 326410 681048 1316339 996011 562279 1079812
$$ packed form
2073F204134l25709k20802l52769j87933k22523m41750k13888j40910k10329L1905
2063C919426K5346k80008k01168l55772n0770J79306k40921j53697q381J09618
2053B942979P5523k60330l32047m9959k93842k38482K57190K59116o6696q38659
2043A454793K18481L05096K22207l23463p33387Q8234N04939k64562m28018L5877
2033A080197J95897n4732J15906j50362r4784j21464k71245P3701K66687m5834
2023I93967L7210k70196K29627L4665j77863j98859J55785M8461j23979p7698
2013F51120J34753J94756j61232r5268M4763j13387M1935k26505J76660n4497
2003E93098j65845R6823n1602m23922K77858L54638O35291l20328m33732N17533
$$ plain form
1993 1079812 869426 900818 1020352 715366 640848 630558 289991 499378 433089 458947
1983 458947 435583 446031 734555 546136 463117 760001 545089 58477 276285 476808
1973 476808 253823 663936 679324 475340 607173 624172 297022 474121 214851 263448
1963 263448 205275 2670 205936 49423 205824 403474 213873 205250 102580 -1548
1953 -1548 114421 -158910 -289700 -273057 75434 208383 327606 205686 427052 478356
1943 478356 354946 292760 -371 135716 515176 352344 167530 259611 -112130 -187559
1933 -187559 -55432 262018 299850 1014334 751682 565442 158220 -64967 -58767 -53126 235358
1922 235358 240897 210594 -244045 -53434 105243 317951 276627 149013 -209863 -148852 259827
$$ packed form
1993A079812k10386L1392J19534l04986p4518j0290l40567K09387o6289K5858
1983D58947k3364J0448K88524j88419q3019K96884k14912m86612K17808K00523
1973D76808k22985M10113J5388k03984J31833J6999l27150J77099k59270M8597
1963B63448n8173k02605K03266j56513J56401J97650j89601q623j02670j04128
1953a548J15969k73331j30790J6643L48491J32949J19223j21920K21366N1304
1943D78356j23410o2186k93131J36087L79460j62832j84814R2081l71741p5429
1933a87559J32127L17450L7832P14484k62652j86240m07222k23187O200N641K88484
1922B35358N539l0303m54639J90611J58677K12708m1324j27614l58876O1011M08679
$$ plain form
1911 259827 183585 312783 277572 -22779 -282417 -505147 -75712 -77352 -288854 -215711 -224433
1900 -224433 -168261 119196 -16126 -37954 325799 698305 157290 -264101 168742 254904
1890 254904 84094 -185313 45149 74787 14065 36631 -267253 -251714 -217833 -105553 -278709
1879 -278709 -40398 204401 38287 178131 -193099 16453 -74247 220234 115547 -76801
1869 -76801 -246943 -389154 -245402 -14421 3904 -140460 -198519 66250 79989 -17055 144506
1858 144506 -149580 -65672 18756 -172757 -403868 -74167 18601 15876 49657 -124869 -112578
1847 -112578 57351 164551 160163 -107212 -109616 103196 666497 510477 611559 722251
1837 722251 608104 983805 564363 615717 476763 217548 532415 743854 280721 239207
$$ packed form
1911B59827p6242J29198l5211l00351k59638k22730M29435j640k11502P3143q722
1900b24433N6172K87457j35322k1828L63753L72506n41015m21391M32843Q6162
1890B54904j70810k69407K30462K9638o0722K2566l03884J5539L3881J12280j73156
1879b78709K38311K44799j66114J39844l71230K09552r0700K94481j04687j92348
1869g6801j70142j42211J43752K30981J8325j44364n8059K64769J3739r7044J61561
1858A44506k94086Q3908Q4428j91513k31111L29701R2768k725L3781j74526J2291
1847a12578J69929J07200m388k67375k404K12812N63301j56020J01082J10692
1837G22251j14147L75701m19442N1354j38954k59215L14867K11439m63133m1514
$$ plain form
1827 239207 264430 86720 -68238 192732 85038 -229335 -108998 -473816 -430462 -270198
1817 -270198 -74880 -31684 -27939 286918 424387 445764 -21089 -463506 73893 504944
1807 504944 44655 -19898 239625 59038 311966 517299 215813 120972 -127311 -244520
1797 -244520 -226397 -180013 -566321 -414246 -443444 -504200 -7721 252861 132037 21840
1787 21840 -112827 -468195 -790824 -537952 -318100 -150815 30872 -209208 -62675 -549881
1777 -549881 -68531 -1543 117397 -117638 -568950 -498280 -292347 -295752 -655210 -205202
1767 -205202 -94395 -100263 -29446 -391592 -176828 -136022 -6823 -76535 -177386 -30808 -214660
1756 -214660 -427048 140750 146114 49737 18766 -156618 -91486 -103432 -239541 -242632 -482311
$$ packed form
1827B39207K5223j77710j54958K60970j07694l14373J20337l64818M3354J60264
1817b70198J95318M3196L745L14857J37469K1377m66853m42417N37399M31051
1807E04944m60289o4553K59523j80587K52928K05333l01486r4841k48283j17209
1797b44520J8123M6384l86308J52075k9198o0756M96479K60582j20824j10197
1787B1840j34667l55368l22629K52872K19852J67285J81687k40080J46533m87206
1777e49881M81350O6988J18940k35035m51312P0670K05933l405l59458M50008
1767b05202J10807n868P0817l62146K14764M0806J29199o9712j00851J46578j83852
1756b14660k12388N67798N364r6377l0971j75384O5132j1946j36109l091k39679
$$ plain form
1745 -482311 -138576 -101847 -228415 -308807 -771425 -564250 -472896 -277064 -426473 -95237
1735 -95237 43158 106123 130242 -204648 -202748 -114972 -272819 -302610 -423102 -256883 -462530
1724 -462530 -115330 -176772 -536659 -100287 189372 -75673 -296667 -207722 -557716 -418614
1714 -418614 54102 95172 90899 75049 35398 208017 620088 619473 373890 282901 418685
1703 418685 374259 328028 444102 171274 -241759 -447659 -190415 -123989 -185624 -133625 -73484
1692 -73484 -578759 -342939 -124922 -128009 -84665 159228 438289 105549 293193 -138082
1682 -138082 76986 230370 195419 21149 15642 298544 -61397 58979 -47361 -115306
1672 -115306 -150251 -52268 153761 108867 80919 -157555 -297293 -95318 -103040 -135234 193346
$$ packed form
1745d82311L43735L6729j26568q0392m62618K07175R1354J95832j49409L31236
1735i5237J38395O2965K4119l34890J900Q7776j57847k9791j20492J66219k05647
1724d62530L47200o1442l59887M36372K89659k65045k20994Q8945l49994J39102
1714d18614M72716M1070m273j5850l9651J72619M12071o15k45583r0989J35784
1703D18685m4426m6231J16074k72828m13033k05900K57244O6426o1635N1999O0141
1692g3484n05275K35820K18017l087M3344K43893K79061l32740J87644m31275
1682a38082K15068J53384l4951j74270n507K82902l59941J20376j06340o7945
1672a15306l4945R7983K06029m4894k7948k38474j39738K01975p722l2194L28580
$$ plain form
1661 193346 256813 141642 79156 -234000 224894 426167 307479 -114780 -303593 -479457
1651 -479457 -483436 196116 -60840 367105 -6624 169530 19300 -137383 22913 -240311
1641 -240311 59599 -221728 -653293 -805783 -575465 -273596 -285915 -264588 -28404 94122
1631 94122 -275876 -304344 -163564 -41518 -225258 -417744 -659854 -466976 -315559 -447846
1621 -447846 -96596 116562 232291 -199187 -269211 -414708 -506767 -16075 69558 -24780
1611 -24780 95749 60340 222895 -23248 -301725 -223917 -324855 -438723 -134390 -22601
1601 -22601 -102676 308670 127656 -46173 -104333 -166627 149790 201838 429904 -252712 -34801
1590 -34801 453246 265088 -186367 -514792 -247723 195010 -119775 248832 605103 336198
$$ packed form
1661A93346O3467j15171o2486l13156M58894K01273j18688m22259j88813j75864
1651d79457l979O79552k56956M27945l73729J76154j50230j56683J60296k63224
1641b40311K99910k81327m31565j52490K30318L01869j2319K1327K36184J22526
1631I4122l69998k8468J40780J22046j83740j92486k42110J92878J51417j32287
1621d47846L51250K13158J15729m31478p0024j45497r2059M90692Q5633r4338
1611b4780J20529l5409J62555k46143k78477P7808j00938j13868L04333J11789
1601b2601q0075M11346j81014j73829n8160o2294L16417N2048K28066o82616K17911
1590c4801M88047j88158m51455l28425K67069M42733l14785L68607L56271k68905
$$ plain form
1580 336198 -289527 1811 -71064 -49390 115907 -19498 3142 -297049 -445872 -170485
1570 -170485 -485085 -493785 -86313 238808 -19902 -90651 -51282 -584720 -242073 -172390 122884
1559 122884 16988 429430 184971 -190483 -40329 235299 -162052 -137334 -176798 -308854
1549 -308854 -96705 -18266 -364168 -350919 -372527 -247991 -73373 41779 -367362 -283738
1539 -283738 127387 183560 -98744 136853 -62308 222748 286675 309350 228380 -51099
1529 -51099 -165694 -465001 -93241 83166 166666 343641 511717 504736 64791 -271954
1519 -271954 -10003 -34798 15783 -251037 -271349 -229235 -69296 -231133 38598 -144041
1509 -144041 -352521 -141946 -170540 -332922 -278629 -275489 26517 17504 385871 563321 36822
$$ packed form
1580C36198o25725K91338p2875K1674J65297j35405K2640l00191j48823K75387
1570a70485l14600q700M07472L25121k58710p0749L9369n33438L42647O9683K95274
1559A22884j05896M12442k44459l75454J50154K75628l97351K4718l9464j32056
1549c08854K12149P8439l45902J3249k1608J24536J74618J15152m09141Q3624
1539b83738M11125N6173k82304K35597j99161K85056O3927K2675q0970k79479
1529e1099j14595k99307L71760J76407Q3500J76975J68076o981m39945l36745
1519b71954K61951k4795N0581k66820k0312M2114J59939j61837K69731j82639
1509a44041k08480K10575k8594j62382N4293L140L02006r013L68367J77450n26499
$$ plain form
1498 36822 -404877 -151745 -56050 -400747 -124620 87345 -157218 -205003 -246333 22372
1488 22372 63524 -90188 216417 -76341 -136471 -146562 -230819 -223475 -75058 -185247 -237815
1477 -237815 240907 309982 -225954 -81926 287849 331219 280503 -133532 319857 111660
1467 111660 227599 403200 -60740 -40674 169701 -81603 -164807 -114496 99200 151594
1457 151594 -145207 -393611 -42080 211821 404442 311617 148704 -163449 -310860 -426587
1447 -426587 -679562 -297716 -192349 -21994 -102716 166782 -3482 201101 332110 279231
1437 279231 56201 -273423 207277 95005 -81283 -425241 -898589 -458851 -242523 -317345
1427 -317345 -154959 -57328 -470054 -207414 -293240 -205400 -192049 22812 205030 110077 240135
$$ packed form
1498C6822m41699K53132R5695l44697K76127K11965k44563m7785m1330K68705
1488B2372M1152j53712L06605k92758o0130j0091q4257P344J48417j10189n2568
1477b37815M78722O9075n35936J44028L69775M3370n0716m14035M53389k08197
1467A11660J15939J75601m63940K0066K10375k51304q3204N0311K13696N2394
1457A51594k96801k48404L51531K53901J92621r2825j62913l12153j47411j15727
1447d26587k52975L81846J05367J70355q0722K69498j70264K04583J31009n2879
1437B79231k23030l29624M80700j12272j76288l43958m73348M39738K16328p4822
1427c17345J62386R7631m12726K62640q5826Q7840J3351K14861J82218r4953J30058
$$ plain form
1416 240135 128375 -205722 -118804 -153819 -151237 -207529 128498 173546 -86518 -95314 -262625
1405 -262625 -583333 -224182 253684 -25113 51934 234932 303546 10864 -181214 -99399
1395 -99399 120557 10116 -167564 16436 -144051 -154350 -60982 285359 113985 -126151
1385 -126151 120343 -119274 -302197 -566613 -328187 -63163 126194 -179208 -374875 47622
1375 47622 98353 -212462 -310359 -233634 -248807 -232758 392254 553567 308089 -136892 -330997
1364 -330997 -387051 -528830 -60876 -43416 -102510 81342 -146104 -213146 -194220 148121 116019
1353 116019 142970 -94492 -14012 -421450 -213738 -96114 -444982 -415725 -254525 -178740
1343 -178740 -418918 -203620 -6767 -83097 15517 -104780 30254 -99378 -441699 41918
$$ packed form
1416B40135j11760l34097Q6918l5015K582n6292L36027M5048k60064q796j67311
1405b62625l20708L59151M77866k78797P7047J82998O8614k92682j92078Q1815
1395i9399K19956j10441j77680J84000j60487j0299R3368L46341j71374k40136
1385a26151K46494k39617j82923k64416K38426K65024J89357l05402j95667M22497
1375D7622N0731l10815r7897P6725j5173J6049O25012J61313k45478m44981j94105
1364c30997n6054j41779M67954J7460n9094J83852k27446o7042J8926L42341l2102
1353A16019K6951k37462Q0480m07438K07712J17624l48868K9257J61200P5785
1343a78740k40178K15298J96853p6330R8614j20297J35034j29632l42321M83617
$$ plain form
1333 41918 11575 160978 74262 -60177 -240495 -204811 -317350 203586 87296 -30016
1323 -30016 261059 -39111 -290977 -369665 -403881 -602137 -403648 27950 194587 164633
1313 164633 84190 131672 70209 -34846 -150232 142017 182276 -9098 -232681 15893
1303 15893 -153599 -172087 172258 -137594 -248091 -39932 134067 134321 -263419 -269939 100268
1292 100268 185810 55367 147064 -45831 -25888 191960 -86179 -97078 -311303 -345545 138546
1281 138546 185794 23654 -65452 91102 322106 155938 -106388 -235331 76890 295039
1271 295039 116803 -29946 70850 -308050 -289846 -30760 432626 11684 -47208 -252514
1261 -252514 -250356 -342205 -151320 393384 358484 318205 333621 440338 371673 90016 -346596
$$ packed form
1333D1918l0343J49403q6716j34439j80318L5684j12539N20936j16290j17312
1323c0016K91075l00170k51866p8688l4216j98256J98489M31598J66637k9954
1313A64633q0443M7482o1463j05055j15386K92249M0259j91374k23583K48574
1303A5893j69492j8488L44345l09852j10497K08159J73999K54l97740o520L70207
1292A00268Q5542j30443R1697j92895J9943K17848k78139j0899k14225l4242M84091
1281A38546M7248j62140q9106J56554K31004j66168k62326j28943L12221K18149
1271B95039j78236j46749J00796l78900J8204K59086M63386m20942n8892k05306
1261b52514K158r1849J90885N44704l4900m0279J5416J06717o8665k81657m36612
$$ plain form
1250 -346596 -390370 -342097 -181068 -227043 -78626 21816 -34613 -83492 85390 474533 379169
1239 379169 343330 404838 409678 -36844 -283543 -181056 -336203 -597082 -266562 -369234
1229 -369234 -160272 196762 -361902 -341446 -383098 -510059 -406954 194126 206051 58552
1219 58552 262708 364229 562758 281959 473612 182871 -158 -267086 -317165 -207809
1209 -207809 -388795 -75679 8674 62606 -58385 -84878 -228877 -215679 45119 179290
1199 179290 159825 -26312 -292559 -52365 282660 291693 213578 20589 -174408 24669
1189 24669 -189730 -249190 -355056 63384 -159514 -241789 -115892 -31276 -52792 -436560 -536760
1178 -536760 -365721 -531882 -375526 -494574 -21497 243902 205922 330542 163485 -44499
$$ packed form
1250c46596m3774M8273J61029m5975J48417J00442n6429m8879J68882L89143r5364
1239C79169l5839O1508M840m46522k46699J02487j55147k60879L30520j02672
1229c69234K08962L57034n58664K0456m1652j26961J03105O01080J1925j47499
1219E8552K04156J01521J98529k80799J91653k90741j83029k66928n0079J09356
1209b07809j80986L13116Q4353N3932j20991k6493j43999J3198K60798J34171
1199A79290j9465j86137k66247K40194L35025R033p8115j92989j94997J99077
1189B4669k14399n9460j05866M18440k22898q2275J25897Q4616k1516l83768j00200
1178e36760J71039j66161J56356j19048M73077K65399l7980J24620j67057k07984
$$ plain form
1168 -44499 -94837 268703 -64077 -288233 -324121 -194524 -478817 -237672 -132783 -133654 -278143
1157 -278143 -384577 -260511 -320596 118024 113501 -42134 30343 61518 137759 377855 290103
1146 290103 159793 8565 -214436 107697 119634 -26384 -245957 -157577 -270445 -398204
1136 -398204 -12289 273421 168537 -263153 -161961 225742 -140462 -43355 170326 333484
1126 333484 315026 317637 612359 245488 -94477 -184198 15462 117219 -435957 -408398 -257953
1115 -257953 -377812 -539325 -227208 -379001 10914 152764 -50601 100853 -256717 -330974
1105 -330974 -175988 -222650 -397553 18336 122472 -302526 70616 73715 -55555 -209871
1095 -209871 -220358 -40630 -291434 -211892 22145 -38758 -70589 -235704 -132583 53790
$$ packed form
1168d4499n0338L63540l32780k24156l5888J29597k84293K41145J04889q71j44489
1157b78143j06434J24066o0085M38620m523j55635P2477L1175P6241K40096q7752
1146B90103j30310j51228k23001L22133J1937j46018k19573Q8380j12868j27759
1136c98204L85915K85710j04884m31690J01192L87703l66204R7107K13681J63158
1126C33484j8458K611K94722l66871l39965q9721J99660J01757n53176K7559J50445
1115b57953j19859j61513L12117j51793L89915J41850k03365J51454l57570p4257
1105c30974J54986m6662j74903M15889J04136m24998L73142L099j29270j54316
1095b09871j0487J79728k50804P9542K34037o0903l1831j65115J03121J86373
$$ plain form
1085 53790 -644329 -315202 25392 5100 -69382 -37303 149628 -35580 58594 169275 -463120
1074 -463120 -325382 326276 293626 107124 -209769 -372913 -448018 -292815 -148539 -635944
1064 -635944 -479233 -268904 -154076 -139944 -30283 13891 158827 138371 58427 -184495
1054 -184495 -151962 -118563 -401072 -467505 -78601 467588 538522 111016 -18930 -311555
1044 -311555 -514559 -91524 36349 225451 33838 -1807 -38820 -79130 281234 692432
1034 692432 302467 171243 347176 -196092 -60389 245841 7438 344408 385393 -126078
1024 -126078 -299538 -542941 -584472 -240076 -415787 -244580 -479890 -249758 -103226 286722
1014 286722 49755 -306671 -230966 -214304 -198743 84151 102425 -154347 -480004 -544074 -329841
$$ packed form
1085E3790o98119L29127L40594k0292p4482L2079J86931j85208R4174J10681o32395
1074d63120J37738O51658l2650j86502l16893j63144p5105J55203J44276m87405
1064f35944J56711K10329J14828J4132J09661M4174J44936k0456p9944k42922
1054a84495L2533L3399k82509o6433L88904N46189P0934m27506j29946k92625
1044c11555k03004M23035J27873J89102j91613l5645l7013m0310L60364M11198
1034F92432l89965j31224J75933n43268J35703L06230k38403L36970M0985n11471
1024a26078j73460k43403m1531L44396j75711J71207k35310K30132J46532L89948
1014B86722k36967l56426P5705J6662J5561K82894J8274k56772l25657o4070K14233
$$ plain form
1003 -329841 -244959 -224400 -57527 241906 64182 25932 37144 193311 -271512 -122277
993 -122277 -139233 10489 229650 227051 -57212 -116504 -23797 179911 -124671 -22045 -168586
982 -168586 -108345 -97176 45517 317623 108550 133560 -269494 -431792 -547365 -176168
972 -176168 147586 64068 75366 578396 294779 -47964 37993 424648 633958 -36820
962 -36820 -120797 -304499 -638118 -291546 -109853 -31775 270828 -105427 -403477 -180644
952 -180644 -145480 -208132 -101809 -75699 -287206 -1832 388632 22707 -60860 70229 -188119
941 -188119 -34030 222054 -307321 -83778 60792 -46431 -86756 -222385 -78805 -174490
931 -174490 -178271 28630 -28352 239708 221749 383653 830826 529661 374505 425273 509156
$$ packed form
1003c29841Q4882K0559J66873K99433j77724l8250J1212J56167m64823J49235
993a22277j6956J49722K19161k599k84263n9292R2707K03708l04582J02626j46541
982a68586O0241J1169J42693K72106k09073K5010m03054j62298j15573L71197
972a76168L23754q3518J1298N03030k83617l42743Q5957L86655K09310o70778
962c6820q3977j83702l33619L46572J81693P8078L02603l76255k98050K22833
952a80644L5164o2652J06323K6110k11507K85374L90464l65925q3567J31089k58348
941a88119J54089K56084n29375K23543J44570j07223m0325j35629J43580r5685
931a74490l781K06901n6982K68060j7959J61904M47173l01165j55156N0768Q3883
$$ plain form
920 509156 7850 -120965 -213694 -381483 -128368 89417 26838 221558 -75424 328866
910 328866 55342 -332951 -559371 -50308 -43936 89801 -43427 -457269 -106177 169224
900 169224 -165795 -133651 68955 140993 -62142 -391461 -198492 -1356 -176951 -70732
890 -70732 389209 105375 -49988 70441 -79204 -68129 107092 -112136 -43992 -127075 470965
879 470965 577961 76183 -281317 26295 -116019 106303 30803 -34009 107356 -4231
869 -4231 -69161 181824 317044 205583 -181855 85361 196191 392539 101512 -265489
859 -265489 -390622 -170885 164615 91314 476760 245614 1371 146807 182842 429805
849 429805 353643 235144 4619 -104063 30792 217053 -54293 -392508 -54531 199798
$$ packed form
920E09156n01306j28815r2729j67789K53115K17785o2579J94720k96982M04290
910C28866k73524l88293k26420N09063O372J33737j33228m13842L51092K75401
900A69224l35019L2144K02606P2038k03135l29319J92969J97136j75595J06219
890g0732M59941k83834j55363J20429j49645J1075J75221k19228O8144q3083N98040
879D70965J06996n01778l57500L07612j42314K22322p5500o4812J41365j11587
869d231o4930K50985J35220j11461l87438K67216J10830J96348k91027l67001
859b65489j25133K19737L35500p3301L85446k31146k44243J45436L6035K46963
849D29805p6162j18499k30525j08682J34855J86261k71346l38215L37977K54329
$$ plain form
839 199798 96923 -141196 85631 222889 336981 279835 236566 -40334 -15079 54738 24233
828 24233 285204 348753 213550 350265 61499 -172534 1939 -68904 -86686 86839 288916
817 288916 125865 -116613 172540 143005 175670 112992 -156718 303571 442647 -130233
807 -130233 -474165 -308786 77065 -10566 -358929 -649658 -822595 -281342 -101003 -96385
797 -96385 285156 -79688 -69462 357904 437060 265017 28417 -460689 -564088 -352908
787 -352908 -122372 -139275 9860 129170 231887 -167739 -182305 199704 299160 -15320
777 -15320 -201875 180186 137891 -76312 19259 459529 575974 507395 105746 158538 256682
766 256682 178 -38961 -16619 207551 672682 256492 -52601 -66846 324881 487433
$$ packed form
839A99798j02875k38119K26827J37258J14092n7146m3269k76900K5255O9817l0505
828B4233K60971O3549j35203J36715k88766k34033J74473p0843j7782J73525K02077
817B88916j63051k42478K89153k9535L2665o2678k69710M60289J39076n72880
807a30233l43932J65379L85851q7631l48363k90729j72937N41253J80339M618
797i6385L81541l64844J0226M27366P9156j72043k36600m89106j03399K11180
787c52908K30536j6903J49135J19310J02717l99626j4566L82009R9456l14480
777a5320j86555L82061m2295k14203R5571M40270J16445o8579m01649N2792R8144
766B56682k56504l9139K2342K24170M65131m16190l09093j4245L91727J62552
$$ plain form
756 487433 273617 204681 50776 -27097 -197574 -333653 192073 -6736 -9573 64623 -287778
745 -287778 239930 -85849 -209494 111520 4845 326796 250196 282682 456009 253067
735 253067 247297 124705 188197 161601 286939 453575 119413 9706 243212 116762 278331
724 278331 557176 396196 161994 219112 137374 161286 313791 210762 354533 292732 190024
713 190024 202132 326887 294115 123695 194466 -21776 110677 -210155 -454164 -17216
703 -17216 486325 320224 -85710 211459 448480 133493 314386 267460 219761 74508
693 74508 -32886 -74805 -19399 -12417 293724 233310 231449 -45121 -249123 -284164 -266125 -462937
681 -462937 -397110 -77164 -317655 -42854 102689 181848 -266334 -258064 -138985 214926 -101982
$$ packed form
756D87433k13816o8936j53905p7873j70477j36079N25726j98809k837P4196l52401
745b87778N27708l25779j23645L21014j06675L21951p6600L2486J73327k02942
735B53067n770j22592O3492k6596J25338J66636l34162j09707K33506j26450J61569
724B78331K78845j60980k34202N7118q1738K3912J52505j03029J43771o1801j02708
713A90024J2108J24755l2772j70420P0771k16242J32453l20832k44009M36948
703a7216N03541j66101m05934K97169K37021l14987J80893m6926m7699j45253
693G4508j07394m1919N5406O982L06141o0414j861k76570k04002l5041J8039j96812
681d62937O5827L19946k40491K74801J45543P9159m48182Q270J19079L53911l16908
$$ plain form
670 -101982 30716 376270 229788 -94198 -74842 285861 205211 -121901 -138200 -287035
660 -287035 -141574 92639 156828 79925 -65630 217045 -77327 -129824 -327954 -95721
650 -95721 551287 66513 -245822 55 -125672 -321198 -209429 -20548 428264 105812
640 105812 -271460 -489408 -523643 5394 206152 145439 311385 221214 332439 520896
630 520896 378281 222836 -82987 -405204 -803182 -216218 83051 180630 567285 302068
620 302068 307192 114913 -269473 -389592 17209 -365877 -166471 275897 110015 63699
610 63699 268808 226993 226797 93839 98483 177866 -7507 -210307 -239980 -28479 -49191 -93853
598 -93853 -284473 -358140 -237123 -216568 23812 -27257 -120244 80105 18377 -245850 2493
$$ packed form
670a01982J32698L45554j46482l23986J9356L60703q0650l27112j6299j48835
660b87035J45461K34213O4189p6903j45555K82675k94372n2497j98130K32233
650i5721O47008m84774l12335K45877j25727j95526J11769J88881M48812l22452
640A05812l77272k17948l4235N29037K00758o0713J65946r0171J11225J88457
630E20896j42615j55445l05823l22217l97978N86964K99269R7579L86655k65217
620C02068N124j92279l84386j20119M06801l83086J99406M42368j65882m6316
610F3699K05109m1815j96j32958M644P9383j85373k02800k9673K11501k0712m4662
598i3853j90620p3667J21017K0555K40380n1069r2987K00349o1728k64227K48343
$$ plain form
587 2493 317706 203660 140604 77734 319624 227738 -51759 -385997 -660728 -464737 123139
576 123139 219653 -40799 5761 372723 352681 -197219 -247611 -85494 -31442 -217960 -164689
565 -164689 -148297 -23330 28989 -67223 353361 243394 144624 -111595 -238819 -85358 -438411
554 -438411 -310117 154376 -164464 -359038 -259131 77894 67023 111539 -110286 -126321 -65597
543 -65597 -91057 -247003 -185289 72363 54169 -247051 -273314 -126632 98627 101860 -18725
532 -18725 -366572 30764 106223 -253909 122306 91167 -285048 -108195 -24781 11215 93707
521 93707 300630 341540 659347 392696 -13002 -8012 175743 47309 -116143 -81281 51140
510 51140 373722 369206 323355 424934 375848 87029 54208 151376 -53229 -316215 -242212
$$ packed form
587B493L15213j14046o3056o2870K41890r1886k79497l34238k74731J95991N87876
576A23139R6514k60452M6560L66962k0042n49900n0392J62117N4052j86518N3271
565a64689J6392J24967N2319r6212M20584j09967r8770k56219j27224J53461l53053
554d38411J28294M64493l18840j94574R9907L37025j0871M4516k21825j6035O0724
543f5597k5460j55946O1714K57652j8194l01220k6263J46682K25259L233j20585
532a8725l47847L97336P5459l60132L76215l1139l76215J76853Q3414L5996Q2492
521I3707K06923M0910L17807k66651m05698M990J83755j28434j63452L4862J32421
510E1140L22582m516m5851J01579m9086k88819l2821R7168k04605k62986P4003
$$ plain form
499 -242212 -65572 14981 -92953 -204303 -129218 -249096 -49941 122976 977 181984
489 181984 532126 631945 327481 348989 178883 94793 139958 283202 88854 -55581 -181514
478 -181514 -242969 14771 242305 47425 69419 -79394 -146106 -144359 -38182 71756 188887
467 188887 -67553 -293695 -324832 -163416 -217806 -238404 -307257 -603081 -527437 -337442 148762
456 148762 -174126 -408636 -69761 -123514 -95499 51991 288758 -108416 -226644 4976
446 4976 214116 -211537 -12251 -138230 -206431 70410 51302 -295539 45847 58625 -42633
435 -42633 51095 326564 294345 -88752 -227713 51514 296354 97869 87584 -144989 206214
424 206214 322431 137483 -6874 -37375 77080 13866 -78855 -9162 -131601 -11170 -5491
$$ packed form
499b42212J76640Q0553j07934j11350P5085j19878J99155J72917j21999J81007
489A81984L50142R9819l04464K1508j70106q4090M5165J43244j94348j44435j25933
478a81514o1455K57740K27534j94880K1994j48813o6712J747J06177J09938J17131
467A88887k56440k26142l1137J61416n4390k0598o8853k95824P5644J89995M86204
456A48762l22888k34510L38875n3753K8015J47490K36767l97174j18228K31620
446D976K09140m25653J99286j25979o8201K76841j9108l46841L41386J2778j01258
435d2633R3728K75469l2219l83097j38961K79227K44840j98485j0285k32573L51203
424B06214J16217j84948j44357l0501J14455o3214r2721O9693j22439J20431N679
$$ plain form
413 -5491 -143332 -34774 -114471 -43127 -297126 -120044 129624 -34095 176522 -351661 -244765
402 -244765 175832 143615 -96910 -225834 -87041 -57421 165659 167655 149344 195725 272781
391 272781 -167932 47174 181687 -228107 -21664 -136379 -389705 -142774 -126917 -142354
381 -142354 8465 137216 211093 113090 165933 50938 -26705 -38434 -215493 -188005 105080
370 105080 61473 -187102 250248 -2044 -361694 58434 -268153 33890 457863 336157
360 336157 23898 313493 309666 189505 99638 -85967 -539621 -513767 -129583 488960 630201
349 630201 322470 225583 398842 358899 469302 -82806 -306426 -255530 -138830 -129030 -67225
338 -67225 -121618 -57173 333095 798748 492119 -42107 -22981 107436 -106279 -10396 122034
$$ packed form
413e491j37841J08558p9697P1344k53999J77082K49668j63719K10617n28183J06896
402b44765M20597l2217k40525j28924J38793K9620K23080J996j8311M6381P7056
391B72781m40713K15106J34513m09794K06443j14715k53326K46931J5857j5437
381a42354J50819J28751P3877r8003N2843j14995p7643j1729j77059K7488K93085
370A05080m3607k48575M37350k52292l59650M20128l26587L02043M23973j21706
360C36157l12259K89595l827j20161q9867j85605m53654K5854L84184O18543J41241
349F30201l07731r6887J73259l9943J10403n52108k23620N0896J16700R800O1805
338f7225n4393O4445L90268M65653l06629n34226J9126J30417k13715R5883J32430
$$ plain form
327 122034 -430717 -299703 125052 -201760 -189321 -174689 -8953 -78634 103242 -94772
317 -94772 -513526 -133204 -303914 -359390 -254453 -368614 -348885 -38629 -38072 -44688 36589
306 36589 76802 -77399 -333009 -720512 -723165 -619096 -444204 -110136 153716 238581 -2802
295 -2802 116153 530388 613884 347172 -190036 -353460 -490908 -120678 -290443 -311659 -153664
284 -153664 -303755 -208025 -15492 -61222 -105799 158579 99605 -358747 -402847 -254015 -225385
273 -225385 235472 438208 263330 -44287 -156961 119378 -111267 214406 508189 485945
263 485945 205607 567779 751146 70770 195931 658401 216570 139771 -30849 194538
253 194538 36054 115046 -92194 -415214 -157548 -331066 -292460 -324632 -167975 -498755
$$ packed form
327A22034n52751J31014M24755l26812J2439J4632J65736o9681J81876j98014
317i4772m18754L80322j70710n5476J04937j14161J9729L10256N57o616Q1277
306C6589M0213j54201k55610l87503k653J04069J74892L34068K63852Q4865k41383
295b802J18955M14235Q3496k66712n37208j63424j37448L70230j69765k1216J57995
284a53664j50091R5730J92533m5730m4577K64378n8974m58352m4100J48832K8630
273b25385M60857K02736j74878l07617j12674K76339k30645L25673K93783k2244
263D85945k80338L62172J83367o80376J25161M62470m41831p6799j70620K25387
253A94538j58484P8992k07240l23020K57666j73518L8606l2172J56657l30780
$$ plain form
243 -498755 -437924 -150684 -159263 -365976 -489639 -70291 -354496 -106937 230225 330432
233 330432 164934 -348940 16234 -56308 -132178 316854 98991 330126 12724 160388
223 160388 123588 -137634 -95074 -250487 -187874 72344 -261248 -121549 -43351 -47216 115877
212 115877 214609 389001 -41603 -523979 -680427 -243096 60448 136627 164594 198558 -4083
201 -4083 469792 535657 778447 88199 -255444 155509 52098 1422 -19664 -222608 255699
190 255699 -48217 -79616 140222 48414 193653 -402293 -616810 -114658 -45943 -144427 -328860
179 -328860 -299178 -85431 -203520 -156924 -11541 167529 231267 142056 168762 157687 196176
168 196176 256934 71669 -189364 -33502 239691 66703 -144517 -42739 -64695 -60549 -231219
$$ packed form
243d98755O0831K87240q579k06713j23663M19348k84205K47559L37162J00207
233C30432j65498n13874L65174p2542p5870M49032k17863K31135l17402J47664
223A60388l6800k61222M2560j55413O2613K60218l33592J39699P8198l865J63093
212A15877R8732J74392m30604m82376j56448M37331L03544P6179K7967L3964k02641
201d083M73875O5865K42790o90248l43643M10953j03411n0676k1086k02944M78307
190B55699l03916l1399K19838r1808J45239n95946k14517N02152O8715r8484j84433
179c28860K9682K13747j18089M6596J45383J79070O3738q9211K6706j1075L8489
168A96176O0758j85265k61033J55862K73193j72988k11220J01778k1956M146j70670
$$ plain form
157 -231219 -155842 70049 214728 18979 -66211 -350556 -364709 161860 302711 307449 13335
146 13335 -245963 -119804 -173621 -402889 -598 -220177 -362375 -358520 -497146 -227019 -7112
135 -7112 209173 16903 27816 -14168 -182985 62049 5703 -588541 -536750 -420850 -313319
124 -313319 -483447 -366718 -60270 74108 85353 44239 131324 -130158 -65067 144184 -188049
113 -188049 -228036 120023 167369 -33911 48142 266510 209297 175117 8049 -202860 -76323
102 -76323 -25144 -249454 -301972 -374073 -242537 -234765 -115723 -10428 191083 140058 -166700
91 -166700 -56647 -227131 -427167 -186585 -15164 -395234 -342386 -335693 -514055 -418708 -332241
80 -332241 -282710 -105679 35605 37106 -158296 -117611 -114145 -12801 -291761 -293315 -81757
$$ packed form
157b31219P5377K25891J44679j95749q5190k84345j4153N26569J40851M738k94114
146A3335k59298J26159n3817k29268M02291k19579j42198L855j38626K70127K19907
135g112K16285j92270J0913m1984j68817K45034n6346n94244N1791J15900J07531
124c13319j70128J16729L06448J34378J1245m1114Q7085k61482O5091K09251l32233
113a88049l9987L48059M7346k01280Q2053K18368n7213l4180j67068k10909J26537
102g6323N1179k24310n2518p2101J31536P772J19042J05295K01511n1025l06758
91a66700J10053j70484k00036K40582J71421l80070N2848O693j78362R5347Q6467
80c32241M9531J77031J41284J501j95402M0685L466J01344k78960j554K11558
$$ plain form
69 -81757 127312 32630 -73873 66471 46799 257157 -40856 -124304 -212563 -147390 -403464
58 -403464 -123878 161802 180052 208086 -205357 -306433 -33137 -164747 -62115 346331
48 346331 294260 183995 173798 -68305 -108906 -168552 -165188 -158044 -59586 -78329 86264 30493
36 30493 32965 148289 303436 218797 415413 238382 67213 267957 166703 -103187 -101542
25 -101542 -240434 -274741 -261117 -271260 -266168 -10367 31818 35903 15091 -54086 -200911 -461980
13 -461980 -301131 -129752 -120896 -34432 -318158 -63233 51541 -414757 -323672 -243788 -256298
2 -256298 -144350 -38290
0 -38290
$$ packed form
69h1757K09069r4682j06503J40344j9672K10358k98013q3448q8259O5173k56074
58d03464K79586K85680J8250K8034m13443j01076K73296j31610J02632M08446
48C46331n2071j10265j0197k42103m0601n9646L364P144R8458j8743J64593n5771
36C0493K472J15324J55147q4639J96616j77031j71169K00744j01254k69890J645
25a01542j38892l4307J3624j0143N092K55801M2185M085k0812o9177j46825k61069
13d61980J60849J71379Q856Q6464k83726K54925J14774m66298R1085P9884j2510
2b56298J11948J06060
0c8290
$$ Imaginary data points
##PAGE= N=2
##DATA TABLE= (X++(I..I)), XYDATA
$$ plain form
16383 -2854488 -2857505 -2804939 -2787072 -2808497 -2660482 -2484331 -2360393 -2338708 -2387000 -2518066 -2350431
16372 -2350431 -2164076 -2356984 -2430352 -2349626 -2106861 -2233191 -2193792 -2115233 -2083593 -2132477
16362 -2132477 -1847825 -1694477 -1689342 -1923252 -1858138 -2073760 -1970654 -1659480 -1591009 -1774347
16352 -1774347 -1708963 -1771852 -1567594 -1337631 -1323082 -1340497 -1200326 -947010 -858215 -962804
16342 -962804 -1072192 -1016776 -1041315 -1118201 -1029430 -1055284 -1113546 -1034588 -895647 -616883 -536212
16331 -536212 -597307 -731443 -823925 -733066 -523884 -628905 -811778 -857459 -554237 -605089
16321 -605089 -475290 -696737 -574150 -382171 -700402 -499843 -282088 -359680 -235194 -119276
16311 -119276 -133926 -7342 -329891 -80991 -138320 -292019 -116285 55711 -47840 -139386
$$ packed form
16383b854488l017N2566J7867k1425J48015J76151J23938K1685m8292j31066J67635
16372b350431J86355j92908p3368Q0726K42765j26330L9399P8559L1640m8884
16362b132477K84652J53348N135k33910O5114k15622J03106L11174O8471j83338
16352a774347O5384o2889K04258K29963J4549j7415J40171K53316Q8795j04589
16342i62804j09388N5416k4539p6886Q8771k5854n8262P8958J38941K78764Q0671
16331e36212o1095j34136r2482R0859K09182j05021j82873m5681L03222n0852
16321f05089J29799k21447J22587J91979l18231K00559K17755p7592J24486J15918
16311a19276j4650J26584l22549K48900n7329j53699J75734J71996j03551r1546
$$ plain form
16301 -139386 -13540 223025 277199 184968 376709 401291 438856 306341 410355 218530
$$ packed form
16301a39386J25846K36565N4174r2231J91741K4582L7565j32515J04014j91825
$$ [...]
##END NTUPLES=NMR SPECTRUM
##END=
