##TITLE=1H_CA-9198-3
 CDCl3
 8 sc, 
 4.10.2023
##JCAMPDX= 6.0         $$ Bruker NMR JCAMP-DX V2.0
##DATA TYPE= NMR SPECTRUM
##DATA CLASS= NTUPLES
##ORIGIN= UXNMR, Bruker Analytische Messtechnik GmbH
##OWNER= root
$$ XWIN-NMR		Version 3.5
$$ Wed Oct  4 14:53:35 2023 Russian Standard Time (UT+4h)  she@DPX200
##.OBSERVE FREQUENCY= 200.13135
##.OBSERVE NUCLEUS= ^1H
##.ACQUISITION MODE= SIMULTANEOUS
##.ACQUISITION SCHEME= undefined
##.AVERAGES= 8
##.DIGITISER RES= 18
##SPECTROMETER/DATA SYSTEM= spect
##.PULSE SEQUENCE= zg30
##.SOLVENT NAME= D2O
##.SHIFT REFERENCE= (INTERNAL, D2O, 0, 15.7524)
##AUDIT TRAIL= $$ (NUMBER, WHEN, WHO, WHERE, WHAT)
$$ ##TITLE= Audit trail, XWIN-NMR		Version 3.5
$$ ##JCAMPDX= 5.01
$$ ##ORIGIN= Bruker BioSpin GmbH
$$ ##OWNER= she
$$ F:/spectra/data/she/nmr/H-F/1/pdata/1/auditp.txt
$$ ##AUDIT TRAIL=  $$ (NUMBER, WHEN, WHO, WHERE, WHAT)
(   1,<2023-10-04 14:52:35.28 +0400>,<she>,<DPX200>,
      <created by zg, POWCHK disabled, PULCHK disabled
       configuration hash MD5:
       00 E9 B6 7A A2 85 ED C7 34 08 36 98 17 FE 4E 26
       data hash MD5: 16K
       97 43 2A 8B 2B 80 39 AA 6F C4 C5 2B 06 52 5A 1E>)
(   2,<2023-10-04 14:52:41.32 +0400>,<she>,<DPX200>,
      <Start of raw data processing
       efp BC_mod = 2 LB = 0.24 FT_mod = 6 PKNL = 1 PHC0 = -21710.89 PHC1 = 11.25271 SI = 16K 
       data hash MD5: 16K
       0E CC 4E 0B 11 E9 C5 CB E2 76 C0 C1 60 28 E2 E2>)
(   3,<2023-10-04 14:52:59.79 +0400>,<she>,<DPX200>,
      <pk PHC0 = 0.2876713 PHC1 = 1.6 
       data hash MD5: 16K
       DD 9B 0B 56 AB 6E 08 02 80 00 AB 90 1F E4 D6 BC>)
(   4,<2023-10-04 14:53:02.59 +0400>,<she>,<DPX200>,
      <abs ABSG = 5 
       data hash MD5: 16K
       DF 24 96 17 97 DB B4 34 AD 1F 5F 54 B0 FE 4C 19>)
$$ ##END=
$$ 
$$ hash MD5
$$ A8 C8 67 06 4D A5 33 D5 57 72 BE 03 0B 53 8F FD
##$RELAX= 
##$RELAX= 
##$RELAX= 
##$RELAX= 
##$RELAX= 
##$RELAX= 
$$ Bruker specific parameters
$$ --------------------------
##$DU= <F:/spectra>
##$EXPNO= 1
##$NAME= <H-F>
##$PROCNO= 1
##$TYPE= <nmr>
##$USER= <she>
##$AMP= (0..31)
100 100 100 100 100 100 100 100 100 100 100 100 100 100 100 100 100 100 
100 100 100 100 100 100 100 100 100 100 100 100 100 100 
##$AQSEQ= 0
##$AQ_mod= 1
##$AUNM= <au_zg>
##$AUTOPOS= <>
##$BF1= 200.13
##$BF2= 200.13
##$BF3= 200.13
##$BF4= 200.13
##$BF5= 200.13
##$BF6= 200.13
##$BF7= 200.13
##$BF8= 200.13
##$BYTORDA= 1
##$CFDGTYP= 0
##$CFRGTYP= 5
##$CHEMSTR= <none>
##$CNST= (0..31)
1 1 145 1 1 1 1 1 1 1 1 1 1 1 1 1 1 1 1 1 1 1 1 1 1 1 1 1 1 1 1 1 
##$CPDPRG= <>
##$CPDPRG1= <>
##$CPDPRG2= <>
##$CPDPRG3= <>
##$CPDPRG4= <mlev>
##$CPDPRG5= <mlev>
##$CPDPRG6= <mlev>
##$CPDPRG7= <mlev>
##$CPDPRG8= <mlev>
##$CPDPRGB= <>
##$CPDPRGT= <>
##$D= (0..31)
0 1.2 0 0 0 0 0 0 0 0.06 0 0.03 0 0 0 0 0.0002 0 0 0 0 0 0 0 0 0 0 0 0 
0 0 0 
##$DATE= 1696416754
##$DBL= (0..7)
120 120 120 120 120 120 120 120 
##$DBP= (0..7)
150 150 150 150 150 150 150 150 
##$DBP07= 0
##$DBPNAM0= <>
##$DBPNAM1= <>
##$DBPNAM2= <>
##$DBPNAM3= <>
##$DBPNAM4= <>
##$DBPNAM5= <>
$$ [...]
##$SUBNAM3= <"">
##$SUBNAM4= <"">
##$SUBNAM5= <"">
##$SUBNAM6= <"">
##$SUBNAM7= <"">
##$SUBNAM8= <"">
##$SUBNAM9= <"">
##$SW= 18.05172834244
##$SWIBOX= (0..15)
0 0 2 0 0 0 0 0 0 0 0 0 0 0 0 0 
##$SW_h= 3612.71676300578
##$TD= 16384
##$TD0= 1
##$TE= 0
##$TE2= 300
##$TE3= 300
##$TEG= 300
##$TL= (0..7)
0 120 120 120 120 120 120 120 
##$TP= (0..7)
150 150 150 150 150 150 150 150 
##$TP07= 0
##$TPNAME0= <>
##$TPNAME1= <>
##$TPNAME2= <>
##$TPNAME3= <>
##$TPNAME4= <>
##$TPNAME5= <>
##$TPNAME6= <>
##$TPNAME7= <>
##$TPOAL= (0..7)
0.5 0.5 0.5 0.5 0.5 0.5 0.5 0.5 
##$TPOFFS= (0..7)
0 0 0 0 0 0 0 0 
##$TUNHIN= 0
##$TUNHOUT= 0
##$TUNXOUT= 0
##$USERA1= <user>
##$USERA2= <user>
##$USERA3= <user>
##$USERA4= <user>
##$USERA5= <user>
##$V9= 5
##$VALIST= <valist>
##$VCLIST= <CCCCCCCCCCCCCCC>
##$VD= 0
##$VDLIST= <DDDDDDDDDDDDDDD>
##$VPLIST= <PPPPPPPPPPPPPPP>
##$VTLIST= <TTTTTTTTTTTTTTT>
##$WBST= 1024
##$WBSW= 4
##$XGAIN= (0..3)
0 0 0 0 
##$XL= 0
##$YL= 0
##$YMAX_a= 444561
##$YMIN_a= -558438
##$ZGOPTNS= <>
##$ZL1= 120
##$ZL2= 120
##$ZL3= 120
##$ZL4= 120
##$ABSF1= 15.76452
##$ABSF2= -2.28733
##$ABSG= 5
##$ABSL= 3
##$ALPHA= 0
##$AQORDER= 0
##$ASSFAC= 0
##$ASSFACI= 0
##$ASSFACX= 0
##$ASSWID= 0
##$AUNMP= <proc_1d>
##$AZFE= 0.1
##$AZFW= 0.1
##$BCFW= 0
##$BC_mod= 2
##$BYTORDP= 0
##$COROFFS= 0
##$CY= -3
##$DATMOD= 1
##$DC= 0
##$DFILT= <>
##$DTYPP= 0
##$F1P= 0
##$F2P= 0
##$FCOR= 1
##$FTSIZE= 16384
##$FT_mod= 6
##$GAMMA= 0
##$GB= 0
##$INTBC= 1
##$INTSCL= 3.70164e-10
##$ISEN= 128
##$LB= 0.24
##$LEV0= 0
##$LPBIN= 0
##$MAXI= 10000
##$MC2= 0
##$MEAN= 0
##$ME_mod= 0
##$MI= 1.114404
##$NCOEF= 0
##$NC_proc= -6
##$NLEV= 6
##$NOISF1= 3.799351
##$NOISF2= 2.8
##$NSP= 0
##$NTH_PI= 0
##$NZP= 0
##$OFFSET= 15.7524
##$PC= 1
##$PHC0= -21710.6
##$PHC1= 12.85271
##$PH_mod= 1
##$PKNL= yes
##$PPARMOD= 0
##$PSCAL= 0
##$PSIGN= 0
##$REVERSE= no
##$SF= 200.130003830222
##$SI= 16384
##$SIGF1= 3
##$SIGF2= 2
##$SINO= 5.538805
##$SIOLD= 16384
##$SREGLST= <1H.CDCl3>
##$SSB= 0
##$STSI= 16384
##$STSR= 0
##$SW_p= 3612.71676300578
##$SYMM= 0
##$S_DEV= 0
##$TDeff= 16384
##$TDoff= 0
##$TI= <>
##$TILT= no
##$TM1= 0
##$TM2= 0
##$TOPLEV= 0
##$USERP1= <user>
##$USERP2= <user>
##$USERP3= <user>
##$USERP4= <user>
##$USERP5= <user>
##$WDW= 1
##$XDIM= 16384
##$YMAX_p= 369657654
##$YMIN_p= -360665
$$ End of Bruker specific parameters
$$ ---------------------------------
##NTUPLES= NMR SPECTRUM
##VAR_NAME=  FREQUENCY,     SPECTRUM/REAL,   SPECTRUM/IMAG
##SYMBOL=    X,             R,               I
##VAR_TYPE=  INDEPENDENT,   DEPENDENT,       DEPENDENT
##VAR_FORM=  AFFN,          ASDF,            ASDF
##VAR_DIM=   16384,         16384,           16384
##UNITS=     HZ,            ARBITRARY UNITS, ARBITRARY UNITS
##FACTOR=    0.220516191357247, 1,           1
##FIRST=     3152.52795203784, 0,            0
##LAST=      -460.188810967938, 0,           0
##MIN=       -460.188810967938, -360665,     0
##MAX=       3152.52795203784, 369657654,    0
$$ Real data points
##PAGE= N=1
##DATA TABLE= (X++(R..R)), XYDATA
$$ [...]
6355H18163o6449N9916l5513O1452N6785j9595l4943j44304J11694O1046j3238
$$ 818163 751714 811630 776117 837569 894354 874759 839816 695512 807206 868252 855014
6344H55014j04087M1204Q5797o7659n9477K0549n0880O2597J10604o3111K1107
$$ 855014 750927 792131 877928 810269 750792 771341 720461 783058 893662 830551 851658
6333H51658j85678R2758j8440k553O8815J01060O3569j8161j8636j39370k602
$$ 851658 665980 758738 740298 737745 806560 907620 971189 953028 934392 795022 792420
6322G92420l4857q992l886L9726R550N5056j1919l251m2046l4688L5108j0220
$$ 792420 757563 748571 744685 784411 793961 849017 837098 833847 791801 757113 792221 782001
6310G82001K7418P9836q4419n7792Q2142q9643l7010R6338P106R6687j6670m963
$$ 782001 809419 889255 804836 747044 829186 739543 702533 798871 805977 902664 885994 881031
6298H81031J3115o2334M4385p4666N8063J38971r7231k29036N0037J72422Q4281
$$ 881031 894146 831812 876197 801531 859594 998565 901334 672298 722335 894757 979038
6287I79038l6545j6760Q3048k5562o3241Q319O7187j06245M370R3833N905l9571
$$ 979038 942493 925733 1008781 983219 919978 928297 995484 889239 893609 987442 993347 953776
6275I53776q1057Q3649K08661L8411m7240K63733n6161p4511j1587J09758n2695
$$ 953776 872719 956368 1165029 1203440 1156200 1419933 1363772 1289261 1277674 1387432 1334737
6264A334737k458J60529J15285r4867j07733Q1822M8852l776o0322J38216J47263
$$ 1334737 1332279 1492808 1608093 1513226 1405493 1487315 1536167 1532391 1472069 1610285 1757548
6253A757548q4007k5076L8096m5977J60421P0138K3225l9710L6204J1350Q5323
$$ 1757548 1673541 1648465 1686561 1640584 1801005 1871143 1894368 1854658 1890862 1902212 1987535
6242A987535J28273j13871j090O7954L9654O6655J07317L7147j921m8758Q0698
$$ 1987535 2115808 2001937 2000847 2068801 2108455 2175110 2282427 2319574 2317653 2268895 2349593
6231B349593P3645L6271J89546J27144J33485J35467J33972Q0791K36048J10650
$$ 2349593 2423238 2459509 2649055 2776199 2909684 3045151 3179123 3259914 3495962 3606612
6221C606612J30154K96970l4863M3961N0048j70776j75191k20895r9245p1522
$$ 3606612 3736766 4033736 3998873 4042834 4092882 3922106 3746915 3526020 3426775 3355253
6211C355253l6498p3714N1220o8868p8073j4325P4353k8087R9114J54528M7112
$$ 3355253 3318755 3245041 3296261 3227393 3149320 3134995 3209348 3181261 3280375 3434903 3482015
6200C482015p0382R4450J67945l3159M3823M3599n0742J26911K06958K2962P627
$$ 3482015 3411633 3506083 3674028 3640869 3684692 3728291 3677549 3804460 4011418 4034380 4042007
6189D042007J41854J61971N7656J03736Q4727K35817J42942P6841K04561L14741
$$ 4042007 4183861 4345832 4403488 4507224 4591951 4827768 4970710 5047551 5252112 5566853
6179E566853J48293J89433K15656J35175K09155M27283K25698K07472J56146K50188
$$ 5566853 5715146 5904579 6120235 6255410 6464565 6891848 7117546 7325018 7481164 7731352
6169G731352L70602K43487K24365K48963K23606J14460J05634P9016J71151J36604
$$ 7731352 8101954 8345441 8569806 8818769 9042375 9156835 9262469 9341485 9512636 9649240
6159I649240J62575K01837R0978O7145K04851K89316L01929M04751M45493M49073
$$ 9649240 9811815 10013652 10104630 10171775 10376626 10665942 10967871 11372622 11818115 12267188
6149A2267188N46943P08609P15840P09445R03637P85618Q50944Q71768Q04609
$$ 12267188 12814131 13522740 14238580 14948025 15851662 16637280 17488224 18359992 19164601
6140A9164601O38064L68239J84766J57480j01909k64261l59132l86950l44552
$$ 19164601 19802665 20170904 20355670 20513150 20411241 20146980 19787848 19400898 19056346
6131A9056346m12959k68952j52115m6704j08815Q9430K19878L07035M30473M05477
$$ 19056346 18643387 18374435 18222320 18175616 18066801 18156231 18376109 18683144 19113617 19519094
6121A9519094N39643P54129P71550R21941J046012R83120R75091J018052R58256
$$ 19519094 20058737 20812866 21584416 22506357 23552369 24535489 25510580 26528632 27486888
6112B7486888M92910K98324k29048m63912o10375q69810r92293j168541j049407
$$ 27486888 27979798 28278122 28049074 27585162 26974787 26104977 25112684 23944143 22894736
6103B2894736r17262q96082p19045o39050n87559m11062m76263k40678j4862j6119
$$ 22894736 21977474 21081392 20362347 19723297 19135738 18724676 18248413 18007735 17992873 17976754
6093A7976754J24377P0304K23026L96442L06112M41170M19417L35554K76927J18629
$$ 17976754 18101131 18171435 18394461 18790903 19097015 19538185 19957602 20293156 20570083 20688712
6083B0688712q8786j60717n94141q33768p80153r08252q60051r56579r26898q42685
$$ 20688712 20599926 20439209 19845068 19011300 18231147 17322895 16462844 15506265 14579367 13736682
6073A3736682r30446o56912n38671n64306m83790j86137m85040l64350j57759
$$ 13736682 12806236 12149324 11610653 11046347 10562557 10376420 9891380 9527030 9369271
6064I369271k88902k17878o1291q6382p8355n6670p0022k30049j61224k6639j55887
$$ 9369271 9080369 8862491 8801200 8714818 8636463 8579793 8509771 8279722 8118498 8091859 7935972
6053G935972k17926l62050k67310m05190m05621l72846k63908l66350k82049j94861
$$ 7935972 7718046 7355996 7088686 6683496 6277875 5905029 5641121 5274771 4992722 4797861
6043D797861k19840k69217j25903q0027j67420k55652j52843j28601L0947j90370
$$ 4797861 4578021 4308804 4182901 4102874 3935454 3679802 3526959 3398358 3429305 3238935
6033C238935k43286j20393j15648O2244r4309q7220q1424R6829j15644K5797r9374
$$ 3238935 2995649 2875256 2759608 2821852 2727543 2640323 2558899 2655728 2540084 2565881 2466507
6022B466507k56136j4682p0609m1945P2162m9066j11188q0027j6773r9054m991
$$ 2466507 2210371 2195689 2125080 2083135 2155297 2106231 1995043 1915016 1898243 1799189 1794198
6011A794198m5909m6132Q7253p6707k9912O9019l5369j37003K4107N8291j09310
$$ 1794198 1748289 1702157 1789410 1712703 1682791 1751810 1716441 1579438 1603545 1661836 1552526
6000A552526R1803N9787k31912j11467J17327J0449k9891J01327j02012n6893
$$ 1552526 1644329 1704116 1472204 1360737 1478064 1488513 1458622 1559949 1457937 1401044
5990A401044J1212L5732r1783j07331l6953J59346j64801j40251J21927O6962
$$ 1401044 1412256 1447988 1356205 1248874 1211921 1371267 1206466 1066215 1188142 1255104
5980A255104j6043k0554L1646L818j728L991J8628j08716Q9508p1008k1920J54579
$$ 1255104 1239061 1218507 1250153 1253971 1252243 1256234 1274862 1166146 1255654 1184646 1162726 1317305
5968A317305q9664j97956J50104j25629o8153P3260K8986k1055M4671R738L6515
$$ 1317305 1227641 1029685 1179789 1054160 986007 1059267 1088253 1067198 1111869 1121607 1158122
5957A158122P4409j51697m9688N1395Q5567p2974p8586K7361P961J1269l4176
$$ 1158122 1232531 1080834 1031146 1082541 1168108 1095134 1016548 1043909 1051870 1063139 1028963
5946A028963J0396M4699K4347q5510k7171J15471o2624J8068K9471r4586r3021
$$ 1028963 1039359 1084058 1108405 1022895 995724 1111195 1048571 1066639 1096110 1001524 908503
5935I08503J18524J51541j1131k2880L6366m4399K748p9276J2175K2926m5463
$$ 908503 1027027 1178568 1167437 1144557 1180923 1136524 1139272 1059996 1072171 1095097 1049634
5924A049634Q9755O8935j60428k147J347j9533J3443K0130P7508m2925J33054
$$ 1049634 1139389 1208324 1047896 1045749 1047096 1027563 1041006 1061136 1138644 1095719 1228773
5913A228773n5496j94528M6360K4525O9727L7333J6646l3879r8046J61632K0045
$$ 1228773 1173277 978749 1025109 1049634 1119361 1156694 1173340 1139461 1041415 1203047 1223092
5902A223092r3360m0292q1846L5008J5488O1917k0317n0696p7062L6104J14468
$$ 1223092 1129732 1089440 1007594 1042602 1058090 1120007 1099690 1048994 971932 1008036 1122504
5891A122504j2219r5287l2489Q5760k040l3700J81571L6551l0523p5874N4752
$$ 1122504 1110285 1014998 982509 1068269 1066229 1032529 1214100 1250651 1220128 1144254 1199006
5880A199006j2897p6199J100k2777m1725N2773N2861n9366Q2109o7295o0644P5345
$$ 1199006 1186109 1109910 1111010 1088233 1046508 1099281 1152142 1092776 1174885 1107590 1046946 1122291
5868A122291r0777p3374J89N5446p4918k9516J5665J6569O9155N1853n0705q8353
$$ 1122291 1031514 958140 958329 1013775 938857 909341 925006 941575 1010730 1062583 1011878 923525
5856I23525P6300J4114P6289j943L5377o409n1243l4805p0528n7159J08717P206
$$ 923525 999825 1013939 1090228 1088285 1123662 1117253 1066010 1031205 960677 903518 1012235 1019441
5844A019441J1872p7617N0082l7145j1134K5348P2567N8895q7209L5999k9509
$$ 1019441 1031313 953696 1003778 966633 955499 980847 1053414 1112309 1025100 1061099 1031590
5833A031590K3934l0532J1714J14697o8349J4858r9088j13227n021K2315J4257
$$ 1031590 1055524 1024992 1036706 1151403 1083054 1097912 998824 885597 880576 902891 917148
5822I17148L2500o3505M2185N6302M5340K8354N4896Q7038o7398q7412q8675j15981
$$ 917148 949648 886143 928328 984630 1029970 1058324 1113220 1200258 1132860 1045448 956773 840792
5810H40792O6067J44740Q7169k8034J344o5877J04687m7633p0311J19032n0753
$$ 840792 906859 1051599 1138768 1110734 1112078 1046201 1150888 1103255 1032944 1151976 1101223
5799A101223k6052K8558k3460m6285M5913P4733M7393j43783P7019L7710R0144
$$ 1101223 1075171 1103729 1080269 1033984 1079897 1154630 1202023 1058240 1135259 1172969 1263113
5788A263113n2986K5406L5067J3562q8579k0729Q7056M6758Q1272J73786J32865
$$ 1263113 1210127 1235533 1270600 1284162 1195583 1174854 1261910 1308668 1389940 1563726 1696591
5777A696591j18486q3376j21326J23745Q8105q8705k5154J3741J14742O0038p8638
$$ 1696591 1578105 1494729 1373403 1497148 1585253 1496548 1471394 1485135 1599877 1659915 1581277
5766A581277q549J04435O7610L2463j18995J50496P0155M080O287J01575l8829
$$ 1581277 1572728 1677163 1744773 1777236 1658241 1808737 1878892 1882972 1889259 1990834 1952005
5755A952005j67551J00465j08589k8014N2736J77450j68N4611j22095o3110Q5920
$$ 1952005 1784454 1884919 1776330 1748316 1801052 1978502 1978334 2032945 1910850 1847740 1933660
5744A933660j15871K16019K4165k5273Q0478J36494M1189j04970r7143J29101
$$ 1933660 1817789 2033808 2057973 2032700 2113178 2249672 2290861 2185891 2088748 2217849
5734B217849M5559j00058J14485j18767j37477J58698J13405J0360n2288j2683
$$ 2217849 2263408 2163350 2277835 2159068 2021591 2180289 2293694 2304054 2251766 2239083
5724B239083J40577M0469m7661R5277m4555M8251k7735J04283J9547l0440P9757
$$ 2239083 2379660 2420129 2372468 2467745 2423190 2471441 2443706 2547989 2567536 2537096 2616853
5713B616853r1748m9572o0585J35029k4635o5513N1588M6513r7697j5209J1962
$$ 2616853 2525105 2475533 2414948 2549977 2525342 2459829 2511417 2557930 2460233 2445024 2456986
5702B456986J7830p2539P2406M7364r1388R666n0488L5164q146j32551O7086J07220
$$ 2456986 2474816 2402277 2474683 2522047 2430659 2440325 2389837 2425001 2416855 2284304 2351390 2458610
5690B458610l1977q045L4529k0310M1566M3002o4851q3720K7727R478o5238J5248
$$ 2458610 2426633 2418588 2453117 2432807 2474373 2517375 2452524 2368804 2396531 2406009 2340771 2356019
5678B356019J6535O6276R3356R0665l4900N7721J8029K4908J02613r5125M550
$$ 2356019 2372554 2438830 2532186 2622851 2587951 2645672 2663701 2688609 2791222 2696097 2700647
5667B700647N9726K3051j10339k3863K28541k606L3889j33500o6490r0495M6116
$$ 2700647 2760373 2783424 2673085 2649222 2877763 2875157 2909046 2775546 2709056 2618561 2664677
5656B664677P3418Q6766o871q1597j9000J5365l5884N6775M6785m4529J55557
$$ 2664677 2738095 2824861 2817990 2736393 2717393 2732758 2696874 2753649 2800434 2755905 2911462
5645B911462J24945k589n3568K8761Q4360J19455N4791l31J27008P0676k610k989
$$ 2911462 3036407 3033818 2980250 3009011 3093371 3212826 3267617 3267286 3394294 3464970 3462360 3459371
5633C459371J12694J39338J90054K98695K45433K47157J04469K67986J66988J42718
$$ 3459371 3572065 3711403 3901457 4200152 4445585 4692742 4797211 5065197 5232185 5374903
5623E374903K35256N16607K72429J06414R6693O1777K0149j64027k70022l05591
$$ 5374903 5610159 6126766 6399195 6505609 6602302 6664079 6684228 6520201 6250179 5944588
5613E944588l09252j46718j73572q3824k67645l10811j39464j61529j24301k79207
$$ 5944588 5635336 5488618 5315046 5231222 4963577 4652766 4513302 4351773 4227472 3948265
5603C948265j40505o4202j36352k21047r4184p3179L5611K7823j90375j35649
$$ 3948265 3807760 3743558 3607206 3386159 3291975 3218796 3254407 3282230 3091855 2956206
5593B956206l7425N8450j69450j46134k1248K5303J1022J46497L0793j19194p8831
$$ 2956206 2918781 2977231 2807781 2661647 2640399 2665702 2676724 2823221 2854014 2734820 2655989
5582B655989K3666q9982L822K8890r673P015J888p3137M8645R2626l5441j25215
$$ 2655989 2679655 2589673 2593495 2622385 2612712 2619727 2621615 2548478 2597123 2689749 2654308 2529093
5570B529093j03235P6163J7748q3807j1041r4223L8285J50037K5733l5801j59951
$$ 2529093 2425858 2502021 2519769 2435962 2424921 2330698 2368983 2519020 2544753 2508952 2349001
5559B349001k9606M6430J42289o1653p5228J21357q6354k5128n3248O8121k0692
$$ 2349001 2319395 2365825 2508114 2446461 2371233 2492590 2406236 2381108 2327860 2395981 2375289
5548B375289j15934J30845J10762N9925j49987J53504j3236p9550K5083j1432
$$ 2375289 2259355 2390200 2500962 2560887 2410900 2564404 2551168 2471618 2496701 2485269
5538B485269O9842O2128p3051R9786p4765k0217l6625l7011P5567K6957J21985
$$ 2485269 2555111 2617239 2544188 2643974 2569209 2548992 2512367 2475356 2550923 2577880 2699865
5527B699865r8101q7793J81466J1607m0607O4739K5019p5054P3736k0194M0623
$$ 2699865 2601764 2513971 2695437 2707044 2666437 2731176 2756195 2681141 2754877 2734683 2775306
5516B775306J12078J9495j61985P2784j7100R836J13681k5540m6728l3325J0228
$$ 2775306 2887384 2906879 2744894 2817678 2800578 2810414 2924095 2898555 2851827 2818502 2828730
5505B828730L6214r8484Q9293R7801M5890M7764q8776j1404m686R9708J04557
$$ 2828730 2864944 2766460 2855753 2953554 2999444 3047208 2958432 2947028 2942342 3042050 3146607
5494C146607k8940N7686P2279m5391j8208O9585j1129Q7747N9674j30886M0277
$$ 3146607 3117667 3175353 3247632 3202241 3184033 3253618 3242489 3330236 3389910 3259024 3299301
5483C299301J321M8536j84739N2923k4201q4800k2078Q1914M9019K25543N918
$$ 3299301 3300622 3349158 3164419 3217342 3193141 3108341 3086263 3168177 3217196 3442739 3448657
5472C448657o6307M0158K9712P4235O5426q165J3034J74204l8498R2386K4883
$$ 3448657 3382350 3422508 3452220 3526455 3591881 3583716 3596750 3770954 3732456 3824842 3849725
5461C849725L4498R8394J41896J72702J54743J42811R9834j35283j4329p6057
$$ 3849725 3884223 3982617 4124513 4297215 4451958 4594769 4694603 4559320 4544991 4468934
5451D468934n1465M0720j0136J50375J9572J04993j1114Q1542n7268k8816J29671
$$ 4468934 4417469 4458189 4448053 4598428 4618000 4722993 4711879 4793421 4736153 4707337 4837008
5440D837008J73568n6954J29078K05618n7492N5114J04039J70634K21950O3324
$$ 4837008 5010576 4953622 5082700 5288318 5230826 5285940 5389979 5560613 5782563 5845887
5430E845887J82836J22985K10441L25570K15443J83002J08417P3479J01205j8368
$$ 5845887 6028723 6151708 6362149 6687719 6903162 7086164 7194581 7268060 7369265 7350897
5420G350897K1718j07422K54904O4448J32291K89799J62047K17838N2266K46537
$$ 7350897 7372615 7265193 7520097 7584545 7716836 8006635 8168682 8386520 8438786 8685323
5410H685323Q8473J30584K03218K15435K66025K64229L06320J13829L34220L30593
$$ 8685323 8773796 8904380 9107598 9323033 9589058 9853287 10159607 10273436 10607656 10938249
5400A0938249L68057M54841K38120L96265L58324M50572L43688N50798N20006
$$ 10938249 11306306 11761147 11999267 12395532 12753856 13204428 13548116 14098914 14618920
5391A4618920L68900M98007M54626L84852N64642P02250P69623O82742Q55386
$$ 14618920 14987820 15485827 15940453 16325305 16889947 17592197 18361820 19044562 19899948
5382A9899948Q77012Q64586J033873J248485J347501J518391J763928J893870
$$ 19899948 20776960 21641546 22675419 23923904 25271405 26789796 28553724 30447594
5374C0447594K269411K479630K871729L295819L541073L769926M092742M397801
$$ 30447594 32717005 35196635 38068364 41364183 44905256 48675182 52767924 57165725
5366E7165725M093050L865075L766716L065808J776872M20617j060443k267826
$$ 57165725 61258775 65123850 68890566 71956374 73733246 74153863 73093420 70825594
5358G0825594l117523l453842l605240l573310l808288l520989l377883l106432
$$ 70825594 67708071 64254229 60648989 57075679 53267391 49746402 46368519 43262087
5350D3262087k878245k248758j948129j666980j369782j032843q44901n64880
$$ 43262087 40383842 38135084 36186955 34519975 33150193 32117350 31272449 30707569
5342C0707569k03404l22454O9748L22610M85282M98176Q80061J196422J238921
$$ 30707569 30504165 30181711 30251459 30574069 31059351 31557527 32437588 33634010 34872931
5333C4872931J305719J515518J459520J425706J289686Q18234L37076J33767n9452
$$ 34872931 36178650 37694168 39153688 40579394 41869080 42687314 43024390 43158157 43098705
5324D3098705l67309l10897m82958m23198l89524o10022o03049n74298m81035
$$ 43098705 42731396 42420499 41937541 41514343 41124819 40514797 39911748 39337450 38856415
5315C8856415m27631k93821k9558L8851J50214M41988N65390Q93224J279737J417629
$$ 38856415 38428784 38134963 38105405 38144256 38294470 38736458 39301848 40195072 41474809 42892438
5305D2892438J684961J789443K210376K453195K142407K118421J776489J552608
$$ 42892438 44577399 46366842 48577218 51030413 53172820 55291241 57067730 58620338
5297E8620338J046787P74162O40778O44201M09394K24686J68572N3577j19631
$$ 58620338 59667125 60441287 61082065 61726266 62135660 62360346 62528918 62582495 62462864
5288F2462864k25392p77691j251117j863524k315705k553803k617558k544843
$$ 62462864 62237472 61459781 60208664 58345140 56029435 53475632 50858074 48313231
5280D8313231k379446k038914j792736j293225j045360r52101n16366l00058k3757
$$ 48313231 45933785 43894871 42102135 40808910 39763550 38811449 38295083 37995025 37971268
5271C7971268K36010L35857M46511N81180N78350N58426K77789L47967L66585
$$ 37971268 38207278 38543135 38989646 39570826 40149176 40707602 40985391 41333358 41699943
5262D1699943M07759K38828J35365j05465n22832q94811j518283j925108k094608
$$ 41699943 42107702 42346530 42481895 42376430 41853598 40958787 39440504 37515396 35420788
5253C5420788k269077k354206k227952k108531j763564j571663j612548j335852
$$ 35420788 33151711 30797505 28569553 26461022 24697458 23125795 21513247 20177395
5245B0177395j136093j251421r26761p15513p70504o48776o25397n84709m77551
$$ 20177395 19041302 17789881 16863120 16147607 15377103 14728327 14102930 13518221 13040670
5236A3040670m99591m54534k97084m83095k37698k91256l45549k64982l44796
$$ 13040670 12541079 12086545 11789461 11306366 11068668 10777412 10431863 10166881 9822085
5227I822085j70631k74130j63514l01989j89772j49357r0961k71687j01108L7827
$$ 9822085 9651454 9377324 9213810 8911821 8722049 8572692 8481731 8210044 8108936 8146763
5217H146763r1386k51154k13699j58171o4209q4140n3673k0133K9303k81302N9026
$$ 8146763 8055377 7804223 7590524 7432353 7368144 7284004 7230331 7210198 7239501 6958199 7017225
5206G017225j4992k58174L875r4037L9693m1870j00021p2679m4615L6574j07235
$$ 7017225 7002233 6744059 6747934 6653897 6693590 6651720 6551699 6479020 6434405 6470979 6363744
5195F363744J07079k8411o2129j23835k6791K4796J31832o1422J15831m9768j78764
$$ 6363744 6470823 6442412 6380283 6256448 6229657 6254453 6386285 6324863 6440694 6390926 6212162
5184F212162k2919k301P4129r1103O4516J36562P1980j10173L3996m3177J71428
$$ 6212162 6189243 6186942 6261071 6169968 6234484 6371046 6443026 6332853 6366849 6323672 6495100
5173F495100L2231N2645K7350Q2827n674n3732M1354L6587J89456J58901J94365
$$ 6495100 6527331 6579976 6607326 6690153 6684479 6630747 6672101 6708688 6898144 7057045 7251410
5162G251410m2126K164J98147J08177j2786J63733J07589J32730J89366K37994
$$ 7251410 7209284 7211448 7409595 7517772 7504986 7668719 7776308 7909038 8098404 8336398
5152H336398L12172J34598J57132K91743M01578M16583L95581M25890N73877O02832
$$ 8336398 8648570 8783168 8940300 9232043 9633621 10050204 10445785 10871675 11445552 12048384
5142A2048384O46794L24961k04329l68318l28465l56282j28624Q1807J44948J19650
$$ 12048384 12695178 13020139 12815810 12447492 12119027 11762745 11634121 11715928 11860876 11980526
5132A1980526J46187l680K67397L01991J40126L00010K91942K29534K70440M12004
$$ 11980526 12126713 12123033 12390430 12692421 12832547 13132557 13424499 13654033 13924473 14336477
5122A4336477K44890N29249M79872M62648N45779N08616P07709N86257P49035
$$ 14336477 14581367 15110616 15590488 16053136 16598915 17107531 17815240 18401497 19150532
5113A9150532R22499J008742J025609J250481J239831J561724J662817J674884
$$ 19150532 20073031 21081773 22107382 23357863 24597694 26159418 27822235 29497119
5105B9497119K085064K176897K220182K385354K279990K029696J656069J126289
$$ 29497119 31582183 33759080 35979262 38364616 40644606 42674302 44330371 45456660
5097D5456660Q55754J08972k38020k10762n28224n28347n09413m89537n58396
$$ 45456660 46312414 46421386 46183366 45972604 45444380 44916033 44406620 43917083 43358687
5088D3358687n86490p03941m12286k41320n5172p4374J51812N42966Q62443J096061
$$ 43358687 42772197 42068256 41655970 41414650 41359478 41285104 41436916 41979882 42842325 43938386
5078D3938386J383488J573987J749262J983411K014952J705781J620026J321563
$$ 43938386 45321874 46895861 48645123 50628534 52643486 54349267 55969293 57290856
5070E7290856O53181J83880K2226j75520k86422k65793o00591o05073p18583o29812
$$ 57290856 57944037 58127917 58150143 57974623 57688201 57422408 56821817 56216744 55498161 54868349
5060E4868349q51933r26697j048742j052077j329569j634989j701517j870922
$$ 54868349 54016416 53089719 52040977 50988900 49659331 48024342 46322825 44451903
5052D4451903j975815k051627j769335j421183j272653j012293p38593n49799
$$ 44451903 42476088 40424461 38655126 37233943 35961290 34948997 34210404 33660605
5044C3660605m63076l32357N9033K32294J95170J97067K70233K63846K38006K17647
$$ 33660605 33197529 32865172 32924205 33156499 33351669 33548736 33818969 34082815 34320821 34538468
5034C4538468J60487N3396L5782k21445n18398q61396j439765j599060j759039
$$ 34538468 34698955 34752351 34788133 34566688 34048290 33186894 31747129 30148069 28389030
5025B8389030j873619j853636j643087j370407j517743j370804r86774r61809
$$ 28389030 26515411 24661775 23018688 21648281 20130538 18759734 17772960 16811151
5017A6811151p83538q41394q26937n98759n40115n53051n68520m13249k31968
$$ 16811151 16027613 15186219 14359282 13760523 13220408 12667357 12098837 11685588 11453620
5008A1453620m22206m18687l56212l14684k93075j74084k67470k41398k79927
$$ 11453620 11031414 10612727 10256515 9941831 9648756 9474672 9207202 8965804 8685877
4999H685877l11762j28481M6464q1978j32930k38175l25798j86813r6246r368
$$ 8685877 8374115 8245634 8292098 8210120 8077190 7839015 7513217 7326404 7230158 7220790
4989G220790m7486j21422j19427p6630M014j74094j58826o0951k87540l2279p455
$$ 7220790 7173304 7051882 6932455 6855825 6859839 6685745 6526919 6465968 6178428 6146149 6138694
4978F138694k4651q2361k2423q3542K7419j7028k04212Q7496j67569j33760L8167
$$ 6138694 6114043 6031682 6009259 5925717 5953136 5936108 5731896 5819392 5651823 5518063 5556230
4967E556230q2057j23327k5944O5723p0844j23350j49526r997K6252o2777q1825
$$ 5556230 5474173 5350846 5324902 5390625 5319781 5196431 5046905 5036908 5063160 5000383 4918558
4956D918558j29396q57P2068K527q3748l5364q268K4872j9702j44734j50924o0913
$$ 4918558 4789162 4788305 4860373 4862900 4779152 4743788 4735520 4760392 4740690 4595956 4445032 4384119
4944D384119P4788P195l7528o198o8082j67080p2394k3922m5366m2331k896N6975
$$ 4384119 4458907 4466102 4428574 4422376 4354294 4187214 4114820 4090898 4045532 4003201 4000305 4057280
4932D057280j12888j03000q9607R7575M635m9143J8354o472O8273j34112k04507
$$ 4057280 3944392 3841392 3751785 3849360 3853995 3804852 3823206 3816734 3885007 3750895 3546388
4921C546388P7531Q5412p1754n0492O131j31513q6988o233J17674j8369p1134
$$ 3546388 3623919 3709331 3637577 3587085 3593216 3461703 3374715 3368482 3486156 3467787 3396653
4910C396653M0223j9334j01296k02228L7949O6300j5165r8704p4145j10228K38444
$$ 3396653 3436876 3417542 3316246 3114018 3151967 3218267 3203102 3104398 3030253 2920025 3158469
4899C158469J452l0017j77288l1241Q2601j9730k6613k3804K7457p5019o9617
$$ 3158469 3159921 3129904 2952616 2921375 3003976 2984246 2957633 2933829 2961286 2886267 2816650
4888B816650n0688r1443J64707P2017p8714q6370N362p5374j01649N3273J9829
$$ 2816650 2765962 2674519 2839226 2911243 2832529 2746159 2751521 2676147 2574498 2627771 2647600
4877B647600j0006r0275K1491L5187N6594R4072j24932L2211J53401L5979o7640
$$ 2647600 2637594 2547319 2568810 2603997 2660591 2754663 2629731 2661942 2815343 2851322 2783682
4866B783682j7575J5322K4088M7705r0234n4249p3170P8656J4121r7271l4961
$$ 2783682 2766107 2781429 2805517 2853222 2762988 2708739 2635569 2714225 2728346 2631075 2596114
4855B596114M6364J67769O9737o0777l9486j29735J26606L4777O7989L285M0900
$$ 2596114 2642478 2810247 2879984 2819207 2779721 2649986 2776592 2811369 2879358 2882643 2923543
4844B923543O989J1304J0354j19934P289n259K7860P9039j14192m5478J13761
$$ 2923543 2930532 2941836 2952190 2832256 2839545 2834286 2862146 2941185 2826993 2781515 2895276
4833B895276J03109n3646k9474Q6958J9729Q6011O1439M9540n6650M247J2646
$$ 2895276 2998385 2944739 2915265 3002223 3021952 3107963 3169402 3218942 3162292 3166539 3179185
4822C179185J5708m490L4684P1621J07960l138L4371j0673k3899N2800j1595Q3265
$$ 3179185 3194893 3190403 3225087 3296708 3404668 3401530 3435901 3425228 3401329 3454129 3442534 3525799
4810C525799R6054J50312J35998R5487o56j6677J78787J06362J20268J94291K17497
$$ 3525799 3621853 3772165 3908163 4003650 4002994 3986317 4165104 4271466 4391734 4586025 4803522
4799D803522L26347L18469L88787N00497J75836l30342m19817j52052r1666q7510
$$ 4803522 5129869 5448338 5837125 6337622 6513458 6183116 5763299 5611247 5519581 5432071
4789E432071j4060k6715j31469j9729J72299O5012P0771j09247r2820J57836K11529
$$ 5432071 5418011 5391296 5259827 5240098 5412397 5477409 5548180 5438933 5346113 5503949 5715478
4778E715478N3194O6133J55237J77507K05653K08622J85207J47223N7262K24158
$$ 5715478 5768672 5834805 5990042 6167549 6373202 6581824 6767031 6914254 6971516 7195674
4768G195674J47230J40128P342j12850k5527J4093J7129J70896J1054j1623R7102
$$ 7195674 7342904 7483032 7490374 7377524 7351997 7366090 7383219 7554115 7565169 7553546 7650648
4757G650648Q1328N9568O6085m1775J1793J14858Q0447N4758K58905M8835J12119
$$ 7650648 7731976 7791544 7857629 7815854 7827647 7942505 8022952 8077710 8336615 8385450 8497569
4746H497569J51650J289L4088M9684J45610N2688J03401J57248L6274Q1191R9317
$$ 8497569 8649219 8650508 8684596 8734280 8879890 8932578 9035979 9193227 9229501 9310692 9410009
4735I410009Q3649O2358J2587J49418J18750J17177J14883l5524q9961J89926
$$ 9410009 9493658 9556016 9568603 9718021 9836771 9953948 10068831 10033307 9943346 10133272
4725A0133272Q7966J31847J30340O4700O532J75345J37285J32414K44300J57912
$$ 10133272 10221238 10353085 10483425 10548125 10554657 10730002 10867287 10999701 11244001 11401913
4715A1401913K50176J70904J31744L08557K97954J14993L68321L28196K88129
$$ 11401913 11652089 11822993 11954737 12263294 12561248 12676241 13044562 13372758 13660887
4706A3660887K87594K86138K44738K57551L35580L11446N04345K33153L38722
$$ 13660887 13948481 14234619 14479357 14736908 15072488 15383934 15888279 16121432 16460154
4697A6460154K16080K50978K45809L10898M35809N11822M32553M79937N70300
$$ 16460154 16676234 16927212 17173021 17483919 17919728 18431550 18864103 19344040 19914340
4688A9914340M65483M25067O25121N99935N06931O08897O37775N69110O27475
$$ 19914340 20379823 20804890 21430011 22029946 22536877 23145774 23783549 24352659 24980134
4679B4980134P35885Q20902Q61490Q94090J015834J174313J281432J377686J476329
$$ 24980134 25716019 26536921 27398411 28292501 29308335 30482648 31764080 33141766 34618095
4670C4618095J576898J787536J857176K008101K070293K281961K350167K508082
$$ 34618095 36194993 37982529 39839705 41847806 43918099 46200060 48550227 51058309
4662E1058309K843044K927433L253309L501375L739465M044711M121409M400511
$$ 51058309 53901353 56828786 60082095 63583470 67322935 71367646 75489055 79889566
4654G9889566M693517M783449M719973M672934M034863K993113J799364o1206
$$ 79889566 84583083 89366532 94086505 98759439 102794302 105787415 107586779 107525573
4646A07525573j433741k917181m149345m719305m885002m731838m301381l886866
$$ 107525573 106091832 103174651 99025306 94306001 89420999 84689161 80387780 76500914
4638G6500914l771907m035563m360164m682871m750975m606163m102186l602451
$$ 76500914 72729007 68693444 64333280 59650409 54899434 50293271 46191085 42588634
4630D2588634l266436k690710k344873k126083j680737j554586j346668j195649
$$ 42588634 39322198 36631488 34286615 32160532 30479795 28925209 27578541 26382892
4622B6382892j139965q78272r67523p04628p43715m84302o17548m95521n71943
$$ 26382892 25242927 24364655 23397132 22692504 21948789 21464487 20846939 20351418 19779475
4613A9779475m97466o21524n33351m94670o49966m45106l85640l37865l82421
$$ 19779475 19282009 18660485 18127134 17632464 16982498 16537392 16151752 15813887 15431466
4604A5431466k10322k54872k78401k19192j19865k04280l24669j33749k03273
$$ 15431466 15221144 14966272 14687871 14468679 14348814 14144534 13819865 13686116 13482843
4595A3482843l39750j60253j71757k91711k25307j81684k67455j88216k50317
$$ 13482843 13143093 12982840 12811083 12519372 12294065 12112381 11844926 11656710 11406393
4586A1406393k98664k81466p5392r4427j87526j27982q1179n0526k06093j74242
$$ 11406393 11107729 10826263 10750871 10656444 10468918 10340936 10259757 10209231 10003138 9828896
4576I828896m5241R8371o1147N8004o7771q6750J2666q1106J2518p8725j31936
$$ 9828896 9783655 9882026 9820879 9878883 9811112 9724362 9737028 9655922 9668440 9589715 9457779
4565I457779j62664j56379j55830l26381j89004q4093j91335j53903n5343p6423
$$ 9457779 9295115 9138736 8982906 8656525 8467521 8383428 8192093 8038190 7982847 7906424
4555G906424J08266j34002j35845K3584j07952M8958j74192j51803K1561J15758
$$ 7906424 8014690 7880688 7744843 7768427 7660475 7709433 7535241 7383438 7404999 7520757
4545G520757o7369r7723N092j54725j19626O0845M0039J1870p9793N2971m1765
$$ 7520757 7453388 7355665 7360757 7206032 7086406 7147251 7187290 7199160 7119367 7172338 7130573
4534G130573p8341J18275j24490n0638r0564r7698N4685j46977p8954r719j01960
$$ 7130573 7052232 7170507 7046017 6995379 6904815 6807117 6861802 6714825 6635871 6626152 6524192
4523F524192K3594Q0352o1771j50109Q7197m408R0710Q6989m8654Q7295P4721
$$ 6524192 6547786 6628138 6566367 6416258 6503455 6499047 6589757 6676746 6628092 6715387 6790108
4512F790108k8377m4505O0391K7165L4367j7695q820o6027j22203r8859k3628
$$ 6790108 6761731 6717226 6777617 6804782 6839149 6821454 6812634 6746607 6624404 6525545 6501917
4501F501917J18352J22712j6467j11032L9214J76354n576M7862Q3590J3031J17204
$$ 6501917 6620269 6742981 6726514 6615482 6654696 6831050 6825474 6873336 6956926 6969957 7087161
4490G087161K4143N5245J16699J32950r7256L8105J20119J53409K71402J55187
$$ 7087161 7111304 7166549 7283248 7416198 7318942 7357047 7477166 7630575 7901977 8057164
4480H057164N0885J47474J04128N2586K66601K19462J80887K4535J33844J50287
$$ 8057164 8108049 8255523 8359651 8412237 8678838 8898300 9079187 9103722 9237566 9387853
4470I387853J09430Q7915K87343L07685K67165K59398K68106N93212Q36494J134801
$$ 9387853 9497283 9585198 9872541 10180226 10447391 10706789 10974895 11568107 12404601 13539402
4460A3539402J565847K012705J056134j163853j942960j596157r80074o14781
$$ 13539402 15105249 17117954 18174088 17010235 15067275 13471118 12491044 11876263
4452A1876263l66309l57198k04748p9122r3584j29046j6092J3154k9020j8816
$$ 11876263 11509954 11152756 10948008 10868886 10775302 10646256 10630164 10643318 10614298 10595482
4442A0595482R5394M6181N2696R5856K83663L12939P3548O2111K58299K20190
$$ 10595482 10690876 10737057 10789753 10885609 11169272 11482211 11555759 11617870 11876169 12096359
4432A2096359J85655K73619K82437J61858L84157K95428L08758L86991L00078
$$ 12096359 12282014 12555633 12838070 12999928 13384085 13679513 13988271 14375262 14675340
4423A4675340M86033L36676M15285M24504M40122M98104L47040N02690M87811
$$ 14675340 15161373 15498049 15913334 16337838 16777960 17276064 17623104 18125794 18613605
4414A8613605N34485M09765M13505O68193O09709O99104P06631R82907Q64365
$$ 18613605 19148090 19557855 19971360 20639553 21249262 21948366 22654997 23637904 24502269
4405B4502269R86156J181355J246112J494046J723124J824525K018609K229736
$$ 24502269 25488425 26669780 27915892 29409938 31133062 32957587 34976196 37205932
4397C7205932K611974L228565L775939M300081N332480O337832P875196R253880
$$ 37205932 39817906 43046471 46822410 51122491 56454971 62792803 70667999 79921879
4389G9921879J1518413J3699043J5072822J4041591P676831l400645j2625668
$$ 79921879 91440292 105139335 120212157 134253748 141930579 138529934 125904266
4382A25904266j6196264j5545455j3292961j0910865q620052o863473n598211
$$ 125904266 109708002 94162547 80869586 69958721 61338669 54475196 48876985
4375D8876985m566747l825109l459725l133242k657213k327200k148648j805201
$$ 48876985 44310238 40485129 37025404 33892162 31234949 28907749 26759101 24953900
4367B4953900j660659j288008j095644j162866r76839p07738q00213p24142o10497
$$ 24953900 23293241 22005233 20909589 19746723 18769884 18062146 17261933 16537791 15927294
4358A5927294n25031o45105n32986n01448n12237m80252m67513m58635m94440
$$ 15927294 15402263 14757158 14224172 13722724 13210487 12730235 12262722 11804087 11309647
4349A1309647k94158l33201l35111k05308j16780l26045k11092j41095j74733
$$ 11309647 11015489 10682288 10347177 10141869 10025089 9699044 9487952 9346857 9172124
4340I172124j48451j09250q6694j63698k68467m8190l7590k09149j17782r6235
$$ 9172124 9023673 8914423 8827729 8664031 8395564 8347374 8309784 8100635 7982853 7886618
4330G886618K0654k49706j32425j59355k3563j3580j14919j37339j64306k2487
$$ 7886618 7907272 7657566 7525141 7365786 7342223 7328643 7213724 7076385 6912079 6889592
4320F889592j05479j59654J5212Q407o5167j09709M3018K2100m7803k225l4834
$$ 6889592 6784113 6624459 6639671 6648078 6582911 6473202 6516220 6538320 6490517 6488292 6453458
4309F453458j28363o635N4651N897m0880Q4458o5771n5463r1925P8489o6939q7612
$$ 6453458 6325095 6318460 6373111 6379008 6338128 6422586 6356815 6301352 6209427 6287916 6220977 6133365
4297F133365J0699L785P9642j3099P4571o2812K5137J06583k0216l8012O1834
$$ 6133365 6144064 6147849 6227491 6214392 6288963 6226151 6251288 6357871 6337655 6299643 6361477
4286F361477Q4496J00488J00663K8502p8840J02030j9843J8607N6832K6640j8658
$$ 6361477 6445973 6546461 6647124 6675626 6596786 6698816 6678973 6697580 6754412 6781052 6762394
4275F762394J4868O6436N9117m3339M0675J65127K9880j7070Q5033q1927J29542
$$ 6762394 6777262 6843698 6902815 6859476 6900151 7065278 7095158 7078088 7163121 7081194 7210736
4264G210736J31257m5880N1029K36252Q080r278K6774r3093L7581l978J94220
$$ 7210736 7341993 7296113 7347142 7583394 7591474 7582196 7608970 7515877 7553458 7549480 7743700
4253G743700J39007J07878J9681k661j51846p8925J9055R4215l4959Q3453Q4537
$$ 7743700 7882707 7990585 8010266 8007605 7855759 7776834 7795889 7890104 7855145 7938598 8023135
4242H023135N2709J35231K94344K55030J52703L84286N32651N40595M10572L81802
$$ 8023135 8075844 8211075 8505419 8760449 8913152 9297438 9830089 10370684 10781256 11163058
4232A1163058O59543P77903O63508P10943N28754M19668J37695j53343k65411
$$ 11163058 11822601 12600504 13264012 13974955 14503709 14923377 15061072 14907729 14642318
4223A4642318l94264o19976l57775l22789j86359k33037n52524m91000n43878
$$ 14642318 14248054 13628078 13270303 12947514 12761155 12528118 11975594 11484594 10940716
4214A0940716n39704m31268n65109o68243m51113k92096k67385k24883j72786
$$ 10940716 10401012 9969744 9404635 8736392 8285279 7993183 7725798 7500915 7328129
4205G328129k48375j48459j5010j79328n5110J8633p7909j61445j36855o538N4641
$$ 7328129 7079754 6931295 6916285 6736957 6681847 6700480 6622571 6461126 6324271 6317733 6372374
4194F372374r275j85115j02062m6994q0011o7359j06021j83503j53198q1620J9460
$$ 6372374 6363099 6177984 6075922 6028928 5948917 5881558 5775537 5592034 5438836 5357216 5376676
4183E376676p6020K8230l0486j07077r7758q0430o1051k3103Q7095r9857Q5465
$$ 5376676 5300656 5328886 5298400 5191323 5093565 5013135 4952084 4928981 5016076 4916219 5001684
4172E001684J21088m1440n6922k8669O5515l714k8218n3619O4482K8157P2149
$$ 5001684 5122772 5081332 5024410 4995741 5061256 5057542 5029324 4975705 5040187 5068344 5140493
4161E140493N4525j72328n6697l8853R9067j2260L7400P2553L9571K9401m1307
$$ 5140493 5195018 5022690 4965993 4927140 5026207 5013947 5051347 5123900 5163471 5192872 5151565
4150E151565P393M3419j07797m8881p6003J38581L6409n7906L8757K28873k241
$$ 5151565 5158958 5202377 5094580 5045699 4969696 5108277 5144686 5086780 5125537 5354410 5352169
4139E352169j82226k8632j11638J9302j31412r299M4842M4168P9724J52137R2009
$$ 5352169 5169943 5141311 5029673 5048975 4917563 4908264 4953106 4997274 5076998 5229135 5321144
4128E321144O2518P9472q4232r1411R076O5277J31982l275Q4784j10506o6716
$$ 5321144 5383662 5463134 5378902 5287491 5296567 5361844 5493826 5490551 5575335 5464829 5398113
4117E398113k7778K03504R9419j5876j17300P5940Q1907K22676J00680k4593J9924
$$ 5398113 5370335 5573839 5673258 5657382 5540082 5616022 5697929 5920605 6021285 5996692 6016616
4106F016616N0944L16487J16513R9452J52889Q4969J81759K13125K70699J12420
$$ 6016616 6067560 6384047 6500560 6600012 6752901 6837870 7019629 7232754 7503453 7615873
4096G615873M6914J66964N749J29867k1537O4709J23236J17260J53527K02281
$$ 7615873 7662787 7829751 7835500 7965367 7943830 8008539 8131775 8249035 8402562 8604843
4086H604843J84480J48870J37243M60978K38338K70013J31165J26844J41470L03830
$$ 8604843 8789323 8938193 9075436 9536414 9774752 10044765 10175930 10302774 10444244 10748074
4076A0748074L18892J85452J55993K37985K40889K87325L87375K40898J50074
$$ 10748074 11066966 11252418 11408411 11646396 11887285 12174610 12561985 12802883 12952957
4067A2952957L21679L97480M34105L15558K85441M05763N07648M81551L08912
$$ 12952957 13274636 13672116 14106221 14421779 14707220 15112983 15620631 16102182 16411094
4058A6411094N67497M43946O07774L05391L23179O11246M69527M10065N73468
$$ 16411094 16978591 17422537 18030311 18335702 18658881 19270127 19739654 20149719 20723187
4049B0723187O27222O09787N96928O78176O88476P50956P19440O82572P38089
$$ 20723187 21350409 21960196 22557124 23235300 23923776 24674732 25394172 26076744 26814833
4040B6814833Q63068Q73370Q68608J024441R85782J098236J184178J262294J133995
$$ 26814833 27677901 28551271 29419879 30444320 31430102 32528338 33712516 34974810 36108805
4031C6108805J146172J467468J481962J549443J543209J612125J834709J909815
$$ 36108805 37254977 38722445 40204407 41753850 43297059 44909184 46743893 48653708
4023D8653708K003008K027755K073020K171882K179057K218521K310987K407967
$$ 48653708 50656716 52684471 54757491 56929373 59108430 61326951 63637938 66045905
4015F6045905K475803K612303K527757K575169K668253K652626K545221K760735
$$ 66045905 68521708 71134011 73661768 76236937 78905190 81557816 84103037 86863772
4007H6863772K660881K469764K277328K224460K280526K163452J906004J746074
$$ 86863772 89524653 91994417 94271745 96496205 98776731 100940183 102846187 104592261
3999A04592261J578093J673984J534156J287530J189385R35015Q33541N84744
$$ 104592261 106170354 107844338 109378494 110666024 111855409 112790424 113623965 114208709
3991A14208709L14065q2813l09519p29836q03301r93461j129603j281380j399106
$$ 114208709 114522774 114439961 114130442 113400606 112597305 111603844 110474241 109192861 107793755
3982A07793755j383545j590613j757978j934726k199086k221171k440695k603731
$$ 107793755 106410210 104819597 103061619 101126893 98927807 96706636 94265941 91662210
3974I1662210k687478k665186k742558k867945k746780k799404k801534k682387
$$ 91662210 88974732 86309546 83566988 80699043 77952263 75152859 72351325 69668938
3966F9668938k624109k589857k470544k473353k572796k432416k270023k338006
$$ 69668938 67044829 64454972 61984428 59511075 56938279 54505863 52235840 49897834
3958D9897834k264857k199331k019788j814622j940167j802259j678411j559385
$$ 49897834 47632977 45433646 43413858 41599236 39659069 37856810 36178399 34619014
3950C4619014j408676j344219j420732j226462j083720j081179r88178q02999
$$ 34619014 33210338 31866119 30445387 29218925 28135205 27054026 26065848 25262849
3942B5262849r65239j029355q40032q94991o97498o50360p73121o05564n04120
$$ 25262849 24297610 23268255 22428223 21533232 20835734 20185374 19412253 18806689 18302569
3933A8302569m63715m70083m45942m71140m39441m42696m56895l95882k22311
$$ 18302569 17838854 17368771 16922829 16451689 16012248 15569552 15112657 14716775 14494464
3924A4494464l79250l79805k29093k60108k46942l02328k39354k46051k10009
$$ 14494464 14115214 13735409 13506316 13246208 12999266 12696938 12457584 12211533 12001524
3915A2001524k88719j55905o0549j94672j84660k52091l82073O7105r2344j74501
$$ 12001524 11712805 11556900 11496351 11301679 11117019 10864928 10482855 10549960 10457616 10283115
3905A0283115j22248k40062j09730k06660o9363k16260n6731m1683l8093j2441
$$ 10283115 10160867 9920805 9811075 9604415 9535052 9318792 9262061 9220378 9182285 9169844
3895I169844k89598n2800j13015J2578L2968j81595q4309J118k3306l7718n1079
$$ 9169844 8880246 8827446 8714431 8727009 8759977 8578382 8494073 8495191 8471885 8434167 8383088
3884H383088j8914p64l8581k6647q5802o9281j21682J1555J92181m3324j11749
$$ 8383088 8364174 8363410 8324829 8298182 8212380 8143099 8021417 8032972 8225153 8181829 8070080
3873H070080l0814k7399m8543R8245r5141O8678N3309p2959p6992K0026j1180
$$ 8070080 8039266 8011867 7963324 8061569 7966428 8035106 8088415 8015456 7938464 7958490 7947310
3862G947310L093J09921j41082q7285J23507k4968J04415j46716l7133J46811
$$ 7947310 7950403 8060324 7919242 7831957 7955464 7930496 8034911 7888195 7851062 7997873
3852G997873J04247K8368P4809J23692m2794J12378O7967M1253o841O6596K57162
$$ 7997873 8102120 8130488 8205297 8328989 8286195 8398573 8466540 8507793 8500952 8567548 8824710
3841H824710K25509J43965J36631K69864K51339J53444L77747K46529J61242M38760
$$ 8824710 9050219 9194184 9330815 9600679 9852018 10005462 10383209 10629738 10790980 11229740
3831A1229740M18726K76865M23105N52046L83510N95965N26196L33727M52769
$$ 11229740 11648466 11925331 12348436 12900482 13283992 13879957 14406153 14739880 15192649
3822A5192649K39672K30815L44710J16787N398J21587M7303L6387n3018L1277
$$ 15192649 15432321 15663136 16007846 16124633 16130031 16251618 16298921 16335308 16282290 16313567
3812A6313567o8215m9711K2324j35743k49334j49159l31098k63562m21460n59368
$$ 16313567 16245352 16195641 16217965 16082222 15832888 15683729 15352631 15089069 14667609 14108241
3802A4108241l09779k67622l41884l22640n07622k43435j69928l39172k14430
$$ 14108241 13798462 13530840 13188956 12866316 12358694 12115259 11945331 11606159 11391729
3793A1391729j50684k51881j77786k40057l4885p0842k23041k30253j30478q6851
$$ 11391729 11241045 10989164 10811378 10571321 10536436 10465594 10242553 10012300 9881822 9794971
3783I794971j75418m8302k59206n1946n9501j43107N6853J8764N329k61847j09553
$$ 9794971 9619553 9571251 9312045 9260099 9200598 9057491 9114344 9133108 9138437 8876590 8767037
3772H767037J4905M4967n1215m2444p3504j73108R2565J7930l710j97474p4449
$$ 8767037 8781942 8826909 8775694 8733250 8659746 8486638 8579203 8597133 8593423 8395949 8321500
3761H321500J71505k2148O7912K73o096O6488L7194J37792j8007j03075K3306
$$ 8321500 8493005 8470857 8538769 8539042 8532946 8599434 8636628 8774420 8756413 8653338 8676644
3750H676644J4828J12369R9897M1057P0610P729N0316K10293K62089p4574O4627
$$ 8676644 8691472 8803841 8903738 8944795 9015405 9023134 9073450 9283743 9545832 9471258 9535885
3739I535885R5628M8642M5286P3694K3511K9998L32765J48727R6424J50284J29947
$$ 9535885 9631513 9680155 9725441 9799135 9822646 9852644 10185409 10334136 10430560 10580844 10710791
3728A0710791J72327P1060k4412J93502J97613J29716J33541J04317K33844J49978
$$ 10710791 10883118 10954178 10929766 11123268 11320881 11450597 11584138 11688455 11922299 12072277
3718A2072277J43008K49593K87604O3126R9584K22507L02507J93807K13475K63050
$$ 12072277 12215285 12464878 12752482 12815608 12915192 13137699 13440206 13634013 13847488 14110538
3708A4110538K07855L92885L88305J80428K83397L93184L02991K74524L88935
$$ 14110538 14318393 14711278 15099583 15280011 15563408 15956592 16259583 16534107 16923042
3699A6923042L70224M15169K01980K46290L92701M31716M23252L87849M98578
$$ 16923042 17293266 17708435 17910415 18156705 18549406 18981122 19404374 19792223 20290801
3690B0290801O26472L21167M44605M69619M76227O14863M28555M54927M86399
$$ 20290801 20917273 21238440 21683045 22152664 22628891 23243754 23672309 24127236 24613635
3681B4613635M69753M16497M26626M98478M31003M92194N52080N36607M92021
$$ 24613635 25083388 25499885 25926511 26424989 26855992 27348186 27900266 28436873 28928894
3672B8928894M29328M89932N54275L12581N59678M50840N69302O69348M11031
$$ 28928894 29358222 29848154 30402429 30715010 31274688 31725528 32294830 32964178 33375209
3663C3375209M33743O07126P34130O71129P51511Q18004R83364J018065J022065
$$ 33375209 33808952 34416078 35150208 35821337 36572848 37390852 38374216 39392281 40414346
3654D0414346J223119J177102J322343J489503J578084J559864J540534J677853
$$ 40414346 41637465 42814567 44136910 45626413 47204497 48764361 50304895 51982748
3646E1982748J547771J736413J739502J626171J568140J402580J360638J379527
$$ 51982748 53530519 55266932 57006434 58632605 60200745 61603325 62963963 64343490
3638F4343490J319902J343025J255831J192487J157243J036236R18206Q49373
$$ 64343490 65663392 67006417 68262248 69454735 70611978 71648214 72566420 73415793
3630G3415793O46023N81789L51382R0433j48404k65709l10748l51661l46420l33384
$$ 73415793 74061816 74643605 74994987 75085420 74937016 74671307 74360559 74008898 73662478 73329094
3620G3329094m46470k45891k56125j82404l59254l66880j42248k05878j73253
$$ 73329094 72882624 72636733 72380608 72198204 71838950 71472070 71329822 71123944 70950691
3611G0950691j66710j37290J92141K44192M72008N30559Q32927J132082J289794
$$ 70950691 70783981 70646691 70838832 71083024 71555032 72085591 72918518 74050600 75340394
3602G5340394J229589J534600J730439K071612K352876K644597K997942L158411
$$ 75340394 76569983 78104583 79835022 81906634 84259510 86904107 89902049 93060460
3594I3060460L316913L416969L742374L816006L910601L913113L832645L973174
$$ 93060460 96377373 99794342 103536716 107352722 111263323 115176436 119009081 122982255
3586A22982255L659957L681188L531683L228689L231015L228526L333090L282049
$$ 122982255 126642212 130323400 133855083 137083772 140314787 143543313 146876403 150158452
3578A50158452L006774K749576K660009K205700J840744J411008Q32272N77197
$$ 150158452 153165226 155914802 158574811 160780511 162621255 164032263 164864535 165441732
3570A65441732K28456k49212m82391p18219p00382p95023o78638q48518q79451
$$ 165441732 165670188 165420976 164938585 164220366 163519984 162724961 162046323 161197805 160318354
3561A60318354q40267p56238p46440o08569m35550j36595k1094J60677O39262
$$ 160318354 159478087 158721849 157975409 157366840 156931290 156794695 156773601 156934278 157573540
3552A57573540O81651J183190J583943J959313K198782K572819K816119L010870
$$ 157573540 158255191 159438381 161022324 162981637 165180419 167753238 170569357 173580227
3544A73580227L385051L513549L738915L888780M131053M481513M656831M867156
$$ 173580227 176965278 180478827 184217742 188106522 192237575 196719088 201375919 206243075
3536B06243075N408965N780012O195259O455820O901699P403432P759143Q243947
$$ 206243075 211652040 217432052 223627311 230083131 236984830 244388262 252147405 260391352
3528B60391352Q832643R493702J0296060J0791762J1265320J1518071J1329837
$$ 260391352 269223995 278717697 289013757 299805519 311070839 322588910 333918747
3521C33918747J0417155R143725P391760N143480K906375P36412j271963k713909
$$ 333918747 344335902 353479627 360871387 366014867 368921242 369657654 368385691 365671782
3513C65671782l936632m398244m499926m642882m649363m686539n374995o200614
$$ 365671782 361735150 357336906 352836980 348194098 343544735 338858196 333483201 327282587
3505C27282587p450515r072796j0880982j2579985j4311448j5409655j6035978
$$ 327282587 319832072 310759276 299878294 287298309 272986861 257577206 241541228
3498B41541228j5900365j5267195j4442023j3265427j1979203j0496831r350165
$$ 241541228 225640863 210373668 195931645 182666218 170687015 160190184 150840019
3491A50840019q338863p315696o456889n714909n253206m707344m152354l708786
$$ 150840019 142501156 135185460 128728571 123013662 117760456 113053112 108900758 105191972
3483A05191972l347363l047343k720665k275375k082697j986498j766467j819674
$$ 105191972 101844609 98797266 96076601 93801226 91718529 89732031 87965564 86145890
3475H6145890j544732j579165j589364j789984j709645j734929j762978j833499
$$ 86145890 84601158 83021993 81432629 79642645 77933000 76198071 74435093 72601594
3467G2601594j963509j980302j918642j941405j856194j824039j825753j897335
$$ 72601594 70638085 68657783 66739141 64797736 62941542 61117503 59291750 57394415
3459E7394415j844777j726384j612431j733046j681276j727480j614448j764361
$$ 57394415 55549638 53823254 52210823 50477777 48796501 47069021 45454573 43690212
3451D3690212j639791j447230j600975j633923j319719j299942j229186j071578
$$ 43690212 42050421 40603191 39002216 37368293 36048574 34748632 33519446 32447868
3443C2447868j105948q80687q46808j033029r48587o81800o65470n40073p70916
$$ 32447868 31341920 30461233 29614425 28581396 27632809 26951009 26285539 25745466 24974550
3434B4974550n58319n28821n92902m35138m46230n43210m80208l73513m83330
$$ 24974550 24416231 23887410 23294508 22859370 22413140 21869930 21389722 21016209 20532879
3425B0532879n06228m90836l30316l57868l99873l32870k37910k03870l54361
$$ 20532879 20026651 19535815 19205499 18847631 18447758 18114888 17876978 17673108 17318747
3416A7318747l62925l28089l57974k80412k12689j87880j99834k00431k96648
$$ 17318747 16955822 16627733 16269759 15989347 15776658 15588778 15388944 15188513 14891865
3407A4891865j80857j02254k99873j92415l58234k25481k19769l12251j79981
$$ 14891865 14711008 14608754 14308881 14116466 13758232 13532751 13312982 13000731 12820750
3398A2820750n9548j01736j66783j65798k49891k47195l26402q2906j42237k09395
$$ 12820750 12761202 12659466 12492683 12326885 12076994 11829799 11503397 11420491 11278254 11068859
3388A1068859k29508r0435j57911j54754j79895q4537j1613k85955k54709o79
$$ 11068859 10839351 10748916 10591005 10436251 10256356 10171819 10160206 9874251 9619542 9618863
3378I618863o4191j08994l1535l3540k6340r2699j26804N9264j76101j63464J0796
$$ 9618863 9554672 9445678 9414143 9380603 9354263 9261564 9134760 9194024 9017923 8854459 8865255
3367H865255r5921N3251m0805j12514j02836o0114j01846n1030j8407N3053j16053
$$ 8865255 8769334 8822585 8781780 8669266 8566430 8506316 8404470 8353440 8335033 8388086 8272033
3356H272033k23814n4304P560q9267O1940q5105j36901L2349k9169p4577j70220
$$ 8272033 8048219 7993915 8001475 7912208 7974148 7889043 7752142 7784491 7755322 7680745 7510525
3345G510525j18199o9594j04623q6726r4795k19259m9025n3769j5792m9198j61106
$$ 7510525 7392326 7322732 7218109 7131383 7036588 6817329 6768304 6714535 6698743 6649545 6488439
3334F488439j78965M2434K5929j46495r3876j3728k5954p3483n2925l1656m2799
$$ 6488439 6309474 6351908 6377837 6231342 6137466 6123738 6097784 6024301 5971376 5939720 5896921
3323E896921l0368K8725j17106n2717j1597j41690j2506M6112m7683P9766j03770
$$ 5896921 5866553 5895278 5778172 5725455 5713858 5572168 5559662 5605774 5558091 5637857 5534087
3312E534087M4478O5322L0501j5923K7749l0617l1464q9919J99175O6680L0789
$$ 5534087 5578565 5643887 5674388 5658465 5686214 5655597 5624133 5534214 5733389 5800069 5830858
3301E830858l1886N1548q7923n721J57582j5090R1300K23907o4762o4232O3697
$$ 5830858 5798972 5850520 5762597 5756876 5914458 5899368 5990668 6214575 6149813 6085581 6149278
3290F149278j845J81232n3960o6718m4824J18764q070j12876Q9152J22073l6662
$$ 6149278 6147433 6328665 6274705 6207987 6163163 6281927 6273857 6160981 6250133 6372206 6335544
3279F335544R7576M9750n430P1535J72329r7403q5838N0263J04466Q5548m8145
$$ 6335544 6433120 6482870 6477440 6548975 6721304 6623901 6538063 6588326 6692792 6778340 6730195
3268F730195M0841K2988N5221R4494K5021J33967K2698J49024M6701J60758J32877
$$ 6730195 6771036 6794024 6849245 6943739 6968760 7102727 7125425 7274449 7321150 7481908 7614785
3257G614785L7488O4706J16070K48426k4303J59269J78397K17058L10788K82863
$$ 7614785 7652273 7716979 7833049 8081475 8057172 8216441 8394838 8611896 8922684 9205547
3247I205547J17503J16959J87168K21178J11452K78507K97767K38218M03273K33991
$$ 9205547 9323050 9440009 9627177 9848355 9959807 10238314 10536081 10774299 11177572 11411563
3237A1411563M75001M78960M37987O29899O27683N98748P98971O65619O05218
$$ 11411563 11886564 12365524 12803511 13433410 14061093 14659841 15458812 16124431 16729649
3228A6729649M90780J69537J51437j65132n18137p16889p89023q34191q73541
$$ 16729649 17220429 17389966 17541403 17376271 16858134 16141245 15352222 14518031 13644490
3219A3644490o91372o69469o35609m55430m42758m00840l98340l50154l69723
$$ 13644490 12953118 12283649 11648040 11192610 10749852 10349012 9950672 9600518 9230795
3210I230795k40876j82550j98550l23539j67176p3955j43854j5982j07243j51624
$$ 9230795 8989919 8807369 8608819 8285280 8118104 8044149 7900295 7884313 7777070 7625446
3200G625446j05914R2133J04571J66674k35247l95792l56489k05122r9462k57526
$$ 7625446 7519532 7611665 7716236 7882910 7647663 7251871 6895382 6690260 6590798 6333272
3190F333272k87012j27632j41549j91421o9783O7902r7283j71445m186j27893
$$ 6333272 6046260 5918628 5777079 5585658 5515875 5583777 5486494 5315049 5310863 5182970
3180E182970o8750j01202N9207P4359n2554P102L4649o0070O8103Q331q4999O9602
$$ 5182970 5114220 5013018 5072225 5146584 5094030 5101132 5135781 5075711 5143814 5152145 5067146 5136748
3168E136748k7412J22027J32990j21991r6866j66294j81133j59983j33514P2790
$$ 5136748 5109336 5231363 5364353 5242362 5145496 4979202 4798069 4638086 4504572 4577362
3158D577362M7220j77414k15662j11102n1169l0633j25295l7380P588j13470j19999
$$ 4577362 4624582 4447168 4231506 4120404 4069235 4038602 3913307 3875927 3883515 3770045 3650046
3147C650046j06291j19193k3571p9375N8635m2759r0692l9233j10477Q3851l839
$$ 3650046 3543755 3424562 3400991 3321616 3380251 3337492 3246800 3207567 3097090 3180941 3177102
3136C177102j60841j47716l7396K8473J2855r9275K1865r6777j73684l94K00025
$$ 3177102 3016261 2868545 2831149 2859622 2872477 2773202 2795067 2698290 2524606 2524212 2724237
3125B724237m2359j14232J2835J60993o4543m681L018r0991r4597j08818J34143
$$ 2724237 2681878 2567646 2580481 2741474 2676931 2672250 2675268 2584277 2489680 2380862 2515005
3114B515005p1091j94274Q098M8313J26124Q5904r3808J7409r3186j6922j186
$$ 2515005 2443914 2249640 2257738 2306051 2432175 2518079 2424271 2441680 2348494 2331572 2330386
3103B330386L8045Q7690J8742j02908m0826J33682m694l7339j6084j06370J66359
$$ 2330386 2368431 2456121 2474863 2371955 2331129 2464811 2460117 2422778 2406694 2300324 2466683
3092B466683M3058K9393l9760r6333K3017O0093M4742p1306q6958m1367R6106
$$ 2466683 2509741 2539134 2499374 2403041 2426058 2486151 2530893 2459587 2372629 2331262 2427368
3081B427368j16180q2999p6713o4334Q4562m4494P9565J7701J29250r0353j62711
$$ 2427368 2311188 2228189 2151476 2087142 2171704 2127210 2206775 2224476 2353726 2263373 2100662
3070B100662K4441j2412j16802J5300K5330M1311O809o2322o0618M7105L6218
$$ 2100662 2125103 2112691 1995889 2011189 2036519 2077830 2084639 2022317 1961699 2008804 2045022
3059B045022q7888J48906j89966j03644r528J13068J9869r4940J3687q4676j8033
$$ 2045022 1957134 2106040 1916074 1812430 1802902 1915970 1935839 1840899 1854586 1769910 1751877
3048A751877L7725l1262j06701J03354J8973m0402j247r1281j29910J38904L5100
$$ 1751877 1789602 1758340 1651639 1754993 1773966 1733564 1732317 1641036 1511126 1650030 1685130
3037A685130l1076N7137m6330l1142j32435Q1814q8106L6270N460r4215J0956
$$ 1685130 1654054 1711191 1664861 1633719 1501284 1583098 1494992 1531262 1536722 1442507 1453463
3026A453463N4743j3916n3165j8042M3399Q7684P409r2739Q3528L3560j36946
$$ 1453463 1508206 1494290 1441125 1423083 1466482 1554166 1561575 1468836 1552364 1585924 1448978
3015A448978o8292j6036l5151Q7793r2886K6597k2861k9922l6210P505R4361R1391
$$ 1448978 1380686 1364650 1329499 1417292 1324406 1351003 1328142 1298220 1262010 1269515 1363876 1455267
3003A455267q309n6069Q5410p5988o881Q8569q380J986R864o9350L2219N6269
$$ 1455267 1446958 1390889 1476299 1400311 1393430 1481999 1473619 1475605 1485469 1416119 1448338 1504607
2991A504607o682l0436N5164j8698q169j11507Q9913J45448m5007m9711Q130J0614
$$ 1504607 1497925 1467489 1522653 1503955 1495786 1384279 1474192 1619640 1574633 1524922 1533052 1543666
2979A543666P1655N4534q6343J09603Q0446j75566j6850J16070n5679j00433p1614
$$ 1543666 1615321 1669855 1583512 1693115 1773561 1597995 1581145 1697215 1641536 1541103 1469489
2968A469489m984p1346M8296Q7696j10514R0470Q2766n700Q1799k448J8338L0724
$$ 1469489 1464505 1393159 1441455 1529151 1418637 1509107 1591873 1586173 1667972 1665524 1683862 1714586
2956A714586L1894M8887M8657J07041L2879Q8089M0331J0865O6779L5489R3041
$$ 1714586 1746480 1795367 1844024 1951065 1983944 2072033 2112364 2123229 2190008 2225497 2318538
2945B318538p7114k38537J55190L6929j46828j98987J0331J64181l5870j9022
$$ 2318538 2241424 2002887 2158077 2195006 2048178 1849191 1859522 2023703 1987833 1968811
2935A968811J6696J04453j0338j290K6512M3124K1929o3942J04251N4991P0267
$$ 1968811 1985507 2089960 2079622 2078332 2104844 2147968 2169897 2105955 2210206 2265197 2335464
2924B335464k4090K3431l068J28681K9406J13468q1132j6977j2255n2182Q1626
$$ 2335464 2311374 2334805 2331737 2460418 2489824 2603292 2522160 2505183 2492928 2440746 2522372
2913B522372J28828L6456q1957J00452P2637N7288m5434O0262J03326K3033J22812
$$ 2522372 2651200 2687656 2605699 2706151 2778788 2836076 2790642 2850904 2954230 2977263 3100075
2902C100075n8520p6714O3900K00048M219k1233j17037P5991O7654j18883N8550
$$ 3100075 3041555 2964841 3028741 3228789 3233008 3211775 3094738 3170729 3238383 3119500 3178050
2891C178050K01656J70146Q0678K0959O8683J86140q1041n1395O8371j10351j40884
$$ 3178050 3379706 3549852 3630530 3651489 3720172 3906312 3825271 3773876 3842247 3731896 3591012
2880C591012j55652q4078R4546p1549M8831J05702M5896r1097R4883R1454J11417
$$ 3591012 3435360 3351282 3445828 3374279 3423110 3528812 3574708 3483611 3578494 3669948 3781365
2869C781365K54617J32784R804K20333J76203L84621K08730J50747J54429L16859
$$ 3781365 4035982 4168766 4178570 4398903 4575106 4959727 5168457 5319204 5473633 5790492
2859E790492M20856L21796J40044j9856l58061l85127l14268l33427l32017k29252
$$ 5790492 6211348 6533144 6673188 6653332 6295271 5910144 5595876 5262449 4930432 4701180
2849D701180k60128k05227j10718j28027j27190p7840j23109j78169n6928n331
$$ 4701180 4441052 4235825 4125107 3997080 3869890 3792050 3668941 3490772 3433844 3428513
2839C428513j03960J08976j17607j21593l4903j25444j42459q7753j660q1076
$$ 3428513 3324553 3433529 3315922 3194329 3159426 3033982 2891523 2803770 2802110 2721034
2829B721034l0984j31136j89099n888j69110j62357J29389l1908q1535r9994N7225
$$ 2721034 2690050 2558914 2369815 2363927 2194817 2032460 2161849 2129941 2048406 1948412 2005637
2818B005637q0309j35677j86813j17712J22501Q5781n426J8590j97710m4124j2988
$$ 2005637 1925328 1789651 1602838 1485126 1607627 1693408 1687982 1706572 1508862 1464738 1451750
2807A451750Q2866L8366j00596j19979Q6534j7288j36266J5230l9594K2553j9291
$$ 1451750 1534616 1572982 1472386 1352407 1438941 1421653 1285387 1300617 1261023 1283576 1264285
2796A264285m661n3217K9393P3185j62960J2694q0356N1995M6834n8838J278j10857
$$ 1264285 1259624 1206407 1235800 1308985 1146025 1158719 1078363 1130358 1177192 1118354 1119632 1008775
2784A008775o9405N6323N0168k79721K2953J40237j2477n0238L5377M4000n1737
$$ 1008775 939370 995693 1045861 766140 789093 929330 916853 866615 901992 945992 894255
2773H94255l6083m6459J3714m9388k313J12414p0265p8449n6453l8716R828R8264
$$ 894255 858172 811713 825427 776039 773726 886140 815875 737426 680973 642257 652085 750349
2761G50349O7932o3744r261L2282r8467q2779J85204o7061n4690Q007r3631K702
$$ 750349 818281 754537 745276 777558 679091 596312 781516 714455 659765 667772 574141 576843
2749E76843k3529j6560P9615j7158l5997L4869k9076j7659J49911Q4385j26207
$$ 576843 553314 536754 616369 599211 563214 598083 569007 551348 701259 785644 659437
2738F59437l5057n1216l5881Q7087p7377j13559J37212k7620n1273J8716o1951
$$ 659437 624380 573164 537283 624370 546993 433434 570646 543026 491753 510469 448518
2727D48518J73546l7446k8924j19061N9446O948J0755P750r8224K8750P01O6950
$$ 448518 622064 584618 555694 436633 496079 503027 513782 521532 423308 452058 452759 519709
2715E19709k9077N1988q0248q0481j9583O3749o8777o0118J04373J7874M4807
$$ 519709 490632 542620 462372 381891 362308 426057 357280 297162 401535 419409 464216
2704D64216q4546J3958L9280O5461M8845k7899j60686N1334J51314j18722j38766
$$ 464216 379670 393628 432908 498369 547214 519315 358629 409963 561277 442555 303789
2693C03789O037j8872J19182J3418J640O8907n176j63473j4416J63787j3895j16360
$$ 303789 309826 290954 410136 423554 425194 494101 488925 325452 311036 474823 460928 344568
2681C44568r3366M3062j419J15790j0705m1213k090P2787n354l0063J8857l4180
$$ 344568 251202 294264 292845 408635 397930 356717 354627 427414 422060 391997 410854 376674
2669C76674j32661j8599J39333o5598q6616P8579N5992L1547L8481j10466O4180
$$ 376674 244013 225414 364747 299149 212533 291112 347104 378651 417132 306666 370846
2658C70846J6241j19846O4074p9795J9149Q9011m374J6220q1474j49571J32504
$$ 370846 387087 267241 331315 251520 270669 359680 355306 371526 290052 140481 272985
2647B72985k5112K1729N6834J2473o4403r1259K361K01040k509m4684M9808o2001
$$ 272985 247873 269602 326436 338909 274506 183247 185608 386648 384139 339455 389263 327262
2635C27262J7027N6967r3568n7951K2411q768M7766J8265J20057J1655j31648
$$ 327262 344289 401256 307688 249737 272148 263380 311146 329411 449468 461123 329475
2624C29475N6791Q9705o5844J1156k2586j32923K1014Q8230J23007m3111j66235
$$ 329475 386266 475971 410127 421283 398697 265774 286788 375018 498025 454914 288679
2613B88679j7520o7397o7714J33879L2059j5685j8787J36895M875N8619J21003
$$ 288679 271159 203762 136048 269927 301986 286301 267514 404409 409284 467903 588906
2602E88906j7505j21744p2129J2324R7989j4269r4936J07964l77j14466O3823
$$ 588906 571401 449657 377528 389852 487841 473572 378636 486600 486223 371757 435580
2591D35580L8561p4896O8998l8045N842n1448J53696n9124k3482m0543M1295N6010
$$ 435580 474141 399245 468243 430198 436040 384592 538288 479164 455682 415139 456434 512444
2579E12444j1780q783o5472J4699k7346N050N4466o6782k9089M7247M2142J42392
$$ 512444 500664 491881 426409 441108 413762 418812 473278 406496 377407 424654 466796 609188
2567F09188q5252l8980Q478L5441n7199k363R3119l3203j15799o9787N3248N55
$$ 609188 523936 484956 493434 528875 471676 469313 562432 529229 413430 343643 396891 397446
2555C97446L1605M7001P136r7157m5517n89n3956Q8554M7119O1944L0365j52796
$$ 397446 429051 476052 483188 386031 340514 339925 285969 374523 421642 483586 513951 361155
2543C61155K5232j04222J30466K8346p461k1107m4645K0856L9305J0097j3167
$$ 361155 386387 282165 412631 440977 433516 412409 367764 388620 427925 438022 424855
2532D24855P4003m9062j02910N3098n7812j6126n4615k4791M3284k5627L6424
$$ 424855 498858 449796 346886 399984 342172 326046 271431 246640 289924 264297 300721
2521C00721q9236R6799j1335j03109J8308O3963p3296J6521Q1296J8892M3078
$$ 300721 211485 308284 296949 193840 212148 276111 202815 219336 300632 319524 362602
2510C62602q3697j9444M4815j67190K8891R2681J9624o2122j5634R2612J0953
$$ 362602 278905 259461 304276 137086 165977 258658 278282 216160 200526 293138 304091
2499C04091O8487p7106r2091J41079p9454N8564L6304k14k0053p607n785o5323
$$ 304091 372578 295472 203381 344460 265006 323570 359874 359660 339607 332000 326215 260892
2487B60892j7195L3556m7725q898J34625J1612r0318p0784P7452q4598P78M4869
$$ 260892 243697 277253 229528 220630 355255 366867 276549 205765 283217 198619 199397 244266
2475B44266n5124j4275R8442j42593r351O9184j9923J14111m6674l6019P7675
$$ 244266 189142 174867 273309 130716 121365 190549 170626 284737 238063 202044 279719
2464B79719j19106Q377P9088J5631m3719r6304j78254M3208K10367O6594k4732
$$ 279719 160613 168990 248078 263709 219990 123686 -54568 -11360 199007 265601 240869
2453B40869k1472j71649k3344L9447j60159K2912J19074K8029K4199L4782L3881
$$ 240869 219397 47748 24404 63851 -96308 -73396 45678 73707 97906 132688 166569
2442A66569o0353p4739Q107J11797k6662M8794J1266O571L1942n1517P211n2955
$$ 166569 106216 31477 39584 151381 124719 173513 184779 191350 223292 171775 178986 126031
2430A26031N5516m5427K8525L8465L0878l8322j85583j0007O9284o4536J70337
$$ 126031 181547 136120 164645 203110 233988 195666 10083 76 69360 4824 175161
2419A75161N9008N1316k373J0887j47560q0300K1119L377r2552J36664m9909K5262
$$ 175161 234169 285485 283112 293999 146439 66139 87258 90635 -1917 134747 84838 110100
2407A10100N1976r5029J10209l112k4895m3177J13919M682q7755N3227J9040m7119
$$ 110100 162076 67047 177256 174144 149249 106072 219991 224673 136918 190145 209185 162066
2395A62066J9586j23249M1608J23232j6723J3015q3607o0318l5766O1648J18080
$$ 162066 181652 58403 100011 223243 206520 219535 135928 75610 39844 101492 219572
2384B19572K001n7048k2743m9822J9817m843l8715m3671N3344N4236k8401L5033
$$ 219572 221573 164525 141782 91960 111777 106934 68219 24548 77892 132128 103727 138760
2372A38760N5181N9043o6114O853o8802l6621N526M1272n0983P1840l0718p2733
$$ 138760 193941 252984 186870 193723 124921 88300 93826 135098 84115 155955 125237 52504
2360E2504L0699q7757J22677L2698J0665J6248J0199J6300O9871o5071p5612k5326
$$ 52504 83203 -4554 118123 150821 161486 177734 187933 204233 274104 209033 133421 108095
2348A08095M3482Q6504j5542n5592M1025O3043n1395K2484p1294j50136M9395
$$ 108095 151577 238081 222539 166947 207972 271015 219620 242104 170810 20674 70069
2337G0069K2290K7349J0877l5587O2926j664m5473l3630J14650p335l1366n632
$$ 70069 92359 119708 130585 94998 157924 156260 110787 77157 191807 184472 153106 147474
2325A47474N7638j2458o8824r0130K9708p2874J16967K1583j08258M4758l4477
$$ 147474 205112 192654 123830 33700 63408 -9466 107501 129084 20826 65584 31107
2314C1107R623Q1636L6341J01590k842m6146r3470j11018N9373K5287o9689J95254
$$ 31107 40730 122366 158707 260297 257455 211309 117839 6821 66194 91481 21792 217046
2302B17046M9263j00243L1620j9616m1028l7080M119o821j8690J5826J1832j1068
$$ 217046 266309 166066 197686 178070 137042 99962 104081 97260 78570 94396 106228 95160
2290I5160Q9146j11333L8668J1401q31P1617n6315R655j21243l3030J07104N2813
$$ 95160 184306 72973 111641 123042 122211 193828 137513 147168 25925 -7105 99999 152812
2278A52812N9612o6392m0062O4186n7280L705M9608l2990n366R4894k7805m7454
$$ 152812 212424 146032 105970 170156 112876 116581 166189 133199 127833 222727 194922 147468
2266A47468k7682J2742j44l9371L109j9019K3686M8770L8794m581j286o6708J26964
$$ 147468 119786 132528 132384 93013 96122 77103 100789 149559 188353 183772 182486 115778 242742
2253B42742M3825j33490r1705J9792J1556P2590j5710o1689q4078M0282K5783
$$ 242742 286567 153077 61372 81164 92720 165310 149600 87911 3833 44115 69898
2242F9898k5705L6523N3530O7484Q650K4395j41503L8830O2292n6349p2608J0977
$$ 69898 44193 80716 134246 201730 210380 234775 93272 132102 194394 138045 65437 76414
2230G6414J01800O2775j744j25293r6407p5203K3696P1395J26294j837j5347J0972
$$ 76414 178214 240989 239245 113952 17545 -57658 -33962 37433 163727 161890 146543 157515
2218A57515J24409J04370r4117n4958l9102J09205k012n8677P2220j13843p196
$$ 157515 281924 386294 292177 237219 198117 307322 305310 246633 318853 205010 197814
2207A97814R2803P2640J8636k13907j854K9464j4305J04008l0655K4253K1402
$$ 197814 290617 363257 381893 167986 166132 195596 181291 285299 254644 278897 300299
2196C00299r8035n7693p9188j4119N870J54342r648o7910J65797J24198j21426
$$ 300299 202264 144571 65383 51264 57134 211476 201828 133918 299715 423913 302487
2185C02487n5843k265k9944J27524J00216j81127J7142j0103j12877J62399O1851
$$ 302487 246644 244379 214435 341959 442175 261048 278190 268087 155210 317609 379460
2174C79460O5977l3074J8308Q080k9274O2551O4780J7557K5766k21066O7942J61178
$$ 379460 445437 412363 430671 438751 409477 472028 536808 554365 580131 359065 427007 588185
2162E88185L041J1457J7417n1963j9460j01276Q4322P4675r9607J07252l4748
$$ 588185 591226 602683 620100 568137 548677 447401 531723 606398 506791 614043 579295
2151E79295J32305J64864j02245m6209M4177j29456R5486J9126N255P404M7R609
$$ 579295 711600 876464 774219 728010 772187 642731 738217 757343 762598 770002 770049 779658
2139G79658j41276P8100O8722J01067K6154R6485J1756P8395L7002R3175L8506
$$ 779658 638382 716482 785204 886271 912425 1008910 1020666 1099061 1136063 1229238 1267744
2128A267744J9076l4324O388J90506R1951O485m1702J05974J23306J01127r2574
$$ 1267744 1286820 1252496 1258884 1449390 1541341 1547826 1506124 1612098 1735404 1836531 1743957
2117A743957o8052P9032K88385k2662O7433J05165L156K66663N8670J2914K48994
$$ 1743957 1675905 1754937 2043322 2020660 2088093 2193258 2196414 2463077 2521747 2534661 2783655
2106B783655L80610K54829J14628L06804L78066J12494M1276J37705L38653M13036
$$ 2783655 3164265 3419094 3533722 3840526 4218592 4331086 4372362 4510067 4848720 5261756
2096E261756N27046P35916R62311J119910J515129K053598K819165L869796N726378
$$ 5261756 5788802 6524718 7487029 8606939 10122068 12175666 14994831 18864627 24591005
2087B4591005M695027k781912o396758m878599l133147k258729j698776j107681
$$ 24591005 29286032 26504120 20107362 15228763 12095616 9836887 8138111 7030430
2079G030430q32271p32984m26453n13588m68050k33818k76842j80336k40429k19928
$$ 7030430 6198159 5465175 5038722 4525134 4057084 3823266 3546424 3366088 3125659 2905731
2069B905731l09023j67492j43046k22017j01377M9202j83278j72506j09946j36551
$$ 2905731 2596708 2429216 2286170 2064153 1962776 2011978 1828700 1656194 1546248 1409697
2059A409697q0857K3833k7535o2113n5618q8371l3401o4410k731J04306r9484
$$ 1409697 1328840 1352673 1325138 1263025 1207407 1119036 1085635 1021225 1018494 1122800 1023316
2048A023316m3171m3682M8496k72778Q8558J17141k19621J2920p9531J6783l1982
$$ 1023316 980145 936463 984959 712181 800739 917880 698259 711179 631648 648431 616449
2037F16449o7335Q725n441p7509n7591J25695J6328K3445q7643o0811m7020q1651
$$ 616449 549114 557839 552398 474889 417298 542993 559321 582766 495123 434312 387292 305641
2025C05641O0330N3987O5053p520j25227n8266l4683J5572J8579K6269J73802
$$ 305641 365971 419958 485011 477491 352264 293998 259315 274887 293466 319735 493537
2014D93537j9223r1320O699j26204J1011n576n5414K6557Q9379J7631j38908J7327
$$ 493537 474314 382994 389693 263489 274500 268924 213510 240067 329446 347077 208169 225496
2002B25496L4934j24097J07102J5328r411j3975L3119m1658q2663R7845m064J6952
$$ 225496 260430 136333 243435 258763 249352 235377 268496 226838 144175 242020 237956 254908
1990B54908m1557L8021J00461l9788L366J4527k3503j06813J0576J16521L3966
$$ 254908 213351 251372 351833 312045 315411 329938 306435 199622 210198 326719 360685
1979C60685k6259j45197j8109q1275L9032J1635J48565p2872m4730j5669K8590
$$ 360685 334426 189229 171120 89845 128877 140512 289077 216205 171475 155806 184396
1968A84396P0734Q1964J2240n0508r6982m1004j7489O3550M0200p7920P825O7792
$$ 184396 255130 337094 349334 298826 201844 160840 143351 206901 247101 169181 177006 244798
1956B44798j9835l7706m924o9982P0035j62997j06787P5415Q5552K6593l0053
$$ 244798 224963 187257 182333 112351 182386 19389 -87398 -11983 73569 100162 70109
1945G0109N7989p2448J9551M1711P5965K0078j31196N9365L030k7058q9461K4102
$$ 70109 128098 55650 75201 116912 192877 212955 81759 141124 144154 117096 27635 51737
1933E1737P135N1963P9171m1129k3225l4776N6397J6415q097J3676j12737q2364
$$ 51737 58872 110835 190006 148877 125652 90876 147273 163688 155591 169267 56530 -25834
1921b5834Q104Q0843K1032k6011k3134k9780J15160J4726p8660R5997J1259p3979
$$ -25834 -17730 63113 84145 58134 35000 5220 120380 135106 56446 152443 163702 89723
1909H9723K1456P1753k2150M2380J9074j05899q2441L996k8524j5750m0803j2953
$$ 89723 111179 182932 160782 203162 222236 116337 33896 37892 9368 -6382 -47185 -60138
1897f0138N5302L0741j06281J03362R9375p9268m3380P236o5534R4388K7063l6643
$$ -60138 -4836 25905 -80376 22986 122361 43093 -287 6949 -58585 35803 62866 26223
1885B6223O8597J0389k7587p0069L9225P344O3443k9666p4934o4785J18472m523
$$ 26223 94820 105209 77622 7553 46778 54122 117565 87899 12965 -51820 66652 62129
1873F2129r2952J23920J0507L0248l7555l6438l1893P2506j00442j28268O1825
$$ 62129 -30823 93097 103604 133852 96297 59859 27966 100472 30 -128238 -66413
1862f6413M4019R9576r3186N8288J30610M1663L934j59463P887j54331J1713K4506
$$ -66413 -22394 77182 -16004 42284 172894 214557 218491 59028 66915 -87416 -75703 -51197
1850e1197N0462J74401j6318j06912q0252J6281P452j8609n2863M7824O4283K5055
$$ -51197 -735 173666 157348 50436 -29816 -13535 -6083 -24692 -77555 -29731 34552 59607
1838E9607N148L7818j18157m0076J7603N2454J9993k5037j50859O2571J3531k9222
$$ 59607 64755 102573 -15584 -55660 -38057 14397 34390 9353 -141506 -78935 -65404 -94626
1826i4626R1340p852r3977Q6626J31345q363n9813l7895J413J23680N9049j235
$$ -94626 -3286 -11138 -105115 -18489 112856 104493 44680 6785 8198 131878 190927 189692
1814A89692p0273k0240M7961j84522p6899J74170M0889p1721q6699j6663K6418
$$ 189692 119419 99179 147140 -37382 -114281 59889 100778 29057 -57642 -74305 -47887
1803d7887P2057k1587j2406l6961Q6690o602l2301K0575O8864n1306j06000Q7744
$$ -47887 24170 2583 -9823 -46784 39906 33304 1003 21578 90442 39136 -66864 20880
1791B0880N6484M9345r0166o2242j17065L9347Q0138q0692L2015J29989k358L618
$$ 20880 77364 126709 36543 -25699 -142764 -103417 -23279 -103971 -71956 58033 55675 59293
1779E9293j5773j9705p126n558k4137M8682n878n7573q2206J38960J0382m7406
$$ 59293 43520 23815 16689 11131 -13006 35676 29798 -27775 -109981 28979 39361 -8045
1767h045J19578o8303L9410O384M2472L7348p261o270o5640J0642p5656p5309
$$ -8045 111533 43230 82640 89024 131496 168844 161583 155313 89673 100315 24659 -50650
1755e0650M2565K4220m4195Q8121o0282M2762k2339J4356J10003K4950o1563q2428
$$ -50650 -8085 16135 -28060 60061 -221 42541 20202 34558 144561 169511 107948 25520
1743B5520k9350r280k0741J03285p897r4740J39097r5999O4631J2117p1133m1917
$$ 25520 -3830 -13110 -33851 69434 61537 -33203 105894 9895 74526 86643 15510 -26407
1731b6407K40569j08566o9805k2435r5948o6107r2397J85222J2108L7512J16354
$$ -26407 214162 105596 35791 13356 -82592 -148699 -241096 -55874 -43766 -6254 110100
1720A10100j2618j5005j8618l3816J0104p4161o91J7657P7918m8142M3694r4999
$$ 110100 97482 82477 63859 30043 40147 -34014 -34705 -17048 60870 12728 56422 -38577
1708c8577N829k9222k8240J35794J17901L63n5362j05835n419l1869J48864R6937
$$ -38577 -32748 -61970 -90210 45584 163485 163848 108486 2651 -2768 -34637 114227 211164
1696B11164j72174p2766k9984N1443P9510N8300m6631j33278N6431K9640O932
$$ 211164 38990 -33776 -63760 -12317 67193 125493 78862 -54416 2015 31655 38587
1685C8587q6640j9302J5866M9035N0270o4744k8919O4453L0104m8612k7634J27464
$$ 38587 -48053 -67355 -51489 -2454 47816 -16928 -45847 18606 48710 98 -27536 99928
1673I9928k0130j32389l4288L0285J11386n1389o647Q183k2757K1867M5833n1140
$$ 99928 79798 -52591 -86879 -56594 54792 3403 -3244 4939 -17818 4049 49882 -1258
1661a258R334K3140O1092M7623j26004K6354n2425j58671J04956J29098k0099
$$ -1258 8076 31216 92308 139931 13927 40281 -12144 -170815 -65859 63239 43140
1650D3140l2570M0045M2951P7485P595j23375j17934J01864O79k2041o3845J4412
$$ 43140 10570 50615 93566 171051 178646 55271 -62663 39201 39880 17839 -46006 -31594
1638c1594P3050R0121k4297J15398P6511j88806q1546j10338r7186m469J08850
$$ -31594 41456 131577 107280 222678 299189 110383 28837 -81501 -178687 -183156 -74306
1627g4306M4637Q4630p6203j0459K3844n9915O2960n6025J25132J17291p4203
$$ -74306 -29669 54961 -21242 -31701 -7857 -67772 -4812 -60837 64295 181586 107383
1616A07383j49757J92725M0729j30096k6163K4224o0300J6217j92945J06395J9860
$$ 107383 -42374 150351 191080 60984 34821 59045 -1255 14962 -177983 -71588 -51728
1605e1728l4379J22566M8883m1987r3362L8681r5287P6587L0178Q1666J0273J03577
$$ -51728 -86107 36459 85342 43355 -50007 -11326 -106613 -30026 152 81818 92091 195668
1593A95668n9063o4085j7633j07993N6802q3546K5969M9845l1309j3761K3394
$$ 195668 136605 72520 54887 -53106 3696 -79850 -53881 -4036 -35345 -49106 -25712
1582b5712k322J05849j4332R8949p5872j38066m5845P1465q2566J2483J41179
$$ -25712 -28034 77815 63483 162432 86560 -51506 -97351 -25886 -108452 -95969 45210
1571D5210l4991l4409J00092n2289o2934J0744K0485k6793o8712J67320M3531
$$ 45210 10219 -24190 75902 23613 -39321 -28577 -8092 -34885 -103597 63723 107254
1560A07254j17922J7909N684O384M2088j29927O893O8482O763N5250j06198j45317
$$ 107254 -10668 7241 12925 19309 61397 -68530 -61637 6845 13608 68858 -37340 -182657
1548a82657K40570n7675M9721l8896L2716L967J12337j18060j8249O333k0402
$$ -182657 57913 238 49959 11063 43779 47746 160083 42023 23774 30107 9705
1537I705m9581K878M5765Q3958m0482r652j10084j5141O7565M963k8181j30005
$$ 9705 -39876 -36998 8767 92725 52243 42591 -67493 -82634 -15069 -10106 -38287 -168292
1525a68292R7325R8868j84959J01200L0953j34711Q1517P859K078N6895N9723
$$ -168292 -70967 27901 -157058 -55858 -24905 -159616 -78099 -70240 -68162 -11267 48456
1514D8456p1247M6600j81j21558Q8495K934o3833J508n4821P1693o825l2296k295
$$ 48456 -22791 23809 23628 -97930 -9435 -6501 -70334 -68826 -123647 -51954 -58779 -91075 -93370
1501i3370k6657L216J63297R6769j11483o4333J69532J1734j16673k1372l3383
$$ -93370 -120027 -116811 46486 143255 31772 -32561 136971 148705 32032 10660 -22723
1490b2723j5150m3925J07800K7599M2358M6162m5634l5926p8770k9659m0814J5024
$$ -22723 -37873 -81798 26002 53601 95959 142121 96487 60561 -18209 -47868 -88682 -73658
1478g3658L1711O074K1889L3772J7689j13636p2561J6719n5145K41205m1411L7032
$$ -73658 -41947 -35873 -13984 19788 37477 -76159 -148720 -132001 -187146 54059 12648 49680
1466D9680j3373m0338n2206K482J29636Q0340j38163n1599P4728J02145l1512
$$ 49680 36307 -4031 -56237 -53755 75881 156221 18058 -33541 41187 143332 111820
1455A11820K0340m2165j19821O7703K6189m7215N8944K6166j984L6259j15385
$$ 111820 132160 89995 -29826 37877 64066 16851 75795 101961 99977 136236 20851
1444B0851P1429K3865j04925j02212N7298j08905M1107J04319j164k6717m8117
$$ 20851 92280 116145 11220 -90992 -33694 -142599 -101492 2827 1663 -25054 -73171
1433g3171l1575J09731j26295k3678N0715m673J17039n4676M7597q0847L114o9346
$$ -73171 -104746 4985 -121310 -144988 -94273 -98946 18093 -36583 11014 -69833 -66719 -136065
1421a36065J05056P3423l4689p7499O5186J6513K6984P107j9935L4802O9005j19254
$$ -136065 -31009 42414 7725 -69774 -4588 11925 38909 46016 26081 60883 129888 10634
1409A0634j41007J16k8883L6362j8040Q044J45566q7254P5324N7001p7133j51228
$$ 10634 -130373 -130257 -159140 -122778 -140818 -132774 12792 -74462 862 57863 -19270 -170498
1397a70498L1876J45905M1406N4067q8859q4514k5172J27436j32147O3627P1201
$$ -170498 -138622 7283 48689 102756 13897 -70617 -95789 31647 -100500 -36873 34328
1386C4328n4737P5166J00718j54832j56509J12535P2861k2147O163m1413J01069
$$ 34328 -20409 54757 155475 643 -155866 -43331 29530 7383 13546 -27867 73202
1375G3202O6729l2976K8275O12o1866K1886j10538p7771Q7772P6036m7381k0997
$$ 73202 139931 106955 135230 135842 73976 95862 -14676 -92447 -4675 71361 23980 2983
1363B983n7548J02460M8353o5809l2242J0616O3568O761j59307j3269L5358J2391
$$ 2983 -54565 47895 96248 30439 -1803 8813 72381 79142 -80165 -93434 -58076 -45685
1351d5685o7090P4361L5929k4754K3830J78179r9570j22768J29469o4393J57110
$$ -45685 -112775 -38414 -2485 -27239 -3409 174770 75200 -47568 81901 17508 174618
1340A74618j04721M527P8622l6284j23840J6593o1428J4730J1447L5215J28901
$$ 174618 69897 74424 153046 116762 -7078 9515 -51913 -37183 -25736 9479 138380
1329A38380l9078j33031l9630n1320J0445P8964R5762K8044k35686R9950O1246
$$ 138380 99302 -33729 -73359 -124679 -114234 -35270 60492 88536 -147150 -47200 14046
1318A4046J8146J55763p4084r9345m7946N6258j4245j24826P0711n2218n7206
$$ 14046 32192 187955 113871 14526 -33420 22838 8593 -116233 -45522 -97740 -154946
1307a54946K01905O8487k9123j640p8198k6649o5154J271Q1984K9953k365O286
$$ -154946 46959 115446 86323 84683 6485 -20164 -85318 -84047 -2063 27890 25525 31811
1295C1811n2876Q2381j66130j2302M7219j23087O6863J63768m6365k2276n5663
$$ 31811 -21065 61316 -104814 -117116 -69897 -192984 -126121 37647 -8718 -30994 -86657
1284h6657q3281R1626K1337J2405P6405o445j2660N7141l023j17786k0045J04898
$$ -86657 -169938 -78312 -56975 -44570 31835 25390 12730 69871 66848 -50938 -70983 33915
1272C3915M2368p6966r8118M154Q7435O115L9011l1670L496N3765K4703L0982
$$ 33915 76283 -683 -98801 -94647 -7212 -1097 37914 6244 9740 63505 88208 119190
1260A19190k39637L2637J21036o452n5172j05473j0445J33264p782j67940r70
$$ 119190 -120447 -87810 33226 26774 -28398 -133871 -144316 -11052 -18834 -186774 -187744
1249a87744O8680m0812J24270k8948k4046K0743L4667N0900J2046l3783j9518
$$ -187744 -119064 -159876 -35606 -64554 -88600 -67857 -33190 17710 29756 -4027 -23545
1238b3545R7761l4928j03881Q9657j8474k0810n9960k7896M9005n6241Q579N3597
$$ -23545 74216 39288 -64593 25064 6590 -14220 -74180 -102076 -53071 -109312 -100733 -47136
1226d7136o4494P3398p4305J76670j7094n8154l2242l0916P5595J1430K5640k00741
$$ -47136 -111630 -38232 -112537 64133 47039 -11115 -43357 -74273 1322 12752 38392 -162349
1214a62349M43J06086Q4394m0498J27279o8769r5144k574J9741q17r8254K48983
$$ -162349 -161906 -55820 28574 -11924 115355 46586 -48558 -51132 -31391 -32208 -130462 118521
1202A18521j09312q5208O1263m7346J42335m0123j6244L9546o5576j23572l651
$$ 118521 9209 -75999 -14736 -62082 80253 40130 23886 63432 -2144 -125716 -129367
1191a29367L1507k5128J04492J5875J2991k1015n522J4675n8597o6808J03584
$$ -129367 -97860 -122988 -18496 -2621 10370 -10645 -16167 -1492 -60089 -126897 -23313
1180b3313N3082k15823J08105P7664k8173K2791L7041R3351p143q1056r8821n4977
$$ -23313 29769 -186054 -77949 -285 -28458 -5667 31374 124725 117582 36526 -62295 -117272
1168a17272P0061J10798M6532n9527M501p2887n1573P7679L6700q4249L9929K3305
$$ -117272 -47211 63587 110119 50592 55093 -17794 -69367 8312 45012 -39237 692 23997
1156B3997k3578M4677m6711L0488L0037n0174j119o6718l2961L2915J489K2502
$$ 23997 419 45096 -1615 28873 58910 8736 7617 -59101 -92062 -59147 -57658 -35156
1144c5156M8011q8932P9569N0005l4546j51591p0161J44629J19429M4513j28540
$$ -35156 12855 -76077 3492 53497 18951 -132640 -202801 -58172 61257 105770 -22770
1133b2770m0257L6797M3674n5496p7729J13755o5665k1410O1260N2041J2446Q6584
$$ -22770 -63027 -26230 17444 -38052 -115781 -2026 -67691 -89101 -27841 24200 36646 123230
1121A23230l7281m3594j72014l4268O9097j1235J01079N0713k3250p6711L1129
$$ 123230 85949 42355 -129659 -163927 -94830 -106065 -4986 45727 22477 -54234 -23105
1110b3105O978n6324o8053j7032N5840K0769J27430n1927j33761o121O2753M857
$$ -23105 -16127 -72451 -140504 -157536 -101696 -80927 46503 -5424 -139185 -145306 -82553 -77696
1098g7696N1014O4441j25061k4900M1880l3844P4732L6758n6745j9829l4868J15890
$$ -77696 -26682 37759 -87302 -112202 -70322 -104166 -29434 7324 -49421 -69250 -104118 11772
1086A1772J4452j2390m9343L409j31490J06003l1914j07188R7518O2111P8419
$$ 11772 26224 13834 -35509 -32100 -163590 -57587 -89501 -196689 -99171 -37060 41359
1075D1359K7022N244Q5731r5549m2650L7896k2702j48514J21620J19605j20956
$$ 41359 68381 73625 159356 63807 21157 59053 36351 -112163 9457 129062 8106
1064H106j76351p8162J39393N7619K118P1460l1582M9695l9562Q2194l2072j08034
$$ 8106 -168245 -246407 -107014 -49395 -47277 24183 -7399 42296 2734 84928 52856 -55178
1052e5178m2127M3424N1925J0898p4953J6180q3775Q5278J05713k05587J13518
$$ -55178 -97305 -53881 -1956 8942 -66011 -49831 -133606 -48328 57385 -148202 -34684
1041c4684q3500J64746J51989k5934j51370k1401k1654j05762J33772P0339m0706
$$ -34684 -118184 46562 198551 172617 21247 -154 -21808 -127570 6202 76541 35835
1030C5835R3214q0622r4906k9554j9230K247J7875n9186p7161P6576R8968L0978
$$ 35835 129049 48427 -46479 -76033 -95263 -93016 -75141 -134327 -211488 -134912 -35944 -4966
1018d966J1801O0405L8002j3719j21250M3263l8484p351n3440q0617J58105M8148
$$ -4966 6835 67240 105242 91523 -29727 13536 -24948 -32299 -85739 -166356 -8251 39897
1006C9897l6515M9363J3234n2184j7092J7210q067m8490p2570j6242R5198L0698
$$ 39897 3382 52745 65979 13795 -3297 13913 5846 -42644 -115214 -131456 -36258 -5560
994e560J5685r132N583P8108r4936o2730N1211J8519N2050K7103q4802j4332k5380
$$ -5560 10125 993 6576 84684 -10252 -72982 -21771 -3252 48798 75901 -8901 -23233 -48613
981d8613j78710J77437P4846p0563K4398K1055Q2478L8707r0475p5104p7210J59781
$$ -48613 -227323 -49886 24960 -45603 -21205 -150 82328 121035 30560 -44544 -121754 38027
969C8027J00945j44955j54693L8322J5593N0763J8605K2976K1565j3300k6024
$$ 38027 138972 -5983 -160676 -122354 -106761 -55998 -37393 -14417 7148 -6152 -32176
958c2176n6267n4407R2557k0728M4914J21316R9477j78217j30692K1022n5407
$$ -32176 -88443 -142850 -50293 -71021 -26107 95209 194686 16469 -114223 -93201 -148608
947a48608P4261L1842J1259J06005P5717J7185p4785r6097P5797j01969P8929
$$ -148608 -74347 -42505 -31246 74759 150476 167661 92876 -3221 72576 -29393 49536
936D9536J12958o5077l8335L0754j88320k4416L6745Q2172M9633P231n2569k1564
$$ 49536 162494 97417 59082 89836 -98484 -122900 -86155 -3983 45650 52881 312 -21252
924b1252P9175L4387k8116J9158p2891q3265P2019l5848l2142Q3023j21053J56362
$$ -21252 57923 92310 64194 83352 10461 -72804 -785 -36633 -68775 14248 -106805 49557
912D9557l1181q0999l4613L2484m591M9279K12929j9947o8352j02829j7275O1372
$$ 49557 18376 -62623 -97236 -64752 -69343 -20064 192865 172918 104566 1737 -15538 45834
900D5834p4594q4696n8501N8497Q8682r5353J31118N2281m1070J27409j35546
$$ 45834 -28760 -113456 -171957 -113460 -24778 -120131 10987 63268 22198 149607 14061
889A4061j10590M4267J8426J62411r7263k0603K0664K7634q8880j04090M5877
$$ 14061 -96529 -52262 -33836 128575 31312 10709 31373 59007 -29873 -133963 -88086
878h8086J08920L540j653r3072m5932J6973j1345j7413j74253O3925K27854K0810
$$ -88086 20834 24374 22721 -70351 -116283 -99310 -110655 -128068 -302321 -238396 -10542 10268
866A0268r4406o974J58737Q2808o2419n0912r5558n2257P4990n8749J9063O2931
$$ 10268 -84138 -91112 67625 150433 88014 37102 -58456 -110713 -35723 -94472 -75409 -12478
854a2478R2171L8856j79649p211P306Q5540o0123K1437k1693L2815N2588K0798
$$ -12478 79693 118549 -61100 -68311 -61005 24535 -35588 -14151 -35844 -3029 49559 70357
842G0357k3117r314P264m9353L607L9356K7427j25240J9803n9528J18295k0921
$$ 70357 47240 37926 45190 -4163 -556 38800 66227 -59013 -39210 -98738 19557 -1364
830a364n4535j40418K6441Q9051n4119J34038r5474J18407O3727o2244l4401j22238
$$ -1364 -55899 -196317 -169876 -80825 -134944 -906 -96380 22027 85754 23510 -10891 -133129
818a33129L5711M9669K5499k3642L1142k0476N1993J08506j55583M8453q016k03991
$$ -133129 -97418 -47749 -22250 -45892 -14750 -35226 16767 125273 -30310 18143 10127 -193864
806a93864R5853Q5754L195j8881j33790N7488J7769j14056O385J14325l680m0555
$$ -193864 -98011 -12257 -9062 -27943 -161733 -104245 -86476 -200532 -194147 -79822 -83502 -124057
794a24057J7984l6827j07830R2227J04471L0331l4775p3313O8421K9696k384J31897
$$ -124057 -106073 -142900 -250730 -158503 -54032 -23701 -58476 -131789 -63368 -33672 -36056 95841
782I5841N3939o7389n3620j5572R1419j0778L9362r0708r3112J5433O7591j01016
$$ 95841 149780 82391 28771 13199 104618 93840 133202 42494 -50618 -35185 32406 -68610
770f8610l2145M8776k1194R0707K457N655R5774p0047r5318k7343J73988n6000
$$ -68610 -100755 -51979 -73173 17534 19991 25646 121420 51373 -43945 -71288 102700 46700
758D6700m9991l860L1224p0341n6017n4729Q7852L2557j09011M8145J5359J3144
$$ 46700 -3291 -7151 24073 -46268 -102285 -157014 -69162 -36605 -145616 -97471 -82112 -68968
746f8968j32212J38818l0594l3759L1852j8505M5479J1623m1947J40901j5369
$$ -68968 -201180 -62362 -92956 -126715 -94863 -113368 -67889 -56266 -98213 42688 27319
735B7319j07243M5298P9656m7618L2786n8880M9501P0137j17397m0023j7004r403
$$ 27319 -79924 -34626 45030 -2588 30198 -28682 20819 90956 -26441 -66464 -83468 -92871
723i2871p8860k3630J86135J55131q8146q9082q2667K2798O280J60233o725k982
$$ -92871 -171731 -195361 -9226 145905 57759 -31323 -113990 -91192 -84912 75321 68596 65614
711F5614r2782k7103P4287R480j1794o6835q30l3243J6188l317J02862k2029p6908
$$ 65614 -27168 -54271 20016 29496 17702 -49133 -49963 -83206 -67018 -70335 32527 10498 -66410
698f6410l2334M9609M6489m4847J7720J1633n4480J49616j17240r480J18350P1
$$ -66410 -98744 -49135 -2646 -47493 -29773 -18140 -72620 76996 -40244 -49724 68626 68697
686F8697N4823q8157j43860q3575J11576J65827j6937M9152n9782n5151R4148
$$ 68697 123520 35363 -108497 -192072 -80496 85331 68394 117546 57764 2613 96761
675I6761o6956j14747R9239n4611j705L3815M1114p5971j183J57467j9801j21942
$$ 96761 29805 -84942 14297 -40314 -42019 -8204 32910 -43061 -44244 113223 93422 -28520
663b8520N9494l9160j01716P9477O779o3389P3593O286P817K452m3551K5456j03823
$$ -28520 30974 -8186 -109902 -30425 -23646 -87035 -13442 -7156 661 3113 -40438 -14982 -118805
650a18805K4793J06948j7658n0182K096j18574M7074N5617Q2109q6772N9607j0905
$$ -118805 -94012 12936 -4722 -54904 -52808 -171382 -124308 -68691 13418 -73354 -13747 -24652
638b4652o8906j6050j19382J26407P8997q1509O7960k3270L6578J5388K14j8574
$$ -24652 -93558 -109608 -228990 -102583 -23586 -105095 -37135 -60405 -23827 -8439 -8225 -26799
626b6799K4299q3831j13684Q2104M1820P4291K9353m8157Q599j0749O7465j04979
$$ -26799 -2500 -86331 -200015 -117911 -76091 -1800 27553 -20604 -12005 -22754 44711 -60268
614f0268p711O6490q4323M4467J16208M302j6219o2168o9883n4075J04414Q3667
$$ -60268 -67979 -1489 -85812 -41345 74863 79165 62946 778 -69105 -123180 -18766 64901
602F4901O552j5489j26710R1960J8616j00976J0134O0686q6894K8923J13351J14032
$$ 64901 71453 55964 -70746 21214 39830 -61146 -51012 9674 -77220 -48297 65054 179086
590A79086j40103K2945L871j0412m7780J5309Q4905j40373J3969k3612l8058K7792
$$ 179086 38983 61928 65799 55387 7607 22916 107821 -32552 -18583 -42195 -80253 -52461
578e2461L5423m1888L0381M4656n3281p1306j8810J86690P1582p5928N1120j5149
$$ -52461 -17038 -58926 -28545 16111 -37170 -108476 -127286 59404 130986 55058 106178 91029
566I1029j13676n4235M7297l8550L0113K4703P3733j1461j9057j46082p472Q0661
$$ 91029 -22647 -76882 -29585 -68135 -38022 -13319 60414 48953 29896 -116186 -123658 -42997
554d2997k1946M6763J094n5081R694k6731L1341k488j1226K4363n9241N3431j5917
$$ -42997 -64943 -18180 -17086 -72167 -62473 -89204 -57863 -60351 -71577 -47214 -106455 -53024 -68941
541f8941K063R7784Q8028k9054l0171N2004l8045p3690M7802R3646l7193j3373
$$ -68941 -66878 30906 118934 89880 59709 111713 73668 -22 47780 141426 104233 90860
529I0860r00j24367j7923k372L1354j14027k2069J6467n5909J40035J17555J9397
$$ 90860 89960 -34407 -52330 -54702 -23348 -137375 -159444 -142977 -198886 -58851 58704 78101
517G8101j9838M2472p5713M5582L9784j81764M6811j09697K8045N0754L9574J59957
$$ 78101 58263 100735 25022 70604 110388 -71376 -24565 -134262 -106217 -55463 -15889 144068
505A44068N684q1241o6242m4274l8438O197P5648J22625n4986k4602Q343q7394
$$ 144068 149752 68511 2269 -42005 -80443 -74246 1402 124027 69041 44439 52782 -34612
493c4612J44201K8538j21327j34322J11717M3342J1208j19488K4984K2211r1005
$$ -34612 109589 138127 16800 -117522 -5805 37537 48745 -70743 -45759 -23548 -114553
482a14553j2218J69073J6614n1962o1754o0698J474l74j4322J04709N6067L0255
$$ -114553 -126771 42302 58916 6954 -54800 -115498 -114024 -114398 -128720 -24011 32056 62311
470F2311l3012Q6356O732j21983j46021m5618J78661L3542R469J3683O3247k9394
$$ 62311 29299 115655 122387 404 -145617 -191235 -12574 20968 30437 44120 107367 77973
458G7973k4645o6714l331l3117J00584q2167L9243Q5538q1355M3152O7416r3790
$$ 77973 53328 -13386 -16717 -49834 50750 -31417 7826 93364 12009 55161 122577 28787
446B8787K8608j09789L1170J19803O1142k2848m1782q3908k2339j2385n5631J8245
$$ 28787 57395 -52394 -21224 98579 159721 136873 95091 11183 -11156 -23541 -79172 -60927
434f0927O3176q8932M707k9672J0867j04703J33788Q7357m4097M0847j428R7232
$$ -60927 2249 -86683 -81976 -111648 -100781 -205484 -71696 15661 -28436 12411 10983 108215
422A08215j6507m4402j02841R5956J37843r5028k6176m954Q004K5722J878l7254
$$ 108215 91708 47306 -55535 40421 178264 83236 57060 52106 60110 85832 87710 50456
410E0456O913O3639j3644J4830j8239j4249J2626O5370o1632m1766Q0142k6916
$$ 50456 57369 121008 107364 122194 103955 89706 102332 167702 106070 64304 144446 117530
398A17530j00407K5159J09108j06493o704N4039l9520P8669l6765j38740L4379
$$ 117530 17123 42282 151390 44897 38193 92232 52712 131381 94616 -44124 -9745
387i745K8001O333J5584J0031J28491m2211j13075R5034N6753L6147l4047l1228
$$ -9745 18256 24589 40173 50204 178695 136484 23409 118443 175196 211343 177296 146068
375A46068j166m9259P1401K4296j71197r6132J22385m5707J3232L8786O088N3978
$$ 146068 144902 95643 167044 191340 20143 -75989 46396 689 13921 52707 58795 112773
363A12773K9369m5594K6839M4249m6982r347J20704p1134M024o384K9846j01385
$$ 112773 142142 96548 123387 167636 120654 111307 232011 160877 164901 158517 188363 86978
351H6978l7402J6543O6043O281j19429k3355J15025M2850l7299J3491j06827J9151
$$ 86978 49576 66119 132162 138443 19014 -4341 110684 153534 116235 129726 22899 42050
339D2050R4826O7780o7292j8834J41618n8314p2622O673l9447n4413o252K9007
$$ 42050 136876 204656 137364 118530 260148 201834 129212 135885 96438 42025 35773 64780
327F4780k473q5662J58956Q0829j22823j05599J13766O1379j46716k2790L3680
$$ 64780 62307 -23355 135601 216430 93607 -11992 101774 163153 16437 -6353 27327
316B7327J60003r8626r2336R5139J04570j38851N9449N4768M9155k7605j12298
$$ 27327 187330 88704 -3632 91507 196077 57226 116675 171443 220598 192993 80695
305H0695J40771L1337q6421o0243L3810N8261o6196j06218l4018Q6376R4982m3453
$$ 80695 221466 252803 166382 106139 139949 198210 132014 25796 -8222 78154 173136 129683
293A29683l891n5117l4993k9548n5280J2925J11311j3729K802Q5449L2923q7782
$$ 129683 125792 70675 35682 6134 -49146 -36221 75090 61361 64163 149612 182535 94753
281I4753j78270L1004J35977J46941L5588j06051j58979P2372Q1673n9789l7559
$$ 94753 -83517 -52513 83464 230405 265993 159942 963 73335 155008 95219 57660
270E7660N3257R261n107k3420r6625K1535R0625N3431n699M2350o0239m0496o5124
$$ 57660 110917 120178 115071 91651 -4974 16561 107186 160617 154918 197268 137029 96533 31409
$$ [...]
##END NTUPLES=NMR SPECTRUM
##END=
