##TITLE=1H_CA-9198-2
 CDCl3
 8 sc, 
 4.10.2023
##JCAMPDX= 6.0         $$ Bruker NMR JCAMP-DX V2.0
##DATA TYPE= NMR SPECTRUM
##DATA CLASS= NTUPLES
##ORIGIN= UXNMR, Bruker Analytische Messtechnik GmbH
##OWNER= root
$$ XWIN-NMR		Version 3.5
$$ Wed Oct  4 14:39:30 2023 Russian Standard Time (UT+4h)  she@DPX200
##.OBSERVE FREQUENCY= 200.13135
##.OBSERVE NUCLEUS= ^1H
##.ACQUISITION MODE= SIMULTANEOUS
##.ACQUISITION SCHEME= undefined
##.AVERAGES= 8
##.DIGITISER RES= 18
##SPECTROMETER/DATA SYSTEM= spect
##.PULSE SEQUENCE= zg30
##.SOLVENT NAME= D2O
##.SHIFT REFERENCE= (INTERNAL, D2O, 0, 15.7447)
##AUDIT TRAIL= $$ (NUMBER, WHEN, WHO, WHERE, WHAT)
$$ ##TITLE= Audit trail, XWIN-NMR		Version 3.5
$$ ##JCAMPDX= 5.01
$$ ##ORIGIN= Bruker BioSpin GmbH
$$ ##OWNER= she
$$ F:/spectra/data/she/nmr/H-F/1/pdata/1/auditp.txt
$$ ##AUDIT TRAIL=  $$ (NUMBER, WHEN, WHO, WHERE, WHAT)
(   1,<2023-10-04 14:38:26.23 +0400>,<she>,<DPX200>,
      <created by zg, POWCHK disabled, PULCHK disabled
       configuration hash MD5:
       00 E9 B6 7A A2 85 ED C7 34 08 36 98 17 FE 4E 26
       data hash MD5: 16K
       35 12 A6 F7 C4 4E 8A 76 34 19 43 12 3F CB 4A BA>)
(   2,<2023-10-04 14:38:28.65 +0400>,<she>,<DPX200>,
      <Start of raw data processing
       efp BC_mod = 2 LB = 0.24 FT_mod = 6 PKNL = 1 PHC0 = -21711.15 PHC1 = 12.65271 SI = 16K 
       data hash MD5: 16K
       B4 84 AC 91 74 43 5C CD 7F DD A4 B0 20 21 E2 D9>)
(   3,<2023-10-04 14:38:44.76 +0400>,<she>,<DPX200>,
      <pk PHC0 = 1.288496 PHC1 = -1.4 
       data hash MD5: 16K
       9E CD 37 FB 66 2A 52 BC 4F E1 55 0E AA 99 B5 20>)
(   4,<2023-10-04 14:38:47.98 +0400>,<she>,<DPX200>,
      <abs ABSG = 5 
       data hash MD5: 16K
       57 06 76 34 D3 B1 B6 D5 8E EB EE 6B 4A 51 81 1F>)
$$ ##END=
$$ 
$$ hash MD5
$$ B4 33 02 0D FB 5D 99 D5 AB 24 82 2F 13 11 15 39
##$RELAX= 
##$RELAX= 
##$RELAX= 
##$RELAX= 
##$RELAX= 
##$RELAX= 
$$ Bruker specific parameters
$$ --------------------------
##$DU= <F:/spectra>
##$EXPNO= 1
##$NAME= <H-F>
##$PROCNO= 1
##$TYPE= <nmr>
##$USER= <she>
##$AMP= (0..31)
100 100 100 100 100 100 100 100 100 100 100 100 100 100 100 100 100 100 
100 100 100 100 100 100 100 100 100 100 100 100 100 100 
##$AQSEQ= 0
##$AQ_mod= 1
##$AUNM= <au_zg>
##$AUTOPOS= <>
##$BF1= 200.13
##$BF2= 200.13
##$BF3= 200.13
##$BF4= 200.13
##$BF5= 200.13
##$BF6= 200.13
##$BF7= 200.13
##$BF8= 200.13
##$BYTORDA= 1
##$CFDGTYP= 0
##$CFRGTYP= 5
##$CHEMSTR= <none>
##$CNST= (0..31)
1 1 145 1 1 1 1 1 1 1 1 1 1 1 1 1 1 1 1 1 1 1 1 1 1 1 1 1 1 1 1 1 
##$CPDPRG= <>
##$CPDPRG1= <>
##$CPDPRG2= <>
##$CPDPRG3= <>
##$CPDPRG4= <mlev>
##$CPDPRG5= <mlev>
##$CPDPRG6= <mlev>
##$CPDPRG7= <mlev>
##$CPDPRG8= <mlev>
##$CPDPRGB= <>
##$CPDPRGT= <>
##$D= (0..31)
0 1.2 0 0 0 0 0 0 0 0.06 0 0.03 0 0 0 0 0.0002 0 0 0 0 0 0 0 0 0 0 0 0 
0 0 0 
##$DATE= 1696415905
##$DBL= (0..7)
120 120 120 120 120 120 120 120 
##$DBP= (0..7)
150 150 150 150 150 150 150 150 
##$DBP07= 0
##$DBPNAM0= <>
##$DBPNAM1= <>
##$DBPNAM2= <>
##$DBPNAM3= <>
##$DBPNAM4= <>
##$DBPNAM5= <>
$$ [...]
##$SUBNAM3= <"">
##$SUBNAM4= <"">
##$SUBNAM5= <"">
##$SUBNAM6= <"">
##$SUBNAM7= <"">
##$SUBNAM8= <"">
##$SUBNAM9= <"">
##$SW= 18.05172834244
##$SWIBOX= (0..15)
0 0 2 0 0 0 0 0 0 0 0 0 0 0 0 0 
##$SW_h= 3612.71676300578
##$TD= 16384
##$TD0= 1
##$TE= 0
##$TE2= 300
##$TE3= 300
##$TEG= 300
##$TL= (0..7)
0 120 120 120 120 120 120 120 
##$TP= (0..7)
150 150 150 150 150 150 150 150 
##$TP07= 0
##$TPNAME0= <>
##$TPNAME1= <>
##$TPNAME2= <>
##$TPNAME3= <>
##$TPNAME4= <>
##$TPNAME5= <>
##$TPNAME6= <>
##$TPNAME7= <>
##$TPOAL= (0..7)
0.5 0.5 0.5 0.5 0.5 0.5 0.5 0.5 
##$TPOFFS= (0..7)
0 0 0 0 0 0 0 0 
##$TUNHIN= 0
##$TUNHOUT= 0
##$TUNXOUT= 0
##$USERA1= <user>
##$USERA2= <user>
##$USERA3= <user>
##$USERA4= <user>
##$USERA5= <user>
##$V9= 5
##$VALIST= <valist>
##$VCLIST= <CCCCCCCCCCCCCCC>
##$VD= 0
##$VDLIST= <DDDDDDDDDDDDDDD>
##$VPLIST= <PPPPPPPPPPPPPPP>
##$VTLIST= <TTTTTTTTTTTTTTT>
##$WBST= 1024
##$WBSW= 4
##$XGAIN= (0..3)
0 0 0 0 
##$XL= 0
##$YL= 0
##$YMAX_a= 610487
##$YMIN_a= -789235
##$ZGOPTNS= <>
##$ZL1= 120
##$ZL2= 120
##$ZL3= 120
##$ZL4= 120
##$ABSF1= 15.74469
##$ABSF2= -2.307159
##$ABSG= 5
##$ABSL= 3
##$ALPHA= 0
##$AQORDER= 0
##$ASSFAC= 0
##$ASSFACI= 0
##$ASSFACX= 0
##$ASSWID= 0
##$AUNMP= <proc_1d>
##$AZFE= 0.1
##$AZFW= 0.1
##$BCFW= 0
##$BC_mod= 2
##$BYTORDP= 0
##$COROFFS= 0
##$CY= -3
##$DATMOD= 1
##$DC= 0
##$DFILT= <>
##$DTYPP= 0
##$F1P= 0
##$F2P= 0
##$FCOR= 1
##$FTSIZE= 16384
##$FT_mod= 6
##$GAMMA= 0
##$GB= 0
##$INTBC= 1
##$INTSCL= 3.70164e-10
##$ISEN= 128
##$LB= 0.24
##$LEV0= 0
##$LPBIN= 0
##$MAXI= 10000
##$MC2= 0
##$MEAN= 0
##$ME_mod= 0
##$MI= 1.114404
##$NCOEF= 0
##$NC_proc= -6
##$NLEV= 6
##$NOISF1= 3.799351
##$NOISF2= 2.8
##$NSP= 0
##$NTH_PI= 0
##$NZP= 0
##$OFFSET= 15.74469
##$PC= 1
##$PHC0= -21709.86
##$PHC1= 11.25271
##$PH_mod= 1
##$PKNL= yes
##$PPARMOD= 0
##$PSCAL= 0
##$PSIGN= 0
##$REVERSE= no
##$SF= 200.130005374552
##$SI= 16384
##$SIGF1= 3
##$SIGF2= 2
##$SINO= 5.538805
##$SIOLD= 16384
##$SREGLST= <1H.CDCl3>
##$SSB= 0
##$STSI= 16384
##$STSR= 0
##$SW_p= 3612.71676300578
##$SYMM= 0
##$S_DEV= 0
##$TDeff= 16384
##$TDoff= 0
##$TI= <>
##$TILT= no
##$TM1= 0
##$TM2= 0
##$TOPLEV= 0
##$USERP1= <user>
##$USERP2= <user>
##$USERP3= <user>
##$USERP4= <user>
##$USERP5= <user>
##$WDW= 1
##$XDIM= 16384
##$YMAX_p= 359740864
##$YMIN_p= -459899
$$ End of Bruker specific parameters
$$ ---------------------------------
##NTUPLES= NMR SPECTRUM
##VAR_NAME=  FREQUENCY,     SPECTRUM/REAL,   SPECTRUM/IMAG
##SYMBOL=    X,             R,               I
##VAR_TYPE=  INDEPENDENT,   DEPENDENT,       DEPENDENT
##VAR_FORM=  AFFN,          ASDF,            ASDF
##VAR_DIM=   16384,         16384,           16384
##UNITS=     HZ,            ARBITRARY UNITS, ARBITRARY UNITS
##FACTOR=    0.220516191357247, 1,           1
##FIRST=     3150.98488259429, 0,            0
##LAST=      -461.731880411493, 0,           0
##MIN=       -461.731880411493, -459899,     0
##MAX=       3150.98488259429, 359740864,    0
$$ Real data points
##PAGE= N=1
##DATA TABLE= (X++(R..R)), XYDATA
$$ [...]
9505 -103399 -103731 -84400 -166309 -183834 -10474 -89395 -83228 -143634 -78287 -113154 -26430 -101137
9493 -101137 -144169 -95532 -67336 -147982 -163315 -174042 -191959 -49684 -12141 63768 20670
9482 20670 32387 -5768 -125831 -175691 -39155 43140 -25865 -57544 -152037 -43984 113853
9471 113853 5971 -64859 -117451 -90279 -25117 114595 54967 -46129 -150275 -38682 5277
9460 5277 37785 -22226 -42905 53704 -14598 -17996 76353 92429 -41826 35286 81801 156453
9448 156453 14196 95446 212114 129489 143491 137100 56054 76604 -32138 -42269 54584
9437 54584 12249 134315 122807 133678 48309 -83412 40734 128720 117663 43409 48373
9426 48373 129758 101425 72886 138006 81815 22881 115438 221364 202968 228466 322377 265888
9414 265888 193713 181264 315834 270628 294117 249038 200644 118701 163167 49225 209944
9403 209944 395370 378970 430825 425310 419621 413405 466936 546512 585167 482327 519578 556964
9391 556964 670447 595460 671323 741370 679134 874328 803117 830851 861386 810454 870801
9380 870801 845501 930058 1040084 972833 954484 1044799 1147024 1286447 1369093 1400842 1402511
9369 1402511 1332907 1441937 1617196 1614624 1689414 1862722 1818040 1928077 2177611 2260799 2562493
9358 2562493 2735959 2920425 3116026 3336486 3676484 3958012 4387810 4817817 5297497 5944566
9348 5944566 6660032 7214106 7928865 8529386 9033818 9378964 9578754 9623180 9324530 8813067
9338 8813067 8274590 7661100 6995548 6254373 5448309 4882041 4286601 3771623 3397108 2967730
9328 2967730 2626471 2358707 2111769 1954213 1876994 1812225 1586536 1537920 1391927 1280824
9318 1280824 1209592 1196689 1085235 890123 861540 923932 836417 851191 798222 735891 651793
9307 651793 777384 743022 629543 583582 534629 476791 459416 469303 458421 536488 427983
9296 427983 445269 522175 449318 415911 304111 291507 197750 323530 258063 210011 315374
9285 315374 263608 229714 377335 330652 285312 326074 126335 146608 199048 244130 261023
9274 261023 246879 203906 185681 115459 162582 186814 140461 141454 120692 294820 293382 191537
9262 191537 130318 162422 207509 218286 228042 146210 79085 80020 112752 183676 371787 290127
9250 290127 313496 218235 223395 116999 151425 173650 115072 242921 164078 174212 221402
9239 221402 129523 78033 105812 90338 84625 18041 103054 38660 83478 144405 -31535 41975
9227 41975 81187 134258 44331 -50768 -110320 30160 -12001 -5367 -34780 -42547 116582 192943
9215 192943 191680 203249 124818 20608 66337 114224 18060 2618 103660 168504 181198
9204 181198 307205 189901 136016 21637 -67667 8880 89642 87388 74934 66678 194389
9193 194389 203887 203281 203234 165965 191052 143724 149927 985 126218 149641 189123 279189 358837
9180 358837 266295 363922 454631 552124 675608 674402 675727 757257 957227 832528 566435
9169 566435 419598 446382 355140 355988 258047 217198 272824 293627 193501 212898 199186 103427
9157 103427 149320 89932 77262 53634 -11345 -36525 65400 135383 163168 105797 129188
9146 129188 133759 81590 9751 68050 146660 222759 214075 281292 305409 252329 258710 198423
9134 198423 81571 67010 66127 178603 266805 218744 131327 173171 187464 107916 72031 114489
9122 114489 169149 163249 204454 257657 248266 249004 212322 117424 51925 79061 76820 104807 132896
9109 132896 254619 111919 157905 208357 122803 90949 100021 190011 172960 156731 134572
9098 134572 148569 148519 267895 261649 140514 131438 50289 127807 138050 62371 61731 39812 110816
9085 110816 142020 104620 158456 183760 166738 164871 71100 122198 150643 147185 192424 199377
9073 199377 253815 224663 193013 248805 251634 225101 197880 139269 211323 302316 291424 295155
9061 295155 241433 215095 210524 118209 24133 43472 124159 163739 232810 209112 173926 219459
9049 219459 195446 289810 149707 203184 173847 78794 161863 231113 163260 128639 309616
9038 309616 340278 212912 167303 159800 206077 312702 273880 207175 232846 161026 266793
9027 266793 251555 288945 303921 208095 160291 189143 198599 176680 199007 188277 316686 259101
9015 259101 243833 221176 156727 270062 300477 260893 404918 382831 294536 213247 205689
9004 205689 203308 209800 285814 292354 349356 297999 268513 199378 196096 274193 286320 308766
8992 308766 289692 361105 324827 366436 333003 333210 380991 339778 344657 231314 269618 408696
8980 408696 388538 412761 463288 383864 491731 459620 401316 444147 353898 276277 419143
8969 419143 481055 561360 452164 428962 570407 552966 601603 561825 517945 504712 513987
8958 513987 492174 543480 555160 596772 504670 545731 623317 486865 426760 525710 630912
8947 630912 587436 545617 601552 617337 517245 651890 647228 631626 621004 598753 677163
8936 677163 723835 719407 703589 700354 790813 760848 754291 734085 685077 762737 770003 830338
8924 830338 736278 802572 838500 894376 827798 808544 894588 771960 744507 865970 921395
8913 921395 953119 848085 891931 1023081 1027656 974082 928611 967540 1003396 1047854 1087318
8902 1087318 1056366 1029674 1103050 1120390 1132146 1131705 1212382 1155040 1201599 1210142 1230132 1120202
8890 1120202 1104607 1203912 1290269 1397647 1308429 1349426 1380537 1317526 1453175 1545763 1385596
8879 1385596 1327979 1268933 1274128 1267949 1337352 1327477 1385405 1472477 1573022 1630266 1703082 1625987
8867 1625987 1497865 1514917 1504333 1574891 1619980 1658704 1606996 1522598 1468154 1569621 1711102
8856 1711102 1641847 1671061 1721607 1596379 1666379 1768502 1841447 1888597 1928336 1951205 1998342
8845 1998342 2110783 2092520 2147764 2177616 2146665 2144146 2154775 2159931 2188491 2239998 2249851 2345672
8833 2345672 2298800 2348204 2387230 2322811 2313537 2365120 2368589 2245239 2336153 2395171 2408681 2442068
8821 2442068 2513708 2458731 2487353 2580396 2592376 2660826 2732440 2674538 2766462 2856263 2909072
8810 2909072 3004167 3034525 3062746 3025319 2961190 3141388 3168036 3254725 3365478 3407176 3585951
8799 3585951 3647827 3813629 3846802 3813602 3842203 4077623 4189193 4188956 4318386 4461402 4518768
8788 4518768 4695637 4806562 4695658 4752872 4755167 4771639 4864548 4944786 5057141 5094690 5075118
8777 5075118 5118077 5222846 5370151 5480370 5615283 5698048 5748322 5892466 5944963 6009038
8767 6009038 6208446 6292823 6321724 6533608 6813870 7002391 7225372 7386018 7714999 7841157
8757 7841157 7833989 8100176 8393418 8637446 8788829 9055561 9138829 9291423 9682082 10060043
8747 10060043 10364478 10626980 10985500 11376339 11693175 12141600 12640692 13163470 13723624
8738 13723624 14103388 14586690 15184394 15505022 15908435 16187308 16602298 16908345 17383873
8729 17383873 17769908 18111616 18535315 19076578 19669822 20311167 21103420 21878597 22705573
8720 22705573 23751696 24689885 25776691 26977656 28076289 29385440 30722948 32420685
8712 32420685 34724940 37267673 40355261 43821496 48113951 53481312 60657105 70709580
8704 70709580 84921529 103520947 125901725 147619599 164995457 165922320 142311864
8697 142311864 112104103 88907510 72628104 60849136 52155557 45575747 40461874
8690 40461874 36160006 32830012 30155564 28162622 26254053 24627816 23136633 21881486
8682 21881486 20980467 20346273 19725385 19171630 18557242 18131738 17771177 17444024 16967478
8673 16967478 16538651 16213067 15782067 15451199 15156974 14850686 14677909 14493398 14262603
8664 14262603 14265212 14095302 14031440 13955061 13813320 13518556 13318135 13034275 12845319 12763985
8654 12763985 12608723 12546149 12322652 12230803 12072428 11689389 11257841 10979838 10728556 10449664
8644 10449664 10222159 9967616 9734667 9606789 9543734 9400684 9367499 9298049 9178782 9077298
8634 9077298 8999686 9123288 9231461 9198084 9124416 9090105 9152663 9245904 9366200 9391287 9570542
8623 9570542 9653559 9795895 10042556 10110801 10312906 10382457 10436336 10531523 10496202 10419942 10308772
8612 10308772 10237867 10413111 10617937 10710386 10691798 10710863 10689690 10522677 10247464 9917714
8602 9917714 9736194 9716399 9656877 9451042 9276252 9191294 9231542 9190096 9146817 9130712 9030685
8591 9030685 8994616 9049792 8990060 9203824 9367963 9346477 9384432 9573952 9722452 9801613 9897920
8580 9897920 10050936 10143679 10166593 10352057 10570686 10539385 10743446 11043020 11118042 11309944
8570 11309944 11559851 11907504 12030033 12325009 12791893 13013896 13313992 13631486 14038811
8561 14038811 14292815 14555024 14982637 15469377 15984986 16540878 17172862 17790821 18548222
8552 18548222 19420221 20417990 21496123 22693119 24209328 25977939 27856497 29914370
8544 29914370 32011556 33954961 35356438 36270467 36440572 35957076 34980067 33735083 32487177
8535 32487177 31396025 30699152 30031860 29852188 29941063 30232290 30903799 31688306 32991533
8526 32991533 34695772 36462343 38187171 39909994 41353836 42182319 42366371 41778721 40780388
8517 40780388 39411212 38046939 36987145 36186286 35686159 35658605 36043864 36631840 37572647
8508 37572647 38965630 40707338 42672505 45047581 47405786 49321470 50802790 51486315
8500 51486315 51293521 50066356 48295805 46642026 44961051 43504942 42232593 41647104
8492 41647104 41545015 41638492 42291966 43349464 44848778 46678705 49077859 51775949 54715788
8483 54715788 57677801 60515206 62923081 64750882 66426635 67729259 68703806 69308831
8475 69308831 68813888 67082260 64338231 60964624 58016186 55908279 54809851 54825751 55667673
8466 55667673 56957036 58177771 58113341 56572589 53407819 49171117 44609721 40340833
8458 40340833 36984471 34201793 32000148 30215939 28728205 27444042 26430135 25705032
8450 25705032 25305471 24904886 24540573 24304799 24358201 24552772 24804129 25262877 25821376 26594648
8440 26594648 27589281 29025695 30964690 33280094 36057166 39205376 42657746 45944223
8432 45944223 48541329 49646529 48962829 47152713 45078586 43417846 42529616 42725781 43783550
8423 43783550 45558013 47158629 48103156 47744681 45415827 41713318 37409168 33144680
8415 33144680 29248762 25931014 23300096 21274887 19680969 18269614 17083873 16051399
8407 16051399 15189307 14307278 13678880 13193159 12603483 11974077 11701190 11384217 11062276
8398 11062276 10635592 10336540 10177118 9873237 9684284 9440695 9251874 9046954 8901925
8389 8901925 8933122 8810124 8659585 8590405 8457382 8246692 8151988 7959088 7974668 7929820
8379 7929820 7798879 7757671 7655705 7629852 7627707 7622136 7608362 7705737 7589562 7528664 7424407
8368 7424407 7473394 7431968 7513579 7368634 7317683 7435496 7368508 7376857 7328108 7339958 7327552
8357 7327552 7340031 7402538 7412735 7368777 7288789 7329024 7347598 7395992 7490494 7671769 7630313
8346 7630313 7624874 7612980 7716824 7822318 7777374 7954630 8086246 8187141 8125652 8185275 8207848
8335 8207848 8292890 8418714 8671896 8723261 8751400 8945413 9075017 9219530 9296503 9547397
8325 9547397 9655410 9881327 9974925 10172372 10267672 10257027 10529068 10836303 10970749 11123519
8315 11123519 11429014 11656520 12035890 12279447 12675965 13038945 13350358 13808015 14176873
8306 14176873 14500997 14878940 15342100 15859105 16446011 17016185 17694518 18517648 19514856
8297 19514856 20493188 21711204 23075456 24750150 26569589 28558034 30494640 32024655
8289 32024655 32923549 33107930 32562724 31579899 30779063 30223955 30097107 30500243 31073115
8280 31073115 31870160 32698133 32988731 32665872 31589076 30223667 28843703 27440059 26273435
8271 26273435 25423304 24720943 24216302 24009956 23972540 23999583 24132337 24141408 24388418 24758672
8261 24758672 25230171 25757548 26528553 27560730 28827561 30261784 31887930 33686710 36028323
8252 36028323 38626270 41254994 43740870 45921816 47128703 47449408 47289684 46202144
8244 46202144 44813484 43515491 42643234 42465251 42675815 42961065 43227136 42951970 42004142
8235 42004142 40515079 38518891 35752366 32828658 30211344 27876286 25938886 24468173
8227 24468173 23092943 22068184 21198520 20534609 20096904 19676937 19276133 18794497 18534214
8218 18534214 18340411 18336316 18313949 18545549 19032203 19551632 20352765 21278885 22339228 23433463
8208 23433463 24382865 24849123 24678530 24043838 22884638 21582776 20693574 20255278 19959993
8199 19959993 19847625 20099246 20402810 20537944 19927972 18896183 17228796 15329021 14259328
8190 14259328 12966769 11894282 11003670 10051876 9230280 8595948 8157877 7692533 7248229
8181 7248229 7011804 6767125 6390691 6113677 5846673 5637425 5418473 5213322 5197998 4969857
8171 4969857 4878198 4822634 4701717 4464701 4327778 4244077 4108487 3946455 3766401 3786032
8161 3786032 3592191 3474034 3562161 3442173 3328958 3231419 3072000 3049532 2929971 2917773
8151 2917773 2816878 2722550 2709996 2685029 2682532 2672382 2510378 2406603 2371748 2356306 2407901
8140 2407901 2435932 2367456 2318064 2285288 2177472 1924483 2115213 2092805 2007479 2023532 1918328
8129 1918328 1947932 1830784 1757048 1765869 1867461 1972089 1894071 1736728 1604129 1668400 1651156
8118 1651156 1682484 1601067 1554733 1641125 1698609 1663488 1557056 1551308 1512742 1605370 1536743
8107 1536743 1553618 1522920 1488291 1486546 1424218 1312402 1381517 1475951 1468661 1228480 1301716
8096 1301716 1412431 1310616 1233344 1165093 1115879 981794 1036239 1039779 1138343 1040845 971435
8085 971435 868592 849127 940162 954112 989330 992527 1015044 948630 1016957 1049599 1011459 960907
8073 960907 1075962 1098252 1006604 1006334 1020570 983438 1080431 978946 928167 931428 979153 889430
8061 889430 755726 838329 928043 960694 870311 972248 905152 872545 833355 820380 778184
8050 778184 802127 779466 638811 621424 614207 677686 618795 681967 645822 575864 572152 591454
8038 591454 655328 648507 557854 583098 583152 526044 645483 541122 530330 613159 518457 398789
8026 398789 425176 623830 672159 674218 715820 564070 402945 456619 428840 470562 553738
8015 553738 439499 479847 440100 389446 391069 498982 467544 433290 400239 376406 464721
8004 464721 521353 560969 493646 458535 446472 399514 523652 548694 496703 448573 357937
7993 357937 319938 510911 527714 475553 466837 416697 405667 313645 406698 567292 616624
7982 616624 512567 332461 396678 483135 368765 366040 414752 543027 584269 645032 533124
7971 533124 471415 513505 477527 390212 509445 576661 538706 525574 358851 318575 390077
7960 390077 462645 503159 470360 527630 441757 401951 453495 345473 369019 342843 342195 340598
7948 340598 386708 388828 434117 484784 468862 355620 353725 283665 333649 371148 339374 468579
7936 468579 403735 408614 498413 411908 443828 475903 486686 620135 486545 442552 471221
7925 471221 556966 599818 568839 556320 511986 517803 475327 530529 546495 564196 478250 401999
7913 401999 482974 485299 538013 475434 513578 412035 511542 629770 588465 552157 495902
7902 495902 459653 449294 444062 473193 451719 357134 310889 440671 486633 470511 357605
7891 357605 353005 372605 385730 356320 379558 567887 636132 665120 567372 677485 600852
7880 600852 486030 646187 644113 507998 533414 508081 416226 465820 490906 534011 536608
7869 536608 489823 646275 638531 553064 441784 459389 502438 537029 534862 486444 437921 409670
7857 409670 380953 328274 383561 316025 283772 201158 387161 435478 381300 398257 401481 496471
7845 496471 384856 335554 455476 435328 326726 327357 328405 227269 220203 284758 377896 437469
7833 437469 371604 383098 329979 272458 365360 441471 358565 457344 404487 432612 427093 391738
7821 391738 432851 407962 351980 369358 310543 282218 261932 186434 139803 152603 295397
7810 295397 293852 -38757 85065 623675 518349 432976 407357 360753 398253 463390 422671
7799 422671 271544 365341 391153 535550 404523 371726 289268 225693 299290 233436 280574
7788 280574 426470 342932 286394 314915 207760 352578 405144 404410 383724 462647 401398
7777 401398 149827 201485 360463 299586 274783 317485 423340 394649 379348 316767 275669
7766 275669 359080 336244 394750 334285 319506 434335 422850 397667 281410 191801 259274
7755 259274 403436 250057 229405 394010 412925 344392 331164 258407 330608 333935 308036
7744 308036 470927 426141 336116 325127 414716 469309 333840 261975 308642 469517 496836
7733 496836 446530 469973 469655 487520 495413 423528 355959 381694 416727 322337 301792 402610
7721 402610 412360 433833 471978 406954 429362 460137 515770 545380 322269 333628 358760 271548
7709 271548 341937 348555 285214 235617 235259 369311 407420 395241 342817 403531 338183 352073
7697 352073 473723 454077 369499 352076 462272 384336 342756 413952 451389 436668 429094
7686 429094 430977 374587 442024 339994 255695 319396 399051 384700 452596 511591 526300 559128
7674 559128 537120 511045 577495 655495 574207 362723 325339 500596 616905 744011 623493
7663 623493 603579 611717 477065 404452 414484 337010 369593 453799 456114 456147 536901 573759
7651 573759 585151 663904 666877 579585 604519 547767 623148 573709 506304 453763 446154 564742
7639 564742 522959 395642 425283 478967 439560 519591 595156 582293 616756 606697 541992
7628 541992 513135 510156 582758 575790 523207 528785 544797 539264 507525 425392 588563 618991
7616 618991 573921 551980 645878 860043 784534 785305 792913 683823 661265 577121 727884 711802
7604 711802 602211 716163 712408 620812 636309 710083 749456 765229 669145 750313 749260 572241
7592 572241 649944 645010 778292 733971 771487 886039 808304 827664 804693 906786 828769
7581 828769 768935 733249 862265 900827 760833 764214 790043 700386 746537 874230 907134
7570 907134 935809 842341 853208 753624 851674 800514 928625 781574 763268 783120 991665
7559 991665 1125118 871157 1040428 1077145 966205 899774 1018424 931287 967957 1002571 1072872
7548 1072872 991757 1092494 1140398 1056588 1058246 956743 984232 963508 998434 961846 1078528
7537 1078528 1097141 1082697 969207 872267 864235 842315 958354 1038717 1040507 1049354 991175 1043814
7525 1043814 1104731 1090788 1198222 1239110 1187932 1234435 1281853 1234992 1181619 1166135 1228918
7514 1228918 1232179 1218673 1213914 1284933 1245153 1082828 1168998 1387012 1331435 1316666 1277198
7503 1277198 1334841 1316485 1255191 1303489 1372890 1256061 1289011 1411847 1350707 1298314 1228702
7492 1228702 1357922 1481327 1477227 1443306 1402487 1415013 1308002 1303011 1311149 1378794 1367470
7481 1367470 1286210 1172755 1299572 1318456 1430075 1422733 1420615 1641955 1618023 1507252 1556673
7470 1556673 1556684 1574338 1507261 1529364 1612700 1710023 1740415 1672304 1643227 1603295 1651683 1638270
7458 1638270 1750095 1809474 1853652 1706369 1743037 1851657 1996858 1868222 1832717 1884035
7448 1884035 2014723 1908738 1920615 1855648 1858383 1875606 1825621 1883489 1918796 1774041 1721272
7437 1721272 1894044 1930019 1999091 1965579 1879963 1875554 1965624 2018121 2100118 2090880 2077357 2185239
7425 2185239 2222406 2144899 2281679 2213370 2264002 2337295 2287167 2400037 2476439 2417143 2361708
7414 2361708 2276086 2311469 2313565 2327169 2382171 2352938 2350878 2405073 2324625 2354349 2517282 2552289
7402 2552289 2476016 2517477 2669888 2632443 2561371 2506309 2502849 2528112 2524927 2536496 2516796 2635001
7390 2635001 2731019 2788773 2747347 2703996 2853561 2834209 2860245 2882077 2944475 2989913 3007579
7379 3007579 2970011 2972404 3049129 2955377 2942786 2931622 2982627 2979955 3118886 3076260 3139704 3390374
7367 3390374 3383005 3418702 3352981 3370738 3397763 3385702 3330426 3485283 3460633 3484399 3500800
7356 3500800 3474526 3469698 3644310 3667858 3680055 3647742 3725493 3794501 3684034 3797713 3913453
7345 3913453 4024249 4103321 3919098 3924155 3967787 4015197 4092347 4162628 4144768 4072114 4052534
7334 4052534 4231987 4402833 4295465 4402728 4359269 4263912 4317049 4448103 4383537 4497813
7324 4497813 4469799 4646767 4722658 4847034 4740977 4677378 4753660 4816353 4956484 4837806
7314 4837806 4857557 4999259 5076130 5085726 5175893 5258353 5232836 5251455 5400469 5353773 5215576
7303 5215576 5320404 5359469 5503566 5620755 5646571 5592310 5663875 5821516 5912071 5869942 5823583
7292 5823583 5929483 5965877 6048239 5975363 6112958 6169058 6114355 6114859 6224474 6386090 6491356
7281 6491356 6606080 6604645 6602410 6827038 6868939 6905095 6953819 7048553 7188744 7266602 7209543
7270 7209543 7164553 7273180 7345251 7213968 7325451 7471737 7644543 7853159 7881584 7941709
7260 7941709 7905764 7984576 8102875 8126508 8268001 8339068 8398557 8459072 8422130 8585464 8717501
7249 8717501 8796609 8859563 8822774 8929503 8978951 9077649 9173504 9394338 9495263 9547738 9636033
7238 9636033 9662575 9771264 9824340 9902389 9979742 10116457 10166490 10266684 10357324 10428180 10564108
7227 10564108 10849764 10950067 11063721 11174318 11283618 11251224 11263748 11467265 11521828 11625350
7217 11625350 11727417 11767622 11966368 11959220 12072334 12234514 12462620 12473398 12580912 12764570
7207 12764570 12791920 12896871 12992211 13173130 13269546 13397100 13536768 13582255 13792681 13903412
7197 13903412 14025269 14200856 14357573 14490620 14678703 14807428 14897007 14973008 15103710 15197439
7187 15197439 15351689 15671091 15819168 15948373 15879894 15978290 16184912 16270887 16317251 16561352
7177 16561352 16641884 16733507 16882331 16922097 17140933 17280249 17274684 17475325 17713199 17756373
7167 17756373 17888403 18090668 18250876 18341235 18365269 18471979 18573501 18844074 18960262 18961243
7157 18961243 19019939 19043446 19118388 19373154 19497911 19573808 19748647 19723714 19907569 20003105
7147 20003105 20058457 20123699 20137607 20230508 20325220 20440964 20412808 20527154 20631102 20684415 20727104
7136 20727104 20788638 20862491 20958027 21040036 21140320 21090535 21195617 21371714 21352539 21285448 21202546
7125 21202546 21251843 21161731 21243372 21379366 21382332 21384552 21278905 21222875 21259882 21256912 21229752
7114 21229752 21240141 21254475 21285373 21212960 21121363 21049467 20823941 20898324 20937917 20749068 20801525
7103 20801525 20793189 20801999 20709241 20581959 20447772 20511445 20341780 20237491 20159574 20024940 20150527
7092 20150527 20057059 19832028 19628847 19533110 19422996 19384084 19280139 19204920 19171121 19021684
7082 19021684 18741160 18604849 18539489 18372180 18314271 18239924 18085514 17972038 17840402 17528160
7072 17528160 17465238 17373723 17385925 17259112 17217987 17012903 16860979 16653961 16454538 16453912 16266991
7061 16266991 15924046 15684352 15723631 15736905 15607305 15424246 15318384 15159692 14956530 14860740
7051 14860740 14693194 14636021 14538190 14411837 14221667 13986358 13974128 13936699 14004617 13730861
7041 13730861 13645453 13418405 13270295 13155484 12996028 12833726 12695883 12518449 12452328 12353308
7031 12353308 12289355 12069932 11928465 11670232 11705309 11664686 11487045 11470597 11429936 11281490
7021 11281490 11257679 11157097 11102914 10830047 10725872 10673619 10552350 10488455 10360565 10388746
7011 10388746 10302348 10208939 10077141 10040071 10048858 9890767 9594306 9540504 9335265 9234635
7001 9234635 9168807 9126492 9028104 8977740 9009382 8772588 8740780 8755771 8549414 8531023 8448436
6990 8448436 8310975 8198357 8178888 8058115 7926100 7673169 7543826 7597283 7471186 7453042
6980 7453042 7415409 7254120 7330759 7301539 7178581 7131496 7044274 6842473 6877424 6920129 6787002
6969 6787002 6855466 6894992 6785971 6645406 6375456 6267796 6201971 6125837 6264945 6179390
6959 6179390 6034923 6152559 6059050 5985180 5952431 5908215 5915460 5773683 5714391 5738343 5648921
6948 5648921 5564033 5401033 5339836 5353806 5299825 5256687 5165170 5116932 5052241 5091136 5059923
6937 5059923 4997835 4994018 4946884 4987418 4957366 4848127 4763713 4683651 4617470 4546242 4580212
6926 4580212 4575553 4537039 4522264 4488476 4417482 4380326 4406756 4483537 4483167 4280048 4118948 4151485
6914 4151485 4266722 4227979 4193910 4185964 4146365 3955896 3992818 3940764 3935812 3975179 3855442
6903 3855442 3835555 3744066 3672745 3671945 3660469 3668999 3603412 3524409 3610084 3561859 3601041 3537546
6891 3537546 3614206 3580905 3405870 3391522 3469351 3427956 3256078 3125945 3145579 3297087 3190206
6880 3190206 3191337 3126492 3153149 3156644 3040636 2948785 3038910 3011145 2934715 2933601 2904986 3016433
6868 3016433 3024874 2934239 2802177 2800551 2696971 2657044 2709696 2686432 2752890 2773026 2768250 2729346
6856 2729346 2647415 2515676 2465915 2495623 2542909 2558753 2627345 2665687 2583920 2456938 2419061
6845 2419061 2490765 2650288 2492360 2309324 2298072 2334399 2356317 2338882 2362139 2413328 2439730
6834 2439730 2374153 2434886 2449488 2381027 2304287 2279567 2254083 2113762 2084514 2140020 2058379
6823 2058379 2106620 2083225 2094499 2162126 2102138 1955023 1989494 2003976 2083002 2078671 2098895
6812 2098895 1962517 1967972 2065464 1935997 1912453 1861809 1690580 1714793 1890200 1899613 1849308
6801 1849308 1897632 1838123 1821376 1751084 1728314 1655334 1744407 1766467 1776191 1829906 1715195
6790 1715195 1706442 1768869 1698619 1711836 1773742 1590512 1522083 1563402 1615154 1575481 1517338
6779 1517338 1430362 1428403 1491808 1423226 1494810 1547822 1557297 1540231 1554291 1566747 1518333 1500713
6767 1500713 1527935 1572163 1628714 1624569 1652833 1651918 1546163 1564827 1445215 1287413 1356591
6756 1356591 1417251 1340118 1249470 1175562 1206312 1332382 1338289 1301547 1292124 1261820 1277207 1281462
6744 1281462 1327232 1295616 1273028 1234520 1176078 1120920 1187729 1219653 1276494 1097268 1107473
6733 1107473 1138652 1105514 1127273 1270408 1187592 1161296 1139659 925256 1031448 1063160 1054566
6722 1054566 1035922 981232 985885 954002 971379 828227 893285 972251 1052430 951924 923549
6711 923549 993217 1058802 1135984 1028533 892933 985685 1026018 1028053 967768 960433 1005141 890764
6699 890764 907731 919387 856408 915934 977875 950312 1056066 950030 934788 949015 968292
6688 968292 1044472 984291 913611 895582 887297 916720 925078 988721 870347 906991 890472 933333
6676 933333 894743 887792 864992 913462 950117 923129 1035047 958016 835242 762163 763241 839355
6664 839355 821535 709914 693687 747146 890039 841947 761346 773408 798830 860934 740930
6653 740930 689209 696740 685668 689741 675234 834542 810253 763599 836492 691322 610761 675887
6641 675887 683349 651925 752168 791240 762174 780560 786692 813223 802093 694861 644355 674802
6629 674802 754153 831578 762227 672220 736908 795361 699516 668825 536154 597666 735130
6618 735130 641941 728999 704869 508128 542277 496993 534022 610825 463568 410065 638983
6607 638983 621163 562552 526604 515930 696060 578989 600698 588087 590083 546062 553624 555006
6595 555006 530048 403610 475473 539429 559630 579737 504840 473749 560004 641676 610490
6584 610490 624419 527658 583447 565716 600164 569418 511699 456089 432510 410587 391639 407090
6572 407090 417594 530870 460627 571125 567856 475891 403226 391150 413877 321494 385345
6561 385345 306026 390647 371515 400779 405865 461829 495244 303211 383475 445569 268484
6550 268484 287266 333572 359758 354257 411649 411368 357081 365636 339825 356608 405854 482221
6538 482221 346752 441955 457310 469363 432641 333855 345013 331911 408821 428398 453803
6527 453803 384796 323565 443547 406029 315897 499230 477673 459500 577985 462039 451956
6516 451956 364930 332245 367321 353794 340990 396375 398483 521300 558483 397458 355317
6505 355317 353559 399466 418775 277887 263827 469082 463191 468348 438346 440426 456801 418506
6493 418506 433302 420893 502851 490692 367903 338686 347678 289888 401010 509067 413795
6482 413795 477225 380557 387291 350095 337203 357175 313194 261336 231896 304921 390447 423520
6470 423520 401788 265172 298093 288759 343746 425707 412179 386345 411870 402030 382962 267701
6458 267701 345573 298117 243320 318387 225382 329141 375023 389569 378167 328047 362569
6447 362569 464125 414868 324097 391184 444986 353357 303493 321277 347103 316123 342561
6436 342561 291132 310176 210930 183855 309041 339282 472285 505139 354721 307628 347536
6425 347536 380679 325509 296651 210860 293282 310383 373162 333561 316846 213163 260959
6414 260959 264352 396400 479036 524309 542991 314440 315348 416968 455177 393576 361059 429297
6402 429297 510674 519901 334893 271455 352734 461224 319726 165726 190116 275891 371417
6391 371417 432992 455317 352558 350539 329569 443646 448629 477357 423223 503909 544123 524136
6379 524136 484832 502752 494344 467759 522544 413956 332094 424203 442583 425420 412549 463461
6367 463461 436422 525002 421528 527256 574775 586157 528603 414761 441937 330220 373721
6356 373721 523708 599666 538388 431176 489029 638450 615475 668655 531892 460354 499149
6345 499149 565533 673926 636803 629627 625154 613432 622600 641924 652022 646040 551653 598454
6333 598454 697316 656075 503727 480026 457913 495235 555957 498942 584199 558676 506596
6322 506596 446565 552492 521786 530644 500587 561589 703144 671394 717743 719390 639325 590117
6310 590117 605714 657627 666114 686852 740477 705114 752410 677925 543611 543343 687158 807398
6298 807398 864247 869688 753171 704851 768327 715067 748985 760693 708590 688640 645859 630374
6286 630374 715805 802744 730123 739572 659442 570284 617695 624216 565929 652608 712028 703955
6274 703955 691741 783052 839652 784009 684992 873366 1002908 1040583 898736 932353 1067060
6263 1067060 1021462 1095384 1073119 938893 915896 930986 990828 944154 877088 850777 901001
6252 901001 1065467 1100935 1120556 1100650 1234174 1136098 1108497 1200257 1057083 975451 967058
6241 967058 874640 838865 811967 843890 891861 864360 916087 901231 845326 857239 823161 821716
6229 821716 962698 889809 924990 879893 853670 984814 970102 957532 945275 911011 903916
6218 903916 935802 992580 1057481 971327 1040866 1079011 958162 930844 1006363 959251 1122285
6207 1122285 1161770 1078449 1096661 1215001 1241113 1236066 1244773 1279273 1401402 1502810 1477979
6196 1477979 1439445 1419738 1407223 1451474 1465396 1380199 1423877 1447840 1461738 1352001 1401289
6185 1401289 1456547 1458924 1503645 1418960 1562144 1541246 1513474 1589456 1589132 1576649 1534417 1547712
6173 1547712 1523616 1371031 1454749 1628956 1618614 1485013 1430833 1427864 1382092 1433292 1529660
6162 1529660 1507233 1500418 1410071 1475616 1500405 1466001 1316449 1303985 1400329 1308414 1253030
6151 1253030 1195872 1140529 1045279 1163556 1222959 1168809 1251401 1302273 1250910 1218471 1237822
6140 1237822 1319639 1288258 1234208 1288590 1293065 1360034 1462980 1390042 1383488 1458555 1512126 1536459
6128 1536459 1403663 1591246 1669821 1660283 1596926 1571012 1665086 1543060 1442359 1509466 1539094
6117 1539094 1628631 1633550 1675047 1631604 1669457 1686734 1705094 1799110 1779061 1796348 1775547 1891596
6105 1891596 1898790 1971842 1878375 1899372 1859032 1839760 1896350 1956927 1876572 1977681 2073123
6094 2073123 2021491 2017714 2136461 2231041 2264253 2156091 2270930 2438387 2363248 2359707 2481382
6083 2481382 2676994 2642557 2636906 2640188 2647465 2700709 2811511 2929815 3003422 3045961 3201954
6072 3201954 3336534 3474552 3375129 3551198 3516748 3465841 3672477 3902538 3921946 3956638
6062 3956638 4175921 4390136 4659390 4849678 4961206 4992489 5103545 5417797 5650410 5818888
6052 5818888 6026086 6030826 6332218 6740059 6885392 6976683 7196244 7366119 7481292 7478922
6042 7478922 7565754 7725217 7898732 8151253 8320727 8527862 8704117 8928766 9302325 9632199
6032 9632199 9877946 10256894 10670966 11018932 11313276 11781742 12332210 12804712 13180542 13433330
6022 13433330 13758995 14162896 14355861 14461272 14564044 14583017 14565657 14751665 14698060 14520031
6012 14520031 14437150 14584236 14705065 14675185 14857885 14923275 15098821 15402254 15672389 15875330
6002 15875330 16006542 16391429 16942638 17347881 17856453 18298246 18681634 18915429 19190056
5993 19190056 19396132 19334351 19166183 19061752 18785239 18334932 17996581 17686021 17254657 16897295
5983 16897295 16540674 16111446 15839336 15604658 15407196 15054433 14856470 14771619 14632594 14550083
5973 14550083 14585572 14759805 14820406 14751198 14679021 14715814 14787647 14936892 14764692 14447095
5963 14447095 14263716 14077562 13746073 13224395 12883575 12397075 11757071 11269836 10943067
5954 10943067 10711022 10183703 9666591 9347159 9123840 8856252 8546780 8275929 8099035
5945 8099035 7921330 7792498 7603712 7587050 7357252 7177709 7020328 6928946 6958700 6673174
5935 6673174 6385932 6269593 6179552 5907782 5745741 5607130 5326629 5161686 4910471 4756642
5925 4756642 4701857 4608292 4460631 4340581 4232488 4006636 3764426 3699807 3711838 3627744
5915 3627744 3467174 3379169 3461954 3442255 3337352 3140233 3170497 3101454 2966321 2960226 2911651
5904 2911651 2843034 2915347 2928509 2746909 2628278 2586123 2509436 2611663 2682050 2700813 2614605
5893 2614605 2477734 2336967 2285119 2229088 2357478 2295005 2222798 2257157 2222764 2258582 2236122
5882 2236122 2157540 2210945 2249515 2178753 2117206 2043358 2079727 2051591 2083505 1988262 1900115
5871 1900115 1870964 1864322 1870396 1876993 2005636 1948654 1877053 1820950 1862584 1781714 1661265 1695723
5859 1695723 1660155 1655070 1759674 1771145 1536245 1561001 1641099 1696732 1739974 1692253 1767002
5848 1767002 1643949 1717257 1636863 1571371 1529102 1560646 1626207 1626931 1647298 1699289 1583390
5837 1583390 1537596 1630853 1499954 1565833 1566805 1639047 1640266 1656657 1645850 1493526 1527880 1568026
5825 1568026 1618881 1661778 1637615 1653609 1635320 1481727 1575253 1639366 1529450 1581799 1534224
5814 1534224 1576364 1650303 1666548 1587165 1486387 1499710 1586592 1531799 1446975 1383427 1466759
5803 1466759 1502156 1571410 1390034 1534078 1564842 1438550 1366782 1377291 1406012 1547881 1578154
5792 1578154 1432444 1501983 1531202 1566250 1515312 1609811 1560748 1455291 1447583 1524127 1478931
5781 1478931 1555362 1514161 1718419 1809498 1729125 1704667 1717001 1682062 1612135 1687168 1680009
5770 1680009 1709408 1824924 1844870 1831508 1772917 1822205 1805099 1836933 2025768 1959030 1844990
5759 1844990 1740197 1894441 1997365 2002998 1936715 1931283 1815948 1900932 1993951 2026735 2062703
5748 2062703 2092773 2006194 2038189 2167551 2154641 2039886 2099664 2165839 2116931 2062221 2046599
5737 2046599 2170230 2266625 2268319 2352654 2443977 2367966 2385483 2487071 2510853 2480845 2557596
5726 2557596 2654181 2693737 2784062 2917930 2804738 2824744 2828836 2870324 2843690 2918964 3076738
5715 3076738 3048549 3106038 3109484 3123414 3245112 3341744 3481898 3467320 3533471 3583221 3575167
5704 3575167 3669932 3861311 3766292 3823384 3981583 4050219 4098114 4191374 4257818 4224988 4318556
5693 4318556 4279859 4384462 4547994 4620189 4598095 4710704 4780763 4927338 4977107 4983088 5154500
5682 5154500 5265489 5231267 5408501 5611911 5635173 5637091 5701030 5901943 6023662 6165199
5672 6165199 6355132 6575813 6629853 6606113 6707632 6827222 6896881 7005522 6970397 7051879
5662 7051879 7082940 7057029 7176957 7152517 7182172 7143984 7171195 7230127 7361089 7495798 7435133
5651 7435133 7386217 7347396 7497425 7726791 7817176 7738353 7862339 7915472 7852495 7952642 8157424
5640 8157424 8234751 8301773 8529340 8710530 8845181 8961163 9082869 9095879 9134292 9246326
5630 9246326 9404122 9627016 9836454 10061663 10274779 10416489 10601246 10828469 11117268 11406916
5620 11406916 11703826 12125396 12684524 13280425 13639491 14098350 14682421 15279690 15835942
5611 15835942 16524811 17389604 17997413 18322109 18517829 18455667 18293896 17791220 17198873 16443846
5601 16443846 15468150 14790371 14192907 13295293 12514041 11910811 11369484 10913223 10487701
5592 10487701 10072270 9648163 9327601 9026100 8620780 8257005 8020678 7848785 7664294
5583 7664294 7354997 7123204 6909704 6881144 6799602 6642836 6587972 6543435 6292765 6146453
5573 6146453 6052413 5975728 5844490 5736769 5656082 5647062 5495746 5430867 5511406 5477469 5388840
5562 5388840 5438675 5428900 5458968 5355280 5359114 5354820 5422167 5343391 5283199 5247781 5211748 5252639
5550 5252639 5162655 5045589 5052815 5083037 5090649 5068171 5061619 5097556 5070333 5098999 4973861 4950699
5538 4950699 5058227 5016707 4992695 5180048 5203662 5247771 5242725 5201433 5184184 5252482 5130315
5527 5130315 5159453 5270854 5230132 5133662 5037111 4947602 4946435 5038593 5063826 4978660 5034591
5516 5034591 5108553 5143710 5191473 5111237 5118985 5202199 5152639 5077937 4987617 5093794 5193290
5505 5193290 5210761 5123199 5165745 5128777 5160894 5260299 5209428 5121519 5209647 5281352 5347895
5494 5347895 5294960 5310681 5477136 5475532 5355495 5423029 5474778 5537354 5690073 5740282 5719097
5483 5719097 5780876 5856532 5908939 6025305 6007035 6135972 6265196 6320150 6299961 6443869 6647589
5472 6647589 6695583 6803325 7008192 7133043 7253280 7449267 7632549 7855104 8132567 8216744
5462 8216744 8313568 8337938 8376749 8432408 8433965 8570760 8693383 8690196 8736824 8880548 8973236
5451 8973236 9051608 9324691 9463776 9570016 9555861 9680050 9888427 10033995 10192737 10397249
5441 10397249 10501939 10816251 11001320 11245389 11645624 12039849 12501991 12934311 13265224
5432 13265224 13495783 13859157 14121136 14024852 14041810 14294716 14275951 14377358 14707924 14865406
5422 14865406 15074936 15399918 15752548 16086704 16367098 16786118 17225854 17603130 18076893
5413 18076893 18504303 18921776 19362429 19829838 20465243 21121339 21831427 22537996 23296880
5404 23296880 24107180 24919479 25912567 26898944 27872237 28754352 29342918 30039768 30627520
5395 30627520 31451265 32416917 33348620 34288522 35491482 36812230 38186032 39767564 41537340
5386 41537340 43379966 45492402 47780868 50295292 53111478 56270216 59687622 63629309
5378 63629309 68170427 73255183 79243832 85651389 92790542 100776165 109079094 117758154
5370 117758154 126855564 136023983 145059342 153642697 161399610 167807329 172199201 174012246
5362 174012246 172905244 168872595 162276965 153982088 144704955 134697608 124394956 114271913
5354 114271913 104364608 95001230 86315583 78333863 71218507 65133834 59631469 54757674
5346 54757674 50478765 46839485 43576330 40663776 38160610 35889972 33840090 32119704
5338 32119704 30554919 28992790 27660199 26437882 25400949 24425651 23441289 22635053 21966581
5329 21966581 21257946 20581159 20120802 19544003 18717114 18234238 17823593 17327590 17034895
5320 17034895 16638233 16275011 16001304 15555421 15230942 14842279 14599729 14384336 14155078
5311 14155078 14022823 13752826 13319316 13128624 12957248 12891698 12742630 12565322 12413531 12179305
5301 12179305 12004783 11837647 11823434 11814209 11655298 11424550 11183205 11252400 11147670 10971139
5291 10971139 10982031 10930482 10855838 10759591 10558101 10434036 10418132 10259526 10214538 10241810 10233979
5280 10233979 10103433 10050200 10055376 10114016 10113325 10079400 10092384 10104176 10089651 10173255 10260352 10221931
5268 10221931 10235817 10378275 10514435 10568705 10692377 10777619 10811248 10714685 10907595 10967316
5258 10967316 11046114 11181067 11402095 11584005 11653699 11809899 11970385 12202954 12374697 12613601
5248 12613601 12798602 13005334 13097930 13319069 13805798 14095339 14375749 14707728 14989316 15346650
5238 15346650 15749459 16192370 16658577 17206831 17750668 18370793 19093924 19891710 20498765
5229 20498765 21377588 22317364 23222740 24195277 25277107 26235322 27045061 27862078 28588735
5220 28588735 29046599 29420352 29877983 30161436 30124163 30040684 30083867 30086230 30006851 29995775 29844463
5209 29844463 29849586 29964325 30075332 30129128 30407301 30785271 31237673 31855993 32631403 33349519
5199 33349519 34064298 35160508 36257999 37374450 38375921 39550204 40570964 41655363
5191 41655363 42486051 43116744 43743121 44371275 44774927 45059407 45250923 45414018 45382471 45187681
5181 45187681 44964704 44540002 43860840 43078106 42176216 41158986 40116623 39022062 37922014
5172 37922014 36834029 35877396 35031183 34168715 33417938 33022655 32583003 32367407 32262343
5163 32262343 32263817 32159811 32186594 32339082 32225410 32324791 32432058 32407919 32359937 32160202
5153 32160202 31949250 31604603 30961762 30309975 29509319 28463271 27422082 26230294 24841406
5144 24841406 23545563 22275023 21111518 20132332 19070282 18226585 17353937 16474461 15776457
5135 15776457 15199908 14560065 14065613 13591888 13106539 12668019 12340809 12029597 11696768
5126 11696768 11318933 10832654 10634480 10452302 10241118 9882080 9609012 9464169 9338953
5117 9338953 9067288 8918758 8668768 8630735 8618416 8476995 8373802 8177222 8111078 7996524
5107 7996524 7969253 7871441 7776753 7693859 7689040 7588514 7455125 7344104 7434881 7427034 7478830
5096 7478830 7413125 7292857 7140227 7200616 7235144 7266847 7282131 7159806 7286928 7252831 7123701
5085 7123701 7108422 7216372 7272104 7256124 7326209 7472800 7549178 7515709 7417800 7588108 7642221
5074 7642221 7603989 7683447 7836501 7805139 7922218 8112707 8231423 8302668 8371897 8636758
5064 8636758 8837911 9088689 9095512 9040413 9181387 9307554 9436859 9468988 9691435 9682833 9887652
5053 9887652 9886001 9947763 10006248 10160019 10324901 10393808 10508909 10648010 10884749 11103190
5043 11103190 11331163 11482076 11709393 11833732 12113203 12386154 12614961 12834480 13160696
5034 13160696 13457655 13868254 14259917 14749011 15201609 15611399 15947638 16464547 17144048
5025 17144048 17667872 18363139 19043483 19788652 20757324 21690132 22675839 23718469 24795225
5016 24795225 26043411 27180192 28527236 29935536 31004837 32041243 33129965 33847251
5008 33847251 34428530 34953741 35153720 35212833 35299589 35233059 35076206 34966760 34610280 34476434
4998 34476434 34337633 34333082 34420185 34496674 34718018 34800810 35140324 35705118 36214515 36875522
4988 36875522 37647841 38498288 39368075 40081639 40813846 41484917 42151846 42755080 43000339
4979 43000339 43132066 43106046 43069810 42857568 42562707 42305616 41877179 41271530 40813887 40264109
4969 40264109 39497630 38773627 37896006 36808284 35840967 34864143 33794425 32780125 31727335
4960 31727335 30861905 30039247 29445297 28808824 28373696 27995253 27742991 27572695 27238691
4951 27238691 27049363 27063282 27069237 27088104 27035278 26927337 26868770 26774024 26583052 26310689 25916807
4940 25916807 25435015 24486571 23576558 22865846 21859765 20763652 19901014 19015583 17834926
4931 17834926 17126523 16269247 15551691 15010698 14515759 13896172 13404059 12883251 12472420
4922 12472420 12137355 11864725 11687682 11570231 11098434 10754934 10606007 10298211 10100592
4913 10100592 10011101 9825549 9661316 9598531 9438685 9282770 9116001 9033312 8842569 8575391
4903 8575391 8460139 8401469 8337945 8288567 7955463 7981098 7766833 7668191 7732069 7596915 7437989
4892 7437989 7395607 7402923 7399053 7338547 7334659 7300665 7224854 7199554 7277608 7283109 7207052 7187574
4880 7187574 7077582 6971391 6852296 6912458 6923433 6864774 6737998 6731123 6706080 6614890 6626426
4869 6626426 6494036 6479291 6618900 6691927 6618899 6598272 6531745 6559422 6681482 6665006 6563891
4858 6563891 6653247 6752321 6706747 6756880 6726321 6763016 6889713 6924038 6833365 6833716 6954006
4847 6954006 7030105 6999150 6979157 6998310 7019442 7092692 7142181 7194482 7191483 7211562 7054482
4836 7054482 7138082 7181146 7305959 7305477 7212187 7268607 7254466 7389141 7302310 7389225 7462966
4825 7462966 7507329 7618493 7574072 7473989 7476697 7656122 7747063 7886039 7972178 8116259 8025566
4814 8025566 8103530 8316836 8322517 8335607 8407895 8562433 8667355 8780519 8756375 8872977 9047379
4803 9047379 9141438 9191706 9343343 9533222 9566450 9614805 9910506 9967284 10092143 10043123 10261700
4792 10261700 10435779 10565376 10739261 10810100 11133193 11340551 11397312 11623572 11875900 12122114
4782 12122114 12266860 12421224 12900663 13271741 13481381 13919149 14266390 14579370 14935570
4773 14935570 15073540 15281124 15711488 16154570 16781671 17417355 18100790 19154391 20218628
4764 20218628 21450529 22903540 24680409 26847323 29771108 33663075 38770745 44719556
4756 44719556 50924056 55958713 57929789 56018347 50745635 43940900 37544871 32627337
4748 32627337 29185461 26591813 24642054 23213317 21993451 21080393 20589281 20047260 19527590
4739 19527590 19021528 18818983 18774197 18603077 18516770 18639265 18532037 18502882 18663756 18783175
4729 18783175 18855377 18934291 19285693 19534784 19775319 19996261 20179730 20318685 20650757 20989347
4719 20989347 21195352 21508943 21841959 22332641 22799185 23129290 23544598 24046032 24634171
4710 24634171 25260992 26064946 26876347 27597928 28557324 29627083 31016205 32645239 34614533
4701 34614533 37271062 40537512 44650248 49766571 55728521 61806905 66285118 67575939
4693 67575939 66267858 62892827 57478532 51343471 46168922 42519550 39885893 37781861
4685 37781861 36131953 34877551 33887076 33204764 32611762 32165037 31898745 31470568 31334124
4676 31334124 31134180 31071178 30973599 31039578 31096236 31100431 31405314 31588704 31621002 31824992 32012131
4665 32012131 32246339 32599947 32848559 33221851 33473333 33782882 34260042 34710220 35154885
4656 35154885 35672536 36218861 36851727 37558242 38246571 38976812 39832468 40850793 41863579
4647 41863579 42912965 44047290 45332055 46556440 47876936 49312238 50547296 51763213
4639 51763213 52731106 53869968 55046080 56079139 57098769 58457196 59805023 60985260
4631 60985260 62415829 63746340 64936812 66371575 67460071 68548855 69786910 70823162
4623 70823162 71847348 72972479 74405480 75673667 77130639 78796062 80628538 82747246
4615 82747246 85116943 88028623 91144775 94649457 98747509 103186504 107926303 112551645
4607 112551645 116396709 119317506 121031958 120981108 119497289 116973317 114007265 111314041
4599 111314041 109090158 107651047 107047040 107211651 108071774 109721585 111745723 114429908
4591 114429908 117475394 120411458 123308473 125977776 127990666 128881211 128837116 127912053 126003400
4582 126003400 123261207 120286570 117138394 113980444 111017299 108366360 106129278 104439530
4574 104439530 103236139 102349386 102129541 102269288 102736277 103622677 104764995 106152621 107577317
4565 107577317 109194012 110729693 112158609 113316650 114188227 114603770 114657310 114352590 113729749
4556 113729749 112879849 111560136 110061686 108479359 107005203 105655961 104251297 103078407
4548 103078407 102133393 101380003 100841558 100376407 99910920 99511993 99223218 98716363 98086721
4539 98086721 97082458 95889176 94397833 92427214 90298299 88115639 85724394 83358808
4531 83358808 80862196 78469715 76045222 73938909 71893194 69931353 68220283 66410792
4523 66410792 64714659 63297300 61989148 60568186 59417849 58277764 57182902 55815610
4515 55815610 54628944 53447048 52215230 51157816 49992635 48886697 47961358 46967988
4507 46967988 45912910 44865317 44089862 43143268 42074689 41146168 40326684 39373951 38517278
4498 38517278 37607275 36708229 36100565 35379944 34659566 33970093 33433100 32870295 32411351
4489 32411351 32145819 31930631 31640036 31352866 31264374 30977327 30870729 30764466 30713137 30619505
4479 30619505 30555868 30539303 30371419 30351621 30352451 30446091 30491367 30594923 30696694 30903084 30982056
4468 30982056 31083951 31250631 31553950 31820173 31840586 32039536 32188538 32420215 32641735 32852473
4458 32852473 33038006 33290394 33419504 33673667 33988205 34235301 34613814 35023706 35357786
4449 35357786 35709062 36194682 36406396 36808962 37289208 37957752 38650573 39584452 40465617
4440 40465617 41478680 42504772 43072150 43376884 43497562 43660766 43879988 44461553 45165847
4431 45165847 45982067 46902830 47804236 48748629 49642416 50688841 51828481 52860242 53842932
4422 53842932 54933494 56118888 57348190 58607503 59986982 61482712 63185068 65017650
4414 65017650 66992046 69039147 71302151 73787692 76517496 79675534 83091664 86608971
4406 86608971 90559306 94970747 100086965 106002542 112941909 120790795 129809164 140465631
4398 140465631 152825303 167578943 185349357 206793548 232476596 261992019 293762332
4391 293762332 324483141 348532472 359740864 353403550 330128265 296797711 261398251
4384 261398251 228799629 200778978 177158160 157539876 141414511 127995140 116591432
4377 116591432 106908203 98528136 91140337 84575282 78811557 73649031 69052869 65099633
4369 65099633 61629697 58500840 55704739 52989078 50612536 48492512 46483611 44580970
4361 44580970 42936995 41393357 39866327 38580378 37470318 36294860 35195852 34181420
4353 34181420 33201135 32234378 31443223 30693908 29971171 29200182 28535580 27782269 26999059
4344 26999059 26455402 25873870 25283572 24672377 24257142 23832553 23277312 22810665 22612876
4335 22612876 22399332 22108878 21698262 21384774 21059361 20737494 20439312 20130165 19865582
4326 19865582 19664427 19461575 19089923 18757824 18606426 18387387 18109925 17719010 17420719
4317 17420719 17078336 16753218 16511731 16336171 16092535 15865910 15786078 15524056 15361964 15280238
4307 15280238 15139252 14974928 14954037 14897134 14832982 14720347 14609802 14423772 14515760 14586267
4297 14586267 14438392 14501373 14414218 14248414 14103158 14103267 13930539 13763730 13709721 13676822 13582041
4286 13582041 13524566 13391242 13159399 13100844 12929189 12959301 12928556 12796619 12651130 12581276
4276 12581276 12501506 12427646 12358938 12335311 12321381 12230888 12195026 12124083 12028079 12000038 12040613
4265 12040613 12029811 11928153 11857089 11885447 11734984 11830362 11781883 11800036 11796032 11674278 11852495
4254 11852495 11874607 11795747 11778166 11852277 11874559 11936612 11940873 11864159 11734786 11704013 11899840
4243 11899840 11930089 11981750 11972259 11909686 11896254 11960705 11996618 12076154 12022691 11912451 11994553
4232 11994553 12224856 12265100 12434628 12482266 12588434 12736739 13032029 13342755 13547728 13824601
4222 13824601 14105962 14241892 14308537 14429586 14529424 14528941 14502186 14526120 14540474 14686448 14841926
4211 14841926 14846209 14961451 15093200 15043985 15078569 15155602 15112379 15123410 15210557 15239993 15374363
4200 15374363 15359425 15418655 15633914 15813090 15860859 16125803 16337171 16460001 16675930 16990786
4190 16990786 17230951 17566216 17796620 18079218 18272855 18598417 18746943 19092436 19361648
4181 19361648 19772577 20297052 20912055 21315963 21784479 22426992 23128054 23976103 24670065
4172 24670065 25428950 26359653 27367812 28539973 29912999 31207938 32579872 33692398
4164 33692398 34447226 34621152 34315670 33445404 32157215 30716470 29153011 27658353 26232411
4155 26232411 24826967 23682096 22641088 21573850 20642017 19957622 19324686 18757865 18173035
4146 18173035 17637221 17358891 16955077 16724821 16291312 15834822 15607912 15439383 15310525
4137 15310525 15234655 15230312 14921083 14754743 14731236 14603001 14384027 14172691 14000144 13900438
4127 13900438 13677451 13458232 13185688 13133694 13131317 13015214 12951187 12797388 12741104 12739682 12712117
4116 12712117 12701908 12635714 12601117 12475175 12432252 12346992 12254703 12153844 12201776 12244565 12199566
4105 12199566 12181881 11999907 12022515 11998733 11950622 12003831 12103736 12267244 12318234 12409609 12602197
4094 12602197 12849062 12996924 13216888 13477683 13743986 13847873 14021921 14253910 14383399
4085 14383399 14501435 14588290 14646990 14623311 14510417 14590832 14578030 14744039 14792576 14839439 14957860
4074 14957860 14960342 15106814 15398352 15536753 15722134 16023211 16243297 16530066 16924676 17135100
4064 17135100 17392309 17672478 18030894 18560827 18977694 19416293 19913461 20435411 20934378
4055 20934378 21340823 21637780 22056045 22436281 22846656 23207127 23741921 24311308 24780093
4046 24780093 25210289 25738010 26242104 26911199 27518305 27850921 28318711 28782119 29271009
4037 29271009 29725239 30183780 30666772 31047447 31585347 32044751 32377280 32795220 33163893
4028 33163893 33534593 33880854 34229963 34570154 34764373 35127602 35576593 35951997 36314595
4019 36314595 36699512 37157653 37607841 38006878 38468747 38958134 39403107 39995793 40593359
4010 40593359 41049928 41819849 42528578 43356215 44159695 45108450 46116962 47254439 48336680
4001 48336680 49564329 50848312 52377573 53809814 55361998 57175289 58848877 60644989
3993 60644989 62580621 64459596 66340318 68634243 70865161 73100992 75393027 77651450
3985 77651450 79987531 82470020 84904807 87353404 89746724 92209273 94648560 97057734
3977 97057734 99341766 101433163 103528030 105522880 107319670 109058295 110717571 112123655
3969 112123655 113441929 114604208 115717357 116685541 117338261 117765774 117855882 117592926 117210259
3960 117210259 116683288 115880022 114910318 113694976 112416610 110914373 109232539 107529549
3952 107529549 105637604 103522109 101501934 99350841 96767865 94206277 91743320 89139613
3944 89139613 86407457 83597415 80820986 78243357 75560686 72807840 70191936 67520782
3936 67520782 64904647 62310361 59865627 57433282 55100766 52869475 50498113 48343604
3928 48343604 46437108 44621813 42867346 41014824 39232046 37691144 36319649 34957570
3920 34957570 33607555 32319314 31127747 30007149 28907768 27917032 27032909 26199078 25323012
3911 25323012 24410702 23802723 23175232 22586501 21951479 21411787 20802323 20325979 19813796
3902 19813796 19350152 19020700 18557317 18137549 17752270 17573735 17129606 16653582 16429337
3893 16429337 16182991 15963330 15792361 15507101 15246340 14940053 14779565 14518382 14276338
3884 14276338 14105055 14053416 13955096 13743581 13634804 13412044 13321203 13230728 13168586 13090919
3874 13090919 13062642 12921176 12912391 12790187 12578491 12690483 12757634 12932525 12792757 12747314
3864 12747314 12737891 12722144 12805477 12786239 12856071 12857607 12867625 13044362 13150075 13104882 13033281
3853 13033281 13121817 13157530 13061606 13132287 13332726 13505052 13628204 13886793 14035094 14217246
3843 14217246 14337185 14526154 14719920 14841448 14997672 15228937 15401291 15589477 15826535
3834 15826535 16120744 16504936 16697249 16961327 17236227 17453301 17803465 17953738 18277700
3825 18277700 18828196 19266350 19647915 20200138 20703519 21165841 21721517 22346229 23167767
3816 23167767 23898076 24753687 25642912 26699841 27704030 28775369 30040356 31260558 32549462
3807 32549462 33742921 34808551 35811091 36827504 37654730 38301712 38781046 39038466 39246491
3798 39246491 39250731 39220796 39240210 39026937 38957850 38706036 38340268 37974499 37317871 36708075
3788 36708075 36009667 35102974 34046980 32882751 31768998 30810959 29667061 28509014 27558938
3779 27558938 26708844 25717580 24923147 24113539 23355951 22732959 22259803 21736580 21293179
3770 21293179 20886231 20447637 19964792 19577881 19177492 18929618 18645638 18273358 17940745
3761 17940745 17861034 17680872 17436763 17346388 17166147 17182361 16967593 16835839 16765723 16696777
3751 16696777 16520963 16450034 16455351 16478484 16462045 16572203 16592860 16446022 16276458 16247652 16271245
3740 16271245 16377820 16353802 16309135 16397584 16523340 16592443 16665538 16675251 16639390 16736304 16801325
3729 16801325 16929067 17001245 17058974 17126209 17147601 17320662 17495717 17613583 17737788 17773294
3719 17773294 17967563 18090120 18367203 18618315 18851563 19026806 19322754 19540502 19679071
3710 19679071 20010858 20175614 20566895 20862511 21149439 21308515 21577211 22020616 22471524
3701 22471524 22726386 23080548 23612678 23893219 24210768 24609984 25084324 25471749 25851293
3692 25851293 26205251 26724435 27224138 27584927 28184192 28580846 28980891 29629717 30118705
3683 30118705 30418053 30882300 31423338 31878718 32427014 32809531 33348221 33884511 34452594
3674 34452594 35105915 35794794 36327374 37051135 37744729 38524310 39185083 39895114 40753825
3665 40753825 41598971 42512971 43445774 44526243 45496810 46628961 47839579 49050086 50345747
3656 50345747 51781456 53221260 54796532 56441014 58022149 59821075 61667755 63476592
3648 63476592 65587375 67649736 69862632 72101039 74331874 76706788 79053900 81427813
3640 81427813 83855016 86227122 88521862 90834024 93220997 95450093 97605159 99829456
3632 99829456 102053634 104225495 106223299 107961699 109756471 111479688 112988869 114219502
3624 114219502 115564519 116652372 117683332 118467740 119095726 119643186 120186345 120509848 120741793
3615 120741793 120943108 120914076 120973120 120911471 120723172 120428437 120177374 119719550 119264959 118741295
3605 118741295 118127299 117645855 117283765 116841634 116234010 115833726 115439396 115021899 114564449
3596 114564449 114158001 113942890 113661893 113254248 113014441 112913257 112842038 112877276 112877937 113174864
3586 113174864 113502639 113982488 114529701 115042275 115755435 116647806 117527311 118575432 119741330
3577 119741330 121207074 122736409 124333449 126022059 127767840 129654047 131725049 133903002
3569 133903002 136145397 138228556 140301926 142236713 144255717 146152962 147946958 149848074
3561 149848074 151510782 153117531 154539598 155863304 157132248 158224398 158988064 159465823
3553 159465823 159715805 159720127 159387068 158843743 157779594 156579762 155193090 153665921 152085407
3544 152085407 150405687 148507614 146548808 144683732 142676799 140394368 138138486 135777601
3536 135777601 133547142 131347829 129086318 126839272 124627076 122644421 120736620 119007798
3528 119007798 117436388 115938978 114624168 113803552 113183389 112741685 112455824 112405309 112485285
3519 112485285 113113233 113727969 114625409 115778410 116996932 118161630 119592968 121072619
3511 121072619 122710609 124299501 125674554 127333928 129000612 130645861 132261508 133837363
3503 133837363 135600761 137182627 138606627 140111774 141448391 142574051 143527989 144225420
3495 144225420 144730024 145073592 145241379 145382730 145282932 145075049 144684934 144508309 144287459
3486 144287459 144225185 144259499 144382115 144630376 145075564 145877477 146790095 148126225 149877778
3477 149877778 151982405 154489931 157377316 161034013 165439231 170597024 176436573 183063050
3469 183063050 190372324 198016586 205962690 213792049 221072004 227808236 233558142 238326881
3461 238326881 241884240 244287073 245579380 246087776 246315864 245997162 245267393 244138784 242788967
3452 242788967 241034761 238666090 235377856 231055798 225694369 219119866 211488300 202989621
3444 202989621 193875689 184509382 174832496 165180296 155863540 147403958 139243261 131608145
3436 131608145 124487378 117803254 111759092 106044364 100825521 95935699 91520105 87212735
3428 87212735 83218253 79588249 76217560 72981501 69838593 66953169 64112843 61295909
3420 61295909 58711233 56242864 54045863 51838541 49770098 47767629 46045026 44445698
3412 44445698 42799426 41286345 39798687 38486799 37315673 36170641 35095307 33956598
3404 33956598 32891199 31944812 31052191 30208823 29490674 28702029 27944753 27269882 26758771
3395 26758771 26028942 25415818 24954763 24415794 23888364 23343088 22816471 22160978 21690501
3386 21690501 21247406 20836457 20352328 19885243 19558028 19231180 18759515 18386848 18089706
3377 18089706 17663825 17305058 16975317 16608436 16215177 15963733 15697064 15449281 15134980
3368 15134980 14870424 14512791 14144233 13924785 13811116 13509343 13366174 13251042 12935412
3359 12935412 12823272 12677211 12506648 12355082 12181776 12008526 11797195 11733272 11677089 11508841
3349 11508841 11360157 11047773 11013167 11098979 10953101 10783258 10687340 10460463 10432029 10427787
3339 10427787 10374563 10203730 10103352 10138313 10064042 9960697 9832231 9760114 9755020 9572709
3329 9572709 9552873 9535397 9596981 9482845 9468377 9343264 9301830 9292178 9256038 9264468 9220347
3318 9220347 9090745 9110650 8995995 9020743 9092274 8991175 8926039 8813720 8748400 8781242 8732128
3307 8732128 8690765 8650783 8529484 8474749 8454377 8357496 8410383 8313662 8140858 8053523 8019199
3296 8019199 7948324 7877244 7839378 7623851 7708229 7675740 7622137 7552809 7537199 7555460 7567413
3285 7567413 7418366 7378302 7595522 7392560 7249956 7307949 7401466 7399162 7474824 7545518 7466374
3274 7466374 7379004 7336617 7494812 7520224 7487159 7403208 7353154 7405297 7458725 7459896 7544164
3263 7544164 7590007 7685343 7723209 7708523 7744910 7659105 7736766 7832154 7859072 8009862 7932305
3252 7932305 7948745 8007745 8256207 8379073 8557176 8826599 8992219 8911334 9101477 9199449
3242 9199449 9327352 9606300 9888782 10106925 10481298 10767351 11063647 11484581 11698321 11868787
3232 11868787 11993858 11881013 11640488 11438719 11135835 10800883 10610267 10461370 10386827 10306489
3222 10306489 10021607 9906113 9870510 9823915 9854779 9981130 10125280 10240544 10182114 10348037
3212 10348037 10489448 10500339 10202809 9789447 9400189 9037807 8801839 8400014 8132823 8016050
3202 8016050 7810256 7589167 7535331 7395874 7297971 7264202 7285862 7103079 7031554 7054308 6963362
3191 6963362 6920932 6953801 7050049 7100474 7212925 7298055 7684449 8029217 8443944 9006889
3181 9006889 9591343 9748405 9568034 9081133 8433728 7851394 7400600 7027759 6703719 6534155
3171 6534155 6427201 6269279 6247943 6088123 5971042 5850894 5774808 5655518 5669029 5560139
3161 5560139 5476604 5397933 5430121 5467643 5466534 5550783 5500751 5550091 5541392 5752269 6064819
3150 6064819 6296378 6257617 6236030 6010379 5631367 5222576 5041828 4606699 4398019 4231444
3140 4231444 4160071 4139481 3955482 3771885 3794899 3905432 3802662 3784985 3798102 3812923 3745681
3129 3745681 3741000 3742112 3670076 3645972 3770452 3865055 3744605 3809692 3861628 3857096 3826135 3764232
3117 3764232 3864260 3882673 3936438 3851364 3747955 3820918 3911665 3865315 3831343 3766206 3706767
3106 3706767 3792878 3757323 3620190 3465576 3527876 3521733 3457789 3469317 3346679 3271380 3160766
3095 3160766 3200437 3228756 3186431 3067774 3060002 3003622 2913423 2809883 2716099 2802703 2796247
3084 2796247 2637232 2644261 2618547 2668861 2689430 2701154 2596417 2575675 2578416 2442105 2527588
3073 2527588 2535801 2569979 2591754 2524907 2571744 2543387 2541581 2333045 2318046 2379540 2455385 2459812
3061 2459812 2235552 2236132 2189088 2117134 2180032 2178058 2193730 2237385 2112317 2100232 2191463 2191260
3049 2191260 2110491 2186289 2183465 2008791 1979461 2106325 2123702 2075396 2020566 2025863 2055239
3038 2055239 2026381 2033524 2040098 2090420 1901505 1859784 1881417 1943274 1873624 1729549 1679780
3027 1679780 1708347 1776311 1769324 1708787 1573498 1653562 1544479 1521194 1403923 1338657 1429059
3016 1429059 1525111 1632793 1560462 1531670 1513438 1465852 1436563 1434701 1459854 1415171 1423064 1446333
3004 1446333 1481100 1440379 1492084 1428584 1308485 1262747 1343416 1297742 1285814 1203919 1207810
2993 1207810 1329718 1331759 1360264 1467063 1479954 1370291 1362215 1352953 1304742 1273900 1355921
2982 1355921 1443626 1460605 1486473 1469945 1507050 1472470 1454053 1398907 1360201 1487172 1411730
2971 1411730 1342380 1360913 1268123 1330172 1375011 1390356 1420039 1350845 1287356 1294014 1347946 1389078
2959 1389078 1471440 1450899 1438722 1333868 1242778 1367722 1344912 1427449 1641094 1536921 1383727
2948 1383727 1373516 1537868 1555240 1436113 1456147 1322238 1243504 1170602 1321607 1385686 1398885
2937 1398885 1461431 1479394 1457321 1340135 1503111 1583361 1723179 1679109 1567082 1584635 1544841
2926 1544841 1538728 1654567 1794480 1885551 1917097 1746494 1776322 1897283 1908282 1883570 1801336
2915 1801336 1735587 1782193 1790014 1702899 1776098 1915969 1940373 1819646 1789213 1843047 1913046
2904 1913046 1962240 2018575 2010417 2079865 2152635 2249456 2210420 2158052 2237943 2361276 2367793 2312291
2892 2312291 2393961 2443517 2412316 2434165 2387337 2363881 2234458 2206294 2316157 2357847 2383922
2881 2383922 2525330 2438687 2334138 2318069 2382424 2458385 2396643 2347636 2346626 2406398 2457865
2870 2457865 2467051 2468501 2649147 2694605 2662757 2689559 2769782 2895053 2875012 2962430 2799554
2859 2799554 2976135 3043253 2892503 3000867 3069143 3123631 3262247 3373883 3359116 3589439
2849 3589439 3743648 4012122 4269997 4449862 4743666 5073969 5390203 5773280 6038441 6165270
2839 6165270 6047596 5974246 5506571 5031977 4594496 4212907 4001358 3721612 3487643 3345552
2829 3345552 3243596 2939217 2802831 2606906 2414519 2361227 2194799 2034533 1925393 1822482
2819 1822482 1757320 1664431 1781898 1678804 1547612 1513651 1421426 1369157 1349972 1400609 1367160
2808 1367160 1426446 1355378 1451298 1415544 1306879 1273731 1197201 1230023 1236814 1176939 1086094
2797 1086094 1103575 1113930 1001442 977103 955084 882668 924052 880811 907636 997641 931919
2786 931919 789640 790503 851838 877308 810925 769404 811112 745081 657561 631106 676577 761114
2774 761114 733212 664515 813541 705456 585663 626946 697584 684199 627012 562897 599719
2763 599719 570700 549546 662615 651873 586631 579665 624430 575801 567092 484566 524557 460055
2751 460055 436916 512629 416752 288841 355698 464130 566976 517669 397179 407646 416800
2740 416800 465536 445984 429339 412884 419436 409167 358281 389833 482814 460553 457044 426181
2728 426181 455071 408170 409443 458184 446428 440333 451884 292233 273094 255375 292094 301112
2716 301112 430799 482077 468652 375783 236560 162341 107697 206027 303410 345482 303428
2705 303428 307326 258420 296636 240123 279475 311538 429506 299704 323099 408914 394112
2694 394112 299156 156167 75060 96920 215319 314828 205891 291793 300824 297628 201652
2683 201652 140618 197861 230635 220551 431655 553187 344726 171933 50184 115103 131790
2672 131790 245224 166302 65072 150033 189545 261544 242186 267141 208333 247904 391711
2661 391711 415514 261178 120088 159457 94716 197028 270170 319402 402005 382237 193988
2650 193988 218862 376471 388544 346945 200613 98668 82001 63293 142324 265157 295843
2639 295843 114881 126431 212791 227503 176984 237302 236523 313401 299755 238032 286169 306525
2627 306525 269354 286488 233706 140880 172787 194852 256945 275140 213361 318898 245060
2616 245060 154119 183259 246078 255484 226996 220304 92419 33345 115687 195580 295751 243567
2604 243567 200317 213771 93010 78587 149234 247520 176321 292482 320554 361865 315014
2593 315014 342324 215295 69034 131501 352377 374755 263762 251462 185242 127842 159530
2582 159530 132527 84714 158258 135738 83885 42395 128407 113206 61094 124640 216717 234783
2570 234783 247160 275948 90879 115221 172046 143808 138436 -10370 91958 54834 62508
2559 62508 78518 231481 234935 215516 184936 118189 121743 211798 179336 202326 373445 189744
2547 189744 35925 126493 196844 24287 216389 153021 103285 155149 280711 231044 182623
2536 182623 163599 186760 220813 237371 129328 90777 52387 87725 27884 10945 23873
2525 23873 -10372 43426 32433 -2345 114563 136054 18097 54466 29780 157223 81802
2514 81802 143152 189291 141074 76000 43093 161613 263604 219788 223673 100976 98486 22658
2502 22658 67194 52296 116113 198008 181506 22311 20280 151620 46187 25838 51836
2491 51836 -30907 35740 85052 -6303 -41428 -36673 -54560 110127 256526 92371 -4787
2480 -4787 15086 115987 182146 176449 191318 221930 172873 154311 132500 212822 213132 156369
2468 156369 221987 132592 117085 73003 -50791 -22059 21895 -10139 119386 78124 139049
2457 139049 135295 165352 103945 29506 12393 6731 82576 70116 86623 119823 82776 161872
2445 161872 201066 201457 149392 5503 72263 105268 91582 20654 93285 -90749 13929
2434 13929 670 105859 133489 175753 204211 118099 51216 -22906 -35352 38324 33425 86011
2422 86011 91699 -27258 -14779 47905 220028 131030 147655 160416 77639 32202 41949 5208
2410 5208 34475 -54092 -43073 -16301 -121225 -20958 -79009 -102326 -3744 -9296 11290 4750
2398 4750 127766 135063 172656 100812 -19443 -15428 -93330 -35691 -17596 -9562 105702 169255
2386 169255 115575 82585 68928 -49590 123559 -30545 -81319 -18479 -37273 138009 103195
2375 103195 48987 -48205 73928 49951 66782 102917 120464 91536 76508 180296 313210
2364 313210 261647 132170 73200 229942 252570 189007 149027 160427 161704 211815 170035
2353 170035 30353 37745 130796 27196 22803 231078 92242 39113 55572 19855 11153
2342 11153 45666 -13679 -81182 -17331 -106214 -6892 -99521 -42712 66717 49960 144133 80259
2330 80259 4917 34869 87379 -14612 69369 101663 168856 147306 34821 97554 15423
2319 15423 -7392 140205 189497 26804 39837 21557 -10318 100415 115623 -74888 -147837
2308 -147837 -35722 49449 113728 92210 -12709 -92663 6994 -38752 -125259 -44350 62909
2297 62909 92258 48305 78030 10566 15587 3267 -20314 -2582 -8635 109058 94866 73427
2285 73427 89941 84292 76999 120733 45536 172093 204072 126331 42940 126567 18067 38863
2273 38863 -15401 -51255 -63305 -29231 -16337 29395 88530 143058 178662 114115 99069 193793
2261 193793 174208 155336 111957 46588 122370 23951 16145 40675 171045 188217 171728 184589
2249 184589 102551 339140 287193 149389 221607 287205 229408 231552 219109 146860 223903
2238 223903 205043 238187 136685 127769 160346 133972 263463 179942 209904 216170 112081
2227 112081 195060 259828 131688 199384 249735 110806 164072 213452 169669 129629 142764
2216 142764 226155 191053 206654 269649 202344 108420 81401 168345 196535 216239 213842 313562
2204 313562 324222 334750 293717 261495 195802 286741 295023 280807 248960 354127 403413 347635
2192 347635 365164 412808 350469 332865 287599 330466 416606 420650 521003 490744 435707 444482
2180 444482 442763 432454 480794 546285 516079 534706 468292 446248 442428 478333 343656 391706
2168 391706 345906 458202 545958 469935 515476 578852 579709 670818 670864 577646 705451 672498
2156 672498 689018 721465 746382 811860 900590 990510 1060519 997508 929570 899434 995097 1098675
2144 1098675 1093305 978405 1045384 1008221 995981 1086890 1196058 1274660 1282320 1368608 1363627 1521498
2132 1521498 1546702 1591320 1560965 1573805 1635402 1655018 1748631 1761422 1761310 1981099 2124936
2121 2124936 2204912 2308777 2386554 2522713 2609335 2824573 2978067 3053054 3253767 3475011
2111 3475011 3640087 3784159 4035194 4287747 4582078 4821204 5184519 5818452 6391485 7215981
2101 7215981 8341171 9707700 11786474 14570546 17957711 21466049 24529179 25631340
2093 25631340 22469267 17455438 13462631 10875890 9095820 7586883 6387520 5754572
2085 5754572 5118096 4551183 4191293 3866826 3574417 3268046 3110182 2781897 2541885 2321500
2075 2321500 2098692 1974575 1863905 1758191 1540146 1494998 1500521 1478796 1257800 1169997
2065 1169997 1131060 1123649 1110446 1026053 954475 1003002 913927 797581 915956 892863 728125
2054 728125 647129 639273 724302 758219 582229 617805 727333 678875 607790 501081 471693
2043 471693 507008 577624 391552 405610 367127 389800 396847 293542 209450 318662 300986
2032 300986 388281 440005 337132 301982 310644 308242 261227 208166 151931 334658 361239 356965
2020 356965 359083 389068 291292 252989 317072 309703 206870 169523 117019 158969 190450 332025
2008 332025 184039 109782 113158 67518 78877 101285 101841 38872 155554 183488 128433 54935
1996 54935 153747 240134 109484 213255 158422 112653 101689 130559 139862 71964 85687 -19239
1984 -19239 59290 63812 57416 75273 114325 239946 221903 248230 123857 39090 26686 -46119
1972 -46119 58401 242235 242511 38020 -44328 45411 37798 107576 132663 115555 78853 92762
1960 92762 65121 180257 170891 -7733 22969 57052 172504 41058 -103651 -35681 -23395
1949 -23395 11119 42497 80449 153140 168459 28072 -19552 -29564 18718 134342 105846
1938 105846 1914 37270 36174 46236 -18293 93467 75382 111798 56148 -60779 -79919
1927 -79919 -150346 -108429 -65446 -12415 182273 114679 -45751 -160896 -83370 153419 37246
1916 37246 -26457 -58057 125134 121337 -10093 26013 -51398 -79376 -102126 -91585 -126552 -8588
1904 -8588 -12526 -104224 -68754 -91170 -65945 -9974 87550 60987 137309 127083 -43977 -36351
1892 -36351 -6073 51063 75514 -49095 -110055 -94658 -153663 -191563 -120157 -33329 -26811 -53257
1880 -53257 -29606 -42999 -18914 -77174 -75972 -54853 37372 -6509 -33800 -61660 -63009 -80415
1868 -80415 -12961 21530 88631 -10169 -83679 -142651 -191819 -163423 -42741 -47245 -48674 -75681
1856 -75681 -98378 -93662 -60546 -1581 -18907 -57626 -110656 -25956 -4394 13499 -19440 -39452
1844 -39452 -101326 -33911 35757 -86153 -129330 -72092 -130799 -235736 -88503 -27473 -66493
1833 -66493 -108227 -134210 -126837 -32003 -49345 13037 17521 -80650 16784 64521 48778 66480
1821 66480 116807 112759 72820 115691 113442 42640 -56409 -64705 -117952 -21756 -27999 -25968 41841
1808 41841 53099 98596 82197 20613 -24070 -23199 24508 -36500 -20292 -16262 -118248 -51117
1796 -51117 7049 34770 -103004 -40846 46949 78485 117405 138775 127864 87985 53599 54095
1784 54095 100894 103202 -6167 129690 76684 14866 9984 53774 112796 44125 -32248 -64070
1772 -64070 -123535 -135289 -133189 -33044 -71144 11540 45985 11276 -90948 -125721 -27929 -26793
1760 -26793 -60864 -7832 -56691 -134629 -77764 29854 22953 -129430 -3458 -73866 -60684
1749 -60684 -70867 2559 111690 -80495 -144839 -130219 -107042 -40817 -445 56782 62019 83147
1737 83147 -43498 -128821 -59748 -1776 -28217 -103699 -52062 -25170 -42602 -30085 16592 -26207
1725 -26207 -38349 25450 -18577 -41372 -10982 -29199 -70041 -91718 -119797 -129926 13178 -23030
1713 -23030 -56575 -20676 18294 77425 107514 87899 121784 -47290 -23947 -18719 -109517 -156485
1701 -156485 -105122 -2718 -148689 -110644 -26000 -52285 20353 -28890 -58512 -60820 -50785
1690 -50785 14708 -35692 -24449 -25627 -119804 -73849 -104977 -157622 -118796 -191487 -196935 -135973
1678 -135973 -177773 -192924 -160903 -103946 -11635 24748 -18017 10581 84023 -42589 -82617
1667 -82617 -35141 -138217 -81814 -136675 -158137 -63826 -79778 -79179 -150270 -6847 -97135 -186767
1655 -186767 -56013 -109994 -105712 -43638 -70206 -106449 -142851 -156794 -56480 -77227 -105531
1644 -105531 -32060 41296 -62740 -166524 25639 -120131 -14522 -7595 40505 97864 79928
1633 79928 -14886 -21197 -103237 -168198 -78106 -29045 -240540 -204679 -211633 -171794 -108287 -22862
1621 -22862 79618 37272 773 19916 -110807 -90244 -21551 -24558 -45760 -69181 24846 -25417
1609 -25417 -88230 -137332 -30416 -97762 -167458 -166525 -163864 -89574 -27077 -39464 -54809 -182396
1597 -182396 -191334 -124675 73004 2551 -127646 -37754 -7289 -46813 31180 10514 74244
1586 74244 75202 -135 23028 191839 207352 -53577 -127425 -156649 -71494 -50969 -142545 -221186
1574 -221186 -184279 -136257 -149066 -73651 23735 -161985 -220591 -140780 -182722 -167532 -185241
1563 -185241 -214671 -149136 -40077 -137561 -221262 -84388 -13282 -18690 -155990 -222334 -56741
1552 -56741 -9254 -152324 -260241 -155349 -208706 -75186 48717 85842 -68222 10611 71147
1541 71147 54173 -84688 -129034 16291 40371 -51394 -21391 -27847 11090 71858 16309 41204
1529 41204 7287 479 665 18167 -29522 -52008 97529 178070 164661 42591 20447 -70918
1517 -70918 -180316 -206004 -69253 -9151 -115652 -134929 -182112 -142400 -81765 16062 -21133
1506 -21133 -50540 -31698 1660 36321 -99269 -89627 -131050 -130609 26845 -76041 -148480 -147527
1494 -147527 -51972 -99701 -235843 -250438 -193326 -102132 -52926 -106286 -72174 -140642 -145013 -130957
1482 -130957 -38769 -15606 -67535 -50575 -16113 -13994 19968 -10272 -48089 -2884 -53445 -136586
1470 -136586 -110686 8984 -74166 -85046 73116 11090 3515 -9505 -43203 18861 -25856
1459 -25856 -52542 21607 -44259 -96731 -82671 -118956 -98157 -97964 -74814 -69901 -44129 34716
1447 34716 56788 56452 -4116 -98986 -64673 -111782 -80260 -14634 -62657 -189547 -283228 -189339
1435 -189339 -151975 -115935 -77656 -134427 -101359 -71228 -47089 -15106 36499 -81713 -25213
1424 -25213 94308 25557 76300 2317 9646 -20642 -132775 -53258 -384 -81068 -52801 -68639
1412 -68639 -125810 -60464 -122217 -173638 -174366 -101385 -63998 -112752 16267 -65253 -124934 -78761
1400 -78761 -27965 50451 60683 18776 12321 46697 17361 78058 -17775 -138604 -56574 -167871
1388 -167871 -160397 -75566 58212 13414 -84472 -76244 -133822 -124663 -113001 38082 78936 5340
1376 5340 -110542 -86719 -34352 -28633 -70135 -84389 -100966 -145648 -39555 37652 13992 83564
1364 83564 -29022 23430 125295 1685 -18906 -92222 -77879 -196226 -51049 -60316 -153168
1353 -153168 -167101 -233146 -211940 -140665 -3808 20122 10780 42563 11854 -8043 35085 62243
1341 62243 3576 66289 70391 139538 42537 -92770 -71550 29069 41419 -168550 -20592
1330 -20592 22275 -76012 -92548 -10920 95879 73069 -14904 66125 24979 -67685 -49449 -64392
1318 -64392 -71254 -49950 -86750 -11658 -23152 -73297 -58370 38975 -99135 -125121 -105108 -94072
1306 -94072 -77498 -17622 -59478 -65548 -1629 -20734 77210 77642 78039 61235 -48091 -19298 9917
1293 9917 -80758 -48176 -152501 8830 -20096 -32982 85017 44766 71585 42680 75109
1282 75109 15256 -36472 -74941 -130658 -26743 54107 -2750 -70874 -102848 -29233 -127363 -256182
1270 -256182 -207904 -55055 -20159 -109217 -106037 -93176 -123181 -84189 -62689 -195516 -183642
1259 -183642 -133156 -196211 -159697 -56649 -98165 -68167 9341 -38281 8576 27838 48609
1248 48609 -91507 -230727 -34515 -14074 -81726 -81463 -144870 -78891 -98298 -135126 -193465 -146593
1236 -146593 -153583 -102659 16660 -49100 -175159 -127819 -164798 -84408 20471 -68916 -101613
1225 -101613 -148526 -87561 -20007 40546 -14372 35828 -39137 -111439 -83744 8091 28541 11370
1213 11370 -80007 -232762 -145655 -56992 81589 29435 -4953 -84690 -101972 -24670 55078
1202 55078 37060 -50536 -42469 -39880 47039 -45108 -20739 -52720 -687 110747 -8052 -142192
1190 -142192 -19698 -59489 -57518 -6321 -60748 8959 -50043 -68798 22447 -32006 -14528 67277
1178 67277 152030 67689 -144150 -116819 -52302 8153 63861 -28225 -142473 -37030 -14183
1167 -14183 -178757 -148479 -81305 -124433 9137 89438 -16000 36385 -11753 -169621 -9529
1156 -9529 20854 -76115 -62983 498 -73791 -80227 13620 -87651 -133566 -97631 -11490 -84193
1144 -84193 8491 -12821 -157353 -40834 -23231 -84478 -67515 -9251 55748 -135494 -132629
1133 -132629 -39216 32106 -9272 97572 147648 11289 49128 85787 58069 -16230 51571
1122 51571 16521 68647 74903 17392 55274 41243 -42188 -39607 -63940 -93379 -65432 -82984
1110 -82984 23877 -8505 -2245 -112509 33384 -21806 -57470 -9147 -59425 -131624 -58280
1099 -58280 -31875 29191 45493 -130100 -113098 -70898 1649 82569 54381 -85904 38467
1088 38467 6701 22457 -13621 -14627 -20690 43108 -3603 45669 -64891 -88920 -50231 -81748
1076 -81748 -97346 -98423 -51761 -10981 59887 76683 9427 65646 968 1360 -31096 -157096
1064 -157096 -91603 -35210 -73539 -58452 -90845 6130 -81350 -47562 54295 193171 97375
1053 97375 43493 -47423 -100714 -39049 29960 -3834 -6410 96475 18901 -18382 4034 38901
1041 38901 21848 40066 2848 -1405 -40404 -218428 -179860 -218744 -211731 -107835 -72544 -37865
1029 -37865 -94295 -53984 -126272 33658 136548 130976 36206 -34041 -71211 -171292 -244761
1018 -244761 -166439 -186595 -76606 123221 74316 -88104 -33543 -33741 12271 98251 73320
1007 73320 -92613 -12973 23153 14293 -79185 17728 112654 50285 -50228 -66379 -70476 24033
995 24033 -67291 -108708 -21555 -5303 32748 148728 36325 -143793 56600 58989 30004
984 30004 55412 -69029 1050 23123 39753 46620 -5394 55915 14923 -8334 -103818 -122699
972 -122699 -148356 -102725 -19697 -20335 60584 141937 30180 34110 -1378 4265 -146039 -110692
960 -110692 -105103 -14577 -15647 -73416 -104044 -108621 -92614 -114932 -165241 -142186 -70554 -150786
948 -150786 -35299 -83371 -167598 -211180 -119976 -107225 -106382 -68002 -68845 63041 -55169 -237224
936 -237224 -59225 3118 27043 22512 -25299 -2206 118252 69233 -6366 -61991 -63766 -91113
924 -91113 29077 -3273 -50193 70398 70850 82724 105341 -56402 -52065 80069 98928 31288
912 31288 -69026 -44931 -133105 5040 12450 -66943 -34139 -39541 -19074 39300 -13140 -22164
900 -22164 -73665 -20163 95062 45473 11002 39118 62912 3128 -18682 62407 -133694 -116433
888 -116433 -89211 -128219 -67856 -2484 21784 40996 -32268 -131407 -205050 -149513 -88556 -3455
876 -3455 31228 -232674 -189962 -118074 -22240 -59178 -16802 -120587 -90234 -1569 -181918 -60753
864 -60753 -63263 -153994 -60115 8732 -110764 -89137 -121418 -145522 -177409 -46619 -5008 -144775
852 -144775 -187049 -181858 -91933 -181682 -185644 -91511 -173789 -54567 -57508 -164406 -51139 33807
840 33807 17279 -23179 -25357 -463 -4028 -110168 -140976 -108621 -31000 -95897 -132349 -81578
828 -81578 -48750 20038 51672 62952 10640 -74512 -83408 -46819 -111562 -86229 -49484 -36892
816 -36892 27148 36116 75430 -7501 -35347 16788 123453 81129 -51575 24876 71924 -64469
804 -64469 -80444 -109379 -8227 68785 37378 120864 139641 129695 2410 -86712 -125153 -1292
792 -1292 -40517 -101496 55763 -74414 -121177 -85666 -56099 -57250 -105024 -92706 -164635 -106275
780 -106275 -53320 -57572 -49823 17895 -135754 -92286 -43581 -65841 -44377 -107860 -97159 -94930
768 -94930 -65923 50237 13761 23913 46991 -18712 36835 53245 58125 -74765 -20961 20915
756 20915 21067 -81228 -58971 51098 130948 179673 86040 50463 -7270 -97935 -14189 -51728
744 -51728 -66250 -82929 22934 -8984 -100045 -25360 45904 111390 79227 62170 70967 -11896
732 -11896 -129071 -112772 6474 27931 -7277 18950 -28605 -7727 -35321 -123741 66616
721 66616 126498 75262 8789 -1305 3432 14513 -26004 62422 -4209 9413 79257 67101
709 67101 244233 72122 -10383 382 -51317 -85334 -4722 69591 93835 75687 94964 40879
697 40879 66323 79114 88383 -21160 -77210 -34403 90036 65612 69416 66530 35578 42133
685 42133 -19813 -124392 -104078 -190789 -193117 -154666 -66072 -112865 -161108 -18583 51080 28842
673 28842 -96070 -40146 -47394 -7955 -82350 -4249 124147 15040 -968 -36666 -52452 61324
661 61324 57580 5570 -41996 -91776 -27300 -30870 -9323 181247 70301 143540 160737 -119839
649 -119839 16477 128528 -17046 28939 48693 -9383 -68044 -68589 -47549 5910 -11829 -121073
637 -121073 -71243 -71940 -53715 781 48243 7717 -69465 -159034 -9868 17565 1017 153499
625 153499 48342 -39826 82734 245640 188181 195289 126160 55370 72856 74081 182574
614 182574 90527 38682 -27571 -18873 15298 -51968 -82539 -11179 -45132 -78225 15848 -24571
602 -24571 63380 9693 -13160 -88070 40194 137180 92776 -326 13380 4463 25097 79069
590 79069 99816 95652 9364 -37125 -131320 -147700 -78594 -52629 -36984 -28543 -82090 -74045 -22572
577 -22572 126323 119500 130715 102153 45215 -22124 -10571 -53784 -46248 -75017 -82856 -4896
565 -4896 80108 76015 31631 76353 32031 -86018 -111613 -15604 -27886 17268 15987 22
553 22 92668 58076 -55526 -79288 61843 60523 -8087 44200 7746 34071 80789 154481
541 154481 97841 124748 85222 174193 256971 228800 238679 178248 -18850 72818 142721 48218
529 48218 25824 92488 187237 114070 39043 56596 27706 79252 227130 104251 120872 157093
517 157093 125929 122826 3823 24039 61807 61812 -2773 35296 44923 97076 79379 26876 84523
504 84523 50602 19624 -74839 31154 -42438 38304 7239 9402 -1460 128204 210407 111255
492 111255 108900 92034 -44157 23526 37672 128044 97189 -107196 -171843 -3693 565 -22106
480 -22106 -82491 3789 -44528 -70506 64333 36945 -16365 67544 146901 110448 27250 -31030
468 -31030 35283 71731 37958 117644 114988 -3967 42351 69674 132089 42189 194825 169620
456 169620 151060 68249 43778 137404 18123 -14695 44960 47039 151932 185452 244105 40329
444 40329 40393 7915 -81984 -84962 -87275 72561 -40079 -43866 95421 46390 63515 73877 34642
431 34642 -628 24536 9971 128180 95931 122435 59395 95653 138218 140988 199837 156468
419 156468 102057 5981 60748 69353 93223 103215 -41232 -86114 -9797 -11360 -575 24322
407 24322 -42535 -61558 -14630 108527 95095 22618 11019 129893 105572 -24904 6626
396 6626 70584 79037 -30230 -6944 19899 73157 26400 21063 58601 -25809 -115689 88998
384 88998 245631 236012 269681 152149 165515 -891 -6228 24993 34464 82802 109992 53660
372 53660 97691 20602 105190 72624 -24642 -9839 -8513 94424 36419 68612 96873 103263
360 103263 21559 62911 136357 153330 46665 22890 107890 131149 -120147 -51807 128855
349 128855 151343 -20006 44395 134638 90236 17960 68814 53316 74145 -61112 -32766
338 -32766 49778 224641 126728 -1547 85477 100190 88443 47351 3431 30453 119847 109938
326 109938 142904 142320 86267 113734 73727 45913 -93554 40802 60262 -93924 -48665 138655
314 138655 48433 197281 172969 108281 56941 33007 91768 -19632 30692 -51302 -31740
303 -31740 54748 228098 118116 83541 -28148 40313 -3818 41555 200472 188472 68965
292 68965 53449 32094 64641 90843 -95151 -39924 75365 48966 91161 -53568 -117685
281 -117685 100724 161055 110432 27589 2127 88182 29047 80837 130949 78476 -16862 76080
269 76080 53199 83118 63348 27262 16425 60977 62653 100446 48641 105759 126309 142441
257 142441 117808 45524 108841 217032 91134 153741 144457 166654 26631 64828 172854
246 172854 181547 49466 57772 172295 50165 147861 251022 85159 -57450 -69007 -39918
235 -39918 89105 114262 60050 5907 101039 16510 37106 6836 36159 29348 154935 80252
223 80252 -96074 11545 116252 -16240 11907 18230 36953 2341 145858 183471 191681
212 191681 144010 76771 64618 111306 173721 98538 62830 135551 30866 48869 52904 8919
200 8919 -59818 -68226 11549 47248 78309 175747 62455 36337 107363 146830 71755 109845
188 109845 227413 108539 117731 251656 282525 149176 80977 165588 185636 230121 144710
177 144710 100351 170270 172448 127108 87471 143320 133467 132857 88540 87134 -62276 53011
165 53011 78420 30844 39101 140811 36380 37248 -7017 23105 73131 71934 114129 114331 162479
152 162479 137370 40761 45905 119019 224523 210833 126723 47206 177297 136651 98913 116111
140 116111 132906 107635 119459 158810 166852 142885 80903 55960 128105 30541 56310 130539
128 130539 197502 166340 164669 255388 102199 202805 196895 73002 38250 39814 103135 153876
116 153876 63042 84796 63698 121330 45442 6637 50563 62041 31930 140795 179647 172173
104 172173 149367 113357 156964 173861 158094 195181 124221 140279 167765 156649 109826 81231
92 81231 -19995 -9127 7239 79143 113381 171132 122931 140668 206641 167679 113466 183100
80 183100 146494 59151 19241 22634 83258 97051 50623 30622 12293 83620 188628 224138
68 224138 123726 88610 173617 113540 116658 131345 49194 15574 115348 83925 10342 111387
56 111387 192614 157445 134515 69045 50090 -968 138247 60368 -62631 -62957 -1172 147027
44 147027 159688 204145 191204 91008 106121 77592 131469 220381 217821 169299 179078 89676
32 89676 136685 118718 208347 251349 215801 163417 106566 50420 121718 186668 145645 193630
20 193630 249277 141953 71148 113130 131855 152967 164950 162480 113185 140147 135621 149539
8 149539 56613 77832 149701 133738 124592 80044 157554 112436
0 112436
$$ Imaginary data points
##PAGE= N=2
##DATA TABLE= (X++(I..I)), XYDATA
16383 -2382819 -2405684 -2342890 -2333160 -2294470 -2269248 -2216558 -2105178 -2051500 -2014322 -1961161 -1901178
16372 -1901178 -1837455 -1829732 -1849987 -1810963 -1770054 -1783705 -1790747 -1647806 -1610437 -1517065 -1453851
16361 -1453851 -1345019 -1358755 -1331722 -1307296 -1353186 -1230775 -1235733 -1162642 -1086074 -1030441 -1092904
16350 -1092904 -1014694 -993860 -914495 -816623 -784298 -781307 -821370 -820853 -767502 -754790 -637269 -577018
16338 -577018 -583321 -602039 -458025 -399014 -347549 -400010 -391761 -415540 -364558 -298719 -216290 -185998
16326 -185998 -132608 -72616 -132271 -128333 26473 93644 107609 128872 158280 196534 230090
16315 230090 276638 305178 436059 436549 601024 583630 541406 458725 549811 623417 630522 610408
16303 610408 660234 699133 750134 748599 743500 780392 824332 850880 872831 972058 1020747 1079654
16291 1079654 1095464 1049191 1071511 1149386 1251946 1138323 1125365 1200894 1281631 1380473 1421600
16280 1421600 1454206 1463132 1543227 1646356 1597432 1582193 1598256 1547758 1623717 1645391 1761341
16269 1761341 1794972 1732512 1683020 1760543 1839128 1826841 1903351 2052484 2100673 2005671 1934418
16258 1934418 1986185 2014588 2031974 2070113 2098243 2167588 2150060 2090676 2142555 2178044 2237610
16247 2237610 2294187 2305527 2331859 2324133 2415423 2441823 2439363 2497679 2406225 2444909 2441941 2505507
16235 2505507 2494720 2578389 2567999 2556129 2638353 2617444 2603298 2642908 2705716 2757646 2725200
16224 2725200 2734608 2680834 2640671 2808833 2816845 2925484 2872580 2891888 2943640 2907606 2871689
16213 2871689 2936524 2884433 3004777 3043483 3005785 2958975 3122228 3298774 3240455 3218684 3122748
16202 3122748 3112305 3282992 3321612 3421886 3374569 3179873 3207216 3249535 3144679 3249763
16192 3249763 3370546 3391197 3347254 3322847 3404768 3485030 3503093 3325462 3306270 3398734 3526390
16181 3526390 3596005 3544189 3540076 3460422 3466700 3502829 3474500 3432109 3420092 3533415 3528031 3568605
16169 3568605 3598434 3669090 3640706 3584386 3551939 3612303 3584219 3595827 3682651 3622977 3572288
16158 3572288 3552360 3572017 3581872 3706816 3696511 3743215 3754636 3892080 3792660 3692071 3744389
16147 3744389 3709699 3780465 3698104 3666802 3657186 3777917 3818676 3818585 3724422 3711474 3679951 3784664
16135 3784664 3783182 3840855 3837694 3932925 3852687 3851407 3853443 3697924 3640333 3616543 3723147 3810148
16123 3810148 3812927 3842262 3931052 3892104 3926662 4085971 4025309 3979294 3894644 3943198 3976557
16112 3976557 3997647 4050121 4071284 3998833 3892010 3960657 3978586 3971144 3994340 4044083 4000537
16101 4000537 4040453 3973120 4022815 3935659 3989508 3906430 4001758 4103493 4120281 4070144 4096496
16090 4096496 4108908 4050261 4083651 3987227 4058222 3992175 3883082 3942669 4000239 4007562 4006608 4054097
16078 4054097 4099471 4091297 4009368 4040609 4121319 3999183 3995965 3997788 4112561 4189837 4124792
16067 4124792 4106332 4000378 4057841 3975964 3896153 3873282 3870055 4022554 3897092 4017766 4097323
16056 4097323 4075046 4036940 3994574 3996178 4150642 4218440 4112173 4180834 4114769 4091962 4081211
16045 4081211 4061047 4066690 4250859 4224274 4146602 4149210 4118002 4097273 4121184 4144715 4068671
16034 4068671 4036156 3995999 4056504 4050496 4051820 4083958 4040623 4126767 4196264 4208211 4180979 4077012
16022 4077012 3991635 4044401 4119674 4105339 4163496 4189307 4178357 4256738 4284572 4132705 4091926
16011 4091926 4154452 4100659 4115474 4018676 3980596 4079195 4114117 4038529 4091173 4111048 4208958
16000 4208958 4142992 4103020 4186875 4088605 3987423 4000721 4155866 4172102 4024925 4048366 4119506
15989 4119506 4269076 4248272 4138158 4078402 4120587 4222708 4199540 4237125 4145258 4162394 4190088
15978 4190088 4250601 4143238 4061506 4110702 4238172 4113141 4115762 4104593 4095128 4223390 4115834
15967 4115834 4190562 4118996 4082452 4162199 4102380 4201899 4147366 4197076 4181435 4221885 4249092
15956 4249092 4215391 4174850 4042378 4176157 4159566 4148753 4150822 4092752 4160554 4108820 4310065
15945 4310065 4264306 4154804 4156665 4213990 4221736 4137196 4126790 4140567 4107274 4105998 4084269 4034481
15933 4034481 4088475 4064555 4090051 4039353 4032669 4099695 4127213 4155695 4208965 4243192 4289815
15922 4289815 4281772 4246198 4126159 4206800 4114061 3994493 3958980 3955084 4086761 4075879 4096592
15911 4096592 4113158 4026723 4146778 4154689 4205679 4243063 4244901 4271489 4240905 4239362 4280485 4216867
15899 4216867 4343320 4267840 4179048 4148235 4167524 4228725 4156118 4219694 4250191 4166467 4207980
15888 4207980 4197328 4230052 4255236 4184537 4233104 4103970 4091162 4147157 4226346 4241263 4150098
15877 4150098 4154689 4346257 4345099 4212187 4196370 4319156 4279067 4144052 4219674 4293993 4270392
15866 4270392 4242187 4216528 4322846 4291601 4161534 4184573 4300213 4324911 4309219 4199962
15856 4199962 4243509 4264462 4178697 4275790 4247132 4202861 4124015 4155972 4169039 4213849 4273756
15845 4273756 4232882 4179192 4183561 4224629 4233780 4170758 4092886 4080228 4192354 4187244 4027716
15834 4027716 4206483 4295475 4295552 4375995 4341299 4272646 4179728 4228029 4201968 4174868 4154798 4176017
15822 4176017 4359294 4260859 4197738 4194542 4231718 4165201 4064719 4201039 4188428 4128293 4317638
15811 4317638 4376503 4212654 4106955 4219572 4328020 4286988 4121214 4288974 4271587 4188505
15801 4188505 4156974 4217614 4311540 4290418 4322085 4237807 4182382 4333903 4405038 4199290 4240382
15790 4240382 4223076 4175155 4186332 4153714 4222394 4197643 4162550 4164277 4093934 4096524 4130131 4171114
15778 4171114 4285981 4329136 4315774 4309872 4266806 4152086 4140961 4202427 4398574 4291209 4200525
15767 4200525 4242186 4194155 4267541 4210304 4230120 4135968 4236281 4267205 4168744 4056728 4125007
15756 4125007 4204881 4224365 4332884 4421541 4303073 4137014 4213487 4338783 4318041 4227404
15746 4227404 4183350 4284669 4382863 4406356 4315949 4232822 4222093 4191346 4112381 4093001 4166193
15735 4166193 4205785 4193203 4262927 4213062 4232279 4299737 4198746 4184680 4088558 4061678 4079904
15724 4079904 4200473 4295044 4225049 4250420 4241902 4333785 4253369 4215080 4210000 4165716 4103502
15713 4103502 4161627 4267300 4268795 4240659 4232905 4326708 4286720 4311671 4351198 4396039 4296367
15702 4296367 4282758 4290746 4215560 4221269 4302902 4180061 4194538 4338599 4310932 4237888 4278716
15691 4278716 4278232 4377079 4293371 4211431 4272256 4286346 4318414 4322938 4241536 4234441 4376489 4361054
15679 4361054 4311098 4301429 4269935 4197345 4212145 4268194 4207921 4291058 4349191 4346665 4351825 4204891
15667 4204891 4242518 4206804 4249347 4212656 4210626 4273502 4365708 4479735 4447729 4351962 4229880
15656 4229880 4220612 4289671 4151760 4214134 4208217 4258185 4334708 4248352 4279707 4272325 4300033 4388143
15644 4388143 4396796 4326620 4355082 4339513 4356388 4379302 4257253 4243307 4279984 4306894 4297429
15633 4297429 4212038 4187479 4185552 4271160 4304499 4390466 4339276 4301735 4231324 4280792 4358787
15622 4358787 4099134 4009991 4081973 4172136 4242086 4315929 4409430 4333565 4267999 4306595 4424239
15611 4424239 4402505 4349430 4271849 4187007 4235493 4326726 4390665 4404327 4324635 4257559 4301654
15600 4301654 4304282 4343816 4244922 4111521 4333014 4404812 4309989 4371609 4380829 4293220 4209418
15589 4209418 4248175 4214029 4152788 4236122 4199296 4228497 4356118 4451561 4377704 4496889 4396735
15578 4396735 4344410 4454055 4461073 4479190 4328999 4272212 4302662 4324094 4340410 4395700 4465187
15567 4465187 4420184 4296549 4286476 4290042 4214673 4336306 4427243 4367762 4292088 4303669 4320576
15556 4320576 4264068 4227923 4227008 4203431 4234226 4282901 4150858 4206050 4348371 4354781 4392806
15545 4392806 4384297 4321876 4348882 4281396 4190312 4262075 4353756 4440345 4371563 4399394 4551174
15534 4551174 4481597 4322641 4181206 4270081 4301899 4413348 4443682 4375547 4391375 4361692 4316711
15523 4316711 4309046 4224447 4257247 4377932 4420790 4406153 4335298 4295855 4449444 4353357 4383406
15512 4383406 4371577 4368737 4341426 4329011 4410375 4496047 4495448 4402821 4420340 4357898 4496361 4452986
15500 4452986 4311555 4362427 4374231 4374025 4285922 4222210 4374799 4284477 4202811 4344880 4329206
15489 4329206 4326516 4369895 4425725 4525783 4384890 4334588 4373304 4413841 4413825 4271402 4231911
$$ [...]
##END NTUPLES=NMR SPECTRUM
##END=
