##TITLE=1H_CA-9198-1
 CDCl3
 8 sc, 
 6.10.2023
##JCAMPDX= 6.0         $$ Bruker NMR JCAMP-DX V2.0
##DATA TYPE= NMR SPECTRUM
##DATA CLASS= NTUPLES
##ORIGIN= UXNMR, Bruker Analytische Messtechnik GmbH
##OWNER= root
$$ XWIN-NMR		Version 3.5
$$ Fri Oct  6 16:13:23 2023 Russian Standard Time (UT+4h)  she@DPX200
##.OBSERVE FREQUENCY= 200.13135
##.OBSERVE NUCLEUS= ^1H
##.ACQUISITION MODE= SIMULTANEOUS
##.ACQUISITION SCHEME= undefined
##.AVERAGES= 8
##.DIGITISER RES= 18
##SPECTROMETER/DATA SYSTEM= spect
##.PULSE SEQUENCE= zg30
##.SOLVENT NAME= CDCl3
##.SHIFT REFERENCE= (INTERNAL, CDCl3, 0, 15.7447)
##AUDIT TRAIL= $$ (NUMBER, WHEN, WHO, WHERE, WHAT)
$$ ##TITLE= Audit trail, XWIN-NMR		Version 3.5
$$ ##JCAMPDX= 5.01
$$ ##ORIGIN= Bruker BioSpin GmbH
$$ ##OWNER= she
$$ F:/spectra/data/she/nmr/H-F/1/pdata/1/auditp.txt
$$ ##AUDIT TRAIL=  $$ (NUMBER, WHEN, WHO, WHERE, WHAT)
(   1,<2023-10-06 16:10:09.71 +0400>,<she>,<DPX200>,
      <created by zg, POWCHK disabled, PULCHK disabled
       configuration hash MD5:
       00 E9 B6 7A A2 85 ED C7 34 08 36 98 17 FE 4E 26
       data hash MD5: 16K
       1C B2 9F 02 98 C8 35 78 4E 9D FC 26 FE E9 58 B4>)
(   2,<2023-10-06 16:10:12.54 +0400>,<she>,<DPX200>,
      <Start of raw data processing
       efp BC_mod = 2 LB = 0.24 FT_mod = 6 PKNL = 1 PHC0 = -22425.83 PHC1 = 8.052712 SI = 16K 
       data hash MD5: 16K
       1D 0F 2D E9 98 03 07 91 35 90 01 06 2F 6F BD 37>)
(   3,<2023-10-06 16:10:37.92 +0400>,<she>,<DPX200>,
      <pk PHC0 = -159.7928 PHC1 = -0.8 
       data hash MD5: 16K
       15 D6 4D 1B 5D A0 32 84 EA A4 2C BB B8 F7 6C B3>)
(   4,<2023-10-06 16:10:42.00 +0400>,<she>,<DPX200>,
      <abs ABSG = 5 
       data hash MD5: 16K
       2B 70 E2 66 D0 D4 9A AA D5 BA 8A DF 54 C4 87 E9>)
(   5,<2023-10-06 16:11:05.53 +0400>,<she>,<DPX200>,
      <pk PHC0 = 6.350004 PHC1 = -9.2 
       data hash MD5: 16K
       A8 09 54 F3 71 78 C0 17 A6 2A 1B A1 60 CC 44 3B>)
(   6,<2023-10-06 16:11:08.89 +0400>,<she>,<DPX200>,
      <abs ABSG = 5 
       data hash MD5: 16K
       86 B7 F7 7A 7A 07 26 33 CB BC 2E D5 CA FA 0F B5>)
(   7,<2023-10-06 16:11:30.90 +0400>,<she>,<DPX200>,
      <pk PHC0 = -7.777057 PHC1 = 10.6 
       data hash MD5: 16K
       4B CA CF 28 55 EA A6 64 87 68 7C C8 AC 29 C0 7D>)
(   8,<2023-10-06 16:11:34.56 +0400>,<she>,<DPX200>,
      <abs ABSG = 5 
       data hash MD5: 16K
       7A F7 D8 B6 E4 C6 D3 31 60 80 45 B9 0F AC FF 0A>)
(   9,<2023-10-06 16:12:16.10 +0400>,<she>,<DPX200>,
      <pk PHC0 = 0.8874465 PHC1 = -1.200001 
       data hash MD5: 16K
       E5 0F 08 CE EC 1B 77 E7 3F DD 06 55 2D DF 3E 79>)
(  10,<2023-10-06 16:12:19.81 +0400>,<she>,<DPX200>,
      <abs ABSG = 5 
       data hash MD5: 16K
       83 74 84 DD 58 B5 2E 48 F4 61 A1 D3 AE 86 38 32>)
$$ ##END=
$$ 
$$ hash MD5
$$ D7 DA A2 3A 44 EC 91 E3 2B C5 40 CB 87 A4 3C A0
##$RELAX= 
##$RELAX= 
##$RELAX= 
##$RELAX= 
##$RELAX= 
##$RELAX= 
$$ Bruker specific parameters
$$ --------------------------
##$DU= <F:/spectra>
##$EXPNO= 1
$$ [...]
##$SUBNAM3= <"">
##$SUBNAM4= <"">
##$SUBNAM5= <"">
##$SUBNAM6= <"">
##$SUBNAM7= <"">
##$SUBNAM8= <"">
##$SUBNAM9= <"">
##$SW= 18.05172834244
##$SWIBOX= (0..15)
0 0 2 0 0 0 0 0 0 0 0 0 0 0 0 0 
##$SW_h= 3612.71676300578
##$TD= 16384
##$TD0= 1
##$TE= 0
##$TE2= 300
##$TE3= 300
##$TEG= 300
##$TL= (0..7)
0 120 120 120 120 120 120 120 
##$TP= (0..7)
150 150 150 150 150 150 150 150 
##$TP07= 0
##$TPNAME0= <>
##$TPNAME1= <>
##$TPNAME2= <>
##$TPNAME3= <>
##$TPNAME4= <>
##$TPNAME5= <>
##$TPNAME6= <>
##$TPNAME7= <>
##$TPOAL= (0..7)
0.5 0.5 0.5 0.5 0.5 0.5 0.5 0.5 
##$TPOFFS= (0..7)
0 0 0 0 0 0 0 0 
##$TUNHIN= 0
##$TUNHOUT= 0
##$TUNXOUT= 0
##$USERA1= <user>
##$USERA2= <user>
##$USERA3= <user>
##$USERA4= <user>
##$USERA5= <user>
##$V9= 5
##$VALIST= <valist>
##$VCLIST= <CCCCCCCCCCCCCCC>
##$VD= 0
##$VDLIST= <DDDDDDDDDDDDDDD>
##$VPLIST= <PPPPPPPPPPPPPPP>
##$VTLIST= <TTTTTTTTTTTTTTT>
##$WBST= 1024
##$WBSW= 4
##$XGAIN= (0..3)
0 0 0 0 
##$XL= 0
##$YL= 0
##$YMAX_a= 384316
##$YMIN_a= -358141
##$ZGOPTNS= <>
##$ZL1= 120
##$ZL2= 120
##$ZL3= 120
##$ZL4= 120
##$ABSF1= 15.74469
##$ABSF2= -2.307159
##$ABSG= 5
##$ABSL= 3
##$ALPHA= 0
##$AQORDER= 0
##$ASSFAC= 0
##$ASSFACI= 0
##$ASSFACX= 0
##$ASSWID= 0
##$AUNMP= <proc_1d>
##$AZFE= 0.1
##$AZFW= 0.1
##$BCFW= 0
##$BC_mod= 2
##$BYTORDP= 0
##$COROFFS= 0
##$CY= -3
##$DATMOD= 1
##$DC= 0
##$DFILT= <>
##$DTYPP= 0
##$F1P= 0
##$F2P= 0
##$FCOR= 1
##$FTSIZE= 16384
##$FT_mod= 6
##$GAMMA= 0
##$GB= 0
##$INTBC= 1
##$INTSCL= 3.70164e-10
##$ISEN= 128
##$LB= 0.24
##$LEV0= 0
##$LPBIN= 0
##$MAXI= 10000
##$MC2= 0
##$MEAN= 0
##$ME_mod= 0
##$MI= 1.114404
##$NCOEF= 0
##$NC_proc= -7
##$NLEV= 6
##$NOISF1= 3.799351
##$NOISF2= 2.8
##$NSP= 0
##$NTH_PI= 0
##$NZP= 0
##$OFFSET= 15.74469
##$PC= 1
##$PHC0= -22586.16
##$PHC1= 7.452711
##$PH_mod= 1
##$PKNL= yes
##$PPARMOD= 0
##$PSCAL= 0
##$PSIGN= 0
##$REVERSE= no
##$SF= 200.130005374233
##$SI= 16384
##$SIGF1= 3
##$SIGF2= 2
##$SINO= 5.538805
##$SIOLD= 16384
##$SREGLST= <1H.CDCl3>
##$SSB= 0
##$STSI= 16384
##$STSR= 0
##$SW_p= 3612.71676300578
##$SYMM= 0
##$S_DEV= 0
##$TDeff= 16384
##$TDoff= 0
##$TI= <>
##$TILT= no
##$TM1= 0
##$TM2= 0
##$TOPLEV= 0
##$USERP1= <user>
##$USERP2= <user>
##$USERP3= <user>
##$USERP4= <user>
##$USERP5= <user>
##$WDW= 1
##$XDIM= 16384
##$YMAX_p= 318618016
##$YMIN_p= -424676
$$ End of Bruker specific parameters
$$ ---------------------------------
##NTUPLES= NMR SPECTRUM
##VAR_NAME=  FREQUENCY,     SPECTRUM/REAL,   SPECTRUM/IMAG
##SYMBOL=    X,             R,               I
##VAR_TYPE=  INDEPENDENT,   DEPENDENT,       DEPENDENT
##VAR_FORM=  AFFN,          ASDF,            ASDF
##VAR_DIM=   16384,         16384,           16384
##UNITS=     HZ,            ARBITRARY UNITS, ARBITRARY UNITS
##FACTOR=    0.220516191357247, 1,           1
##FIRST=     3150.98488258926, 0,            0
##LAST=      -461.731880416515, 0,           0
##MIN=       -461.731880416515, -424676,     0
##MAX=       3150.98488258926, 318618016,    0
$$ Real data points
##PAGE= N=1
##DATA TABLE= (X++(R..R)), XYDATA
$$ [...]
$$ plain form
7282 331027 365658 403660 459654 414700 400298 411925 435999 412393 404031 436738 465834 421265
7270 421265 436862 480324 455135 452219 447019 507851 462530 437514 443900 457975 526657 490096
7258 490096 434671 494148 487513 516920 588764 602847 576543 563567 593373 623431 652948 661942
7246 661942 767303 782840 821444 807029 761787 758701 785948 769024 764380 784941 802973 749152
7234 749152 699862 636637 641375 711214 659447 688304 663386 602110 591246 592876 596527 553598
7222 553598 493961 470091 484083 438481 489083 480932 411580 398953 421396 410246 437490 438231
7210 438231 387684 402052 415634 414987 434814 401696 414061 458517 366712 356028 353147 334641
7198 334641 344648 404547 417370 394615 353438 359548 377468 422274 380495 391897 413138 400379
$$ packed form
7282C31027L4631L8002N5994m4954j4402J1627K4074k3606q362L2707K9096m4569
7270D21265J5597M3462k5189k916n200O0832m5321k5016O386J4075O8682l6561
7258D90096n5425N9477o635K9407P1844J4083k6304j2976K9806L0058K9517Q994
7246F61942J05361J5537L8604j4415m5242l086K7247j6924m644K0561J8032n3821
7234G49152m9290o3225M738O9839n1767K8857k4918o1276j0864J630L651m2929
7222E53598n9637k3870J3992m5602N0602q151o9352j2627K2443j1150K7244P41
7210D38231n0547J4368J3582o47J9827l3118J2365M4456r1805j0684k881j8506
7198C34641J0007N9899J2823k2755m1177O110J7920M4806m1779J1402K1241j2759
$$ plain form
7186 400379 349979 286520 305438 324313 284852 328656 325767 368321 375639 312553 320343 318884
7174 318884 322536 306675 263439 346396 343529 353222 397617 368090 374648 361391 388706 349691
7162 349691 312692 334506 371029 358873 356025 355336 411697 379290 386847 406278 377113 321436
7150 321436 396330 434261 333443 363877 381574 366772 410507 388758 369951 396584 334427
7139 334427 380865 373513 426010 432642 401548 354452 315213 319261 346769 392255 356092 346497
7127 346497 382199 343556 345224 394179 448895 421667 370968 392858 395036 411830 429670 362730
7115 362730 374418 388494 462426 411943 460300 437346 423936 442721 415321 378053 376284 405315
7103 405315 422192 457055 404526 422590 445500 480978 448575 387544 435084 407603 387448 394150
$$ packed form
7186D00379n0400o3459J8918J8875l9461M3804k889M2554P318o3086P790j459
7174C18884L652j5861m3236Q2957k867R693M4395k9527O558j3257K7315l9015
7162C49691l6999K1814L6523j2156k848o89N6361l2407P557J9431k9165n5677
7150C21436P4894L7931j00818L0434J7697j4802M3735k1749j8807K6633o2157
7139C34427M6438p352N2497O632l1094m7096l9239M048K7508M5486l6163r595
7127C46497L5702l8643J668M8955N4716k7228n0699K1890K178J6794J7840o6940
7115C62730J1688J4076P3932n0483M8357k2954j3410J8785k7400l7268j769K9031
7103D05315J6877L4863n2529J8064K2910L5478l2403o1031M7540k7481k0155O702
$$ plain form
7091 394150 448145 454013 344993 371051 448898 469964 439359 353056 340899 372828 417731 471995
7079 471995 353707 385606 466824 463472 435882 401667 347290 370172 367734 422647 432049 434888
7067 434888 426831 454554 454902 417203 329295 373605 379129 342219 277542 442175 511321 526502
7055 526502 510205 483318 457878 415181 447967 495109 560340 454993 357977 386070 393953 406160
7043 406160 427125 442141 492616 486859 436124 467078 482703 467506 362688 409105 436806 449889
7031 449889 465932 459652 424525 436530 445804 435720 478757 489737 493216 479571 511207 473918
7019 473918 462684 460242 514691 505016 487068 531162 552955 528503 519714 549045 564210 507962
7007 507962 519999 470987 505215 528163 567226 546833 528492 594506 610310 488615 498712
$$ packed form
7091C94150N3995N868j09020K6058P7847K1066l0605q6303j2157L1929M4903N4264
7079D71995j18288L1899Q1218l352k7590l4215n4377K2882k438N4913R402K839
7067D34888q057K7723L48l7699q7908M4310N524l6910o4677J64633O9146J5181
7055E26502j6297k6887k5440m2697L2786M7142O5231j05347r7016K8093P883J2207
7043D06160K0965J5016N0475n757n0735L0954J5625j5197j04818M6417K7701J3083
7031D49889J6043o280l5127J2005R274j0084M3037J0980L479j3645L1636l7289
7019D73918j1234k442N4449r675j7948M4094K1793k4452q789K9331J5165n6248
7007E07962J2037m9012L4228K2948L9063k0393j8341O6014J5804j21695J0097
$$ plain form
6996 498712 513080 497590 542307 562875 569816 540224 556771 614388 571020 544057 537751 549573
6984 549573 545899 536568 624375 631414 583328 622904 645054 604653 585722 555018 532419 566714
6972 566714 536185 579742 642286 677189 671713 656998 654061 664481 610157 588375 577709 555815
6960 555815 654858 698311 726291 681021 621788 561717 618346 726243 733451 655975 597268 666874
6948 666874 670495 684540 670644 685247 741529 785227 737414 709367 729791 777834 825809 821985
6936 821985 834414 844880 842409 813825 809335 814667 819997 860066 953810 947404 939770 922549 923297
6923 923297 937054 972416 973013 982089 952026 901507 935294 968781 923786 914532 930541 909341
6911 909341 843712 828719 834298 855749 859954 789854 854035 859859 792454 856416 889379 873150
$$ packed form
6996D98712J4368j5490M4717K0568O941k9592J6547N7617m3368k6963o306J1822
6984E49573l674r331Q7807P039m8086L9576K2150m0401j8931l0704k2599L4295
6972E66714l0529M3557O2544L4903n476j4715k937J0420n4324k1782j0666k1894
6960E55815R9043M3453K7980m5270n9233o0071N6629J07897P208p7476n8707O9606
6948F66874L621J4045j3896J4603N6282M3698m7813k8047K0424M8043M7975l824
6936H21985J2429J0466k471k8584m490N332N330M0069R3744o406p634j7221P48
6923I23297J3757L5362N97R076l0063n0519L3787L3487m4995r254J6009k1200
6911I09341o5629j4993N579K1451M205p0100O4181N824o7405O3962L2963j6229
$$ plain form
6899 873150 853698 807583 795158 808171 743928 781972 769317 746066 805738 778098 855339 787911
6887 787911 820701 831008 807070 827197 789719 771089 837094 877692 900661 857774 886541 962604
6875 962604 900388 905542 950197 1008158 987095 986581 985718 960529 1039105 1105488 1079980 1136120 1208337
6862 1208337 1286150 1322159 1244347 1156690 1114104 1080103 998025 1025859 1030257 958337 985553 1015565
6850 1015565 982302 976519 945474 987603 935091 913103 931758 937945 996484 988343 987371 941376
6838 941376 920054 951687 1046051 973919 920353 968674 1007382 994010 998502 998729 1002310 988703
6826 988703 984688 998945 1081297 1035946 1039809 1017884 982315 977252 1076153 1116286 1110451 1124323
6814 1124323 1122067 1150151 1168306 1185528 1243713 1236547 1233671 1281016 1339994 1394183 1395420 1396372 1396044
$$ packed form
6899H73150j9452m6115j2425J3013o4243L8044j2655k3251N9672k7640P7241o7428
6887G87911L2790J0307k3938K0127l7478j8630O6005M0598K2969m2887K8767P6063
6875I62604o2216N154M4655N7961k1063n14q63k5189P8576O6383k5508N6140P2217
6862A208337P7813L6009p7812q7657m2586l4001q2078K7834M398p1920K7216L0012
6850A015565l3263n783l1045M2129n2512k1988J8655O187N8539q141r72m5995
6838I41376k1322L1633R4364p2132n3566M8321L8708j3372M492K27L581j3607
6826I88703m015J4257Q2352m5351L863k1925l5569n063R8901M0133n835J3872
6814A124323k256K8084J8155J7222N8185p166k876M7345N8978N4189J237R52l28
$$ plain form
6801 1396044 1450618 1486158 1503505 1495283 1549181 1514393 1528571 1658559 1716292 1760995 1753495 1810960
6789 1810960 1885994 1936451 2007490 2127233 2220073 2332848 2411203 2533566 2632810 2765097 2946597
6778 2946597 3076719 3289439 3389743 3594763 3790744 3952473 4224135 4463180 4622422 4733284
6768 4733284 4748432 4788435 4662553 4501571 4318031 4123666 3906861 3739411 3611610 3477017
6758 3477017 3321848 3096810 2946678 2855534 2700488 2625311 2536315 2393106 2320750 2213848
6748 2213848 2147098 2090020 2074492 2030650 1907062 1880527 1797942 1790774 1801794 1831799 1849546
6737 1849546 1752295 1705740 1709551 1702548 1766752 1745790 1734757 1723706 1763699 1790298 1774962 1817833
6725 1817833 1810146 1811205 1859827 1896936 1933942 1894064 1812709 1805979 1858051 1892240 1823327 1839144
$$ packed form
6801A396044N4574L5540J7347q222N3898l4788J4178J29988N7733M4703p500N7465
6789A810960P5034N0457P1039J19743R2840J12775P8355J22363R9244J32287J81500
6778B946597J30122K12720J00304K05020J95981J61729K71662K39045J59242J10862
6768D733284J5148M0003j25882j60982j83540j94365k16805j67450j27801j34593
6758C477017j55169k25038j50132r1144j55046p5177q8996j43209p2356j06902
6748B213848o6750n7078j5528m3842j23588k6535q2585p168J1020L0005J7747
6737A849546r7251m6555L811p003O4204k0962j1033j1051L9993K6599j5336M2871
6725A817833p687J059M8622L7109L7006l9878q1355o730N2072L4189o8913J5817
$$ plain form
6713 1839144 1855727 1920843 2042511 2034259 2038585 1991375 2000161 2071724 2002811 2064412 2081348 2109100
6701 2109100 2249420 2228238 2305020 2322894 2327997 2353366 2357537 2344018 2429032 2531782 2611595
6690 2611595 2732097 2783531 2863404 2886112 2963292 2958969 2948977 2913184 2765297 2666802 2585257
6679 2585257 2457267 2390382 2325734 2211459 2141453 2030107 1997029 1982672 1841735 1749743 1675004
6668 1675004 1667839 1624526 1562358 1582253 1602973 1544634 1571176 1540756 1522188 1503657 1505794 1462184
6656 1462184 1422557 1485149 1496027 1429565 1416810 1424887 1411605 1404282 1415215 1372612 1279198 1340920
6644 1340920 1356000 1274788 1300496 1299210 1337587 1314016 1281209 1252513 1288987 1290135 1272495 1261782
6632 1261782 1282975 1338005 1270839 1270115 1247693 1234633 1300079 1247448 1181593 1162892 1154258 1181165
$$ packed form
6713A839144J6583O5116J21668q252M326m7210Q786P1563o8913O1601J6936K7752
6701B109100J40320k1182P6782J7874N103K5369M171j3519Q5014J02750P9813
6690B611595J20502N1434P9873K2708P7180m323r992l5793j47887r8495q1545
6679B585257j27990o6885o4648j14275p0006j11346l3078j4357j40937r1992p4739
6668A675004p165m3313o2168J9895K0720n8339K6542l0420j8568j8531K137m3610
6656A462184l9627O2592J0878o6462j2755Q077j3282p323J0933m2603r3414O1722
6644A340920J5080q1212K5708j286L8377k3571l2807k8696L6474J148j7640j0713
6632A261782K1193N5030o7166p24k2422j3060O5446n2631o5855j8701q634K6907
$$ plain form
6620 1181165 1192485 1222633 1211781 1156556 1219310 1199280 1170162 1158256 1161369 1189347 1241797 1282315
6608 1282315 1185698 1175998 1147006 1105970 1133167 1134622 1174632 1145268 1125755 1085255 1050189 1113938
6596 1113938 1150218 1160584 1093460 1162186 1132433 1180314 1101090 1105493 1153643 1140619 1095230 1091298
6584 1091298 1160133 1183799 1189262 1189785 1170957 1107084 1104594 1071345 1067671 1055220 1109158 1104334 1054398
6571 1054398 1154106 1099392 1021022 1060526 1029686 1042841 1138337 1095582 1151262 1228546 1171520
6560 1171520 1084071 1142368 1161199 1208000 1242017 1185218 1120032 1095559 1147213 1113170 1136549
6549 1136549 1134868 1178634 1199268 1290441 1271427 1202977 1224296 1232798 1239868 1230524 1255390 1248800
6537 1248800 1233746 1232602 1151914 1225384 1261106 1174537 1234972 1229790 1343981 1364077 1321095 1312894
$$ packed form
6620A181165J1320L0148j0852n5225O2754k0030k9118j1906L113K7978N2450M0518
6608A282315r6617r700k8992m1036K7197J455M0010k9364j9513m0500l5066O3749
6596A113938L6280J0366o7124O8726k9753M7881p9224M403M8150j3024m5389l932
6584A091298O8835K3666N463N23j8828o3873k490l3249l674j2451N3938m824m9936
6571A054398R9708n4714p8370L9504l0840J3155R5496m2755N5680P7284n7026
6560A171520q7449N8297J8831M6801L4017n6799o5186k4473N1654l4043K3379
6549A136549j681M3766K0634R1173j9014o8450K1319Q502P070r344K4866o590
6537A248800j5054j144q0688P3470L5722q6569O0435n182J14191K0096m2982q201
$$ plain form
6525 1312894 1382438 1423834 1355996 1342668 1334892 1312374 1285156 1363805 1359329 1293536 1315463 1326219
6513 1326219 1301461 1370338 1351314 1352166 1322227 1258884 1281329 1328987 1321849 1344949 1329290 1287485
6501 1287485 1291391 1373831 1419864 1430318 1427788 1407333 1441322 1526181 1419671 1432042 1471249 1369142
6489 1369142 1372991 1453838 1398122 1414104 1423583 1420439 1391654 1372261 1430727 1442699 1480382 1358126
6477 1358126 1354505 1405587 1317124 1302801 1326968 1359654 1379928 1387186 1433786 1437876 1451956 1399431
6465 1399431 1406720 1454752 1481440 1507420 1509182 1506071 1503512 1485163 1512949 1510388 1508403 1460408 1433310
6452 1433310 1438846 1402192 1390512 1432442 1362049 1317742 1344048 1367195 1342676 1346418 1331010 1274537
6440 1274537 1247966 1312672 1343950 1308069 1348528 1401061 1409977 1433930 1440440 1455921 1411068 1429584
$$ packed form
6525A312894O9544M1396o7838j3328p776k2518k7218P8649m476o5793K1927J0756
6513A326219k4758O8877j9024Q52k9939o3343K2445M7658p138K3100j5659m1805
6501A287485L906Q2440M6033J0454k530k0455L3989Q4859j06510J2371L9207j02107
6489A369142L849Q0847n5716J5982R479l144k8785j9393N8466J1972L7683j22256
6477A358126l621N1082q8463j4323K4167L2686K0274P258M6600M090J4080n2525
6465A399431P289M8032K6688K5980J762l111k559j8349K7786k561j985m7995k7098
6452A433310N536l6654j1680M1930p0393m4307K6306K3147k4519L742j5408n6473
6440A274537k6571O4706L1278l5881M0459N2533Q916K3953O510J5481m4853J8516
$$ plain form
6428 1429584 1514422 1516884 1487600 1416822 1421972 1435329 1420246 1467485 1502027 1468982 1486301 1512053
6416 1512053 1414791 1428428 1438526 1448501 1493837 1509315 1496990 1504044 1527465 1487661 1435579 1410162
6404 1410162 1378051 1407463 1464731 1438119 1456786 1436188 1380336 1391370 1449345 1494974 1529707
6393 1529707 1457597 1425351 1426831 1449879 1411762 1488841 1573111 1531289 1487484 1494528 1535609 1490225
6381 1490225 1522752 1533122 1566638 1639156 1624875 1642329 1722769 1726339 1696825 1700052 1738354 1796539
6369 1796539 1780078 1755727 1719194 1788115 1792204 1763745 1790575 1815344 1813819 1814416 1840498 1880946
6357 1880946 1802079 1808154 1869532 1896128 1898976 1914696 1969730 1958725 1993537 2030465 2045727 2042284
6345 2042284 2048987 2074440 2099417 2112511 2199057 2239943 2211013 2273261 2276222 2274236 2260856 2316247
$$ packed form
6428A429584Q4838K462k9284p0778N150J3357j5083M7239L4542l3045J7319K5752
6416A512053r7262J3637J0098R975M5336J5478j2325P054K3421l9804n2082k5417
6404A410162l2111K9412N7268k6612J8667k0598n5852J1034N7975M5629L4733
6393A529707p2110l2246J480K3048l8117P7079Q4270m1822m3805P044M1081m5384
6381A490225L2527J0370L3516P2518j4281J7454Q0440L570k9514L227L8302N8185
6369A796539j6461k4351l6533O8921M089k8459K6830K4769j525N97K6082M0448
6357A880946p8867O075O1378K6596K848J5720N5034j1005L4812L6928J5262l443
6345B042284O703K5453K4977J3094Q6546M0886k8930O2248K961j986j3380N5391
$$ plain form
6333 2316247 2354553 2441173 2582325 2610667 2577642 2597354 2706313 2798622 2905749 2913032 2930844
6322 2930844 2977218 3049834 3053482 3103524 3129303 3170622 3153881 3167995 3182509 3179310 3186979 3202215
6310 3202215 3228913 3249633 3300808 3387749 3430989 3414014 3443724 3559778 3684073 3775653 3919457
6299 3919457 3978349 4075340 4228852 4372622 4521302 4668962 4802108 5053838 5222621 5473473
6289 5473473 5783072 6083568 6375740 6626091 7016983 7368453 7598554 7786118 7830568 7874578
6279 7874578 7892703 7960959 7905661 7858954 7858640 7917564 8041154 8005851 7985183 7948966 7881658 7718106
6267 7718106 7623235 7638820 7641608 7686412 7762884 7776147 7856023 7893987 7894479 7817605 7678872 7497483
6255 7497483 7390394 7327327 7320283 7379541 7443956 7511442 7659638 7856486 8133066 8414477 8724081
$$ packed form
6333B316247L8306Q6620J41152K8342l3025J9712J08959R2309J07127P283J7812
6322B930844M6374P2616L648N0042K5779M1319j6741J4114J4514l199P669J5236
6310C202215K6698K0720N1175Q6941M3240j6975K9710J16054J24295R1580J43804
6299C919457N8892R6991J53512J43770J48680J47660J33146K51730J68783K50852
6289E473473L09599L00496K92172K50351L90892L51470K30101J87564M4450M4010
6279G874578J8125O8256n5298m6707l14N8924J23590l5303k0668l6217o7308j63552
6267G718106r4871J5585K788M4804P6472J3263P9876L7964M92p6874j38733j81389
6255G497483j07089o3067p044N9258O4415O7486J48196J96848K76580K81411L09604
$$ plain form
6244 8724081 8955633 9218395 9410176 9488451 9516859 9457812 9327448 9152433 8979620 8690839
6234 8690839 8317319 7873162 7472809 7080930 6741257 6363495 6024129 5736284 5482456 5229417
6224 5229417 5046504 4827379 4656593 4587245 4571091 4493505 4337359 4248187 4197727 4177506 4112167
6213 4112167 4025032 3939265 3937891 3907258 3863779 3825211 3801499 3847046 3849156 3821558 3775473 3749721
6201 3749721 3807899 3870019 3858143 3847634 3782051 3820537 3892178 3830526 3871362 3916138 3902996
6190 3902996 3849168 3882572 3913473 3913275 3907717 3869011 3882235 3884152 3949011 4005187 4040490 4080507
6178 4080507 4088402 4173712 4224913 4220713 4195367 4168698 4208232 4219745 4263011 4308968 4274538 4170211
6166 4170211 4132493 4110277 4059347 3995633 4041981 4051435 4011569 4023464 3965727 3964958 3917214 3943783
$$ packed form
6244H724081K31552K62762J91781P8275K8408n9047j30364j75015j72813k88781
6234H690839l73520m44157m00353l91879l39673l77762l39366k87845k53828k53039
6224E229417j82913k19125j70786o9348j6154p7586j56146q9172n0460k0221o5339
6213D112167q7135q5767j374l0633m3479l8568k3712M5547K110k7598m6085k5752
6201C749721N8178O2120j1876j0509o5583L8486P1641o1652M0836M4776j3142
6190C902996n3828L3404L0901j98n558l8706J3224J917O4859N6176L5303M0017
6178D080507P895Q5310N1201m200k5346k6669L9534J1513M3266M5957l4430j04327
6166D170211l7718k2216n0930o3714M6348R454l9866J1895n7737p69m7744K6569
$$ plain form
6154 3943783 3954990 3977756 4001052 4029509 4089662 4103462 4049508 4043893 4092772 4109399 4107241 4192805
6142 4192805 4322258 4377712 4508573 4692175 4974346 5262157 5548052 5818011 6038052 6119396
6132 6119396 6098688 5934318 5721146 5519819 5278413 5256876 5171077 5115598 5116251 5226981 5360645
6121 5360645 5448640 5702319 5802854 5976547 6232049 6371774 6355734 6259241 6178576 6188027 6130305
6110 6130305 6182125 6278310 6512877 6782428 6943688 7059156 7009466 6848049 6589304 6250131
6100 6250131 5967668 5661762 5347818 5128326 4917729 4755551 4611667 4555025 4474967 4351822
6090 4351822 4263396 4224730 4166742 4153969 4153250 4172759 4117330 4098531 4064829 3968240 3960323 3972225
6078 3972225 3903694 3888368 3909162 3924628 3903639 3877440 3883877 3822372 3929838 3924363 3870558 3964438
$$ packed form
6154C943783J1207K2766K3296K8457O0153J3800n3954n615M8879J6627k158Q5564
6142D192805J29453N5454J30861J83602K82171K87811K85895K69959K20041Q1344
6132F119396k0708j64370k13172k01327k41406k1537q5799n5479O53J10730J33664
6121E360645Q7995K53679J00535J73693K55502J39725j6040r6493q0665R451n7722
6110F130305N1820R6185K34567K69551J61260J15468m9690j61417k58745l39173
6100F250131k82463l05906l13944k19492k10597j62178j43884n6642q0058j23145
6090D351822q8426l8666n7988j2773p19J9509n5429j8799l3702r6589p917J1902
6078C972225o8531j5326K0794J5466k0989k6199O437o1505J07466n475n3805R3880
$$ plain form
6066 3964438 3975157 3877792 3856223 3876721 3873590 3896884 3943695 3914251 3870842 3907896 3908822 3988720
6054 3988720 4013811 3921812 4010226 4077158 4094906 4098753 4171161 4109915 4083031 4161176 4163100 4144596
6042 4144596 4175336 4213553 4194831 4304095 4361732 4378685 4350945 4435089 4437816 4388160 4467547
6031 4467547 4514719 4635797 4749129 4750770 4761398 4846235 4961404 5092615 5106297 5126636 5211175
6020 5211175 5389389 5496324 5559223 5637070 5748218 5955878 6092878 6184461 6248519 6312956
6010 6312956 6384729 6514943 6597678 6780472 6921582 6982178 7055932 7193485 7327554 7489108
6000 7489108 7663035 7829184 8019615 8239088 8449964 8668929 8913700 9200859 9365704 9508301
5990 9508301 9674904 9895797 10107242 10239121 10270972 10333732 10353142 10342074 10295604 10228362 10144232
$$ packed form
6066C964438J0719r7365k1569K0498l131K3294M6811k9444m3409L7054R26P9898
6054C988720K5091r1999Q8414O6932J7748L847P2408o1246k6884P8145J924j8504
6042D144596L0740L8217j8722J09264N7637J6953k7740Q4144K727m9656P9387
6031D467547M7172J21078J13332J641J0628Q4837J15169J31211J3682K0339Q4539
6020E211175J78214J06935O2899P7847J11148K07660J37000R1583O4058O4437
6010F312956P1773J30214Q2735J82794J41110O0596P3754J37553J34069J61554
6000G489108J73927J66149J90431K19473K10876K18965K44771K87159J64845J42597
5990I508301J66603K20893K11445J31879L1851O2760J9410j1068m6470o7242q4130
$$ plain form
5979 10144232 10080443 10043405 9989302 9930188 9858327 9837010 9827280 9910974 9958811 10050238 10089206
5968 10089206 10185014 10378117 10529166 10688910 10865702 11085201 11298795 11473677 11704440 11806811
5958 11806811 11888194 12016063 11967940 11902521 11802853 11668525 11515585 11309558 11074326 10946440
5948 10946440 10771187 10648774 10487495 10465761 10366940 10289093 10284263 10248639 10322263 10227771 10317158
5937 10317158 10387178 10486063 10552582 10636498 10829977 10895264 10851401 10876002 10858196 10796014 10732041
5926 10732041 10612073 10389867 10202682 10046314 9887011 9704916 9568754 9467008 9368643 9256270
5916 9256270 9191976 9221990 9180203 9104635 9086583 9046296 9090777 9158914 9193735 9186541 9197276 9163930
5904 9163930 9164637 9223201 9330566 9398976 9471594 9466563 9520173 9543520 9571255 9610228 9675330 9832991
$$ packed form
5979A0144232o3789l7038n4103n9114p1861k1317r730Q3694M7837R1427L8968
5968A0089206R5808J93103J51049J59744J76792K19499K13594J74882K30763J02371
5958A1806811Q1383J27869m8123o5419r9668j34328j52940k06027k35232j27886
5948A0946440j75253j22413j61279k1734r8821p7847m830l5624P3624r4492Q9387
5937A0317158P0020R8885O6519Q3916J93479O5287m3863K4601j7806o2182o3973
5926A0732041j19968k22206j87185j56368j59303j82095j36162j01746r8365j12373
5916I256270o4294L0014m1787p5568j8052m0287M4481O8137L4821p194J0735l3346
5904I163930P07N8564J07365O8410P2618n031N3610K3347K7735L8973O5102J57661
$$ plain form
5892 9832991 9945198 10035197 10119766 10217330 10351399 10543398 10766702 10992552 11243121 11593954
5882 11593954 11884222 12173933 12579696 13075580 13629270 14276700 15120961 16214549 17609172
5873 17609172 19324170 21535026 23933992 25654113 25921980 24648423 22675026 20696381
5865 20696381 19052573 17902214 17081111 16494716 16117871 15956665 15864762 15805826 15956689
5856 15956689 16111532 16255532 16462189 16871632 17308106 17823145 18453606 19258592 20248169
5847 20248169 21338238 22782116 24547311 26672289 29479864 32972059 37540045 43429606
5839 43429606 50352646 56731719 59539047 57185336 51182012 44192944 38095117 33363377
5831 33363377 29780232 27083680 25029107 23353783 22175108 21188202 20448702 19976198 19617140
$$ packed form
5892I832991J12207Q9999Q4569R7564J34069J91999K23304K25850K50569L50833
5882A1593954K90268K89711M05763M95884N53690O47430Q44261J093588J394623
5873A7609172J714998K210856K398966J720121K67867j273557j973397j978645
5865B0696381j643808j150359q21103n86395l76845j61206r1903n8936J50863
5856A5956689J54843J44000K06657M09443M36474N15039O30461Q04986R89577
5847B0248169J090069J443878J765195K124978K807575L492195M567986N889561
5839D3429606O923040O379073K807328k353711o003324o989068o097827m731740
5831C3363377l583145k696552k054573j675324j178675r86906p39500m72504l59058
$$ plain form
5822 19617140 19391783 19243466 19214347 19356508 19694297 20098920 20780024 21808117 23017388
5813 23017388 24507920 26425755 28840015 31936288 35881073 41146423 47705577 54656473
5805 54656473 59134766 58550919 53302813 45958602 39005723 33253758 28807677 25478203
5797 25478203 22913003 20793467 19130239 17861744 16759455 15854269 15246773 14771957 14326022
5788 14326022 14000398 13691022 13402556 13313229 13333034 13513137 13791993 14188346 14635427 15252446
5778 15252446 16130929 17382555 18992085 21005726 23262276 25104785 25601205 24258660
5770 24258660 21925032 19401871 17131356 15354930 14038768 12934522 12026462 11306937
5762 11306937 10843995 10431327 10039568 9661365 9269416 9020838 8748988 8456299 8259111
$$ packed form
5822A9617140k25357j48317k9119J42161L37789M04623O81104J028093J209271
5813B3017388J490532J917835K414260L096273L944785N265350O559154O950896
5805E4656473M478293n83847n248106p344211o952879n751965m446081l329474
5797B5478203k565200k119536j663228j268495j102289r05186o07496m74816m45935
5788A4326022l25624l09376k88466q9327J9805J80103K78856L96353M47081O17019
5778A5252446Q78483J251626J609530K013641K256550J842509M96420j342545
5770B4258660k333628k523161k270515j776426j316162j104246r08060p19525
5762A1306937m62942m12668l91759l78203l91949k48578k71850k92689j97188
$$ plain form
5753 8259111 8064492 7887942 7806408 7765130 7674797 7523355 7387295 7351787 7369089 7312377 7129005
5742 7129005 7069949 6995889 6834444 6761695 6765515 6679743 6594427 6485972 6418857 6423049 6437854
5731 6437854 6445638 6463096 6405959 6390940 6326013 6285178 6184636 6055942 6047352 6016907 6060676
5720 6060676 6015857 6003944 5957092 5955995 6031948 6040678 6098377 6130133 5993520 5959314 5976177 5986134
5708 5986134 5925868 5965192 5967899 5974301 6039134 6062017 6107409 6133197 6097492 6125950 6199384 6329743
5696 6329743 6392680 6400285 6514243 6526596 6514922 6558312 6554178 6518527 6580693 6621337 6666337 6705882
5684 6705882 6753535 6859016 6941442 7080807 7179017 7259472 7370710 7485460 7590258 7611990
5674 7611990 7549113 7445531 7512065 7411320 7274468 7213295 7171735 7184895 7107621 7132587 7191486
$$ packed form
5753H259111j94619j76550q1534m1278r0333j51442j36060l5508J7302n6712j83372
5742G129005n9056p4060j61445p2749L820q5772q5316j08455o7115M192J4805
5731F437854P784J7458n7137j5019o4927m0835j00542j28694q590l0445M3769
5720F060676m4819j1913m6852j097P5953Q730N7699L1756j36613l4206J6863R957
5708E986134o0266L9324K707O402O4833K2883M5392K5788l5705K8458P3434J30359
5696F329743O2937P605J13958J2353j1674M3390m134l5651O2166M0644M5000L9545
5684F705882M7653J05481Q2426J39365R8210Q0455J11238J14750J04798K1732
5674G611990o2877j03582O6534j00745j36852o1173m1560J3160p7274K4966N8899
$$ plain form
5663 7191486 7155144 7259728 7286540 7308820 7359680 7490071 7637069 7743302 7855635 7976343
5653 7976343 8191175 8278548 8360614 8495247 8554806 8705048 8844095 9017409 9170988 9208639
5643 9208639 9300598 9435063 9579748 9739167 9843510 9966445 10070930 10114578 10107928 10003099
5633 10003099 9995461 9877177 9754355 9662923 9567980 9411803 9328142 9181037 8985415 8864333
5623 8864333 8696524 8524391 8422466 8361127 8297729 8187923 8104458 8102314 8022029 7921124 7884517
5612 7884517 7915689 7960172 8013669 7943878 7918878 7964013 7900379 7783552 7726492 7654484 7622811
5601 7622811 7557862 7496043 7468341 7328726 7240138 7237817 7194394 7107046 7079916 7111682 7108340 7137064
5589 7137064 7102697 7112749 7166225 7062098 7051372 7119742 7116465 7137732 7178699 7228374 7259110
$$ packed form
5663G191486l6342J04584K6812K2280N0860J30391J46998J06233J12333J20708
5653G976343K14832Q7373Q2066J34633N9559J50242J39047J73314J53579L7651
5643I208639R1959J34465J44685J59419J04343J22935J04485M3648o650j04829
5633A0003099p638j18284j22822r1432r4943j56177q3661j47105j95622j21082
5623H864333j67809j72133j01925o1339o3398j09806q3465k144q0285j00905l6607
5612G884517L1172M4483N3497o9791k5000M5135o3634j16827n7060p2008l1673
5601G622811o4949o1819k7702j39615q8588k321m3423q7348k7130L1766l342K8724
5589G137064l4367J0052N3476j04127j0726O8370l277K1267M0967M9675L0736
$$ plain form
5578 7259110 7324087 7419746 7513930 7581772 7645169 7710898 7788554 7909836 8050343 8200069 8343562
5567 8343562 8540058 8611831 8745599 8884328 8930673 9064251 9210773 9373249 9459591 9568316
5557 9568316 9650319 9705892 9842561 9898536 9903417 9945492 9936780 9924072 9863137 9794130 9792118 9808386
5545 9808386 9859964 9857217 9875832 9834180 9920271 9949793 9935416 9897793 9870796 9773670 9771704 9771410
5533 9771410 9752467 9673073 9665802 9628681 9686219 9717170 9744677 9851088 9883205 9979900 10091595
5522 10091595 10192864 10282399 10354931 10450736 10530463 10563591 10576637 10595080 10616094 10636939 10701105
5511 10701105 10863423 11006897 11096123 11265133 11399761 11508828 11575709 11759230 11810194 11868959
5501 11868959 11863758 11818807 11731157 11612776 11481247 11407982 11468964 11412662 11323618 11416395 11451394
$$ packed form
5578G259110O4977R5659R4184O7842O3397O5729P7656J21282J40507J49726J43493
5567H343562J96496P1773J33768J38729M6345J33578J46522J62476Q6342J08725
5557I568316Q2003N5573J36669N5975M881M2075q712j2708o0935o9007k012J6268
5545I808386N1578k747J8615m1652Q6091K9522j4377l7623k6997r7126j966k94
5533I771410j8943p9394p271l7121N7538L0951K7507J06411L2117R6695J11695
5522A0091595J01269Q9535P2532R5805P9727L3128J3046J8443K1014K0845O4166
5511A0701105J62318J43474Q9226J69010J34628J09067O6881J83521N0964N8765
5501A1868959n201m4951q7650j18381j31529p3265O0982n6302q9044R2777L4999
$$ plain form
5490 11451394 11500186 11576866 11669953 11756109 11829265 11870433 11988542 12106128 12134817 12145615 12133541
5479 12133541 12208169 12284797 12308623 12368765 12385389 12388685 12421381 12503099 12526417 12672743 12816911
5468 12816911 12859457 12934817 12990842 13085828 13167975 13202204 13353232 13457666 13540521 13696109 13867146
5457 13867146 13881785 13945177 13976848 14082686 14240862 14338579 14349425 14389826 14525277 14559250 14635157
5446 14635157 14752810 14874014 15009903 15160817 15262312 15363412 15462560 15580616 15742041 15920580
5436 15920580 15976159 16140681 16222093 16255844 16342551 16430774 16508287 16552895 16640586 16672515 16759117
5425 16759117 16808012 16813600 16918275 17074380 17188589 17270895 17458616 17574666 17714582 17788042
5415 17788042 17970681 18142784 18190497 18339935 18548012 18632457 18742546 18919840 19074201 19235593
$$ packed form
5490A1451394M8792P6680R3087Q6156P3156M1168J18109J17586K8689J0798j2074
5479A2133541P4628P6628K3826O0142J6624L296L2696Q1718K3318J46326J44168
5468A2816911M2546P5360N6025R4986Q2147L4229J51028J04434Q2855J55588J71037
5457A3867146J4639O3392L1671J05838J58176R7717J0846M0401J35451L3973P5907
5446A4635157J17653J21204J35889J50914J01495J01100R9148J18056J61425J78539
5436A5920580N5579J64522Q1412L3751Q6707Q8223P7513M4608Q7691L1929Q6602
5425A6759117M8895N588J04675J56105J14209Q2306J87721J16050J39916P3460
5415A7788042J82639J72103M7713J49438K08077Q4445J10089J77294J54361J61392
$$ plain form
5405 19235593 19395321 19595417 19772908 20010646 20312245 20530856 20798210 21150695 21464091
5396 21464091 21720796 21995733 22382875 22717115 23102960 23614428 24069117 24491385 25008935
5387 25008935 25581610 26073383 26610531 27101033 27573400 28168404 28719575 29264500 29845479
5378 29845479 30378027 30959792 31555625 32164779 32785410 33447948 34120803 34820428 35489320
5369 35489320 36210292 36977307 37749879 38501823 39278994 40083158 40901648 41952960 42956780
5360 42956780 44026726 45132514 46302448 47515925 48834683 50227311 51813782 53412897
5352 53412897 55179828 57144212 59249035 61593008 64057012 66735946 69603858 72809339
5344 72809339 76280158 80118122 84269865 88883499 93928166 99359480 105144178 111330172
$$ packed form
5405A9235593J59728K00096J77491K37738L01599K18611K67354L52485L13396
5396B1464091K56705K74937L87142L34240L85845N11468M54689M22268N17550
5387B5008935N72675M91773N37148M90502M72367N95004N51171N44925N80979
5378B9845479N32548N81765N95833O09154O20631O62538O72855O99625O68892
5369C5489320P20972P67015P72572P51944P77171Q04164Q18490J051312J003820
5360D2956780J069946J105788J169934J213477J318758J392628J586471J599115
5352E3412897J766931J964384K104823K343973K464004K678934K867912L205481
5344G2809339L470819L837964M151743M613634N044667N431314N784698O185994
$$ plain form
5336 111330172 117780925 124360847 130885256 137034615 142597968 147245005 150592067 152383037
5328 152383037 152419548 150615307 147081113 142235641 136344310 129610226 122450383 115136401
5320 115136401 107951094 101040210 94643401 88761547 83353582 78462688 74064647 70111315
5312 70111315 66552931 63355780 60433033 57828216 55471643 53368165 51392455 49493351
5304 49493351 47759005 46133500 44627683 43260702 41815917 40478227 39159800 37766141
5296 37766141 36437480 35100507 33901240 32833063 31864987 31072952 30308151 29689402 29018667
5287 29018667 28334884 27647193 26927653 26240202 25591964 25076265 24576415 24110663 23623483
5278 23623483 23129364 22650437 22237440 21846957 21414320 21050648 20827529 20526155 20267462
$$ packed form
5336A11330172O450753O579922O524409O149359N563353M647037L347062J790970
5328A52383037L6511j804241l534194m845472n891331o734084p159843p313982
5320A15136401p185307o910884o396809n881854n407965m890894m398041l953332
5312G0111315l558384l197151k922747k604817k356573k103478j975710j899104
5304D9493351j734346j625505j505817j366981j444785j337690j318427j393659
5296C7766141j328661j336973j199267j068177r68076p92035p64801o18749o70735
5287B9018667o83783o87691p19540o87451o48238n15699m99850m65752m87180
5278B3623483m94119m78927m12997l90483m32637l63672k23119l01374k58693
$$ plain form
5269 20267462 19987064 19768253 19530559 19311805 19147739 19018372 18959131 18820464 18761750 18846216
5259 18846216 18892285 18983189 19070190 19095059 19002505 18982960 19048022 19127112 19341367 19641837 20039963
5248 20039963 20433426 20866570 21453808 22112650 22628581 22840390 22807239 22508025 22134130 21665207
5238 21665207 21178120 20711836 20147032 19690791 19331417 19010426 18870981 18702594 18627264 18633288
5228 18633288 18694097 18898457 19026027 19292644 19647510 19902872 20156670 20390431 20536627 20445325
5218 20445325 20200995 19836107 19398008 18731695 18107082 17450718 16822959 16268237 15833071
5209 15833071 15391778 15043690 14804907 14515338 14224946 13975935 13882220 13697500 13593709 13429530
5199 13429530 13357787 13237610 13181438 13071842 12974241 12848333 12746421 12711360 12675864 12595065
$$ packed form
5269B0267462k80398k18811k37694k18754j64066j29367n9241j38667n8714Q4466
5259A8846216M6069R0904Q7001K4869r2554j9545O5062P9090K14255L00470L98126
5248B0039963L93463M33144N87238O58842N15931K11809l3151k99214l73895m68923
5238B1665207m87087m66284n64804m56241l59374l20991j39445j68387p5330O024
5228A8633288O0809K04360J27570K66617L54866K55362K53798K33761J46196r1302
5218B0445325k44330l64888m38099o66313o24613o56364o27759n54722m35166
5209A5833071m41293l48088k38783k89569k90392k49011r3715j84720j03791j64179
5199A3429530p1743j20177n6172j09596r7601j25908j01912l5061l5496q0799
$$ plain form
5189 12595065 12535628 12495092 12463727 12373262 12342880 12275560 12159243 12077070 11947539 11845330 11652936
5178 11652936 11469884 11367922 11289641 11212343 11075080 11002020 10960270 10887704 10854452 10810477 10823640
5167 10823640 10779825 10800092 10789434 10747677 10691782 10721240 10658934 10611970 10555152 10492400 10289196
5156 10289196 10082975 10013955 9894937 9786734 9725504 9694122 9574452 9558060 9474546 9320401
5146 9320401 9209254 9195155 9148471 9098649 9067867 8969661 8900602 8906895 8896338 8827287 8858565
5135 8858565 8898819 8906541 8944239 8913420 8929456 8958150 8967735 8963628 9037584 9025876 9086153 9086056 9209922
5122 9209922 9278460 9368613 9418106 9502777 9677020 9738697 9855567 10009725 10134784 10352874
5112 10352874 10547594 10662879 10930443 11161707 11400779 11622503 11912148 12134833 12387541
$$ packed form
5189A2595065n9437m0536l1365r0465l0382o7320j16317q2173j29531j02209j92394
5178A1652936j83052j01962p8281p7298j37263p3060m1750p2566l3252m3975J3163
5167A0823640m3815K0267j0658m1757n5895K9458o2306m6964n6818o2752k03204
5156A0289196k06221o9020j19018j08203o1230l1382j19670j6392q3514j54145
5146I320401j11147j4099m6684m9822l0782r8206o9059O293j0557o9051L1278
5135H858565M0254P722L7698l0819J6036K8694R585m107P3956j1708O0277r7J23866
5122I209922O8538R0153M9493Q4671J74243O1677J16870J54158J25059K18090
5112A0352874J94720J15285K67564K31264K39072K21724K89645K22685K52708
$$ plain form
5103 12387541 12844995 13280275 13769130 14278881 14722244 15136310 15572121 16059279 16489723
5094 16489723 16747538 16957087 17112113 17176535 17347615 17350868 17332341 17329520 17320251 17352287 17331199
5083 17331199 17287779 17358766 17457830 17627710 17756256 18023638 18368295 18741675 19181272 19754860
5073 19754860 20359325 20990112 21667137 22345477 23060857 23732204 24370852 24827115 25190833
5064 25190833 25472875 25673586 25805982 25867073 25883739 25703744 25386994 25007529 24371677 23673790
5054 23673790 22934522 22213864 21552968 20956745 20386750 19883490 19514195 19248583 19092036
5045 19092036 18941263 18917152 18886948 18889963 18875827 18990709 19065542 19121458 19163909 19284742 19341547
5034 19341547 19274344 19276698 19205694 19101245 18941340 18607768 18039553 17542423 16959506 16266354
$$ packed form
5103A2387541M57454M35280M88855N09751M43363M14066M35811M87158M30444
5094A6489723K57815K09549J55026O4422J71080L253j8527k821r269L2036k1088
5083A7331199m3420P0987R9064J69880J28546K67382L44657L73380M39597N73588
5073A9754860O04465O30787O77025O78340P15380O71347O38648M56263L63718
5064B5190833K82042K00711J32396O1091J6666j79995l16750l79465o35852o97887
5054B3673790p39268p20658o60896n96223n69995n03260l69295k65612j56547
5045A9092036j50773k4111l0204L015j4136J14882P4833N5916M2451J20833N6805
5034A9341547o7203K354p1004j04449j59905l33572n68215m97130n82917o93152
$$ plain form
5024 16266354 15634126 15043888 14454714 13950994 13525837 13134892 12808309 12524816 12244730
5015 12244730 12027772 11890767 11744238 11456225 11170751 10889933 10660959 10410327 10161635
5006 10161635 9991954 9792986 9586838 9394468 9329992 9236740 9116621 8925821 8895148 8883453
4996 8883453 8836358 8738552 8674468 8649938 8552254 8502657 8497602 8542753 8589724 8671502 8745146 8793448
4984 8793448 8920726 9026924 8963433 8910396 8829455 8745488 8585341 8440853 8351140 8246409
4974 8246409 8193158 8132482 8087611 8079633 8052797 8110460 8132746 8079507 8100677 8108280 8081549 8055854
4962 8055854 8071685 8114506 8133657 8216383 8264942 8324148 8413580 8447652 8478021 8537771 8515679
4951 8515679 8566881 8621780 8708636 8793108 8906473 8911871 8967562 9082805 9137884 9212797 9241517
$$ packed form
5024A6266354o32228n90238n89174n03720m25157l90945l26583k83493k80086
5015A2244730k16958j37005j46529k88013k85474k80818k28974k50632k48692
5006A0161635j69681j98968k06148j92370o4476r3252j20119j90800l0673j1695
4996H883453m7095r7806o4084k4530r7684m9597n055M5151M6971Q1778P3644M8302
4984H793448J27278J06198o3491n3037q0941q3967j60147j44488q9713j04731
4974H246409n3251o0676m4871p978k6836N7663K2286n3239K1170P603k6731k5695
4962H055854J5831M2821J9151Q2726M8559N9206Q9432L4072L0369N9750k2092
4951H515679N1202N4899Q6856Q4472J13365N398N5691J15243N5079P4913K8720
$$ plain form
4940 9241517 9317665 9445534 9555021 9726293 9858911 9880039 9980873 10098524 10221530 10301971
4930 10301971 10462240 10614813 10712342 10817544 10866714 11043541 11206499 11262164 11415077 11487790
4920 11487790 11654436 11881756 12095110 12336487 12568377 12793196 12974199 13128392 13309940
4911 13309940 13446665 13655440 13838075 13994834 14182475 14333764 14622194 15005784 15286789
4902 15286789 15674032 16035830 16330172 16691877 17129022 17519720 17940250 18332778 18704955
4893 18704955 19135079 19610807 20208419 20872539 21702740 22540846 23425452 24232503 25014001
4884 25014001 25642690 26174041 26553111 26884050 27122766 27235860 27320722 27365001 27342082 27407582
4874 27407582 27474872 27575911 27785779 27971199 28257394 28621520 28949637 29242928 29441012 29755991
$$ packed form
4940I241517P6148J27869J09487J71272J32618K1128J00834J17651J23006Q0441
4930A0301971J60269J52573R7529J05202M9170J76827J62958N5665J52913P2713
4920A1487790J66646K27320K13354K41377K31890K24819J81003J54193J81548
4911A3309940J36725K08775J82635J56759J87641J51289K88430L83590K81005
4902A5286789L87243L61798K94342L61705M37145L90698M20530L92528L72177
4893A8704955M30124M75728N97612O64120Q30201Q38106Q84606Q07051P81498
4884B5014001O28689N31351L79070L30939K38716J13094Q4862M4279k2919O5500
4874B7407582O7290J01039K09868J85420K86195L64126L28117K93291J98084L14979
$$ plain form
4864 29755991 30137100 30589100 31100194 31698545 32374768 33089910 33921851 34654022 35299518
4855 35299518 35681958 35964523 36117795 36162285 36199864 36138998 35940238 35659842 35247952 34824795
4845 34824795 34341055 33866037 33301610 32625001 31973522 31373157 30848299 30357501 29809398
4836 29809398 29319747 28727390 28226862 27814484 27514888 27322613 27153999 26983655 26854263
4827 26854263 26751377 26701585 26729469 26627033 26498586 26317473 26162628 25911966 25625404 25157920
4817 25157920 24529689 23906688 23219549 22520370 21863316 21265560 20748438 20255829 19730558
4808 19730558 19260909 19023442 18766082 18475986 18232339 17959174 17750961 17603507 17447205
4799 17447205 17240277 17020146 16858738 16684859 16499462 16340013 16185662 16139374 16055914 15925188
$$ packed form
4864B9755991L81109M52000N11094N98351O76223P15142Q31941P32171O45496
4855C5299518L82440K82565J53272M4490L7579o0866j98760k80396m11890m23157
4845C4824795m83740m75018n64427o76609o51479o00365n24858m90798n48103
4836B9809398m89651n92357n00528m12378k99596j92275j68614j70344j29392
4827B6854263j02886m9792K7884j02436j28447j81113j54845k50662k86562m67484
4817B5157920o28231o23001o87139o99179o57054n97756n17122m92609n25271
4808A9730558m69649k37467k57360k90096k43647k73165k08213j47454j56302
4799A7447205k06928k20131j61408j73879j85397j59449j54351m6288q3460j30726
$$ plain form
4789 15925188 15919054 15922690 15982771 16018389 15987434 16040219 16215392 16404617 16609884 16882466 16984992
4778 16984992 17196997 17386312 17490942 17467840 17419078 17453388 17395484 17405453 17356482 17451622 17542827
4767 17542827 17594139 17762416 17953829 18111019 18201304 18411712 18663737 18891018 19097897 19286573
4757 19286573 19491073 19720596 19920391 20066166 20178926 20264201 20304523 20283080 20266186 20331307
4747 20331307 20334059 20394963 20553815 20690041 20936347 21235012 21619044 21954672 22415026 22994158
4737 22994158 23570619 24223764 24857106 25376218 25830360 26114421 26400721 26747961 27200376
4728 27200376 27822182 28604202 29661283 30995037 32745428 35152682 38107211 41447986
4720 41447986 44485735 46266623 46213382 44486636 41845925 39048284 36634350 34974324
$$ packed form
4789A5925188o134L636O0081L5618l0955N2785J75173J89225K05267K72582J02526
4778A6984992K12005J89315J04630k3102m8762L4310n7904R969m8971R5140R1205
4767A7542827N1312J68277J91413J57190R0285K10408K52025K27281K06879J88676
4757A9286573K04500K29523J99795J45775J12760Q5275M0322k1443j6894O5121
4747B0331307K752O0904J58852J36226K46306K98665L84032L35628M60354N79132
4737B2994158N76461O53145O33342N19112M54142K84061K86300L47240M52415
4728B7200376O21806P82020J057081J333754J750391K407254K954529L340775
4720D1447986L037749J780888n3241j726746k640711k797641k413934j660026
$$ plain form
4712 34974324 33796076 32850729 32129570 31500806 30995280 30466363 29916176 29390663 29023944
4703 29023944 28736988 28611012 28562971 28551194 28643775 28858218 29109254 29599386 30159073 30748825
4693 30748825 31386503 31986614 32620140 33234118 33793297 34310216 34935013 35631854 36225014
4684 36225014 36884979 37514501 38311835 39315030 40455892 41729514 43243725 45007065 47098177
4675 47098177 49735740 52853899 55740649 57641081 58301763 57635894 55760945 53129693
4667 53129693 50532205 48297412 46533938 45178890 44036002 43070807 42329858 41558173 40770614
4658 40770614 40188964 39682654 39217631 38873371 38617869 38366065 38259456 38227179 38217945 38221346
4648 38221346 38169496 38081689 37880555 37786738 37609179 37462650 37306422 37187286 37147984 37300340
$$ packed form
4712C4974324j178248r45347p21159o28764n05526n28917n50187n25513l66719
4703B9023944k86956j25976m8041j1777R2581K14443K51036M90132N59687N89752
4693C0748825O37678O00111O33526O13978N59179N16919O24797O96841N93160
4684C6225014O59965O29522P97334J003195J140862J273622J514211J763340K091112
4675D7098177K637563L118159K886750J900432O60682o65869j874949k631252
4667E3129693k597488k234793j763474j355048j142888r65195p40949p71685p87559
4658D0770614n81650n06310m65023l44260k55502k51804j06609l2277r234L401
4648C8221346n1850q7807k01134r3817j77559j46529j56228j19136l9302J52356
$$ plain form
4638 37300340 37422804 37620268 37864254 38199003 38529825 38981948 39573748 40249434 41118551
4629 41118551 42129820 43126731 44078316 44915983 45598995 46162775 46622915 46979190 47183296
4620 47183296 47225770 47171944 47307929 47571159 48004429 48642238 49317055 49945891 50657292 51295779
4610 51295779 51942989 52708691 53524715 54389377 55377995 56419864 57375493 58127175 58804552
4601 58804552 59541625 60408760 61461415 62482808 63482389 64487338 65235435 65784605 66385544
4592 66385544 67035825 67719252 68362158 69014666 69773198 70675328 71635984 72661484 73799408
4583 73799408 75063816 76450528 77737449 78949986 80033762 81088598 82143435 83287826
4575 83287826 84602291 85994998 87257682 88374257 89255343 89932447 90680863 91367117 92066396
$$ packed form
4638C7300340J22464J97464K43986L34749L30822M52123N91800O75686Q69117
4629D1118551J011269R96911R51585Q37667O83012N63780M60140L56275K04106
4620D7183296M2474n3826J35985K63230M33270O37809O74817O28836P11401O38487
4610E1295779O47210P65702Q16024Q64662R88618J041869R55629P51682O77377
4601E8804552P37073Q67135J052655J021393R99581J004949P48097N49170O00939
4592F6385544O50281O83427O42906O52508P58532R02130R60656J025500J137924
4583G3799408J264408J386712J286921J212537J083776J054836J054837J144391
4575H3287826J314465J392707J262684J116575Q81086O77104P48416O86254O99279
$$ plain form
4566 92066396 92920006 93882017 94925251 96037019 97340041 98644705 100107240 101561409
4558 101561409 103142686 104785624 106495244 108200530 109825570 111407441 112941952 114266164
4550 114266164 115347391 116104631 116485130 116524416 116198394 115503673 114509441 113285376 112023248
4541 112023248 110745059 109359873 108084832 106923720 105884126 104945843 104082139 103278196
4533 103278196 102678487 102088971 101577311 100859201 100054872 99184663 98020287 96684601 95213983
4524 95213983 93669285 91955457 90153903 88386135 86611600 84846551 83173127 81489005
4516 81489005 79937809 78384100 76850753 75482113 74193091 72966615 71895011 70958831
4508 70958831 70051358 69396986 68785982 68340647 68056287 67817070 67647879 67428925 67178104
$$ packed form
4566I2066396Q53610R62011J043234J111768J303022J304664J462535J454169
4558A01561409J581277J642938J709620J705286J625040J581871J534511J324212
4550A14266164J081227P57240L80499L9286l26022o94721r94232j224065j262128
4541A12023248j278189j385186j275041j161112j039594r38283q63704q03943
4533A03278196n99709n89516n11660p18110q04329q70209j164376j335686j470618
4524I5213983j544698j713828j801554j767768j774535j765049j673424j684122
4516H1489005j551196j553709j533347j368640j289022j226476j071604r36180
4508G0958831r07473o54372o11004m45335k84360k39217j69191k18954k50821
$$ plain form
4499 67178104 66872853 66466445 66027276 65589725 65180442 64977822 64871135 64849137 64916272 65057899
4489 65057899 65341428 65615885 66001069 66472145 66952460 67515419 68047237 68634376 69292514
4480 69292514 70145396 71132493 72039718 73112521 74307580 75663131 77024027 78418375 79843879
4471 79843879 81240379 82397537 83411573 84386207 85310273 86267266 87274118 88248592 89209426
4462 89209426 90212340 91105031 91894119 92786597 93674047 94601427 95503256 96398681 97082773
4453 97082773 97529862 97740550 98001524 98311763 98704463 99299365 99961213 100818915 101756469
4444 101756469 102745404 103666514 104393789 104920052 105235464 105479175 105705502 106087202 106448246
4435 106448246 106482154 106401572 106204976 106038013 105814176 105446590 105061517 104809560 104607039 104599556
$$ packed form
4499F7178104l05251m06408m39169m37551m09283k02620j06687k1998O7135J41627
4489F5057899K83529K74457L85184M71076M80315N62959N31818N87139O58138
4480F9292514Q52882R87097R07225J072803J195059J355551J360896J394348J425504
4471G9843879J396500J157158J014036R74634R24066R56993J006852R74474R60834
4462H9209426J002914Q92691P89088Q92478Q87450R27380R01829Q95425O84092
4453I7082773M47089K10688K60974L10239L92700N94902O61848Q57702R37554
4444A01756469R88935R21110P27275N26263L15412K43711K26327L81700L61044
4435A06448246L3908q0582j96596j66963k23837l67586l85073k51957k02521p483
$$ plain form
4425 104599556 104391499 103942657 103318268 102536774 101767060 101079787 100512319 100015531 99724577
4416 99724577 99731216 99855319 99858923 99695718 99269092 98568094 97842497 97290205 97003114 96908019
4406 96908019 97073777 97494515 98058595 98718298 99373999 100003072 100531655 101069690 101779318
4397 101779318 102817894 104375281 106194589 108231349 110526915 113003248 115495294 118041522
4389 118041522 120492953 122951382 125475673 128319638 131767415 135814425 140465563 145787297
4381 145787297 151956359 158773807 166421414 174946739 184485079 195468511 208082630 222655158
4373 222655158 239104913 257231119 276225501 294390501 309424338 318300495 318618016
4366 318618016 310023440 294305353 274276041 252791003 231797946 212410078 195183506
$$ packed form
4425A04599556k08057m48842o24389p81494p69714o87273n67468m96788k90954
4416I9724577O639J24103L604j63205m26626p00998p25597n52292k87091r5095
4406I6908019J65758M20738N64080O59703O55701O29073N28583N38035P09628
4397A01779318J038576J557387J819308K036760K295566K476333K492046K546228
4389A18041522K451431K458429K524291K843965L447777M047010M651138N321734
4381A45787297O169062O817448P647607Q525325R538340J0983432J2614119J4572528
4373B22655158J6449755J8126206J8994382J8165000J5033837Q876157L17521
4366C18618016q594576j5718087k0029312k1485038k0993057j9387868j7226572
$$ plain form
4359 195183506 180038581 166847299 155275265 145173528 136333940 128577774 121657119
4352 121657119 115554393 110161726 105374007 101135307 97434605 94155942 91179028 88574153
4344 88574153 86244937 84059899 81985997 80100873 78222526 76512681 75008461 73581391
4336 73581391 72214610 70900253 69427087 67672414 65679784 63446739 61195570 58968260
4328 58968260 56770607 54852320 52969752 51249092 49696469 48298475 46950771 45759712
4320 45759712 44635283 43553636 42610028 41689030 40802193 39887223 39122606 38377386 37743541
4311 37743541 37162133 36472342 36001183 35498068 35046917 34771526 34501107 34276329 34167880
4302 34167880 34006353 33974011 34022956 34110975 34148617 34118176 34062091 33768928 33263560 32533971
$$ packed form
4359A95183506j5144925j3191282j1572034j0101737q839588p756166o920655
4352A21657119o102726n392667m787719m238700l700702l278663k976914k604875
4344H8574153k329216k185038k073902j885124j878347j709845j504220j427070
4336G3581391j366781j314357j473166j754673j992630k233045k251169k227310
4328E8968260k197653j918287j882568j720660j552623j397994j347704j191059
4320D5759712j124429j081647r43608r20998q86837r14970p64617p45220o33845
4311C7743541n81408o89791m71159n03115m51151k75391k70419k24778j08449
4302C4167880j61527l2342M8945Q8019L7642l0441n6085k93163n05368p29589
$$ plain form
4292 32533971 31702449 30930701 30166832 29442370 28795609 28202599 27700352 27242996 26875876
4283 26875876 26491268 26159296 25942093 25657965 25307174 25074865 24803857 24556754 24400885
4274 24400885 24137198 24001596 23881633 23734655 23573742 23478561 23361363 23226879 23097953 22998885
4264 22998885 22927056 22857369 22696452 22642563 22617085 22548481 22579137 22576898 22599250 22580841 22559438
4253 22559438 22551939 22558215 22499874 22499814 22505105 22477815 22349784 22212351 22145064 22122303 22052937 22088543
4241 22088543 21982448 21935213 21921133 21918056 21962566 22044898 22114557 22371226 22671332 22974012 23195026
4230 23195026 23233792 23198199 22886119 22445515 21920681 21457990 20934752 20500270 20122162 19865805
4220 19865805 19684665 19578770 19471951 19293588 19143580 19120404 19063605 18964914 18969584 18880278
$$ packed form
4292C2533971q31522p71748p63869p24462o46761n93010n02247m57356l67120
4283B6875876l84608l31972k17203k84128l50791k32309k71008k47103j55869
4274B4400885k63687j35602j19963j46978j60913r5181j17198j34484j28926r9068
4264B2998885p1829o9687j60917n3889k5478o8604L0656k239K2352j8409k1403
4253B2559438p499O276n8341o0N291k7290j28031j37433o7287k2761o9366L5606
4241B2088543j06095m7235j4080l077M4510Q2332O9659K56669L00106L02680K21014
4230B3195026L8766l5593l12080m40604n24834m62691n23238m34482l78108k56357
4220A9865805j81140j05895j06819j78363j50008k3176n6799r8691M670q9306
$$ plain form
4210 18880278 18737533 18664682 18591450 18576434 18522600 18422745 18415126 18374188 18339338 18257706 18221979
4199 18221979 18236952 18165480 18090703 18148107 18165839 18162561 18189898 18265863 18324858 18499982 18648887
4188 18648887 18734991 18848040 18973563 19052114 19250980 19372838 19520570 19682352 19804088 20067403
4178 20067403 20310907 20636083 21049056 21470294 21800015 22042639 22088389 21890532 21638589 21373007
4168 21373007 21183089 21001591 20762560 20719674 20726354 20701073 20767056 20911772 21118203 21339514
4158 21339514 21564200 21683274 21559928 21369119 21126479 20881929 20702350 20586238 20512935 20501279
4148 20501279 20380033 20399443 20397999 20369874 20336376 20358658 20404209 20358489 20323883 20274169 20186569
4137 20186569 20112508 20039988 19982510 19945046 19882918 19882598 19938525 19926304 19723104 19460279 19200616
$$ packed form
4210A8880278j42745p2851p3232j5016n3834r9855p619m0938l4850q1632l5727
4199A8221979J4973p1472p4777N7404J7732l278K7337P5965N8995J75124J48905
4188A8648887Q6104J13049J25523P8551J98866J21858J47732J61782J21736K63315
4178B0067403K43504L25176M12973M21238L29721K42624M5750j97857k51943k65582
4168B1373007j89918j81498k39031m2886O680k5281O5983J44716K06431K21311
4158B1339514K24686J19074j23346j90809k42640k44550j79579j16112p3303j1656
4148B0501279j21246J9410j444k8125l3498K2282M5551m5720l4606m9714q7600
4137B0186569p4061p2520n7478l7464o2128l20N5927j2221k03200k62825k59663
$$ plain form
4126 19200616 18880659 18678598 18460934 18295515 18217248 18203431 18207500 18155831 18175551 18314277
4116 18314277 18353152 18341784 18390566 18344910 18400942 18387969 18442224 18520091 18570359 18714879 18776828
4105 18776828 18772495 18704306 18669026 18492507 18434529 18397576 18277749 18166533 18052034 17947633
4095 17947633 17904260 17794037 17823151 17900965 17806570 17841943 17888366 17913594 17924773 17918254 17845341
4084 17845341 17724661 17710824 17649965 17633611 17629615 17565893 17618235 17643619 17711436 17781847 18004186
4073 18004186 18167147 18259418 18326056 18524854 18708977 18922441 19052937 19239889 19485111 19685131
4063 19685131 19930227 20123786 20207492 20356556 20513685 20685104 20841529 20971526 21097855 21251563
4053 21251563 21436528 21693034 21996584 22220309 22502495 22821329 23169595 23436033 23694533
$$ packed form
4126A9200616l19957k02061k17664j65419p8267j3817M069n1669J9720J38726
4116A8314277L8875j1368M8782m5656N6032j2973N4255P7867N0268J44520O1949
4105A8776828m333o8189l5280j76519n7978l6953j19827j11216j14499j04401
4095A7947633m3373j10223K9114P7814r4395L5373M6423K5228J1179o519p2913
4084A7845341j20680j3837o0859j6354l996o3722N2342K5384O7817P0411K22339
4073A8004186J62961R2271O6638J98798J84123K13464J30496J86952K45222K00020
4063A9685131K45096J93559Q3706J49064J57129J71419J56425J29997J26329J53708
4053B1251563J84965K56506L03550K23725K82186L18834L48266K66438K58500
$$ plain form
4044 23694533 24003848 24262871 24467514 24701142 24870405 25053956 25241049 25334101 25474084 25722649
4034 25722649 26008923 26252508 26549777 26792529 27001477 27346583 27562674 27790005 28150228
4025 28150228 28468651 28725021 28982079 29327097 29691944 30020794 30330485 30625974 30978691
4016 30978691 31268268 31540318 31796912 32170869 32629474 33095231 33575944 34115592 34758884
4007 34758884 35337242 35868146 36467386 37014324 37530311 38041693 38634831 39266853 39995394
3998 39995394 40861285 41693751 42561381 43413943 44280918 45195957 46131477 47117913 48002893
3989 48002893 48929828 49914866 50974917 52123569 53264678 54450805 55687694 57052296
3981 57052296 58329329 59684695 61046126 62473717 63924972 65329836 66785870 68360052
$$ packed form
4044B3694533L09315K59023K04643K33628J69263J83551J87093R3052J39983K48565
4034B5722649K86274K43585K97269K42752K08948L45106K16091K27331L60223
4025B8150228L18423K56370K57058L45018L64847L28850L09691K95489L52717
4016C0978691K89577K72050K56594L73957M58605M65757M80713N39648O43292
4007C4758884N78358N30904N99240N46938N15987N11382N93138O32022P28541
3998C9995394Q65891Q32466Q67630Q52562Q66975R15039R35520R86436Q84980
3989D8002893R26935R85038J060051J148652J141109J186127J236889J364602
3981E7052296J277033J355366J361431J427591J451255J404864J456034J574182
$$ plain form
3973 68360052 69879212 71362723 72848437 74260146 75694799 77214148 78910616 80711736
3965 80711736 82665656 84638102 86669547 88727775 90886897 93190505 95419535 97766069
3957 97766069 100132519 102334581 104506802 106713409 109099343 111766419 114723921 117934361
3949 117934361 121484136 125310725 129625143 134715976 140645524 147728201 156389624 167134597
3941 167134597 181120661 199772908 224910660 257240058 290977932 309069249 299905843
3934 299905843 271106595 237210240 207809984 185065704 167785557 154430869 144126687
3927 144126687 135986847 129358545 123911243 119446351 115635299 112253986 109134478 105933014
3919 105933014 102607947 99340905 96138328 93077345 90347379 87981650 85798150 83557111
$$ packed form
3973F8360052J519160J483511J485714J411709J434653J519349J696468J801120
3965H0711736J953920J972446K031445K058228K159122K303608K229030K346534
3957I7766069K366450K202062K172221K206607K385934K667076K957502L210440
3949A17934361L549775L826589M314418N090833N929548P082677Q661423J0744973
3941A67134597J3986064J8652247K5137752L2329398L3737874J8091317r163406
3934B99905843k8799248l3896355k9400256k2744280j7280147j3354688j0304182
3927A44126687q139840o628302n447302m464892l811052l381313l119508l201464
3919A05933014l325067l267042l202577l060983k729966k365729k183500k241039
$$ plain form
3911 83557111 81381399 79197055 76983670 74689187 72474837 70295672 68201026 66041350
3903 66041350 63907514 61842144 59792807 57913399 56229571 54550669 52973910 51420499
3895 51420499 49919756 48447733 47007696 45706117 44413705 43114496 41901877 40795155
3887 40795155 39681427 38640558 37615818 36484366 35497855 34600634 33646708 32756588 31960802
3878 31960802 31204659 30451878 29681741 28998115 28451732 27871773 27374571 26837167 26247227
3869 26247227 25634593 24990028 24392885 23849623 23367036 23025990 22624377 22182035 21828696
3860 21828696 21448079 21092661 20722314 20285352 19879280 19493933 19134491 18747248 18422158
3851 18422158 18137566 17888220 17674623 17548767 17355646 17155783 17002923 16876947 16717034
$$ packed form
3911H3557111k175712k184344k213385k294483k214350k179165k094646k159676
3903F6041350k133836k065370k049337j879408j683828j678902j576759j553411
3895E1420499j500743j472023j440037j301579j292412j299209j212619j106722
3887D0795155j113728j040869j024740j131452r86511q97221r53926q90120p95786
3878C1960802p56143p52781p70137o83626n46383n79959m97202n37404n89940
3869B6247227o12634o44565n97143n43262m82587l41046m01613m42342l53339
3860B1828696l80617l55418l70347m36962m06072l85347l59442l87243l25090
3851A8422158k84592k49346k13597j25856j93121j99863j52860j25976j59913
$$ plain form
3842 16717034 16521911 16437997 16354562 16275014 16212531 16127604 16002933 15889311 15821757 15739391 15697196
3831 15697196 15607021 15522925 15563388 15642620 15659272 15709078 15752579 15786743 15918675 15969656 15984189
3820 15984189 16086634 16155105 16254076 16358720 16438228 16484268 16668956 16703728 16843905 17037906
3810 17037906 17274694 17431846 17676957 17979523 18163750 18384723 18625598 18892270 19100749
3801 19100749 19354218 19557969 19746819 19896567 19956606 20057628 20097465 20131826 20155459 20139379
3791 20139379 20110632 20096980 20049060 19962070 19878302 19775562 19748881 19715890 19593415 19404144 19260671
3780 19260671 19162092 19047353 18895970 18879326 18708004 18606286 18416202 18334674 18250541 18141515
3770 18141515 18012059 17940427 17920195 17855382 17832017 17837280 17859637 17904506 17927204 17920884 17901287
$$ packed form
3842A6717034j95123q3914q3435p9548o2483q4927j24671j13622o7554q2366m2195
3831A5697196r0175q4096M0463P9232J6652M9806M3501L4164J31932N0981J4533
3820A5984189J02445O8471R8971J04644P9508M6040J84688L4772J40177J94001
3810A7037906K36788J57152K45111L02566J84227K20973K40875K66672K08479
3801A9100749K53469K03751J88850J49748O0039J01022L9837L4361K3633j6080
3791B0139379k8747j3652m7920q6990q3768j02740k6681l2991j22475j89271j43473
3780A9260671r8579j14739j51383j6644j71322j01718j90084q1528q4133j09026
3770A8141515j29456p1632k0232o4813k3365N263K2357M4869K2698o320j9597
$$ plain form
3759 17901287 17938242 17921761 18016151 18037885 18097649 18132286 18185751 18290661 18384564 18470316 18545017
3748 18545017 18556706 18532938 18627932 18672825 18772019 18932382 19069284 19186002 19348855 19524034
3738 19524034 19700041 19883330 20021028 20182410 20349262 20519461 20724114 20838660 21048740
3729 21048740 21195738 21331196 21450234 21569939 21720811 21821096 22049892 22186105 22275362 22393302
3719 22393302 22531710 22693660 22766902 22808884 22838046 22932311 22987282 23034594 23056461 23079849 23083466
3708 23083466 23149628 23170745 23213192 23172509 23203557 23246198 23289249 23416839 23577475 23663366 23728574
3697 23728574 23794975 23826629 23887446 24045920 24155930 24254390 24464647 24620297 24816424 25044156
3687 25044156 25254299 25462920 25753164 26023134 26314061 26609402 26953241 27250673 27519447
$$ packed form
3759A7901287L6955j6481R4390K1734N9764L4637N3465J04910R3903Q5752P4701
3748A8545017J1689k3768R4994M4893R9194J60363J36902J16718J62853J75179
3738A9524034J76007J83289J37698J61382J66852J70199K04653J14546K10080
3729B1048740J46998J35458J19038J19705J50872J00285K28796J36213Q9257J17940
3719B2393302J38408J61950P3242M1982K9162R4265N4971M7312K1867K3388L617
3708B3083466O6162K1117M2447m0683L1048M2641M3051J27590J60636Q5891O5208
3697B3728574O6401L1654O0817J58474J10010R8460K10257J55650J96127K27732
3687B5044156K10143K08621K90244K69970K90927K95341L43839K97432K68774
$$ plain form
3678 27519447 27806200 28182380 28457321 28778495 29186449 29609210 30002443 30293008 30644142
3669 30644142 31023671 31464405 31997284 32508953 33078697 33589346 34083906 34694679 35306553
3660 35306553 35922365 36584312 37346996 38037402 38878241 39780181 40704864 41751178 42910163
3651 42910163 44068091 45330057 46692758 48097966 49518255 51116337 52892432 54720468
3643 54720468 56713642 58843082 61027049 63280230 65552400 67937169 70535912 73314362
3635 73314362 76300637 79418320 82681740 85849155 88929963 91944598 94827166 97640701
3627 97640701 100391221 103129220 105791232 108342565 110679441 112781897 114636821 116355673
3619 116355673 117813039 119050414 119923507 120628046 121190901 121553724 121760738 121883514 121914637
$$ packed form
3678B7519447K86753L76180K74941L21174M07954M22761L93233K90565L51134
3669C0644142L79529M40734N32879N11669N69744N10649M94560O10773O11874
3660C5306553O15812O61947P62684O90406Q40839R01940R24683J046314J158985
3651D2910163J157928J261966J362701J405208J420289J598082J776095J828036
3643E4720468J993174K129440K183967K253181K272170K384769K598743K778450
3635G3314362K986275L117683L263420L167415L080808L014635K882568K813535
3627I7640701K750520K737999K662012K551333K336876K102456J854924J718852
3619A16355673J457366J237375Q73093P04539N62855L62823K07014J22776L1123
$$ plain form
3610 121914637 121797127 121716691 121471668 121092947 120584081 119838478 118934456 118025889 117184119
3601 117184119 116457328 115808820 115263095 114958953 114804961 114865087 115081182 115347965 115737915
3592 115737915 116224908 116817860 117546896 118333651 119221780 120238294 121295074 122558627 123979744
3583 123979744 125501070 127064913 128815062 130774917 132760357 134822185 136951639 139058505
3575 139058505 141262999 143500408 145813429 148276815 150791115 153452659 156178360 159019212
3567 159019212 162121829 165274487 168588175 171906658 175479280 179092496 182691693 186219294
3559 186219294 189635110 192880981 195783221 198389427 200580129 202310785 203742450 204799828
3551 204799828 205572227 206215972 206705235 207219584 207610132 207845554 208034109 208035306 207685066 206970185
$$ packed form
3610A21914637j17510q0436k45023l78721n08866p45603r04022r08567q41770
3601A17184119p26791o48508n45725l04142j53992O0126K16095K66783L89950
3592A15737915M86993N92952P29036P86755Q88129J016514J056780J263553J421117
3583A23979744J521326J563843J750149J959855J985440K061828K129454K106866
3575A39058505K204494K237409K313021K463386K514300K661544K725701K840852
3567A59019212L102617L152658L313688L318483L572622L613216L599197L527601
3559A86219294L415816L245871K902240K606206K190702J730656J431665J057378
3551B04799828P72399O43745M89263N14349L90548K35422J88555J197l50240p14881
$$ plain form
3541 206970185 205667701 203853019 201612561 198891497 195842434 192580309 189175984 185863153
3533 185863153 182683213 179709885 176916552 174153304 171544505 169093950 166662712 164288756
3525 164288756 161995576 159660208 157333703 155128227 153090014 151133675 149366436 147643531
3517 147643531 146077964 144771261 143608111 142672605 141895911 141251150 140716666 140274806 139836271
3508 139836271 139297936 138710000 137947972 136951593 136104853 135215236 134261698 133247750 132229912
3499 132229912 131209067 130140108 129108979 127978227 126907477 125735819 124519446 123186105
3491 123186105 121758153 120179985 118526993 116821925 115003904 113140064 111171703 109218327
3483 109218327 107248320 105280342 103394072 101519215 99723268 97989385 96299791 94693342
$$ packed form
3541B06970185j302484j814682k240458k721064l049063l262125l404325l312831
3533A85863153l179940k973328k793333k763248k608799k450555k431238k373956
3525A64288756k293180k335368k326505k205476k038213j956339j767239j722905
3517A47643531j565567j306703j163150r35506p76694o44761n34484m41860m38535
3508A39836271n38335n87936p62028r96379q46740q89617r53538j013948j017838
3499A32229912j020845j068959j031129j130752j070750j171658j216373j333341
3491A23186105j427952j578168j652992j705068j818021j863840j968361j953376
3483A09218327j970007j967978j886270j874857j795947j733883j689594j606449
$$ plain form
3475 94693342 93092901 91624084 90146950 88791167 87391880 86061269 84764809 83576573
3467 83576573 82361164 81225845 80185782 79194647 78260113 77446698 76628834 75905198 75243648
3458 75243648 74616021 74074799 73602049 73166801 72783266 72431617 72036312 71711869 71460042
3449 71460042 71293488 71139331 71005861 70829695 70746182 70722349 70708618 70735945 70845556 70896486
3439 70896486 71127536 71568080 72122001 72892974 73680441 74572164 75685541 76980603 78430917
3430 78430917 80119721 82146881 84312730 86735155 89420218 92230351 95202852 98278369
3422 98278369 101250478 103986377 106523059 108690180 110296177 111386344 111973544 112116658
3414 112116658 111905885 111383231 110666984 109850116 108801129 107724766 106426403 104959178 103241257
$$ packed form
3475I4693342j600441j468817j477134j355783j399287j330611j296460j188236
3467H3576573j215409j135319j040063r91135r34534q13415q17864p23636o61550
3458G5243648o27627n41222m72750m35248l83535l51649l95305l24443k51827
3449G1460042j66554j54157j33470j76166q3513k3833j3731K7327J09611N0930
3439G0896486K31050M40544N53921P70973P87467Q91723J113377J295062J450314
3430G8430917J688804K027160K165849K422425K685063K810133K972501L075517
3422I8278369K972109K735899K536682K167121J605997J090167N87200J43114
3414A12116658k10773n22654p16247q16868j048987j076363j298363j467225j717921
$$ plain form
3405 103241257 101090761 98489733 95407225 91908612 88060552 84005978 79780064 75498346
3397 75498346 71465519 67564227 63931100 60495228 57311635 54604637 52101649 49834590
3389 49834590 47599609 45653200 44034237 42504615 41130392 39869788 38797196 37779563
3381 37779563 36778119 35916009 35160182 34467916 33800018 33200636 32664871 32150076 31682227
3372 31682227 31221580 30783551 30428719 30122210 29775619 29410241 29088344 28748760 28491119
3363 28491119 28248308 27957008 27770648 27445393 27114672 26850726 26552533 26237107 25958723
3354 25958723 25634878 25285043 24987818 24620171 24235528 23899018 23605375 23226102 22897963
3345 22897963 22550901 22202522 21844519 21494232 21117155 20775302 20397595 20006152 19718125
$$ packed form
3405A03241257k150496k601028l082508l498613l848060m054574m225914m281718
3397G5498346m032827l901292l633127l435872l183593k706998k502988k267059
3389D9834590k234981j946409j618963j529622j374223j260604j072592j017633
3381C7779563j001444q62110p55827o92266o67898n99382n35765n14795m67849
3372C1682227m60647m38029l54832l06509l46591l65378l21897l39584k57641
3363B8491119k42811k91300j86360l25255l30721k63946k98193l15426k78384
3354B5958723l23845l49835k97225l67647l84643l36510k93643l79273l28139
3345B2897963l47062l48379l58003l50287l77077l41853l77707l91443k88027
$$ plain form
3336 19718125 19445092 19027939 18652558 18299087 17997030 17686503 17409766 17105438 16846530
3327 16846530 16639908 16369070 16119703 15864362 15485500 15199217 14979773 14785574 14588164
3318 14588164 14442534 14349937 14154045 14085932 14015482 13894277 13795602 13709633 13584255 13507093
3308 13507093 13421639 13364058 13277589 13278398 13220986 13182125 13149106 13193934 13101531 13043229 13051896 13041267
3296 13041267 13161469 13292189 13394190 13427963 13490363 13565425 13628724 13621928 13710392 13768081 13882745
3285 13882745 14068025 14263765 14431919 14721239 15011919 15320191 15609496 15848907 16148668
3276 16148668 16529835 16895847 17252157 17591729 17987641 18469996 19019163 19638108 20428516
3267 20428516 21342370 22383589 23620668 24979384 26578877 28481010 30856802 33783879
$$ packed form
3336A9718125k73033m17153l75381l53471l02057l10527k76737l04328k58908
3327A6846530k06622k70838k49367k55341l78862k86283k19444j94199j97410
3318A4588164j45630r2597j95892o8113p0450j21205r8675q5969j25378p7162
3308A3507093q5454n7581q6469Q09n7412l8861l3019M4828r2403n8302Q667j0629
3296A3041267J20202J30720J02001L3773O2400P5062O3299o796Q8464N7689J14664
3285A3882745J85280J95740J68154K89320K90680L08272K89305K39411K99761
3276A6148668L81167L66012L56310L39572L95912M82355N49167O18945P90408
3267B0428516R13854J041219J237079J358716J599493J902133K375792K927077
$$ plain form
3259 33783879 37600882 42602290 49350412 57853131 66310062 69670653 66082870 58510621
3251 58510621 50621571 44237125 39408753 35860116 33188464 31332987 30106076 29259703
3243 29259703 28720826 28376991 28263346 28220372 28389430 28851397 29505075 30436746 31594502
3234 31594502 33001945 34783904 36857476 39293741 42207293 45886441 50433605 56480841
3226 56480841 64615043 75932435 90839875 108201252 119414778 116357696 102761786
3219 102761786 85935357 71324393 59901423 51367673 44842812 39836518 35938797 33102860
3211 33102860 30858699 28957583 27574873 26481676 25534346 24765289 24150394 23698225 23480277
3202 23480277 23442173 23661496 24155799 24949368 26077213 27588800 29399273 31739185 35056345
$$ packed form
3259C3783879L817003N001408O748122Q502719Q456931L360591l587783p572249
3251E8510621p889050o384446m828372l548637k671652j855477j226911q46373
3243B9259703n38877l43835j13645m2974J69058M61967O53678R31671J157756
3234C1594502J407443J781959K073572K436265K913552L679148M547164O047236
3226E6480841Q134202J1317392J4907440J7361377J1213526l057082j3595910
3219A02761786j6826429j4610964j1422970q533750o524861n006294l897721k835937
3211C3102860k244161j901116j382710j093197r47330p69057o14895m52169k17948
3202B3480277l8104K19323M94303P93569J127845J511587J810473K339912L317160
$$ plain form
3193 35056345 39643024 45875687 53570685 60482702 61704587 56489899 48304835 40293603
3185 40293603 33786639 28783326 25051704 22096870 19799932 17903464 16480790 15287814
3177 15287814 14293779 13474245 12712723 12015361 11390006 10770629 10206271 9720556 9233114
3168 9233114 8826174 8576935 8342786 8093929 7887136 7680615 7466251 7163645 6999548 6878196
3158 6878196 6724400 6542891 6321602 6012039 5782800 5679092 5516359 5379989 5237091 5142303
3148 5142303 5138397 5010731 4883755 4841009 4712569 4639043 4556026 4428488 4309635 4151623
3138 4151623 4126175 4145582 4067556 4015787 3938173 3833990 3776474 3774215 3659786 3661669 3653063 3622097
3126 3622097 3600350 3568869 3464844 3436382 3407367 3376100 3324038 3299114 3182585 3028585 3036027
$$ packed form
3193C5056345M586679O232663P694998O912017J221885n214688q185064q011232
3185D0293603o506964n003313l731622k954834k296938j896468j422674j192976
3177A5287814r94035q19534p61522o97362o25355o19377n64358m85715m87442
3168I233114m06940k49239k34149k48857k06793k06521k14364l02606j64097j21352
3158F878196j53796j81509k21289l09563k29239j03708j62733j36370j42898r4788
3148E142303l906j27666j26976m2746j28440p3526q3017j27538j18853j58012
3138D151623k5448J9407p8026n1769p7614j04183n7516k259j14429J883q606l0966
3126C622097k1747l1481j04025k8462k9015l1267n2062k4924j16529j54000P442
$$ plain form
3115 3036027 2946307 2857899 2830152 2804441 2765566 2698718 2620077 2597725 2543663 2428485 2423982
3104 2423982 2400421 2398257 2337651 2337539 2299733 2249073 2255313 2231276 2191590 2179073 2189704 2188909 2162197
3091 2162197 2091186 2039488 1993008 1958391 1874397 1758466 1672808 1655868 1649232 1643197 1678100 1735831
3079 1735831 1683050 1677201 1647943 1647336 1676174 1653611 1641254 1613389 1572393 1588913 1527152 1540538
3067 1540538 1571224 1559936 1538607 1518498 1442893 1321714 1363004 1382921 1365255 1299980 1285115
3056 1285115 1343017 1238418 1272502 1252265 1285378 1257585 1180085 1204155 1125435 1148722 1183558
3045 1183558 1169331 1135301 1156565 1135038 1158517 1090819 1095711 1058352 1033653 1100164 1094376 1152776
3033 1152776 1091487 1101509 1098404 1016132 1010774 1013082 975601 959538 933064 896707 907986 991090
$$ packed form
3115C036027q9720q8408k7747k5711l8875o6848p8641k2352n4062j15178m503
3104B423982k3561k164o0606j12l7806n0660O240k4037l9686j2517J0631p95k6712
3091B162197p1011n1698m6480l4617q3994j15931q5658j6940o636o035L4903N7731
3079A735831n2781n849k9258o07K8838k2563j2357k7865m0996J6520o1761J3386
3067A540538L0686j1288k1329k0109p5605j21179M1290J9917j7666o5275j4865
3056A285115N7902j04599L4084k0237L3113k7793p7500K4070p8720K3287L4836
3045A183558j4227l4030K1264k1527K3479o7698M892l7359k4699O6511n788N8400
3033A152776o1289J0022l105q2272n358K308l7481j6063k6474l6357J1279Q3104
$$ plain form
3021 991090 973276 993068 957901 940602 941665 997787 1045254 1055319 1051556 1041694 1084549 1052926
3009 1052926 1065814 1097983 1119518 1129171 1173826 1191490 1269267 1237284 1215011 1236522 1228527 1192611
2997 1192611 1206615 1209048 1197498 1172267 1180813 1160011 1188561 1172779 1170970 1188420 1220819 1205829
2985 1205829 1212385 1204262 1214757 1194602 1186893 1161372 1160848 1198643 1244286 1346267 1288247 1350984
2973 1350984 1500994 1600584 1729963 1753278 1771757 1817342 1877499 1903795 1955858 1877139 1794287
2962 1794287 1728880 1588106 1495949 1418126 1452009 1433820 1452046 1353588 1374763 1322024 1289459
2951 1289459 1258250 1233024 1156367 1131845 1104704 1057608 1125938 1113762 1063182 1104997 1190178
2940 1190178 1206952 1241048 1305528 1370908 1478037 1580898 1707300 1770481 1762050 1638454 1560389
$$ packed form
3021I91090j7814J9792l5167j7299J063N6122M7467J0065l763r862M2855l1623
3009A052926J2888L2169K1535R653M4655J7664P7777l1983k2273K1511p995l5916
2997A192611J4004K433j1550k5231Q546k0802K8550j5782j809J7450L2399j4990
2985A205829O556q123J0495k0155p709k5521n24L7795M5643J01981n8020O2737
2973A350984J50010R9590J29379K3315J8479M5585O0157K6296N2063p8719q2852
2962A794287o5407j40774r2157p7823L3883j8189J8226r8458K1175n2739l2565
2951A289459l1209k5226p6657k4522k7141m7096O8330j2176n0580M1815Q5181
2940A190178J6774L4096O4480O5380J07129J02861J26402O3181q431j23596p8065
$$ plain form
2929 1560389 1457263 1381142 1371102 1281841 1215702 1198994 1135960 1141010 1078158 1079106 1111135 1040653
2917 1040653 1075466 1035622 939099 917680 862067 887528 858574 804273 760614 806920 788829
2906 788829 821546 884604 895245 879554 832829 940203 964971 964471 953034 923676 846373 855827
2894 855827 844931 816162 735126 796433 829392 756480 759349 745704 724842 765560 698731 645120
2882 645120 678800 732020 724300 718981 648713 602001 626584 558371 520203 530338 536379 592262
2870 592262 586603 560640 557973 599680 582093 590768 595099 607901 501637 489749 521814 495163
2858 495163 529630 456713 472162 477900 477221 456462 476688 459576 442268 451468 463902 488387
2846 488387 448782 457223 493808 486943 468902 417976 434364 509746 472299 466029 458939 501114
$$ packed form
2929A560389j03126p6121j0040q9261o6139j6708o3034N050o2852R48L2029p0482
2917A040653L4813l9844r6523k1419n5613K5461k8954n4301m3659M6306j8091
2906G88829L2717O3058J0641j5691m6725J07374K4768n00j1437k9358p7303R454
2894H55827j0896k8769q1036O1307L2959p2912K869j3645k0862M0718o6829n3611
2882F45120L3680N3220p720n319p0268m6712K4583o8213l8168J0135O041N5883
2870E92262n659k5963k667M1707j7587Q675M331J2802j06264j1888L2065k6651
2858D95163L4467p2917J5449N738o79k0759K0226j7112j7308R200J2434K4485
2846D88387l9605Q441L6585o865j8041n0926J6388P5382l7447o270p090M2175
$$ plain form
2834 501114 481478 451375 413124 422127 438211 481339 493813 464240 383308 277899 291093 286754
2822 286754 314916 321455 276963 330049 325161 297708 309852 307976 329546 320608 286940 217760
2810 217760 166590 165386 91112 131686 262117 183182 135841 122299 115163 148193 174134 174886
2798 174886 145154 154828 128913 106129 141635 76413 44993 38749 -8550 68131 82040 57232
2786 57232 96349 101384 138340 101185 81090 51440 49525 75181 38220 51868 55711 -24483
2774 -24483 -60759 13760 36346 18092 58449 -10437 -20292 39433 15485 53387 52016 -65798
2762 -65798 -35084 -37909 -80621 -40041 -11664 -2698 -12975 10977 -67102 -100963 -99758 -101756 -17205
2749 -17205 13364 -17729 -56491 -27930 -38003 -30289 -51934 -29279 -54862 -63805 -56403 -57923 -77618
$$ packed form
2834E01114j9636l0103l8251R003J6084M3128J2474k9573q0932j05409J3194m339
2822B86754K8162O539m4492N3086m888k7453J2144j876K1570q938l3668o9180
2810B17760n1170j204p4274M0574J30431p8935m7341j3542p136L3030K5941P52
2798A74886k9732R674k5915k2784L5506o5222l1420o244m7299P6681J3909k4808
2786E7232L9117N035L6956l7155k0095k9650j915K5656l6961J3648L843q0194
2774b4483l6276P4519K2586j8254M0357o8886r855N9725k3948L7902j371j17814
2762f5798L0714k825m2712M0580K8377Q966j0277K3952p8079l3861J205j998Q4551
2749a7205L0569l1093l8762K8561j0073P714k1645K2655k5583q943P402j520j9695
$$ plain form
2736 -77618 -78147 -68733 -11247 37244 50947 -42356 -78078 -63757 -85765 -8570 3868 -17604
2724 -17604 2015 -52716 -31981 -55831 -34576 -19883 -78170 -80148 -35024 -23766 -69594 -53445
2712 -53445 1877 -77265 -156316 -165939 -105787 -87287 -108070 -91381 -52348 -70991 -42288 -61395
2700 -61395 -100113 -19070 -27042 -36951 4985 41423 -64630 -20814 18484 -33542 -68019 -11327
2688 -11327 -83710 -71824 -43536 -28789 -41407 -40661 -95118 -53599 -32092 -52837 -109020 -97174
2676 -97174 -35719 -18412 -15289 -77228 -86842 -111562 -79049 -33780 -37967 -10910 -31240 -89928
2664 -89928 -64777 -9442 60275 31038 6341 43886 78706 113588 77960 83981 62654 10974
2652 10974 34822 85663 40587 21966 38772 49124 50834 32585 77019 133946 111458 107660
$$ packed form
2736g7618n29R414N7486M8491J3703r3303l5722J4321k2008P7195J2438k1472
2724a7604J9619n4731K0735k3850K1255J4693n8287j978M5124J1258m5828J6149
2712e3445N5322p9142p9051r623O0152J8500k0783J6689L9033j8643K8703j9107
2700f1395l8718Q1043p972r909M1936L6438j06053M3816L9298n2026l4477N6692
2688a1327p2383J1886K8288J4747j2618P46n4457M1519K1507k0745n6183J1846
2676i7174O1455J7307L123o1939r614k4720L2513M5269m187K7057k0330n8688
2664h9928K5151N5335O9717k9237k4697L7545L4820L4882l5628O021k1327n1680
2652A0974K3848N0841m5076j8621J6806J0352J710j8249M4434N6927k2488l798
$$ plain form
2640 107660 118588 155322 168703 72500 145137 189550 182828 181046 192369 233941 251283 203993
2628 203993 166723 187668 205975 230359 201886 268712 211488 216837 200343 233756 227044 213334
2616 213334 217190 259054 323406 290571 257264 288056 315612 324623 350987 310048 311473 260286
2604 260286 281253 308390 292188 305165 312828 298512 303276 368404 426469 370280 382899 472320
2592 472320 423861 395686 388521 369860 344827 333648 340308 270354 317548 327192 293168 217316
2580 217316 327601 337329 301096 280870 217253 246739 314558 330243 282620 218974 324665
2569 324665 346220 305385 261789 304191 363206 335314 254732 216199 245286 207333 222765 210321
2557 210321 244894 305022 237686 271652 269268 233079 198626 161345 214650 98431 140410 199774
$$ packed form
2640A07660J0928L6734J3381r6203P2637M4413o722j782J1323M1572J7342m7290
2628B03993l7270K0945J8307K4384k8473O6826n7224N349j6494L3413o712j3710
2616B13334L856M1864O4352l2835l3307L0792K7556R011K6364m0939J425n1187
2604B60286K0967K7137j6202J2977P663j4316M764O5128N8065n6189J2619Q9421
2592D72320m8459k8175p165j8661k5033j1179O660o9954M7194R644l4024p5852
2580B17316J10285R728l6233k0226o3617K9486O7819J5685m7623o3646J05691
2569C24665K1555m0835m3596M2402N9015k7892q0582l8533K9087l7953J5432j2444
2557B10321L4573O0128o7336L3966k384l6189l4453l7281N3305j16219M1979N9364
$$ plain form
2545 199774 157343 149424 111920 41625 14598 23862 57676 51622 32958 110145 117919 153499
2533 153499 151203 153728 178408 82092 22005 33416 19808 -47166 -78537 -99963 -121691 -69352
2521 -69352 28650 -46897 -48803 -25414 -11971 49903 -6597 -47561 -32300 -18670 -49715 -56085
2509 -56085 -62121 -88520 -56415 -24994 19958 7824 -21000 -113354 -152748 -119279 -130194 -156103
2497 -156103 -147686 -111061 -51933 -111432 -132357 -110363 -90555 -48979 -111990 -119425 -137146 -110327
2485 -110327 -135934 -125422 -209852 -99735 -45571 -99037 -165328 -179305 -188001 -147424 -165166 -157375
2473 -157375 -168568 -186380 -91037 -102924 -98669 -118809 -56002 -114721 -165518 -162171 -175689 -177894
2461 -177894 -140329 -174573 -125579 -70256 -89939 -133488 -118673 -115640 -156643 -126683 -69129 -81359
$$ packed form
2545A99774m2431p919l7504p0295k7027R264L3814o054j8664P7187P774L5580
2533A53499k296K525K4680r6316o0087J1411j3608o6974l1371k1426k1728N2339
2521f9352R8002p5547j906K3389J3443O1874n6500m0964J5261J3630l1045o370
2509e6085o036k6399L2105L1421M4952j2134k8824r2354l9394L3469j0915k5909
2497a56103Q417L6625N9128n9499k0925K1994J9808M1576o3011p435j7721K6819
2485a10327k5607J0512q4430J10117N4164n3466o6291j3977q696M0577j7742P791
2473a57375j1193j7812R5343j1887M255k0140O2807n8719n0797L347j3518k205
2461a77894L7565l4244M8994N5323j9683m3549J4815L033m1003K9960N7554j2230
$$ plain form
2449 -81359 -115252 -138043 -77199 -54115 -105766 -101842 -80876 -108379 -111472 -146937 -150110 -178475
2437 -178475 -179886 -141297 -130899 -169531 -192285 -155921 -137382 -145794 -106204 -139448 -155607 -124473
2425 -124473 -133737 -187917 -138896 -130337 -178876 -166688 -148513 -126955 -172055 -165097 -130667 -86699
2413 -86699 -42720 -84295 -142944 -119562 -105323 -141851 -169744 -146114 -175456 -162030 -102377 -131510
2401 -131510 -132449 -113626 -86059 -72447 -158141 -173368 -192674 -139979 -98897 -104698 -87853 -118168
2389 -118168 -104228 -172523 -125020 -73272 -162202 -186507 -183642 -167836 -171848 -79996 -62528 -135146
2377 -135146 -167718 -151667 -185083 -157597 -122447 -100205 -178919 -230660 -212871 -189341 -107651 -86971
2365 -86971 -80591 -72851 -52500 -60527 -102892 -39340 -17568 -88899 -102548 -150066 -151972 -156742 -129475
$$ packed form
2449h1359l3893k2791O0844K3084n1651L924K0966k7503l093l5465l173k8365
2437a78475j411L8589J0398l8632k2754L6364J8539q412L9590l3244j6159L1134
2425a24473r264n4180M9021Q559m8539J2188J8175K1558m5100O958L4430M3968
2413h6699M3979m1575n8649K3382J4239l6528k7893K3630k9342J3426N9653k9133
2401a31510r39J8823K7567J3612q5694j5227j9306N2695M1082n801J6845l0315
2389a18168J3940o8295M7503N1748q8930k4305K865J5806m012R1852J7468p2618
2377a35146l2572J6051l3416K7486L5150K2242p8714n1741J7789K3530Q1690K0680
2365h6971O380P740K0351q027m2365O3552K1772p1331j3649m7518j906m770K7267
$$ plain form
2352 -129475 -113274 -108820 -174705 -193387 -238018 -141393 -133233 -199683 -130873 -78110 -62640 -128105
2340 -128105 -113983 -123177 -139991 -122649 -153880 -202088 -154921 -105191 -157951 -215712 -185815 -183031
2328 -183031 -141758 -120281 -143007 -146062 -217469 -187894 -139700 -131182 -123803 -148331 -170742 -206659
2316 -206659 -164967 -159514 -164642 -104431 -54405 -55029 -52481 -138052 -154745 -142372 -96699 -142524 -170757
2303 -170757 -194402 -140801 -96680 -99232 -87778 -113206 -84757 -101187 -121148 -168656 -202753 -106703
2291 -106703 -92892 -114827 -93016 -90898 -123654 -109882 -85899 -120732 -109039 -114601 -170182 -73078
2279 -73078 -56971 -84124 -119632 -117480 -98388 -184690 -217519 -171715 -138703 -110167 -73289 -74624
2267 -74624 -104450 -98853 -40986 -73108 -33918 -83580 -119530 -42012 -117225 -162647 -143540 -134787
$$ packed form
2352a29475J6201M454o5885j8682m4631R6625Q160o6450O8810N2763J5470o5465
2340a28105J4122r194j6814J7342l1231m8208M7167M9730n2760n7761K9897K784
2328a83031M1273K1477k2726l055p1407K9575M8194Q518P379k4528k2411l5917
2316b06659M1692N453n128O0211N0026o24K548q5571j6693J2373M5673m5825k8233
2303a70757k3645N3601M4121k552J1454k5428K8449j6430j9961m7508l4097R6050
2291a06703J3811k1935K1811K118l2756J3772K3983l4833J1693n562n5581R7104
2279g3078J6107k7153l5508K152J9092q6302l2829M5804L3012K8536L6878j335
2267g4624k9826N597N7867l2122L9190m9662l5950P7518p5213m5422J9107Q753
$$ plain form
2255 -134787 -88722 -64523 -116637 -155750 -134579 -161556 -82429 -152722 -122049 -115229 -138021 -87004
2243 -87004 -72331 -101888 -84705 -122983 -87731 -89004 -50267 -5227 2003 -36143 -15537 27521
2231 27521 4808 -55448 -115651 -128463 -79006 -80870 -42401 -10446 -70441 -35498 -97271 -86965
2219 -86965 -47660 -26884 -55419 -6295 -38580 -4533 -43241 -27231 -60339 -46343 1103 47804
2207 47804 11855 -3134 10514 18333 -28296 -47879 9593 24181 -2935 -29767 -9181 -31734
2195 -31734 -4456 -41030 9760 56559 38617 46302 31796 -16736 -32522 -59130 39716 -3535
2183 -3535 19494 35636 34194 73469 181390 194524 145054 68801 96549 133958 111960 94872
2171 94872 108509 141119 196079 117118 115386 116048 146292 195805 209868 168516 184717 164843
$$ packed form
2255a34787M6065K4199n2114l9113K1171k6977P9127p0293L0673O820k2792N1017
2243h7004J4673k9557J7183l8278L5252j273L8737M5040P230l8146K0606M3058
2231B7521k2713o0256o0203j2812M9457j864L8469L1955n9995L4943o1773J0306
2219h6965L9305K0776k8535M9124l2285L4047l8708J6010l3108J3996M7446M6701
2207D7804l5949j4989J3648P819m6629j9583N7472J4588k7116k6832K0586k2553
2195c1734K7278l6574N0790M6799j7942P685j4506m8532j5786k6608R8846m3251
2183c535K3029J6142j442L9275J07921J3134m9470p6253K7748L7409k1998j7088
2171I4872J3637L2610N4960p8961j732O62L0244M9513J4063m1352J6201j9874
$$ plain form
2159 164843 179657 194560 186707 265272 304147 293769 243819 308401 303472 326387 256746 281156
2147 281156 299125 333379 342612 314599 364865 428488 375281 423927 435107 430132 491718 513815
2135 513815 530084 487017 536980 636196 661425 672404 678201 678398 664257 688678 717876 796259
2123 796259 826565 912822 905249 963737 1066711 1182427 1254745 1321956 1450688 1528879 1644444
2112 1644444 1758908 1889921 2039753 2177513 2328145 2359890 2591905 2822321 3072475 3462925
2102 3462925 3910418 4456326 5249221 6249177 7623601 9401945 11707602 13357513 12928329
2093 12928329 11103402 8881693 7091166 5731229 4746758 3965946 3337838 2870007 2524814
2084 2524814 2228645 2055961 1938685 1817542 1751194 1651624 1519253 1308629 1185846 1112452
$$ packed form
2159A64843J4814J4903p853P8565L8875j0378m9950O4582m929K2915o9641K4410
2147B81156J7969L4254R233k8013N0266O3623n3207M8646J1180m975O1586K2097
2135E13815J6269m3067M9963R9216K5229J0979N797J97j4141K4421K9198P8383
2123G96259L0306Q6257p573N8488J02974J15716P2318O7211J28732P8191J15565
2112A644444J14464J31013J49832J37760J50632L1745K32015K30416K50154L90450
2102C462925M47493N45908P92895R99956J374424J778344K305657J649911m29184
2093A2928329j824927k221709j790527j359937r84471p80812o28108m67831l45193
2084B524814k96169j72684j17276j21143o6348r9570j32371k10624j22783p3394
$$ plain form
2074 1112452 972505 906322 901282 852355 776253 769035 695172 609477 581355 527136 490226 471092
2062 471092 509476 457649 382635 375973 357602 310665 315811 305246 290616 265594 240629 305027
2050 305027 268226 233860 290340 303551 269098 296052 266607 235879 254605 223307 191262 110483
2038 110483 156818 162483 114468 81092 62297 75704 110402 73486 61409 131374 163336 103485
2026 103485 22018 10590 40148 39113 -8694 66843 21360 3142 -13441 -1933 3075 8339
2014 8339 -18561 -47587 -83275 -84629 -85315 -74892 -66168 -9673 -52615 -31808 -53242 -30322 -5195
2001 -5195 -28453 -163145 -97349 -25216 30264 34156 30576 22842 -24686 -40892 -136910 -128400 -19758
1988 -19758 68441 13944 68509 29863 -23211 -27201 -19090 -35762 -83386 -82699 -73356 -78116 -115646
$$ packed form
2074A112452j39947o6183n040m8927p6102p218p3863q5695k8122n4219l6910j9134
2062D71092L8384n1827p5014o662j8371m6937N146j0565j4630k5022k4965O4398
2050C05027l6801l4366N6480J3211l4453K6954k9445l0728J8726l1298l2045q0779
2038A10483M6335N665m8015l3376j8795J3407L4698l6916j2077O9965L1962n9851
2026A03485q1467j1428K9558j035m7807P5537m5483j8218j6583J1508N008N264
2014H339k6900k9026l5688j354o86J0423Q724N6495m2942K0807k1434K2920K5127
2001e195k3258j34692O5796P2133N5480L892l580p734m7528j6206r6018Q510J08642
1988a9758Q8199n4497N4565l8646n3074l990Q111j6672m7624O87R343m760l7530
$$ plain form
1975 -115646 -78589 -40013 -13033 -14798 -28886 -102076 -85582 -30837 -9587 -953 -26938 -34870
1963 -34870 -61039 -70752 -80799 -97227 -91217 -122344 -150600 -31293 -4944 29666 -35653 -21932
1951 -21932 -36833 -61825 -80144 -52581 -65427 -145639 -67030 -46267 -57234 -103184 -116708 -60509
1939 -60509 -81646 -73889 -32364 -49590 -76617 -53807 -111059 -124310 -88817 -87903 -67889 -29009
1927 -29009 -83798 -124681 -117650 -46661 -34372 -97385 -78540 -10815 -63431 -51866 -61869 -48402
1915 -48402 -63055 -101477 -116287 -123187 -51845 -190 13524 -62302 -70195 -58533 -128120 -83173
1903 -83173 -113921 -99827 -77394 -64306 -103045 -83376 -78904 -89970 -29800 49250 55312 41177
1891 41177 61121 -53836 -49036 -206 -52988 -26045 -3460 -26122 -53744 -35778 -42585 -53224
$$ packed form
1975a15646L7057L8576K6980j765j4088p3190J6494N4745K1250Q634k5985p932
1963c4870k6169r713j0047j6428O010l1127k8256J19307K6349L4610o5319J3721
1951b1932j4901k4992j8319K7563j2846q0212P8609K0763j0967m5950j3524N6199
1939f0509k1137P757M1525j7226k7027K2810n7252j3251L5493R14K0014L8880
1927b9009n4789m0883P031P0989J2289o3013J8845O7725n2616J1565j0003J3467
1915d8402j4653l8422j4810o900P1342N1655J3714p5826p893J1662o9587M4947
1903h3173l0748J4094K2433J3088l8739J9669M472j1066O0170P9050O062j4135
1891D1177J9944j14957M800M8830n2782K6943K2585k2662k7622J7966o807j0639
$$ plain form
1879 -53224 -57858 -67046 -123920 -131873 -89899 -52473 -14370 -44914 -71013 -109809 -59665 -69106 -112732
1866 -112732 -102521 -71345 -65722 -74858 -61595 -43889 -30925 1937 -42527 -81774 -100568 -88472
1854 -88472 -71071 -78260 -93401 -95342 -126865 -97005 -115851 -85790 -132660 -113534 -134278 -110375
1842 -110375 -104344 -124318 -49173 -52871 -131686 -61851 -14419 -21596 5548 -41787 -67747 -68088 -55974
1829 -55974 -100982 -120959 -36897 -3432 -71609 -69290 -1436 2168 -57939 -134810 -70797 4179
1817 4179 8167 -4626 -21315 -10031 31779 -53627 -2421 -675 -101281 -49782 -8937 -18205
1805 -18205 -48098 -84368 -62943 -20135 -32410 -61910 -78133 -89266 -24620 -77441 -92734 -88209
1793 -88209 -95413 -14958 -67278 -20408 7778 -34791 -57089 -104872 -91864 -90203 -116353 -56865
$$ packed form
1879e3224m634r188n6874p953M1974L7426L8103l0544k6099l8796N0144r441m3626
1866a12732J0211L1176N623r136J3263J7706J2964L2862m4464l9247j8794J2096
1854h8472J7401p189j5141j941l1523K9860j8846L0061m6870J9126k0744K3903
1842a10375O031j9974P5145l698p8815O9835M7432p177K7144m7335k5960l41J2114
1829e5974m5008j9977Q4062L3465o8177K319O7854L604o0107p6871O4013P4976
1817D179L988j2793j6689J1284M1810q5406N1206J746j00606N1499M0845r268
1805a8205k9893l6270K1425M2808j2275k9500j6223j1133O4646n2821j5293M525
1793h8209p204Q0455n2320M6870K8186m2569k2298m7783J3008J661k6150N9488
$$ plain form
1781 -56865 -5250 30921 -34727 -34217 5745 837 18618 -11 -88742 -48015 -54591 -32854 -44516
1768 -44516 -49357 -15830 -7229 4362 6398 3007 22862 54051 68431 67473 30889 17997 30201
1755 30201 -14341 -83366 -54722 -53045 -50087 -9127 -28134 -3723 -36185 -1345 -17327 -53813
1743 -53813 -53165 -66507 -49233 -78472 -133363 -120556 -80221 -107321 -104790 -93809 -110209 -159723
1731 -159723 -131463 -57625 -69623 -90144 -107735 -71729 -58045 -94740 -113457 -56717 -65049 -112783
1719 -112783 -99165 -77096 -128842 -120930 -95563 -152634 -82364 -36820 -21201 -11970 -53735 -65298
1707 -65298 -28703 -43761 -23323 -70764 -46897 25874 46838 -56972 -24393 -36593 -94512 -78423
1695 -78423 -47586 -46353 606 704 -7446 35036 -36393 -73479 -60899 -69521 -72647 -15415 -96225
$$ packed form
1781e6865N1615L6171o5648N10L9962m908J7781j8629q8731M0727o576K1737j1662
1768d4516m841L3527Q601J1591K036l391J9855L1189J4380r58l6584j2892J2204
1755C0201m4542o9025K8644J677K958M0960j9007K4411l2462L4840j5982l6486
1743e3813O48j3342J7274k9239n4891J2807M0335k7100K531J0981j6400m9514
1731a59723K8260P3838j1998k0521j7591L6006J3684l6695j8717N6740q332m7734
1719a12783J3618K2069n1746P912K5367n7071P0270M5544J5619R231m1765j1563
1707f5298L6595j5058K0438m7441K3867P2771K0964j03810L2579j2200n7919J6089
1695g8423L0837J233M6959R8q150M2482p1429l7086J2580q622l126N7232q0810
$$ plain form
1682 -96225 -108264 -148789 -91832 -103537 -130587 -97162 -13873 -70215 -72626 -62525 -83119 -41137
1670 -41137 -69921 -36893 -13256 -61471 -103842 -130498 -87192 -118514 -125419 -5080 -22421 -102411
1658 -102411 -144281 -46658 -83716 -127579 -104646 -135994 -147475 -73817 -50999 -106318 -115802 -45201
1646 -45201 -41927 -21405 -74244 -106609 -57107 -8827 -19214 -10709 26907 38836 -8428 -8038 -75876
1633 -75876 -52657 31399 20146 -20310 -32193 14937 -8071 -9402 -31333 34890 -9072 33114
1621 33114 -15894 -62906 -28694 -48147 -52652 -43935 -12883 -17417 -23401 -4077 6846 26565 20133
1608 20133 20024 -525 7811 5434 -19795 -11775 -70357 -39928 -9521 5679 -21732 58977 30439
1595 30439 -27111 -10023 -2790 -53021 -49707 -16774 -20298 41642 10595 33325 27681 -36138 -37705
$$ packed form
1682i6225j2039m0525N6957j1705k7050L3425Q3289n6342k411J0101k0594M1982
1670d1137k8784L3028K3637m8215m2371k6656M3306l1322o905J20339j7341p9990
1658a02411m1870R7623l7058m3863K2933l1348j1481P3658K2818n5319r484P0601
1646d5201L274K0522n2839l2365M9502M8280j0387Q505L7616J1929m7264L90o7838
1633g5876K3219Q4056j1253m0456j1883M7130k3008j331k1931O6223m3962M2186
1621C3114m9008m7012L4212j9453m505Q717L1052m534n984J9324J0923J9719o432
1608B0133j09k0549Q336k377k5229Q020n8582L0429L0407J5200k7411Q0709k8538
1595C0439n7550J7088P233n0231L314L2933l524O1940l1047K2730n644o3819j567
$$ plain form
1582 -37705 -50551 -23637 -8160 42708 48855 15418 21581 -23665 -71992 -54278 -33470 -31354
1570 -31354 -85867 -95359 -53006 -20406 31557 1703 1724 2611 -83898 -23333 -63487 -97427 -54167
1557 -54167 -74894 -72223 -10042 -15462 -30986 2473 51760 25029 -11492 -32498 -51297 -61688
1545 -61688 -100433 -69329 -24431 15048 -69205 -63910 -49667 -43541 -95218 -79382 -28856 -16809
1533 -16809 40382 66903 13905 -8555 -42920 20021 11757 30165 18479 -26558 14421 9376
1521 9376 -40774 33690 17629 -19521 -35003 -61786 -42998 -83183 -58740 -57534 -13574 11784
1509 11784 47902 11873 -28608 3242 -10763 -74388 -45675 -62407 -38618 12156 10323 8400
1497 8400 53887 110584 102319 47038 -16384 7711 71587 74364 17949 55298 -23372 22082
$$ packed form
1582c7705j2846K6914J5477N0868O147l3437O163m5246m8327J7714K0808K116
1570c1354n4513r492M2353L2600N1963k9854K1Q87q6509O0565m0154l3940M3260
1557e4167k0727K671O2181n420j5524L3459M9287k6731l6521k1006j8799j0391
1545f1688l8745L1104M4898L9479q4253N295J4243O126n1677J5836N0526J2047
1533a6809N7191K6521n2998k2460l4365O2941q264J8408j1686m5037M0979n045
1521I376n0150P4464j6061l7150j5482k6783J8788m0185K4443J206M3960K5358
1509A1784L6118l6029m0481L1850j4005o3625K8713j6732K3789N0774j833j923
1497H400M5487N6697q265n5281o3422K4095O3876K777n6415L7349p8670M5454
$$ plain form
1485 22082 -25508 -69337 -69665 -55548 -56387 -28273 -15290 -18717 -27308 -15069 -16546 -10314 54989
1472 54989 46928 69279 26761 5839 -23436 -43867 -18944 39528 -27861 37327 -54287 -76838
1460 -76838 -45968 -46405 -49012 -20120 29159 -16854 -7040 -4093 -31295 21204 0 11796 34401
1447 34401 9883 4051 30930 22978 -9840 28300 15742 34418 -46715 -41702 -18633 -58315
1435 -58315 -52698 -40869 -21787 -42872 -32870 -41408 -20738 29015 8997 -119088 -100112 -40538
1423 -40538 -39765 -53314 -35735 -4654 13045 41190 58114 -922 -10358 -48945 -59735 -12953
1411 -12953 80869 65880 -3404 -22321 -53554 24469 18232 -51052 -50706 -39040 -60541 -48173
1399 -48173 -69792 -24648 20215 33275 -8958 -2952 46043 46570 10070 93746 33711 5491
$$ packed form
1485B2082m7590m3829l28J4117q39K8114J2983l427q591J2239j477O232O5303
1472E4989q061K2351m2518k0922k9275k0431K4923N8472o7389O5188r1614k2551
1460g6838L0870m37k607K8892M9279m6013R814K947k7202N2499k1204J1796K2605
1447C4401k4518n832K6879p952l2818L8140j2558J8676q1133N013K3069l9682
1435e8315N617J1829J9082k1085J0002q538K0670M9753k0018j28085J8976N9574
1423d0538P73j3549J7579L1081J7699K8145J6924n9036r436l8587j0790M6782
1411a2953R3822j4989o9284j8917l1233P8023o237o9284L46J1666k1501J2368
1399d8173k1619M5144M4863J3060m2233O006M8995N27l6500Q3676o0035k8220
$$ [...]
##END NTUPLES=NMR SPECTRUM
##END=
