##TITLE=1H_CA-9197-1
 CDCl3
 8 sc, 
 2.10.2023
##JCAMPDX= 6.0         $$ Bruker NMR JCAMP-DX V2.0
##DATA TYPE= NMR SPECTRUM
##DATA CLASS= NTUPLES
##ORIGIN= UXNMR, Bruker Analytische Messtechnik GmbH
##OWNER= root
$$ XWIN-NMR		Version 3.5
$$ Mon Oct  2 14:56:56 2023 Russian Standard Time (UT+4h)  she@DPX200
##.OBSERVE FREQUENCY= 200.13135
##.OBSERVE NUCLEUS= ^1H
##.ACQUISITION MODE= SIMULTANEOUS
##.ACQUISITION SCHEME= undefined
##.AVERAGES= 8
##.DIGITISER RES= 18
##SPECTROMETER/DATA SYSTEM= spect
##.PULSE SEQUENCE= zg30
##.SOLVENT NAME= CDCl3
##.SHIFT REFERENCE= (INTERNAL, CDCl3, 0, 15.7755)
##AUDIT TRAIL= $$ (NUMBER, WHEN, WHO, WHERE, WHAT)
$$ ##TITLE= Audit trail, XWIN-NMR		Version 3.5
$$ ##JCAMPDX= 5.01
$$ ##ORIGIN= Bruker BioSpin GmbH
$$ ##OWNER= she
$$ F:/spectra/data/she/nmr/H-F/1/pdata/1/auditp.txt
$$ ##AUDIT TRAIL=  $$ (NUMBER, WHEN, WHO, WHERE, WHAT)
(   1,<2023-10-02 14:53:50.32 +0400>,<she>,<DPX200>,
      <created by zg, POWCHK disabled, PULCHK disabled
       configuration hash MD5:
       00 E9 B6 7A A2 85 ED C7 34 08 36 98 17 FE 4E 26
       data hash MD5: 16K
       EF 77 26 F5 32 C5 5A 4E B6 4D 7D AF 8B EC FA 86>)
(   2,<2023-10-02 14:55:34.85 +0400>,<she>,<DPX200>,
      <Start of raw data processing
       efp BC_mod = 2 LB = 0.24 FT_mod = 6 PKNL = 1 PHC0 = -21708.47 PHC1 = 9.85271 SI = 16K 
       data hash MD5: 16K
       8E E3 4A 0A 11 47 B6 34 B6 0F CB 91 2B 8F F3 FA>)
(   3,<2023-10-02 14:56:00.93 +0400>,<she>,<DPX200>,
      <pk PHC0 = -159.3595 PHC1 = 0.4 
       data hash MD5: 16K
       77 D3 EF 64 2D 84 6B 58 60 83 95 12 42 9B EA 46>)
(   4,<2023-10-02 14:56:04.21 +0400>,<she>,<DPX200>,
      <abs ABSG = 5 
       data hash MD5: 16K
       B9 4F ED 91 56 DD 5D C2 FA AB 90 BF AA B2 52 CD>)
$$ ##END=
$$ 
$$ hash MD5
$$ 79 32 17 E8 21 A6 09 6A 7D 69 3B 14 46 77 FE 28
##$RELAX= 
##$RELAX= 
##$RELAX= 
##$RELAX= 
##$RELAX= 
##$RELAX= 
$$ Bruker specific parameters
$$ --------------------------
##$DU= <F:/spectra>
##$EXPNO= 1
##$NAME= <H-F>
##$PROCNO= 1
##$TYPE= <nmr>
##$USER= <she>
##$AMP= (0..31)
100 100 100 100 100 100 100 100 100 100 100 100 100 100 100 100 100 100 
100 100 100 100 100 100 100 100 100 100 100 100 100 100 
##$AQSEQ= 0
##$AQ_mod= 1
##$AUNM= <au_zg>
##$AUTOPOS= <>
##$BF1= 200.13
##$BF2= 200.13
##$BF3= 200.13
##$BF4= 200.13
##$BF5= 200.13
##$BF6= 200.13
##$BF7= 200.13
##$BF8= 200.13
##$BYTORDA= 1
##$CFDGTYP= 0
##$CFRGTYP= 5
##$CHEMSTR= <none>
##$CNST= (0..31)
1 1 145 1 1 1 1 1 1 1 1 1 1 1 1 1 1 1 1 1 1 1 1 1 1 1 1 1 1 1 1 1 
##$CPDPRG= <>
##$CPDPRG1= <>
##$CPDPRG2= <>
##$CPDPRG3= <>
##$CPDPRG4= <mlev>
##$CPDPRG5= <mlev>
##$CPDPRG6= <mlev>
##$CPDPRG7= <mlev>
##$CPDPRG8= <mlev>
##$CPDPRGB= <>
##$CPDPRGT= <>
##$D= (0..31)
0 1.2 0 0 0 0 0 0 0 0.06 0 0.03 0 0 0 0 0.0002 0 0 0 0 0 0 0 0 0 0 0 0 
0 0 0 
##$DATE= 1696244030
##$DBL= (0..7)
120 120 120 120 120 120 120 120 
##$DBP= (0..7)
150 150 150 150 150 150 150 150 
##$DBP07= 0
##$DBPNAM0= <>
##$DBPNAM1= <>
##$DBPNAM2= <>
##$DBPNAM3= <>
##$DBPNAM4= <>
$$ [...]
##$SUBNAM3= <"">
##$SUBNAM4= <"">
##$SUBNAM5= <"">
##$SUBNAM6= <"">
##$SUBNAM7= <"">
##$SUBNAM8= <"">
##$SUBNAM9= <"">
##$SW= 18.05172834244
##$SWIBOX= (0..15)
0 0 2 0 0 0 0 0 0 0 0 0 0 0 0 0 
##$SW_h= 3612.71676300578
##$TD= 16384
##$TD0= 1
##$TE= 0
##$TE2= 300
##$TE3= 300
##$TEG= 300
##$TL= (0..7)
0 120 120 120 120 120 120 120 
##$TP= (0..7)
150 150 150 150 150 150 150 150 
##$TP07= 0
##$TPNAME0= <>
##$TPNAME1= <>
##$TPNAME2= <>
##$TPNAME3= <>
##$TPNAME4= <>
##$TPNAME5= <>
##$TPNAME6= <>
##$TPNAME7= <>
##$TPOAL= (0..7)
0.5 0.5 0.5 0.5 0.5 0.5 0.5 0.5 
##$TPOFFS= (0..7)
0 0 0 0 0 0 0 0 
##$TUNHIN= 0
##$TUNHOUT= 0
##$TUNXOUT= 0
##$USERA1= <user>
##$USERA2= <user>
##$USERA3= <user>
##$USERA4= <user>
##$USERA5= <user>
##$V9= 5
##$VALIST= <valist>
##$VCLIST= <CCCCCCCCCCCCCCC>
##$VD= 0
##$VDLIST= <DDDDDDDDDDDDDDD>
##$VPLIST= <PPPPPPPPPPPPPPP>
##$VTLIST= <TTTTTTTTTTTTTTT>
##$WBST= 1024
##$WBSW= 4
##$XGAIN= (0..3)
0 0 0 0 
##$XL= 0
##$YL= 0
##$YMAX_a= 461312
##$YMIN_a= -466521
##$ZGOPTNS= <>
##$ZL1= 120
##$ZL2= 120
##$ZL3= 120
##$ZL4= 120
##$ABSF1= 15.73698
##$ABSF2= -2.314869
##$ABSG= 5
##$ABSL= 3
##$ALPHA= 0
##$AQORDER= 0
##$ASSFAC= 0
##$ASSFACI= 0
##$ASSFACX= 0
##$ASSWID= 0
##$AUNMP= <proc_1d>
##$AZFE= 0.1
##$AZFW= 0.1
##$BCFW= 0
##$BC_mod= 2
##$BYTORDP= 0
##$COROFFS= 0
##$CY= -3
##$DATMOD= 1
##$DC= 0
##$DFILT= <>
##$DTYPP= 0
##$F1P= 0
##$F2P= 0
##$FCOR= 1
##$FTSIZE= 16384
##$FT_mod= 6
##$GAMMA= 0
##$GB= 0
##$INTBC= 1
##$INTSCL= 3.70164e-10
##$ISEN= 128
##$LB= 0.24
##$LEV0= 0
##$LPBIN= 0
##$MAXI= 10000
##$MC2= 0
##$MEAN= 0
##$ME_mod= 0
##$MI= 1.114404
##$NCOEF= 0
##$NC_proc= -6
##$NLEV= 6
##$NOISF1= 3.799351
##$NOISF2= 2.8
##$NSP= 0
##$NTH_PI= 0
##$NZP= 0
##$OFFSET= 15.77554
##$PC= 1
##$PHC0= -21867.83
##$PHC1= 10.25271
##$PH_mod= 1
##$PKNL= yes
##$PPARMOD= 0
##$PSCAL= 0
##$PSIGN= 0
##$REVERSE= no
##$SF= 200.129999200966
##$SI= 16384
##$SIGF1= 3
##$SIGF2= 2
##$SINO= 5.538805
##$SIOLD= 16384
##$SREGLST= <1H.CDCl3>
##$SSB= 0
##$STSI= 16384
##$STSR= 0
##$SW_p= 3612.71676300578
##$SYMM= 0
##$S_DEV= 0
##$TDeff= 16384
##$TDoff= 0
##$TI= <>
##$TILT= no
##$TM1= 0
##$TM2= 0
##$TOPLEV= 0
##$USERP1= <user>
##$USERP2= <user>
##$USERP3= <user>
##$USERP4= <user>
##$USERP5= <user>
##$WDW= 1
##$XDIM= 16384
##$YMAX_p= 390462762
##$YMIN_p= -456141
$$ End of Bruker specific parameters
$$ ---------------------------------
##NTUPLES= NMR SPECTRUM
##VAR_NAME=  FREQUENCY,     SPECTRUM/REAL,   SPECTRUM/IMAG
##SYMBOL=    X,             R,               I
##VAR_TYPE=  INDEPENDENT,   DEPENDENT,       DEPENDENT
##VAR_FORM=  AFFN,          ASDF,            ASDF
##VAR_DIM=   16384,         16384,           16384
##UNITS=     HZ,            ARBITRARY UNITS, ARBITRARY UNITS
##FACTOR=    0.220516191357247, 1,           1
##FIRST=     3157.15887801409, 0,            0
##LAST=      -455.557884991695, 0,           0
##MIN=       -455.557884991695, -456141,     0
##MAX=       3157.15887801409, 390462762,    0
$$ Real data points
##PAGE= N=1
##DATA TABLE= (X++(R..R)), XYDATA
$$ [...]
6555E4700k2605K5264J3345K624j9928j9441k4085N1710K2430m3721J8598K0865
$$ 54700 32095 57359 70704 73328 53400 33959 9874 61584 84014 40293 58891 79756
6543G9756k9038j7834O4536k0502K764j125m2415N635J4777N068j5637r525p983
$$ 79756 50718 32884 97420 76918 79682 78557 36142 41777 56554 61622 45985 36460 28477
6530B8477j5506J8548n55j3430P335k1821M8701K4406l2638N843o62r627J610
$$ 28477 12971 31519 30964 17534 24869 3048 51749 76155 43517 49360 48698 39071 40681
6517D0681L5147O885N96j4807k4421J3791Q683l838k42o677J4678k2114j6481
$$ 40681 75828 82713 83309 68502 44081 57872 66555 62717 62475 55798 70476 48362 31881
6504C1881j6460K4509Q914Q815Q486k4097j3229k3367k1506N391K7041P773L283
$$ 31881 15421 39930 48844 57659 66145 42048 28819 5452 -16054 -10663 16378 24151 27434
6491B7434J3685r47J6434J1107m1719K8855K1899k9117k1059L5870l3177l54L9077
$$ 27434 41119 40172 56606 67713 25994 54849 76748 47631 26572 62442 29265 28911 67988
6478F7988J2686n1167J3696K1681J9903o580p071r505j097O297J0177K811k1936
$$ 67988 80674 29507 43203 64884 84787 78207 71136 61631 60534 66831 77008 79819 57883
6465E7883k326j7631L0533J1955r689K7262k157n5779O828J6272o772L2239J6778
$$ 57883 55557 37926 68459 80414 70725 97987 95830 40051 46879 63151 56379 88618 105396
6452A05396j9759k9987l1376K8539K2373K2576J0753L01n793q346j0685O993j3818
$$ 105396 85637 55650 24274 52813 75186 97762 108515 108816 103023 94677 83992 90985 77167
6439G7167J6950j0782N025K3099J1646j1243K5914l9249p499K005p905K9063k1351
$$ 77167 94117 83335 88360 111459 123105 111862 137776 98527 91028 93033 85128 114191 92840
6426I2840j6434Q129p951l5551k340N849J8191K340K4668k63J0803j4873J4328
$$ 92840 76406 84535 76584 41033 38693 44542 62733 65073 89741 89478 100281 85408 99736
6413I9736K975j2416K7656J6823l0178j3662p441j6114M7577J1103p775k3530
$$ 99736 102711 90295 117951 134774 104596 90934 83493 67379 114956 126059 118284 94754
6401I4754m1507M634j1695J406L1305J9831J639k310J75l2817l848J7172R7q28
$$ 94754 53247 57881 46186 47592 78897 98728 100367 98057 98232 65415 61567 78739 78836 78008
6387G8008j0186K8316J7406K973n994m385l5115K5428j2631Q518K9666R627j0934
$$ 78008 67822 96138 113544 116517 110523 106138 71023 96451 83820 92338 122004 131631 120697
6374A20697k0747j1839m1456k033M959J9040J5027K0328j4036p669L3581L158
$$ 120697 99950 88111 46655 44622 49581 68621 83648 103976 89940 82271 115852 119010
6362A19010L502j6001j6372r982O762O187j0266J021M5672J2524j6854J5981j7414
$$ 119010 122512 106511 90139 80157 86919 93106 82840 83861 129533 142057 125203 141184 123770
6349A23770J3350k0841j5874K0090k699p489k809j0960l015J0371P120k7759J5341
$$ 123770 137120 116279 100405 120495 117796 110307 107498 96538 93523 103894 111014 83255 98596
6336I8596J6626k1563J1260J8847l7802J2307L019k3352J8945K7441r415Q804
$$ 98596 115222 93659 104919 123766 85964 98271 101290 77938 96883 124324 114909 123713
6324A23713K1790j0561Q047j9233q248J4520l4957K1850P778J4943J0274m563
$$ 123713 145503 134942 142989 123756 115508 130028 95071 116921 124699 139642 149916 145353
6312A45353P902J4416J4652j6460j1268l1943l3820J4508Q088N8717o476k5378
$$ 145353 153255 167671 182323 165863 154595 122652 88832 103340 111428 170145 163669 138291
6300A38291K5404l0313K26k0570K8187j1190q663K7000M341J9263O906k064L760
$$ 138291 163695 133382 133608 113038 141225 130035 121372 148372 152713 171976 178882 176818 180578
6287A80578m7107M868J0144J3808L049n230j567J8594J3727M838k1944j1955L706
$$ 180578 133471 138339 148483 162291 165340 160110 158543 177137 190864 195702 173758 161803 165509
6274A65509k5407J1990L4493K0233J7616L7769K767m2066k7373K2476K4014J7239
$$ 165509 140102 152092 186585 206818 224434 262203 264970 222904 195531 218007 242021 259260
6262B59260k1510q273L0146j2986L030K619J5395J5282J9946K5443R085J5088
$$ 259260 237750 229477 259623 246637 249667 252286 267681 282963 302909 328352 337437 352525
6250C52525L690K3030k113K9593R2917M2853q020k130J3754J3450j7134N42l8379
$$ 352525 356215 379245 377132 406725 499642 542495 534475 532345 546099 559549 542415 542957 504578
6237E04578l3781j7715j4891J4600Q02r184M0884L2209M8633L3930N7750L535
$$ 504578 470797 453082 438191 452791 453593 444409 485293 517502 566135 600065 657815 661350
6225F61350J3296n1629l7560j3248o2933o3290j0444o597m8667j6097k0589j5800
$$ 661350 674646 623017 585457 572209 509276 445986 435542 428945 380278 364181 343592 327792
6213C27792L6152J6990k9546n064k7892j1552q150r102j660M9665k4468j6605
$$ 327792 363944 380934 351388 346324 318432 306880 298730 289628 287968 337633 313165 296560
6201B96560K8536j5367n461M937k238K4848j3622K2722J6598o540j3392K8074
$$ 296560 325096 309729 304268 309205 306967 331815 318193 340915 357513 350973 337581 365655
6189C65655J1069j7462J8754J1396l4915L1920L9434K1016Q731l8342J4528n154
$$ 365655 376724 359262 378016 389412 354497 386417 425851 446867 455598 417256 431784 426630
6177D26630J206k0658L7814q975k7159L1417O307L2978k1351K7034M9382l8396
$$ 426630 427836 407178 444992 436017 408858 440275 446582 479560 458209 485243 534625 496229
6165D96229k3070L4874K0437j4800J6416O19K8693M9243J9745K9494r120J5768
$$ 496229 473159 508033 528470 513670 530086 530705 559398 608641 628386 657880 648760 664528
6153F64528K1111L3692N1569J8876K2609L9249N3874N3847N5157K8824L2853N1883
$$ 664528 685639 719331 770900 789776 812385 851634 905508 959355 1014512 1043336 1076189 1128072
6141A128072l4815j110J921J223J9291k2291r368J6647M7450M5012Q17M0734O7772
$$ 1128072 1093257 1092147 1094068 1095291 1114582 1092291 1082923 1099570 1147020 1192032 1192849 1233583 1301355
6128A301355Q2009P0964R0729J20419J09466J25915J50095J72231K29337J95715
$$ 1301355 1383364 1454328 1545057 1665476 1774942 1900857 2050952 2223183 2452520 2648235
6118B648235J36812J47124P7772o2545j01072j62993j64868j12492j35845q0705
$$ 2648235 2785047 2932171 3009943 2947398 2846326 2683333 2518465 2405973 2270128 2189423
6108B189423o5451k7499l5514O230K5019N9575M0483J36425J47485R0059R6860
$$ 2189423 2123972 2096473 2060959 2067189 2092208 2151783 2192266 2328691 2476176 2566235 2663095
6097B663095R6256J27789J23932J73786J98986J12066J41163K0570n6189j10311
$$ 2663095 2759351 2887140 3011072 3184858 3383844 3495910 3637073 3657643 3601454 3491143
6087C491143j82434j98119j87477j69048j75079j66839j71448p7995j20674p6352
$$ 3491143 3308709 3110590 2923113 2754065 2578986 2412147 2240699 2162704 2042030 1965678
6077A965678j3612l1718j6956M2685K4927L1873M4235O7235P9563J12964J05953
$$ 1965678 1952066 1920348 1903392 1946077 1971004 2002877 2047112 2114347 2193910 2306874 2412827
6066B412827R8292Q8450N9639M8174n2134j35219j66041j57837j71399j43407
$$ 2412827 2511119 2599569 2659208 2707382 2655248 2520029 2353988 2196151 2024752 1881345
6056A881345j39949j10266j11758q7621r0971m3596k6709l6936l0625n7502k3438
$$ 1881345 1741396 1631130 1519372 1431751 1340780 1297184 1270475 1233539 1202914 1145412 1121974
6045A121974k2525m136j7958Q438n399j1619L8378l00J1284K435m9115k9262p5287
$$ 1121974 1099449 1095313 1077355 1085793 1080394 1068775 1107153 1106853 1118137 1120572 1071457 1042195 966908
6032I66908o6852l9390l8574m8741k1027j7067p4437m7111L738k423m2372l6521
$$ 966908 900056 860666 822092 773351 752324 735257 660820 613709 617447 615024 572652 536131
6020E36131m6087m919L4330K2804l7491k9163J2145j6137p278k1926j6612K1108
$$ 536131 490044 485125 519455 542259 504768 475605 487750 471613 464335 442409 425797 446905
6008D46905m5484m3024K3831k154q220L2746K1762j4984k1939j2596j4204j6026
$$ 446905 401421 358397 382228 380074 371854 404600 426362 411378 389439 376843 362639 346613
5996C46613j5711J9789K0824N826k5904l0531l0107K7169J6430j8561j0927M684
$$ 346613 330902 350691 371515 377341 351437 320906 290799 317968 334398 315837 304910 309594
5984C09594J0555q519R587K2968K6652j3249O960j0435J0663j1221o965k624K0259
$$ 309594 320149 311630 321217 344185 370837 357588 364548 354113 364776 353555 346590 343966 364225
5971C64225j9259l731J1422q176J9851K0029m3313l3296j2824L4325R736J79K3682
$$ 364225 344966 341235 352657 344481 364332 384361 341048 307752 294928 329253 338989 339168 362850
5958C62850r885l9159K3212K8025k6805l701J062J4009L6953n0427j6176M2188
$$ 362850 352965 313806 337018 365043 338238 334537 335599 349608 386561 336134 319958 362146
5946C62146j4152J2314k4958j8052J3034R594p40O541N676j3108j1629J7162L9044
$$ 362146 347994 360308 335350 317298 330332 339926 339186 345727 351403 338295 326666 343828 382872
5933C82872P453j4444J2724k7103j0846n492J143M3190J1383J5413j6797o5921
$$ 382872 390325 375881 388605 361502 350656 345164 346307 389497 400880 416293 399496 333575
5921C33575J9482M4935k4424m1274M3R204R279J0082K0862K1567J4806l42j6301
$$ 333575 353057 397992 373568 332294 332337 341541 350820 360902 381764 403331 418137 417795 401494
5908D01494J1121J4434l2923M114M3504K2631k765J4998j4111k2726j0532J0941
$$ 401494 412615 427049 394126 398240 441744 464375 461610 476608 462497 439771 429239 440180
5896D40180j4623p566J0541N566Q918K3462K4451J8820j8766K3078k6750J1637
$$ 440180 425557 417991 428532 434098 443016 466478 490929 509749 490983 514061 487311 498948
5884D98948j9708K400J6073m351M0239K8431K9790K332l1684j0158O6112J4180
$$ 498948 479240 481640 497713 493362 533601 562032 591822 594154 562470 552312 618424 632604
5872F32604J7019j8087l7525j2172j875K5584J9096o2019k1035J0419J4918J4530
$$ 632604 649623 631536 594011 581839 579964 605548 624644 562625 541590 552009 566927 581457
5860E81457J3729J1920M7186K2560j8309k6003L2525Q948K1457r78k559K2712
$$ 581457 595186 607106 654292 676852 658543 632540 665065 674013 695470 694492 691933 714645
5848G14645M6987K268k0590J5466j412K9897k0509p180k7922j8889m819k0587
$$ 714645 761632 763900 743310 758776 757364 787261 766752 759572 731650 712761 707942 687355
5836F87355r923Q457M165l7468J4921Q629k0139j9952J6543j880j6433L3699L0802
$$ 687355 677432 685889 690054 652586 667507 676136 655997 636045 652588 650708 634275 667974 698776
5823F98776M1172K6266k4627O619P250N662j8285j919Q590j7567k1819j7452j7843
$$ 698776 739948 766214 741587 748206 755456 761118 742833 740914 749504 731937 710118 692666 674823
5810F74823l1111J5235J7725K6233l7222j0952K3981l162m829Q577k3057J6038
$$ 674823 643712 658947 676672 702905 665683 654731 678712 675550 670721 679298 656241 672279
5798F72279J2166j5412P495m7982K1176K7133j3457l102k2490J6626J8754K6325
$$ 672279 684445 669033 676528 628546 649722 676855 663398 660296 637806 654432 673186 699511
5786F99511l6294K34l0838Q150M2323j9493M9311k738J1232j6251P242L521j6040
$$ 699511 663217 663451 632613 640763 683086 663593 712904 710166 721398 705147 712389 715910 699870
5773F99870K803j0205J457j3050M112j8208J6852J3157M5612j2492l0713r682
$$ 699870 702673 692468 693925 680875 684987 666779 683631 696788 742400 729908 699195 689513
5761F89513j9307Q843M758J5579N873N0992K4862Q337J0853O398M8121O949P715
$$ 689513 670206 679049 683807 699386 705259 756251 781113 789450 800303 806701 854822 861771 869486
5748H69486P172k9761k1683p449m742n892K3422k1007l2006K197J323j5584J3343
$$ 869486 876658 846897 825214 817765 813023 807131 830553 809546 777540 779737 781060 765476 778819
5735G78819K2194k1375n856L4656K0531N650O241N357L2712J5589L7766N652l6145
$$ 778819 801013 779638 773782 808438 828969 834619 840860 846217 878929 894518 932284 937936 901791
5722I01791L552m546K769m4793P171K3667J34o515j0289N387O65o929j7901L7873
$$ 901791 905343 900797 903566 858773 865944 889611 889745 883230 872941 878328 878993 872064 854163 892036
5708H92036J6916K5123R761n051J5346j9228K8525M0256J9265p31k6290j0982
$$ 892036 908952 934075 943836 938785 954131 934903 963428 1003684 1022949 1022218 995928 984946
5696I84946Q102K8516j4093j4433L6689j0811j1847J2841J4634j191j5368K9684
$$ 984946 993048 1021564 1007471 993038 1029727 1018916 1007069 1019910 1034544 1033353 1017985 1047669
5684A047669K2013P547L2971j801m136l800K8287j8134k8962L479J7454K0855
$$ 1047669 1069682 1077229 1110200 1108399 1104263 1100463 1128750 1110616 1081654 1085133 1102587 1123442
5672A123442M046M7563J0403J4241J9761k025L164M3454K5056k974j2067O300
$$ 1123442 1127488 1175051 1185454 1199695 1219456 1217431 1220595 1264049 1289105 1286131 1274064 1280364
5660A280364O0482J6890N204m902L1731N92J7598M1856K0503K6458l857K5444
$$ 1280364 1340846 1357736 1362940 1358038 1389769 1390361 1407959 1449815 1470318 1496776 1492919 1518363
5648A518363K3454j0353L2885L6440J9478K6304j092K1934K765L0006O5681M7332
$$ 1518363 1541817 1531464 1564349 1600789 1620267 1646571 1645479 1667413 1670178 1700184 1765865 1813197
5636A813197J9205J6537K3042P1534L0648L2483L3410K4621K0294O0655K6665
$$ 1813197 1832402 1848939 1871981 1943515 1974163 2006646 2040056 2064677 2084971 2145626 2172291
5625B172291K3919L3759K9581M2815J7273P8673K7372J1796M7350Q474J3341M3244
$$ 2172291 2196210 2229969 2259550 2302365 2319638 2398311 2425683 2437479 2484829 2493303 2506644 2549888
5613B549888M6088L7178J9860O4513L2870N9034N4546M6572N6495Q5680O8580
$$ 2549888 2595976 2633154 2653014 2717527 2750397 2809431 2863977 2910549 2967044 3052724 3121304
5602C121304N5613N4564N6601O6263O1858N0567L2403P3443J2004N4358Q6568
$$ 3121304 3176917 3231481 3288082 3354345 3416203 3466770 3499173 3572616 3584620 3638978 3725546
5591C725546P3594N2095N0568J16085J30561Q0795J30272J06317J07293J28122
$$ 3725546 3799140 3851235 3901803 4017888 4148449 4229244 4359516 4465833 4573126 4701248
5581D701248J41539J22027J05646J69026J42377J87056K24357K22679K85297L07258
$$ 4701248 4842787 4964814 5070460 5239486 5381863 5568919 5793276 6015955 6301252 6608510
5571F608510L21811L45357L79745M30223M24346M77267M79000L97597K95078J85475
$$ 6608510 6930321 7275678 7655423 8085646 8509992 8987259 9466259 9863856 10158934 10344409
5561A0344409L7058n3411m7437R205N5219J19746J70039K58978L49839L50784
$$ 10344409 10381467 10328056 10280619 10289824 10345043 10464789 10634828 10893806 11243645 11594429
5551A1594429M72800O02970O24809P05768P91942P87915P04498N37641M58216
$$ 11594429 12067229 12670199 13295008 14000776 14792718 15580633 16285131 16822772 17280988
5542A7280988M65049N18344N19304M33709L58886J84848m6364j84497k87205k42067
$$ 17280988 17746037 18264381 18783685 19217394 19576280 19761128 19714764 19530267 19243062 19000995
5532A9000995n7776J42870L24812M92645O06420O00099N13139M15196L89636M11316
$$ 19000995 18943219 19086089 19410901 19903546 20509966 21110065 21623204 22038400 22428036 22839352
5522B2839352M39752M57875L55536K11462o173j90320k38872j54869j8022R8592
$$ 22839352 23279104 23736979 24092515 24303977 24297804 24107484 23868612 23713743 23695721 23794313
5512B3794313J22333Q932l7514q1916J1390P057J03646K75129L49495K94316J77041
$$ 23794313 23916646 23925578 23888064 23806148 23817538 23824595 23928241 24203370 24552865 24847181 25024222
5501B5024222N3791j65601l82441n52826n66716n06287m72031m59856n20922n68294
$$ 25024222 25078013 24912412 24529971 23977145 23410429 22904142 22432111 21972255 21451333 20883039
5491B0883039m78490k94180j13476J15381K09438K69363K10236J01129j5860j87360
$$ 20883039 20404549 20110369 19996893 20112274 20321712 20591075 20801311 20902440 20886580 20699220
5481B0699220l38723n25808n36954m96547m55441n90987p97683r31501r58481
$$ 20699220 20360497 19834689 19297735 18801188 18345747 17754760 16957077 16025576 15067095
5472A5067095r11204p94739o53366m73057l64887k76684j57114l9542J5172P8354
$$ 15067095 14155891 13361152 12707786 12234729 11869842 11593158 11436044 11396502 11411674 11490028
5462A1490028J28230J69947J44214N3269j25137m12615o12242p04485o92181n98011
$$ 11490028 11618258 11788205 11932419 11985688 11860551 11447936 10835694 10131209 9439028 8841017
5452H841017n30801n10284m24726l52623k83828k71707j99863j66636j76536j71256
$$ 8841017 8310216 7799932 7375206 7022583 6738755 6467048 6267185 6100549 5924013 5752757
5442E752757j18525j18964j09606j22410j04932j02119o5883q9163o1073l1962
$$ 5752757 5634232 5515268 5405662 5283252 5178320 5076201 5010318 4921155 4860082 4828120
5432D828120l0656l2687o2893n4647m4046K0131k0473K3586P468O5973L0743K6188
$$ 4828120 4797464 4764777 4701884 4647237 4603191 4623322 4602849 4626435 4633903 4699876 4730619 4756807
5420D756807N5470Q4573R6106J06143R6545O1248q782p4409j17672q6021j07988
$$ 4756807 4812277 4896850 4992956 5099099 5195644 5256892 5248110 5173701 5056029 4970008 4862020
5409D862020j17459n4900n8745n0731n4508J2377J8621j8178L4220K9048O7416
$$ 4862020 4744561 4689661 4630916 4580185 4525677 4538054 4556675 4538497 4572717 4601765 4669181
5398D669181N7726P6495J11169R3116Q1179N8377Q0781M0089K5474K406l4860
$$ 4669181 4726907 4803402 4914571 5007687 5088866 5147243 5228024 5268113 5293587 5295993 5261133
5387E261133o1815p3164n3890J1366J7623l3966J2802Q2611M7578L7391K5635
$$ 5261133 5199318 5126154 5072264 5083630 5101253 5067287 5080089 5162700 5210278 5247669 5273304
5376E273304R7778Q1521P4148O9958P1445R2607K9949O0078N3665L8845M0863
$$ 5273304 5371082 5452603 5526751 5596709 5668154 5760761 5790710 5850788 5904453 5943298 5984161
5365E984161P6972R5459Q3337J05665Q6903J21057J07688J20314J46740J48139
$$ 5984161 6061133 6156592 6239929 6345594 6432497 6553554 6661242 6781556 6928296 7076435
5355G076435J37404J52588J88926K23107J74582K17514K56758K90049K65871K75383
$$ 7076435 7213839 7366427 7555353 7778460 7953042 8170556 8427314 8717363 8983234 9258617
5345I258617L12415K72654K68349K72531L53325L35438L03703K52006M3066j48760
$$ 9258617 9571032 9843686 10112035 10384566 10737891 11073329 11377032 11629038 11672104 11523344
5335A1523344j85541j09470m3546K3405P5160R0957J68817J96530K60104L17718
$$ 11523344 11337803 11228333 11184787 11208192 11283352 11374309 11543126 11739656 11999760 12317478
5325A2317478L71231M02866L83576L61455L60978L71567M51524N37027N68952
$$ 12317478 12688709 13091575 13475151 13836606 14197584 14569151 15020675 15557702 16126654
5316A6126654O10262N75902M42925L11195K23132K33330K97539M05244N08798
$$ 16126654 16736916 17312818 17755743 18066938 18290070 18523400 18820939 19226183 19734981
5307A9734981N82765O81930Q04570R91554J137252J351066J566089J828404K052218
$$ 19734981 20317746 20999676 21804246 22795800 23933052 25284118 26850207 28678611 30730829
5298C0730829K338800K670857K985366L384419L731099M277683M925701N563159
$$ 30730829 33069629 35740486 38725852 42110271 45841370 50119053 55044754 60607913
5290F0607913N999197N741265M440747K360481P61015J09928k9263o85352k358034
$$ 60607913 66607110 72348375 76789122 79149603 79910618 80020546 79991283 79305931 76947897
5281G6947897m294474n470782n418432m629442l539398k530400j646122r39310
$$ 76947897 72653423 67182641 61764209 57134767 53595369 51064969 49418847 48479537
5273D8479537l54735J92961O63616J142857J787046K353499K880306L092109K628257
$$ 48479537 48124802 48317763 48981379 50124236 51911282 54264781 57145087 60237196 62865453
5264F2865453J225179m42313j469443j446285p47734N0339P63014R95843N20393
$$ 62865453 64090632 63648319 62178876 60732591 59984857 60035196 60798210 61794053 62314446
5255F2314446r10389k754056l970932m412017m316373l998234l529970l099033
$$ 62314446 61404057 58650001 54679069 50267052 45950679 41952445 38422475 35323442
5247C5323442k670713k219536j813198j452432j173534r59639p97387o43797m76951
$$ 35323442 32652729 30433193 28619995 27167563 25994029 25034390 24237003 23593206 23116255
5238B3116255l24406j72094k4376J25706K65947K61142J89671o645r9698j77648
$$ 23116255 22791849 22619755 22595379 22721085 22987032 23248174 23437845 23431200 23331502 23153854
5228B3153854k15712l90761o15700p39151p29731o48342n94875n30649m80628
$$ 23153854 22938142 22547381 21931681 21192530 20462799 19814457 19219582 18688933 18208305
5219A8208305n43912m99699m01701l78193l37958k75692k20238j61974j87726
$$ 18208305 17664393 17164694 16762993 16384800 16046842 15771150 15550912 15388938 15201212
5210A5201212j14314j11029j08331l6764m0514k10218l61691l57654l07877k12049
$$ 15201212 15086898 14975869 14867538 14830774 14790260 14580042 14218351 13860697 13552820 13340771
5200A3340771j52259l8538N9662J24599J94545K40526K99391K53674J30498L1204
$$ 13340771 13188512 13149974 13209636 13334235 13528780 13769306 14068697 14322371 14452869 14484073
5190A4484073n0438q1557j09154n5513j8526m0652j58995k66736l81451n24668
$$ 14484073 14433635 14352078 14242924 14187411 14168885 14128233 13969238 13702502 13321051 12796383
5180A2796383n41094n12279m58257m02890k89176k75442j76984j21343q6471k6715
$$ 12796383 12255289 11743010 11284753 10881863 10592687 10317245 10140261 10018918 9932447 9905732
5170I905732p5831J6251O2854M3530J28679J01254M3804Q0641N4152K1276N5110
$$ 9905732 9829901 9846152 9909006 9952536 10081215 10182469 10226273 10306914 10361066 10382342 10437452
5159A0437452O4544O9523O0456n0055q7981j77494l09948l56867l10546l06907
$$ 10437452 10501996 10571519 10631975 10581920 10493939 10316445 10006497 9649630 9339084 9032177
5149I032177k50098k41031j75480j47983j80109r8741q3989p3291p9494r4420
$$ 9032177 8782079 8541048 8365568 8217585 8037476 7938735 7854746 7781455 7701961 7607541
5139G607541o4429p1779m9595k1416k0425m5928l0443k5900j9129j9156k6939
$$ 7607541 7543112 7471333 7421738 7400322 7379897 7333969 7303526 7277626 7258497 7239341 7212402
5128G212402j7308m98K8027L4906K389k8348L3139K2541J0693K6407M0520L6446
$$ 7212402 7195094 7194596 7222623 7257529 7259918 7231570 7264709 7287250 7297943 7324350 7364870 7401316
5116G401316J9652K9127K6212K2064K0632N056L1514N0198L6754J3398Q883P5855
$$ 7401316 7420968 7450095 7476307 7498371 7519003 7524059 7555573 7605771 7642525 7655923 7664806 7740661
5104G740661L3578J0543J3218J8653L3188L2676O7364M5569L6525L8719O2088
$$ 7740661 7774239 7784782 7798000 7816653 7849841 7882517 7949881 7995450 8031975 8070694 8132782
5093H132782N6882N5943L3002M2956Q8152K9603O0340M2840O5063O9739M6070
$$ 8132782 8189664 8245607 8278609 8321565 8409717 8439320 8499660 8542500 8607563 8677302 8723372
5082H723372N7648N1358L7248P5784N2183O4728L3248M8922M9301R3430M5436
$$ 8723372 8781020 8832378 8869626 8945410 8997593 9062321 9095569 9144491 9193792 9287222 9332658
5071I332658M7090J02322O2701M9500M0170O2954P7511Q7393Q5943O9133O6421
$$ 9332658 9379748 9482070 9544771 9594271 9634441 9697395 9774906 9862299 9948242 10017375 10083796
5060A0083796R7337Q6866Q7018N2778Q1847O7618L5967L2535N7153O7369J1550
$$ 10083796 10181133 10267999 10355017 10407795 10489642 10557260 10593227 10625762 10682915 10750284 10761834
5049A0761834L9313Q1752R0147N0340L9788P7941O4299R6871K2772O1397P5943
$$ 10761834 10801147 10882899 10973046 11023386 11063174 11141115 11205414 11302285 11325057 11386454 11462397
5038A1462397P6590L4346R8512P1649O5182Q7012J22009J09860M5823P1641J15187
$$ 11462397 11538987 11573333 11671845 11743494 11808676 11895688 12017697 12127557 12173380 12245021 12360208
5027A2360208Q0301Q6971P0585M4059M5282L1382O8618M5704R3504J10570N2645
$$ 12360208 12440509 12527480 12598065 12642124 12687406 12718788 12787406 12833110 12926614 13037184 13089829
5016A3089829J06315R2518P5061Q7416R2909J06232O8413O5765M0866O7677Q6838
$$ 13089829 13196144 13288662 13363723 13451139 13544048 13650280 13718693 13784458 13825324 13893001 13979839
5005A3979839J07363Q0404P7321Q9822R8312J28748J22853J24139J12269J55686
$$ 13979839 14087202 14167606 14244927 14334749 14433061 14561809 14684662 14808801 14921070 15076756
4995A5076756J39399J65354J93935J23205P3402P3792M7838K1161k059k4914M393
$$ 15076756 15216155 15381509 15575444 15698649 15772051 15845843 15893681 15914842 15912783 15887869 15892262
4984A5892262K7580J7756N9860R5940M0807Q5774O8130R7063Q5566P0191m404
$$ 15892262 15919842 15937598 15997458 16093398 16134205 16219979 16288109 16385172 16470738 16540929 16536525
4973A6536525l7041l9081q5719j33240j05203p4323m5851l2659l8833l884j9104
$$ 16536525 16499484 16460403 16374684 16241444 16136241 16061918 16016067 15983408 15944575 15940691 15921587
4962A5921587J6145M6806K754O0302Q4205R9210P1541J64127J07402J24886K28281
$$ 15921587 15937732 15984538 15987292 16047594 16131799 16231009 16302550 16466677 16574079 16698965 16927246
4951A6927246K32411K94309L00132L57938L32899K90488K78178J83819n089p1106
$$ 16927246 17159657 17453966 17754098 18112036 18444935 18735423 19013601 19197420 19192331 19121225
4941A9121225j46423j10477j04040j21454j09816n8967j10929p3239q6830o0975
$$ 19121225 18974802 18864325 18760285 18638831 18529015 18470048 18359119 18285880 18199050 18138075
4931A8138075J2503Q4367J00020J49766K29756K20678K67753K77488K60191K52951
$$ 18138075 18150578 18234945 18334965 18484731 18714487 18935165 19202918 19480406 19740597 19993548
4921A9993548K46653K33516J71624R8420k7952j06406j04469j18859q9596j09263
$$ 19993548 20240201 20473717 20645341 20743761 20715809 20609403 20504934 20386075 20296479 20187216
4911B0187216q3731r2756j34596j78274k85601m13936m75751o04737n48647n31248
$$ 20187216 20103485 20010729 19876133 19697859 19412258 18998322 18522571 17917834 17369187 16837939
4901A6837939m98492l75155l48558k98097k16100k01149j57646j09372l3257k8469
$$ 16837939 16339447 15964292 15615734 15317637 15101537 14900388 14742742 14633370 14600113 14571644
4891A4571644n3409k546o5853m2398o1282p9150m9117l1499k8866j00836j99341
$$ 14571644 14518235 14515689 14449836 14407438 14346156 14267006 14217889 14186390 14157524 14056688 13857347
4880A3857347k90694l36989l68418l50219l24574k86241k67509k48206k37423
$$ 13857347 13566653 13229664 12861246 12511027 12186453 11900212 11632703 11384497 11147074
4871A1147074j59410j83353j82396j77609j41703j62238j48775j41641j17596
$$ 11147074 10987664 10804311 10621915 10444306 10302603 10140365 9991590 9849949 9732353
4862I732353j07131j08226j00199j05436r4895r1379q6066j05859j00968r5798
$$ 9732353 9625222 9516996 9416797 9311361 9216466 9125087 9039021 8933162 8832194 8736396
4852H736396r9622q9993q0845j17247p4368m1251r3249j08872m2304r7632m8614
$$ 8736396 8636774 8546781 8465936 8348689 8274321 8233070 8139821 8030949 7988645 7891013 7842399
4841G842399n6970p0260p2385o1757p5975o1625n5876q1588m7268m7835p4761
$$ 7842399 7785429 7715169 7642784 7581027 7505052 7443427 7387551 7305963 7258695 7210860 7136099
4830G136099m1185o1746l9376n4768l5428n4770r6228j2953p7475l0924l3046
$$ 7136099 7094914 7033168 6993792 6939024 6903596 6848826 6752598 6739645 6662170 6631246 6598200
4819F598200p7332k2884k3033o9505m3136k6256n7920n4765j6768j0127m2742
$$ 6598200 6520868 6497984 6474951 6405446 6362310 6336054 6278134 6223369 6206601 6196474 6153732
4808F153732n80k2101l8890j3845m2384l5156j2213l5390m4009l3149l1380n5636
$$ 6153732 6153152 6131051 6092161 6078316 6035932 6000776 5988563 5953173 5909164 5876015 5844635 5788999
4796E788999o8102j1874k7743l0669K04k960n0533m1138K5176o336m435k6133
$$ 5788999 5720897 5709023 5681280 5650611 5650815 5647855 5597322 5556184 5581360 5575024 5570589 5544456
4784E544456J696j8101n0707l5641o6086o4588k6639k7439o8375l4641k8073m1486
$$ 5544456 5546152 5528051 5477344 5441703 5375617 5311029 5284390 5256951 5188576 5153935 5125862 5084376
4772E084376J6373J281N081k4038k6118j3890j06k2347j9623j4978n5653j9451
$$ 5084376 5100749 5102030 5107111 5083073 5056955 5043065 5042959 5020612 5000989 4986011 4930358 4910907
4760D910907k8080l5846Q93l235k654l1502N41O735J426K2397p76L233J0683k9244
$$ 4910907 4882827 4846981 4847874 4844639 4841985 4810483 4811024 4817759 4819185 4841582 4840806 4844039 4854722 4825478
4746D825478J7153l3046j4119j8800k9189q437k545L321J1001J3256k4536j0114
$$ 4825478 4842631 4809585 4795466 4776666 4747477 4739040 4736495 4739816 4750817 4764073 4739537 4729423
4734D729423K9218Q2481j5548J809N754K6991Q765o521M8650J9159M6623K9438
$$ 4729423 4758641 4841122 4825574 4827383 4833137 4860128 4868893 4862372 4911022 4930181 4976804 5006242
4722E006242K9636L7643K2529N2473L7396N6537N7971M2220J6518p685J3035N6610
$$ 5006242 5035878 5073521 5096050 5148523 5185919 5242456 5300427 5342647 5359165 5351480 5364515 5421125
4710E421125O5185O4880N0230J01881R7380J34448J28851J53314J20086J82166
$$ 5421125 5486310 5551190 5601420 5703301 5800681 5935129 6063980 6217294 6337380 6519546
4700F519546J74848J48158Q2616K5195r244r352k5731m891K4275K1119P0004J03868
$$ 6519546 6694394 6842552 6925168 6950363 6941119 6931767 6906036 6901145 6925420 6946539 7016543 7120411
4688G120411P0241J20538J34835Q0555Q2633O3039k0777q111O579l7319k4314
$$ 7120411 7190652 7311190 7446025 7526580 7609213 7672252 7651475 7643364 7649943 7612624 7588310
4677G588310M161L3451P4084J14840O4723J70433K05747K33752K73167L13692
$$ 7588310 7592471 7625922 7700006 7814846 7879569 8050002 8255749 8489501 8762668 9076360
4667I076360L68496M63665M85356N48313O84823Q22572R04893J027091J198813
$$ 9076360 9444856 9908521 10393877 10942190 11627013 12449585 13354478 14381569 15580382
4658A5580382J273643J342066J174493O84536J9866n91435r31379j015660q61970
$$ 15580382 16854025 18196091 19370584 20055120 20074986 19483551 18552172 17536512 16674542
4649A6674542o13356l59090j02473L3714K57403M77640O74107Q70032J048820
$$ 16674542 16061186 15702096 15599623 15633337 15890740 16368380 17042487 17912519 18961339
4640A8961339J157306J193867J007516M63752l19480r84619j294506j360334j184362
$$ 18961339 20118645 21312512 22320028 22783780 22464300 21479681 20185175 18824841 17640479
4631A7640479j032655p83212o94729n50799m01401k80203j19448p5382k3013R8032
$$ 17640479 16607824 15824612 15129883 14579084 14177683 13897480 13778032 13702650 13679637 13777669
4621A3777669J49050J14046R5392Q7224N4952J21599J88860K16451L46211M77431
$$ 13777669 13926719 14040765 14136157 14223381 14278333 14399932 14588792 14805243 15151454 15628885
4611A5628885O25113Q06941R42545J161909J453651J701779J984190K232022K346468
$$ 15628885 16253998 17060939 18003484 19165393 20619044 22320823 24305013 26537035 28883503
4602B8883503K102967J364218J16152j125372j833635k072357j855705j489790
$$ 28883503 30986470 32350688 32466840 31341468 29507833 27435476 25579771 24089981
4594B4089981j061880p40005l59542j3561L76234O94379R38522J231023J435990
$$ 24089981 23028101 22288096 21928554 21914993 22291227 22985606 23924128 25155151 26591141
4585B6591141J455042J151685L95695p50056j769016k386033k436757k231606
$$ 26591141 28046183 29197868 29593563 28843507 27074491 24688458 22251701 20020095
4577B0020095j982205j674816j408230j165770r65505q41256o97778n66843n21031
$$ 20020095 18037890 16363074 14954844 13789074 12823569 11982313 11284535 10717692 10196661
4568A0196661m62649l91525l86216l38406l18005k75736j91461j87081j75991
$$ 10196661 9734012 9342487 8956271 8617865 8299860 8024124 7832663 7645582 7469591
4559G469591j82987j93869j49694j32669j43281j41913j29784j32400j11588r6932
$$ 7469591 7286604 7092735 6943041 6810372 6667091 6525178 6395394 6262994 6151406 6054474
4549F054474p6544n4979m9298l2790m1824m8710k0176m4114o8314p9875n9785
$$ 6054474 5977930 5922951 5873653 5840863 5799039 5750329 5730153 5686039 5617725 5537850 5478065
4538E478065l1866k2971k0298j7591l4561m320k5583k4770j2810L2423J7624L1644
$$ 5478065 5446199 5423228 5402930 5385339 5350778 5346458 5320875 5296105 5283295 5315718 5333342 5364986
4526E364986r41N4733L4050j691P8580O8686P7590R2554R2945P5557Q9308Q2122
$$ 5364986 5364045 5418778 5452828 5451137 5529717 5598403 5675993 5768547 5861492 5937049 6026357 6108479
4514F108479Q2090J11787R2729P4243J00697J05263J16853J80119J66545J73517
$$ 6108479 6190569 6302356 6395085 6469328 6570025 6675288 6792141 6972260 7138805 7312322
4504G312322J99557J82021K15548K45802K54378L20969M08279M30579N26919O23004
$$ 7312322 7511879 7693900 7909448 8155250 8409628 8730597 9138876 9569455 10096374 10719378
4494A0719378O85863Q48238R49643J107706J288799J519523J751891J950371K185730
$$ 10719378 11405241 12253479 13203122 14310828 15599627 17119150 18871041 20821412 23007142
4485B3007142K228427J913336J139577j05561j315230k028693k260077k045297
$$ 23007142 25235569 27148905 28288482 28182921 26867691 24838998 22578921 20533624
4477B0533624j773913j500045j239892r48074p55743n71897m23188l64781k61030
$$ 20533624 18759711 17259666 16019774 15071700 14315957 13744060 13320872 12956091 12695061
4468A2695061j47909j28188r4723k4651Q4214J11614K14492L10972M10017N60159
$$ 12695061 12547152 12418964 12324241 12299590 12383804 12495418 12709910 13020882 13430899 13991058
4458A3991058O42462P42567Q81154R91739J162008J334964J502533J720216J847818
$$ 13991058 14633520 15376087 16257241 17248980 18410988 19745952 21248485 22968701 24816519
4449B4816519J911008J706602J140310J84462r89026j839473k104989k050213
$$ 24816519 26727527 28434129 29574439 29758901 28769875 26930402 24825413 22775200
4441B2775200j702398j353353j033350o95210l74436j52936J11437L24026N65636
$$ 22775200 21072802 19719449 18686099 17990889 17616453 17463517 17574954 17898980 18464616
4432A8464616P57052Q54009P45752L86600k20566r66418j403624j501785j413909
$$ 18464616 19221668 20075677 20821429 21208029 20987463 20021045 18617421 17115636 15701727
4423A5701727j208282r40875q04221o73756n45244m08888k99079k04061j44074
$$ 15701727 14493445 13552570 12748349 12074593 11529349 11120461 10821382 10617321 10473247
4414A0473247l9648k4555J6524j7212L675N09o1260m9759n5184P442O9903J52028
$$ 10473247 10433599 10409044 10425568 10408356 10412031 10412540 10351280 10301521 10246337 10253779 10323682 10475710
4402A0475710J97423K79044L52009N03847O32858P86880R46887J055136J052517
$$ 10475710 10673133 10952177 11304186 11808033 12440891 13227771 14174658 15229794 16282311
4393A6282311P95929K56642m87367j053659j355508j339889j202741j031881r05441
$$ 16282311 17078240 17334882 16847515 15793856 14438348 13098459 11895718 10863837 9958396
4384I958396p79268o52372n76296m82738l85357l78505l22280k95442k42306k08401
$$ 9958396 9179128 8526756 7950460 7467722 7082365 6703860 6381580 6086138 5843832 5635431
4374E635431j73224j91826k07566j04816j28770j02896j27243j36917j08337r4697
$$ 5635431 5462207 5270381 5062815 4957999 4829229 4726333 4599090 4462173 4353836 4259139
4364D259139j18662o9009j00164p0301q0764n4061J702l2437j017K2173L5807
$$ 4259139 4140477 4071468 3971304 3901003 3820239 3766178 3767880 3735443 3734426 3756599 3792406
4353C792406J2327O362N2231M0553J5742l13L7028O879n6182m6666j17201j13099
$$ 3792406 3804733 3811095 3863326 3903879 3919621 3919308 3956336 3963215 3907033 3860367 3743166 3630067
4341C630067j10210j27547j49951j04042r5215k0077p8645p2716n5990m3013o023
$$ 3630067 3519857 3392310 3242359 3138317 3043102 3023025 2944380 2871664 2815674 2772661 2766638
4330B766638n7792l8083m2397o75l9994N305J0901p889q450q323o468J1696L5633
$$ 2766638 2708846 2670763 2628366 2627691 2587697 2593002 2603903 2596014 2587564 2579241 2572773 2584469 2620102
4317B620102l1724P806M2574j312J2938L0850O2023R2166K7298M5003Q0507J25760
$$ 2620102 2588378 2596184 2638758 2637446 2650384 2681234 2743257 2835423 2862721 2907724 2988231 3113991
4305C113991J19846J37394J48450P9834R8418N7481j2675m9108j04553j07203
$$ 3113991 3233837 3371231 3519681 3599515 3697933 3755414 3742739 3693631 3589078 3481875
4295C481875j30002p9851p9972r8583q6144q1790q4619p1931l5202J1157J7802
$$ 3481875 3351873 3272022 3192050 3093467 3007323 2925533 2840914 2768983 2733781 2744938 2762740
4284B762740m4012l136q228L333J0016K639N234M1574P44r571K1465J9302L6869
$$ 2762740 2718728 2715592 2707364 2710697 2720713 2723352 2728586 2770160 2770904 2761333 2782798 2802100 2838969
4271B838969O0686L5697P8316Q1033L3939J03225J38657J31707J67502J06336
$$ 2838969 2899655 2935352 3013668 3094701 3128640 3231865 3370522 3502229 3669731 3776067
4261C776067J19872R0511P258k8144n5869q9503r5755j15003j33235r8187o4513
$$ 3776067 3895939 3986450 3993708 3965564 3909695 3820192 3724437 3609434 3476199 3378012 3313499
4250C313499n5494n1748l5450Q142l4785j8035N2881J2730L4027N1483N2420Q8642
$$ 3313499 3258005 3206257 3170807 3178949 3144164 3126129 3179010 3191740 3225767 3277250 3329670 3418312
4238C418312P6620O2096R1751O9585M8103P316n5685p5335r8812j25513j01494
$$ 3418312 3494932 3557028 3648779 3718364 3766467 3773783 3718098 3642763 3543951 3418438 3316944
4227C316944j05451j11968j13356p2108p9493o8355m2687k3094k8516p7826m8889
$$ 3316944 3211493 3099525 2986169 2914061 2834568 2766213 2723526 2700432 2671916 2594090 2545201
4216B545201j9412j1497n4032j1090J5264l314j5184l6765K0272P018K2353L2304
$$ 2545201 2525789 2514292 2460260 2449170 2464434 2461120 2445936 2409171 2429443 2436461 2458814 2491118
4204B491118L6788J7184M1124N0829N0952P3531P2149R6336O1359O3508O8031
$$ 2491118 2527906 2545090 2586214 2637043 2687995 2761526 2833675 2930011 2991370 3054878 3122909
4193C122909K9131L2526l9525q2146j04484j44497j26127j24276m9727o0587q0256
$$ 3122909 3152040 3184566 3145041 3062895 2958411 2813914 2687787 2563511 2513784 2453197 2372941
4182B372941n9764o7751k1969J075m7030o4344k2473l0939j6740m242n3916k5346
$$ 2372941 2313177 2245426 2223457 2224532 2177502 2113158 2090685 2059746 2043006 2038764 1984848 1959502
4170A959502K0664m72J0046k1971j8299k6879r756q599J0464l3162l120M1697
$$ 1959502 1980166 1979694 1989740 1967769 1949470 1922591 1912835 1904236 1914700 1881538 1878418 1920115
4158A920115o822J7094j571K4888K9042J5723K000J071J2782L5091K4600J1286
$$ 1920115 1913293 1930387 1928816 1953704 1982746 1998469 2000469 2001540 2014322 2049413 2074013 2085299
4146B085299J266j6994K1482L8518q462n027R398K5961N7307K3803l9070o191
$$ 2085299 2086565 2069571 2091053 2129571 2121109 2116082 2125480 2151441 2208748 2232551 2193481 2187290
4134B187290L2105J9279L2909P3304L1592J5045L6524O9152O0584L8874Q5149
$$ 2187290 2219395 2238674 2271583 2344887 2376479 2391524 2428048 2497200 2557784 2596658 2681807
4123B681807P4311P1734Q6309Q2496Q6386N4198o4311p2266p6583p0135l8188
$$ 2681807 2756118 2827852 2914161 2996657 3083043 3137241 3072930 3000664 2924081 2853946 2815758
4112B815758P461r231k9583M1585J8998J0868M4502N776N637J8103M1364P6243
$$ 2815758 2823219 2813988 2784405 2825990 2844988 2855856 2900358 2906134 2911771 2929874 2971238 3047481
4100C047481K1289K0365J454k540L6633l197O3947M6279K9396L4091O7235M1602
$$ 3047481 3068770 3089135 3090589 3088049 3124682 3121485 3185432 3231711 3261107 3295198 3362433 3404035
4088C404035M1469K8496N3708L7937L1260M9265K0721J4284J5299O1802O6626
$$ 3404035 3445504 3474000 3527708 3565645 3596905 3646170 3666891 3681175 3696474 3758276 3824902
4077C824902M5809L0948M7758M6483N7767K8143L7996M7166L2561J8874K1685
$$ 3824902 3870711 3901659 3949417 3995900 4053667 4081810 4119806 4166972 4199533 4218407 4240092
4066D240092M1504M8332P8372N6087M2946P7547L7420O7511O3616P9746N7633
$$ 4240092 4281596 4329928 4408300 4464387 4507333 4584880 4622300 4689811 4753427 4833173 4890806
4055D890806P8150N2168N5010P8332J13147P0067P2099J18251J32402Q1195J20187
$$ 4890806 4968956 5021124 5076134 5154466 5267613 5337680 5409779 5528030 5660432 5741627 5861814
4044E861814R7917J34293J36927P7910J34648J38616J24239J44680J27555J33862
$$ 5861814 5959731 6094024 6230951 6308861 6443509 6582125 6706364 6851044 6978599 7112461
4034G112461J75385J68346J61019J74519J76431J68935J49337K09753K00603K27271
$$ 7112461 7287846 7456192 7617211 7791730 7968161 8137096 8286433 8496186 8696789 8924060
4024H924060K15659K24156K50126K05829K38765K86955L22585K85524L03730K94654
$$ 8924060 9139719 9363875 9614001 9819830 10058595 10345550 10668135 10953659 11257389 11552043
4014A1552043L35583L35475L45257L83325M18440M36215M82438M72175M88422
$$ 11552043 11887626 12223101 12568358 12951683 13370123 13806338 14288776 14760951 15249373
4005A5249373N29695N64086O14951O56736O75564P04715P49427Q06595Q69964
$$ 15249373 15779068 16343154 16958105 17614841 18290405 18995120 19744547 20551142 21421106
3996B1421106Q85389R58041J047875J081597J136142J170495J292938J333475
$$ 21421106 22306495 23264536 24312411 25394008 26530150 27700645 28993583 30327058
3988C0327058J398700J483867J541463J657774J708995J773679J904407J952899
$$ 30327058 31725758 33209625 34751088 36408862 38117857 39891536 41795943 43748842
3980D3748842K045296K094614K146700K216036K249276K288619K336466K378141
$$ 43748842 45794138 47888752 50035452 52251488 54500764 56789383 59125849 61503990
3972F1503990K440680K453772K491338K525654K543756K574166K571312K524495
$$ 61503990 63944670 66398442 68889780 71415434 73959190 76533356 79104668 81629163
3964H1629163K496500K406342K294599K182781K068659J971173J788305J675785
$$ 81629163 84125663 86532005 88826604 91009385 93078044 95049217 96837522 98513307
3956I8513307J571607J458958J339651J240925J126037R71028Q44457O48359L90808
$$ 98513307 100084914 101543872 102883523 104124448 105250485 106221513 107065970 107714329 108105137
3947A08105137J29888k06716m14075o40666q40208r65672j114636j218640j307753
$$ 108105137 108235025 108028309 107614234 106973568 106133360 105167688 104053052 102834412 101526659
3938A01526659j427565j556474j652523j775352j933339k073280k279132k365276
$$ 101526659 100099094 98542620 96890097 95114745 93181406 91108126 88828994 86463718
3930H6463718k451367k581079k607236k627711k592414k601465k547869k500446
$$ 86463718 84012351 81431272 78824036 76196325 73603911 71002446 68454577 65954131
3922F5954131k478682k401630k366975k371858k337631k333670k249257k204954
$$ 65954131 63475449 61073819 58706844 56334986 53997355 51663685 49414428 47209474
3914D7209474k157694k086408k036922k001590j834397j754495j699283j580687
$$ 47209474 45051780 42965372 40928450 38926860 37092463 35337968 33638685 32057998
3906C2057998j479010j422837j367225j242090j216812j136727j099080j030283
$$ 32057998 30578988 29156151 27788926 26546836 25330024 24193297 23094217 22063934
3898B2063934r59488r15202q65750q16080p45132p17035o41877o23857o17998
$$ 22063934 21104446 20189244 19323494 18507414 17762282 17045247 16403370 15779513 15161515
3889A5161515n57489n46120m75103m51980m33119m02120l85225l58955l44662
$$ 15161515 14604026 14057906 13582803 13130823 12697704 12295584 11910359 11551404 11206742
3880A1206742l24288k81532k67576k79385k78344k20219k29802j91866k25917
$$ 11206742 10882454 10600922 10333346 10053961 9775617 9555398 9325596 9133730 8907813
3871H907813j88218j54917j79653j78878j37055j17657j40700j33759r7441j12821
$$ 8907813 8719595 8564678 8385025 8206147 8069092 7951435 7810735 7676976 7579535 7466714
3861G466714j08504r7640j02191o5166r8882j18760r0222q4388o4684m8913j8571
$$ 7466714 7358210 7260570 7158379 7093213 6994331 6875571 6785349 6700961 6636277 6587364 6568793
3850F568793n7519p3111o4478n3206j8647m9661l0538l6326j3457l3535k9753
$$ 6568793 6511274 6438163 6373685 6320479 6301832 6252171 6221633 6185307 6171850 6138315 6108562
3839F108562R798K49L686J0822j26r006L7656N632j4337K2520j5500J9234M364
$$ 6108562 6118360 6118609 6122295 6133117 6132991 6123985 6161641 6167273 6152936 6175456 6159956 6179190 6183554
3826F183554j0249j1958N142J5985k7991o4800p07l4983n3856k4927m2538m3479
$$ 6183554 6173305 6161347 6166489 6182474 6154483 6089683 6088976 6053993 6000137 5975210 5932672 5889193
3814E889193n8903r5669m0681l8467p6127m6037n5464p1125r9046k3924n2209
$$ 5889193 5830290 5734621 5693940 5655473 5579346 5533309 5477845 5406720 5307674 5283750 5231541
3803E231541o0983o3618j9418l8432l7256l0175j9887q682l7994k8464m2931J8505
$$ 5231541 5170558 5106940 5087522 5049090 5011834 4981659 4961772 4953090 4915096 4886632 4843701 4862206
3791D862206k522j4020L4379P843k16N856J8671k6772J4989M0955J3034J6403
$$ 4862206 4859684 4845664 4880043 4887886 4887670 4893526 4912197 4885425 4900414 4941369 4954403 4970806
3779D970806J0739J8809Q74L9515L6413M3450J4402j5767O0295M9129K0306N0005
$$ 4970806 4981545 5000354 5001228 5040743 5077156 5120606 5135008 5119241 5179536 5228665 5248971 5298976
3767E298976K0311L1519o935N8969M1244M296L4714M6470O2163K8507M63O4325
$$ 5298976 5319287 5350806 5343871 5402840 5444084 5448380 5483094 5529564 5591727 5620234 5620697 5685022
3755E685022Q5880N5096O7473N1378L8049L1811N4884L1730L2513M0153O5869
$$ 5685022 5770902 5825998 5893471 5944849 5982898 6014709 6069593 6101323 6133836 6173989 6239858
3744F239858P0223O9174M5274M6014O8413O8242O4581Q5409Q4819L6108Q2248
$$ 6239858 6310081 6379255 6424529 6470543 6538956 6607198 6671779 6757188 6842007 6878115 6960363
3733F960363R4283R0376J14552R0447P7839J01977R4484J39807R7805J29924J02786
$$ 6960363 7054646 7145022 7259574 7350021 7427860 7529837 7624321 7764128 7861933 7991857 8094643
3722H094643J25405J13830J09145J19138J48477K31892J93408J61157J57611J75828
$$ 8094643 8220048 8333878 8443023 8562161 8710638 8942530 9135938 9297095 9454706 9630534
3712I630534J96343J93055J86262J74875J80358J72258K05490K17192K06293J67060
$$ 9630534 9826877 10019932 10206194 10381069 10561427 10733685 10939175 11156367 11362660 11529720
3702A1529720J76290J56585J82618K06208J92333J70104J58935J64041J52766
$$ 11529720 11706010 11862595 12045213 12251421 12443754 12613858 12772793 12936834 13089600
3693A3089600J77720J43945J64049J43794J40171J55774J70434J56008J69790
$$ 13089600 13267320 13411265 13575314 13719108 13859279 14015053 14185487 14341495 14511285
3684A4511285J51892J65474J81044J75227J93990J81026J88411K10384J97921
$$ 14511285 14663177 14828651 15009695 15184922 15378912 15559938 15748349 15958733 16156654
3675A6156654K67064K10119K34039K76479L08955L26958L41723L40926L50627
$$ 16156654 16423718 16633837 16867876 17144355 17453310 17780268 18121991 18462917 18813544
3666A8813544L96718M25300M06882M07080M38125M56289M55341M65066N04561
$$ 18813544 19210262 19635562 20042444 20449524 20887649 21343938 21799279 22264345 22768906
3657B2768906N28015N45371N74837O03321O21747O33456O87559O74349O95698
$$ 22768906 23296921 23842292 24417129 25020450 25642197 26275653 26963212 27637561 28333259
3648B8333259P38193P69796Q31463Q71484R07523R45412R28249J017067J071936
$$ 28333259 29071452 29841248 30672711 31544195 32451718 33397130 34325379 35342446 36414382
3639C6414382J125841J113396J108348J185529J199504J122275J126710J129762
$$ 36414382 37540223 38653619 39761967 40947496 42147000 43269275 44395985 45525747
3631D5525747J093061J112135J101446J120529J170698J211391J175237J173118
$$ 45525747 46618808 47730943 48832389 49952918 51123616 52335007 53510244 54683362
3623E4683362J168551J186375J085420J041179J009311R71300R23873Q99054Q83225
$$ 54683362 55851913 57038288 58123708 59164887 60174198 61145498 62069371 62968425 63851650
3614F3851650R31605R86851J008357J052588J108042J196109J257392J268456
$$ 63851650 64783255 65770106 66778463 67831051 68939093 70135202 71392594 72661050
3606G2661050J255926J312754J310326J265718J271876J165841J200852J175865
$$ 72661050 73916976 75229730 76540056 77805774 79077650 80243491 81444343 82620208
3598H2620208J172913J196087J286624J433850J514570J691445J868727K065469
$$ 82620208 83793121 84989208 86275832 87709682 89224252 90915697 92784424 94849893
3590I4849893K294382K515833K707902K906170L082064L246324L392740L573193
$$ 94849893 97144275 99660108 102368010 105274180 108356244 111602568 114995308 118568501
3582A18568501L696322L877016M016136M124146M245578M362774M512865M623582
$$ 118568501 122264823 126141839 130157975 134282121 138527699 142890473 147403338 152026920
3574A52026920M806405M996267N182734N300765N450341N592639N631173N728141
$$ 152026920 156833325 161829592 167012326 172313091 177763432 183356071 188987244 194715385
3566A94715385N737953N743481N796341N780829N855319O031734O245166O508049
$$ 194715385 200453338 206196819 211993160 217773989 223629308 229661042 235906208 242414257
3558B42414257O783920P143896P555385P955262Q359025Q820328R249355R632677
$$ 242414257 249198177 256342073 263897458 271852720 280211745 289032073 298281428 307914105
3550C07914105R968259J0174464J0310880J0086586R578715Q694660P579359O220112
$$ 307914105 317882364 328056828 338367708 348454294 358033009 366727669 374307028 380527140
3542C80527140M745432L199684J690977K99529r59073j959926k726139l342979
$$ 380527140 385272572 388472256 390163233 390462762 389503689 387543763 384817624 381474645
3534C81474645l850025m394768n078520n901859o959628q165541r376972j0523752
$$ 381474645 377624620 373229852 368151332 362249473 355289845 347124304 337747332 327223580
3526C27223580j1565570j2381437j2900335j3175975j3191215j2930022j2486474
$$ 327223580 315658010 303276573 290376238 277200263 264009048 251079026 238592552
3519B38592552j1805987j0963139j0121158r291294q549702p842298p173502o670818
$$ 238592552 226786565 215823426 205702268 196410974 187861272 180018974 172845472 166174654
3511A66174654o256362n869401n587269n324523m947558m494007m086885l658559
$$ 166174654 159918292 154048891 148461622 143137099 138189541 133695534 129608649 125950090
3503A25950090l243663k918463k586237k369549k262903k301099k409626k571926
$$ 125950090 122706427 119787964 117201727 114832178 112569275 110268176 107858550 105286624
3495A05286624k721394k837128k826969k689728k499851k326672k019533j641562
$$ 105286624 102565230 99728102 96901133 94211405 91711554 89384882 87365349 85723787
3487H5723787j332339j122169q82771p67635o56404o09671n19830m62111l43299
$$ 85723787 84391448 83269279 82386508 81618873 80962469 80352798 79832968 79370857 79027558
3478G9027558k44214j81575j29152k3395J8009K6573n2232k63208m59881o96431
$$ 79027558 78783344 78601769 78472617 78449222 78467231 78493804 78441572 78178364 77718483 77022052
3468G7022052r18651j184101j371886j500540j558523j582452j617091j599101
$$ 77022052 76103401 74919300 73547414 72046874 70488351 68905899 67288808 65689707
3460F5689707j545960j564393j664344j776782j895263k032946k260637k409556
$$ 65689707 64143747 62579354 60915010 59138228 57242965 55210019 52949382 50539826
3452E0539826k422675k506477k428282k334995k227057k079290j892737j775411
$$ 50539826 48117151 45610674 43182392 40847397 38620340 36541050 34648313 32872902
3444C2872902j575202j448166j371421j240348j125607j052553r48122q88238
$$ 32872902 31297700 29849534 28478113 27237765 26112158 25059605 24111483 23223245
3436B3223245q41703p81270o61561o31103o74220n81056n66215n26960m96551
$$ 23223245 22381542 21600272 20938711 20307608 19633388 19052332 18486117 17959157 17462606
3427A7462606m51134m50809m44851l94249l71760m16122l72231l33406l49861
$$ 17462606 17011472 16560663 16115812 15721563 15349803 14933681 14561450 14228044 13878183
3418A3878183l00885k84946l20481l38766k54857k52435k51041k44536k53921
$$ 13878183 13577298 13292352 12971871 12633105 12378248 12125813 11874772 11630236 11376315
3409A1376315k51381k27760j86809k00472k16889j71622j87342j74987j47442
$$ 11376315 11124934 10897174 10710365 10509893 10293004 10121382 9934040 9759053 9611611
3400I611611j50199j65003j31880r6688j27640j08981j10170j04534q5817l6240
$$ 9611611 9461412 9296409 9164529 9067841 8940201 8831220 8721050 8616516 8530699 8494459
3390H494459n5614l4270j8855m7096m6993k2739l3171n3479k225J6350j3462l4809
$$ 8494459 8438845 8404575 8385720 8338624 8291631 8268892 8235721 8182242 8180017 8196367 8182905 8148096
3378H148096j6802j077J5785L5702J04736J24232J33168J49548K40415K22964
$$ 8148096 8131294 8130217 8146002 8181704 8286440 8410672 8543840 8693388 8933803 9156767
3368I156767K77080L38526M11352N41689O37104Q21875R89465J065114J002555
$$ 9156767 9433847 9772373 10183725 10725414 11362518 12184393 13173858 14238972 15241527
3359A5241527L65882o27523j206391j264864j027757q65427o39882m63742m08950
$$ 15241527 15607409 14979886 13773495 12508631 11480874 10615447 9975565 9511823 9102873
3350I102873l38242k37056j75562j17219j11133j33533j05832r7334r9462q6712
$$ 9102873 8764631 8527575 8352013 8234794 8123661 7990128 7884296 7786962 7687500 7600788
3340G600788p8857n8364n4251j0359K5346l5188k6454l977k3460Q135Q36J5493
$$ 7600788 7521931 7463567 7409316 7398957 7424303 7389115 7362661 7358684 7335224 7343359 7344195 7359688
3328G359688J1430M4192K8811M0263N0321N8668P0136P2508L8158R1445P8769
$$ 7359688 7371118 7415310 7444121 7484384 7534705 7593373 7663509 7736017 7774175 7865620 7944389
3317G944389R475P6096O7132M5478R3029O6053O7198J18932R4185J19904J09688
$$ 7944389 7953864 8029960 8097092 8142570 8235599 8301652 8368850 8487782 8581967 8701871 8811559
3306H811559J15985J30211J30570J34504J74556J92799K22066K11328K23680K17576
$$ 8811559 8927544 9057755 9188325 9322829 9497385 9690184 9912250 10123578 10347258 10564834
3296A0564834K43515K57841K61669K26679K28513K01785J84389K02090J77079
$$ 10564834 10808349 11066190 11327859 11554538 11783051 11984836 12169225 12371315 12548394
3287A2548394J63491J77572J40967J71569K08028J66640J99890K16335K15567
$$ 12548394 12711885 12889457 13030424 13201993 13410021 13576661 13776551 13992886 14208453
3278A4208453K49481K30411K43677L37719L84312L62625L99233M36391M82875
$$ 14208453 14457934 14688345 14932022 15269741 15654053 16016678 16415911 16852302 17335177
3269A7335177M93877N26269N99755O03486N70793N63756N20813M77074N21623
$$ 17335177 17829054 18355323 18955078 19558564 20129357 20693113 21213926 21691000 22212623
3260B2212623N24475N19411N44128N31659N07263N33909N08681N25987M70313
$$ 22212623 22737098 23256509 23800637 24332296 24839559 25373468 25882149 26408136 26878449
3251B6878449N08042N18461N52571O12843O66664O91651P57797Q16808R13812
$$ 26878449 27386491 27904952 28457523 29070366 29737030 30428681 31186478 32003286 32917098
3242C2917098R34841J006990J047111J083959R99159R80607R81290R56445J027215
$$ 32917098 33851939 34858929 35906040 36989999 37989158 38969765 39951055 40907500 41934715
3233D1934715J101213J260045J418263J626061J858807K214748K494861K847720
$$ 41934715 43035928 44295973 45714236 47340297 49199104 51413852 53908713 56756433
3225E6756433L130909L372635L593717L588950L410890L143336K706644K123189
$$ 56756433 59887342 63259977 66853694 70442644 73853534 76996870 79703514 81826703
3217H1826703J251659K42880p32731j691629k484453l009287l379508l414428
$$ 81826703 83078362 83321242 82588511 80896882 78412429 75403142 72023634 68609206
3209F8609206l276485k986566k721986k522405k380414k282405k250909k172503
$$ 68609206 65332721 62346155 59624169 57101764 54721350 52438945 50188036 48015533
3201D8015533k117145k082303j987380j943091j890896j843983j745850j690263
$$ 48015533 45898388 43816085 41828705 39885614 37994718 36150735 34404885 32714622
3193C2714622j598226j521040j505661j408955j292467j213055j137313j067953
$$ 32714622 31116396 29595356 28089695 26680740 25388273 24175218 23037905 21969952
3185B1969952r22042q51789p69999p48388o23782o37109n80367n36303n39011
$$ 21969952 21047910 20196121 19426122 18677734 18053952 17416843 16836476 16300173 15761162
3176A5761162m98167n07624n19607n05777m80197m46505m44285m34069l86678
$$ 15761162 15262995 14755371 14235764 13729987 13249790 12803285 12359000 11924931 11538253
3167A1538253l36427l32452l47979k78099l02305l02476k90109k82066k75291
$$ 11538253 11201826 10869374 10521395 10243296 9940991 9638515 9348406 9066340 8791049
3158H791049k51648k77104j95446k45508k37184k00209j95245k03637j92862j58399
$$ 8791049 8539401 8262297 8066851 7821343 7584159 7383950 7188705 6985068 6792206 6633807
3148F633807j81708j93025k03608j82912j35115j50943j84416j40650j28415j51762
$$ 6633807 6452099 6259074 6055466 5872554 5737439 5586496 5402080 5261430 5133015 4981253
3138D981253j30142j36044j20569j09414j21938j00335j37753r2974q4660q9360
$$ 4981253 4851111 4715067 4594498 4485084 4363146 4262811 4125058 4032084 3947424 3858064
3128C858064p8801j06016m2043q8195n8634q5213q2508m3792o6473n353n5344
$$ 3858064 3779263 3673247 3631204 3543009 3484375 3399162 3316654 3272862 3206389 3201036 3145692
3117C145692k5560q2985k7209j6508p0580p2784m9331o8118n7092n2306P974k4741
$$ 3145692 3120132 3037147 3009938 2993430 2922850 2850066 2800735 2732617 2675525 2623219 2631193 2606452
3105B606452r1501l7986k048m8646j4253m2935m0984n1014k2373j3253o9930k4803
$$ 2606452 2514951 2476965 2474917 2426271 2412018 2369083 2328099 2277085 2254712 2241459 2171529 2146726
3093B146726l3137M118j5659k919P762n8489n7680M7496k6323j4507l6999l0861
$$ 2146726 2113589 2117707 2102048 2099129 2106891 2048402 1990722 2038218 2011895 1997388 1960389 1929528
3081A929528q93l913k4050M96m3873Q383K2040k4249o411j3670k853J5826k7419
$$ 1929528 1928635 1924722 1900672 1901168 1857295 1865678 1887718 1863469 1857058 1843388 1840535 1856361 1828942
3068A828942L065J1763K9820k4808l3619M3162K177p511N0809k8030j6598M0731
$$ 1828942 1832007 1843770 1873590 1848782 1815163 1858325 1860502 1852991 1903800 1875770 1859172 1899903
3056A899903m5428K8236K4383P424l1262k9123j8919j3235p216M966K1465L560
$$ 1899903 1854475 1882711 1907094 1914518 1883256 1854133 1835214 1821979 1814763 1819729 1841194 1844754
3044A844754m6934L0750P793N353N560j230J0974k048J7161J6971L2347J8753
$$ 1844754 1797820 1828570 1836363 1841716 1847276 1846046 1857020 1854972 1872133 1889104 1921451 1940204
3032A940204J9784m91p988J4608m476J3255J5977l0412J8300J7317l4853K9288
$$ 1940204 1959988 1959497 1951509 1966117 1961641 1974896 1990873 1960461 1978761 1996078 1961225 1990513
3020A990513J7074L6552K6587n429J4593Q423K6222n129j4561o28J7652J6712
$$ 1990513 2007587 2044139 2070726 2065297 2079890 2088313 2114535 2109406 2094845 2094217 2111869 2128581
3008B128581L0383j121K9413K4696j382K9992J9954q202Q038J4057J3001K3663
$$ 2128581 2158964 2157843 2187256 2211952 2210570 2240562 2260516 2252314 2260352 2274409 2287410 2311073
2996B311073J0715M0489K1071R888L5265J9740J6795M1322M8544J535K4541M942
$$ 2311073 2321788 2362277 2383348 2393236 2428501 2448241 2465036 2506358 2554902 2556437 2580978 2585920
2984B585920L2729K6941M2943O9220M324R2946N3325K9370L5096O2009N6377O5081
$$ 2585920 2618649 2645590 2688533 2757753 2762077 2855023 2908348 2937718 2972814 3034823 3091200 3156281
2972C156281M3416L5951O5661K5257L0153R6826Q5813O5224R9267Q3566J12490
$$ 3156281 3199697 3235648 3301309 3326566 3356719 3453545 3539358 3604582 3703849 3787415 3899905
2961C899905J41825J30528J37256J52855J24256M3669L5052r852N41K9448O4664
$$ 3899905 4041730 4172258 4309514 4462369 4586625 4630294 4665346 4655494 4656035 4685483 4750147
2950D750147M4922M9533Q7149P9291J20033J04277J15264J34465J00036Q8994
$$ 4750147 4795069 4844602 4931751 5011042 5131075 5235352 5350616 5485081 5585117 5674111
2940E674111J46298J09438J36933J56882J33834J60976J91693J66817K30026L01645
$$ 5674111 5820409 5929847 6066780 6223662 6357496 6518472 6710165 6876982 7107008 7408653
2930G408653K57013K60983K23875J99782J63048J57855K13885J90591K18737K83135
$$ 7408653 7665666 7926649 8150524 8350306 8513354 8671209 8885094 9075685 9294422 9577557
2920I577557L14372L28745L63061L94192L95221M45945M88028N51262O05879O16802
$$ 9577557 9891929 10220674 10583735 10977927 11373148 11819093 12307121 12858383 13464262 14081064
2910A4081064O87170P41926Q63822R11072J036968J115330J231551J303926J407132
$$ 14081064 14768234 15510160 16373982 17285054 18322022 19437352 20668903 21972829 23379961
2901B3379961J454742J447263J433859J322270J180013Q98346N00329K01540K0615
$$ 23379961 24834703 26281966 27715825 29038095 30218108 31116454 31616783 31818323 31838938
2892C1838938k3918m6679K1444Q7869J08907J48615J28004J19031J31225K04697
$$ 31838938 31815020 31768341 31789785 31877654 31986561 32135176 32263180 32382211 32513436 32718133
2882C2718133K95008L98495N66157P46885R11941J113036J281430J503471J886200
$$ 32718133 33013141 33411636 33977793 34724678 35636619 36749655 38031085 39534556 41420756
2873D1420756K407795K901745L403744L944640M169294L315614R04162k202795
$$ 41420756 43828551 46730296 50134040 54078680 58247974 61563588 62467750 60264955
2865F0264955m279461m846099m580832m021633l389349k827667k262890j814180
$$ 60264955 55985494 51139395 46558563 42536930 39147581 36319914 34057024 32242844
2857C2242844j408895j160425r55174q99158p87324o77954n67259m05771l03967
$$ 32242844 30833949 29673524 28718350 27819192 27031868 26353914 25786655 25380884 25076917
2848B5076917j66338k7381R8762J15557K03242L37454L58635M41722M38725L91803
$$ 25076917 24910579 24883198 24981960 25097517 25300759 25638213 25996848 26438570 26877295 27269098
2838B7269098K08571j33657n76154r72495j281632j468487j510348j445272j296558
$$ 27269098 27477669 27344012 26767858 25795363 24513731 23045244 21534896 20089624 18793066
2829A8793066j230543j107254r60442q25900p71260p61223o52933o35636o51598
$$ 18793066 17562523 16455269 15494827 14668927 13897667 13136444 12483511 11847875 11196277
2820A1196277n77288n42003n45351m90856m09002l94618l84905m01080l39781
$$ 11196277 10618989 10076986 9531635 9040779 8631777 8237159 7852254 7451174 7111393
2811G111393l30486l05617k83109k48895k46508k08748j87491j71699j83829k08121
$$ 7111393 6780907 6475290 6192181 5943286 5696778 5488030 5300539 5128840 4945011 4736890
2801D736890j43482j31916j35636j66009j13372j22911j69728j01671j12495j33330
$$ 4736890 4593408 4461492 4325856 4159847 4046475 3923564 3753836 3652165 3539670 3406340
2791C406340j02760q7734p3064q3807p1895p7229j25860j09825p7652m9443r6467
$$ 3406340 3303580 3215846 3142782 3058975 2987080 2909851 2783991 2674166 2596514 2547071 2450604
2780B450604p2130m4505p0880q3113m9941j6091p1477q4117k8493n1126o2920
$$ 2450604 2378474 2333969 2263089 2179976 2130035 2113944 2042467 1958350 1929857 1878731 1815811
2769A815811k5895m5541k7653l2740m8496m4206j5551k7350n9095j6575n7392
$$ 1815811 1789916 1744375 1716722 1683982 1635486 1591280 1575729 1548379 1489284 1472709 1415317
2758A415317n4511m2022k9235k2853j4026k3008k3496N361l5573k7122k3631j8452
$$ 1415317 1360806 1318784 1289549 1266696 1252670 1229662 1206166 1211527 1175954 1148832 1125201 1106749
2746A106749l9793m2340r797l3374k8169k0319k0152j9397l647j90k9143l8267
$$ 1106749 1066956 1024616 1014819 981445 953276 932957 912805 893408 889761 889571 860428 822161
2734H22161k0815r322j1870q427k5718K3231l8690k3456l0384J500n742l700J4360
$$ 822161 801346 792024 780154 771727 746009 769240 730550 707094 676710 678210 672468 668768 683128
2721F83128m44J2324j954k6750j7333J2362Q30k4504k9811J3789k2730J257j541
$$ 683128 682684 695008 693054 666304 648971 661333 662163 637659 607848 621637 598907 600164 598623
2708E98623O205k0802j1852j7820J3300j5511j0216J1465j5821j1801j3285K0436
$$ 598623 604828 584026 572174 554354 567654 552143 541927 553392 537571 525770 512485 532921
2696E32921J9995J1383m0423j2477J5214k593J1947R117k890j9183m7220j1602
$$ 532921 552916 564299 523876 511399 526613 524020 535967 545084 542194 523011 475791 464189
2684D64189K5311k8199R734k985K506M6657j1955l0140O687l9255j1731J5878
$$ 464189 489500 461301 471035 468050 470556 517213 505258 475118 481805 442550 430819 446697
2672D46697r520l0127R904J3143m967k7349R328J4306m220M768o863J3568l2695
$$ 446697 437177 407050 416954 430097 425130 397781 407109 421415 417195 421963 415100 428668 395973
2659C95973p536O121K9641k3151L7244l70k2128l2961o154K2141p416N855n690
$$ 395973 388437 394558 424199 401048 438292 437922 415794 382833 376679 398820 391404 397259 391569
2646C91569j2513j9045m105j4672j6591K2348Q090o777p682o193K2749K4670J439
$$ 391569 379056 360011 355906 341234 324643 346991 355081 348304 340622 334429 357178 381848 383287
2633C83287j677r705j5393K0304o25j1552k0734M175j5547N671O695M257J3307
$$ 383287 381610 371905 356512 376816 376191 364639 343905 348080 332533 338204 344899 349156 362463
2620C62463N856j6417O744o063J7480J0153n503J6959j3550K3631j437k723J0670
$$ 362463 368319 351902 358646 352583 370063 380216 374713 391672 378122 401753 400316 397593 408263
2607D08263k0203m281K5088O562L8663j441j0695k1922k0530r838k4087j1827
$$ 408263 388060 383779 408867 415429 454092 452651 441956 420034 399504 389666 365579 353752
2595C53752J8630L7797J7641J1834J9654l327J9292J092L5665J1453N481P985
$$ 353752 372382 410179 427820 439654 459308 455981 475273 476365 512030 523483 528964 536949
2583E36949j382N441m2636k5939j737l3501L172n0129l2144J3802k6606J2592
$$ 536949 535567 541008 498372 472433 470696 437195 440367 390238 358094 371896 345290 357882
2571C57882l8718j696R21J0612J3535l5934k049q084m167J2916m7411M1156O796
$$ 357882 319164 317468 318389 329001 342536 306602 304553 296469 292302 305218 257807 298963 305759
2558C05759P55J4871J1411m2764J3318L8398J4995q552j4018j3410o272M987m9018
$$ 305759 306514 321385 332796 290032 303350 341748 356743 348191 334173 320763 314491 319478 270460
2545B70460l6834J756K1554k7709l5404J8907o13j6528l25Q900J304j6564n972
$$ 270460 233626 235382 256936 229227 193823 212730 212117 195589 195264 204164 205468 188904 182932
2532A82932l080J6154j81J5980l0766J0705K4845k6522j9267j4451J1231J2881
$$ 182932 179852 196006 195825 211805 181039 191744 216589 190067 170800 156349 167580 180461
2520A80461K4009J5321l5066j1101L428l2030J009P064k1634N0271Q617l5429
$$ 180461 204470 219791 184725 173624 177052 145022 146031 153095 131461 181732 190349 154920
2508A54920Q837j1622j6099L932l429K3344j2723J0922J4559k8251j0916J7917
$$ 154920 163757 152135 136036 139968 136539 159883 147160 158082 172641 144390 133474 151391
2496A51391j8931j579K9688j8826l4385l0769R768M2755L2330k6708j5692k2251
$$ 151391 132460 130881 160569 141743 107358 76589 86357 129112 161442 134734 119042 96791
2484I6791m76M9667L7723j8076j5541q522q361o212M673J2326j3962Q728j2973
$$ 96791 96315 145982 183705 165629 150088 141566 133205 126993 131666 143992 130030 138758 125785
2471A25785r434K160p288k5050l922J4522J0534k3875l5655O852K4080j2973j7220
$$ 125785 116351 118511 111223 86173 82251 96773 107307 83432 47777 54629 78709 65736 48516
2458D8516K5165O293k3764k1249K9636J7498M819j9779K6381r975q415P435k7237
$$ 48516 73681 79974 56210 34961 64597 82095 86914 67135 93516 83541 75126 82561 55324
2445E5324j7596L2970J0435l7788P111o904J542J894P155N507J3152P975j9268
$$ 55324 37728 70698 81133 43345 50456 43552 45094 46988 54143 59650 72802 80777 61509
2432F1509J8481O396r478q677M440l1268l815J950j3622J0670L425J509L0297
$$ 61509 79990 86386 76908 68231 72671 41403 37588 39538 25916 36586 40011 41520 71817
2419G1817K3639l7796Q649N216J5488n2255J7619R391M074l0815J4675J0564j8639
$$ 71817 95456 57660 66309 71525 87013 34758 52377 61768 65842 35027 49702 60266 41627
2406D1627Q154k1509o108k0011n769M823q027J27J4695l859J8547J6077J1485
$$ 41627 49781 28272 22164 2153 -3616 1207 -6820 -6693 8002 4143 22690 38767 50252
2393E0252K072K0771r649n121M81K268l7887k5857J9109o485R092K248K1553k0921
$$ 50252 52324 73095 63446 58325 58806 61074 23187 -2670 16439 9954 19046 21294 42847 21926
2379B1926k294j0204K4280j0494k5651L9803r279N064K060R047k4051p675k0749
$$ 21926 19632 9428 33708 23214 -2437 37366 28087 33151 35211 44258 20207 12532 -8217
2366h217J6399J015L9374l2378J2859L5150N450l062k1680j2578q520J1430N374
$$ -8217 8182 9197 48571 16193 29052 64202 69652 66590 44910 32332 23812 35242 40616
2353D0616M957l9333K2916j3247j3812j0185J1378J1456R155J1742J2892j0172
$$ 40616 45573 6240 29156 15909 2097 -8088 3290 14746 23901 35643 48535 38363
2341C8363N941l0179l677M3193P357K307j3288j7916K0397P264j6603k0323m669
$$ 38363 44304 14125 10448 53641 60998 63305 50017 32101 52498 59762 43159 22836 18167
2328A8167K0946k6932n418Q924L7220N193k1025m0700K4940J715K4375j3889j8095
$$ 18167 39113 12181 6763 15687 52907 58100 37075 -3625 21315 23030 47405 33516 15421
2315A5421l1380k4166L16L2082K0965J6678R164m583L2940j8605j5136N201J383
$$ 15421 -15959 -40125 -39809 -7727 13238 29916 39080 34497 67437 48832 33696 38897 40280
2302D0280k9698J95N632j0877J606L4415n138o765K2620j9538q005m613J8268
$$ 40280 10582 10777 16409 5532 7138 41553 36415 29650 52270 32732 24727 20114 38382
2289C8382K4197k7267l7228m839L0510j4761j0495Q580K7155k9181j0650j244
$$ 38382 62579 35312 -1916 -6755 23755 8994 -1501 7079 34234 5053 -5597 -6841
2277f841K2876K0221K679k8670J6769q236j6120J1571M218l1426j652k3714R029
$$ -6841 16035 36256 38935 10265 27034 18798 2678 14249 18467 -12959 -14611 -38325 -29296
2264b9296L7399O638n923J3424J7256J5698P957j8655l914l9414j2847K6005p558
$$ -29296 8103 14741 8818 22242 39498 55196 63153 44498 40584 1170 -11677 14328 6770
2251F770q412K1022p767O723J0260k7981R285J0739l5301k8339J0045K1896K7492
$$ 6770 -1642 19380 11613 18336 28596 615 9900 20639 -14662 -43001 -32956 -11060 16432
2238A6432r30k253L7600k1828l2073k5065O459K370J6340K3950J9794j2326P7
$$ 16432 15502 13249 50849 29021 -3052 -28117 -21658 -19288 -2948 21002 40796 28470 28547
2225B8547P967L71j1321L2068k147k5828N915n7112P89J25Q279L8196p42p550
$$ 28547 36514 36885 25564 57632 55485 29657 35572 -21540 -20751 -20626 -12347 25849 25107 17557
2211A7557l708L530J5852j5345m137L7773q530l9252l021M0222O891K4504j7940
$$ 17557 13849 17379 33231 17886 13749 51522 42992 3740 719 40941 47832 72336 54396
2198E4396J5742k2410j0784k688j5049L4465l327l9727K2537j5212K653Q542M784
$$ 54396 70138 47728 36944 34256 19207 53672 50345 10618 33155 17943 20596 29138 33922
2185C3922k155k2518R263j5449m350K5095L7555L3335k7020k0192q195k777L7871
$$ 33922 31767 9249 18512 3063 -1287 23808 61363 94698 67678 47486 39291 36514 74385
2172G4385j8451p059m001R655m7328q466J9625J5743K1074K5105j3705n735L827
$$ 74385 55934 48875 44874 54529 7201 -1265 18360 34103 55177 80282 66577 60842 64669
2159F4669k2350p50N492K2315O983J5618K187K9648j8147k80J3000o1666J2159
$$ 64669 42319 41569 47061 69376 76359 91977 94164 123812 105665 105385 118385 56719 68878
2146F8878K6912R199K6671j5417K0846K6799q963j2281o788n0226l979M0483J9
$$ 68878 95790 104989 131660 116243 137089 163888 154925 142644 135856 85630 81651 122134 122153
2133A22153J0120o577K2740j1696K894J9356K4261R608n517j955l328j2160O928
$$ 122153 132273 125696 148436 136740 139634 158990 183251 192859 187342 185387 182059 169899 176827
2120A76827k7028j9389R866O742L0657J5639o43N1593q966J018J9077J2941P649
$$ 176827 149799 130410 140276 147018 177675 193314 192671 244264 235298 236316 255393 268334 275983
2107B75983J1547K0707k190L0047J1159l867L8605L4682J6140l643K6137J2391
$$ 275983 287530 308237 306047 336094 347253 343386 381991 416673 432813 429170 455307 467698
2095D67698R425J1224J7965L6493N6901L3566K2456N5557L9934K0947M3450Q2324
$$ 467698 477123 488347 506312 542805 599706 633272 655728 711285 751219 772166 815616 897940
2083H97940L1689N2754J06143P3958R6287P7770J64708J68765J99774K32528K87848
$$ 897940 929629 982383 1088526 1162484 1258771 1336541 1501249 1670014 1869788 2102316 2390164
2072B390164L90014M63320N76751O69617R00954Q71976N09653m42735j017403
$$ 2390164 2780178 3243498 3820249 4489866 5390820 6262796 6772449 6329714 5312311
2063E312311j048299q05722n81159m25495l28336l05799k53454j20548j03661
$$ 5312311 4264012 3458290 2877131 2451636 2123300 1817501 1564047 1443499 1339838
2054A339838p4846p3967p6549o4657o6491q8701o9995m8854q2024l9767n1015
$$ 1339838 1264992 1191025 1114476 1049819 983328 894627 824632 775778 693754 653987 602972
2043F02972l5406m8973n4105J7618j2465p9505j216j4193j7516k5375R623k760
$$ 602972 567566 518593 464488 482106 469641 390136 388920 374727 357211 331836 341459 338699
2031C38699k2481k2166j1481L721J4917l030r553j9643j1746J514l4735j8627
$$ 338699 316218 294052 282571 286292 301209 298179 288626 268983 257237 258751 224016 205389
2019B05389P636j9253j3775l2091J817n967L900o218j9051M159P50j3742k9782
$$ 205389 213025 193772 179997 147906 149723 143756 147656 141438 122387 126546 127296 113554 83772
2006H3772R241J4436m276R978O310L4706q775j6100p290k5435m6265j6345K6000
$$ 83772 93013 107449 103173 113151 119461 154167 145392 129292 122002 96567 50302 33957 59957
1993E9957M423J4989J6766k8988k8925J9660J1621o735l6619K276L4144Q447l4020
$$ 59957 64380 79369 96135 67147 38222 57882 69503 62768 26149 28425 62569 71016 36996
1980C6996J4069o436o845p306Q910O695k4270O862R906j7798K2215m075o772n545
$$ 36996 51065 44629 37784 30478 39388 46083 21813 28675 38581 20783 42998 38923 32151 26606
1966B6606o673L1290j683j5376j7328j506M001J7245k6569P862o488N290j3860
$$ 26606 19933 51223 49540 34164 16836 15330 19331 36576 10007 17869 11381 16671 2811
1953B811M930K7k7472k1838P593J7194j6289M443j3271k3113L3380L837p983L3634
$$ 2811 7741 7768 -19704 -41542 -33949 -16755 -33044 -28601 -41872 -64985 -31605 -27768 -35751 -2117
1939b117J3213j2523J2699P869J0249r268J5075p60N07l043n6711M782J456J1454
$$ -2117 11096 -1427 11272 19141 29390 20122 35197 34437 34944 31901 -24810 -20028 -18572 -7118
1925g118P648K3222k2208k1238M557j0918K6512l23l0838J5467N225k1727M321
$$ -7118 530 23752 1544 -19694 -15137 -26055 457 134 -30704 -15237 -10012 -31739 -27418
1912b7418K696k208J0581k1900O279j2989K2547r951J2179j6336j1272K9159P278
$$ -27418 -24722 -26930 -16349 -38249 -31970 -44959 -22412 -32363 -20184 -36520 -47792 -18633 -11355
1899a1355l1967K4142J053l6750K9091J0670K6984o059k2315J4547K6044k1239
$$ -11355 -43322 -19180 -18127 -54877 -25786 -15116 11868 5809 -16506 -1959 24085 2846
1887B846N20j828N012l9425N887J3614r266M430K484N208p807J601k0896j0051
$$ 2846 3366 1538 6550 -32875 -26988 -13374 -22640 -18210 -15726 -10518 -18325 -16724 -37620 -47671
1873d7671K8385n119M882j3657J4365j3442j2988K9904J7417j592p959M039m3288
$$ -47671 -19286 -24405 -19523 -33180 -18815 -32257 -45245 -15341 2076 484 -7475 -3436 -46724
1860d6724L7222J8117j0459k0975J3768q603j8236N048J1786o024L367o919l5002
$$ -46724 -9502 8615 -1844 -22819 -9051 -17654 -35890 -30842 -19056 -25080 -21713 -28632 -63634
1847f3634O328J9207K5074J6199j8985j9493j6548K1045J3394P647M9594k9583
$$ -63634 -57306 -38099 -13025 3174 -15811 -35304 -51852 -30807 -17413 -9766 39828 10245
1835A0245j0163l0408l028M822p073L7742q272j6802M704K2350P317k7742n8O793
$$ 10245 82 -30326 -33354 -28532 -35605 2137 -6135 -22937 -18233 4117 11434 -16308 -16366 -9573
1821i573j6251m0K829L840K5578J9939N460r235o364r250K3156K9769j9247k5479
$$ -9573 -25824 -25864 -23035 -19195 6383 26322 31782 22547 16183 6933 30089 59858 40611 15132
1807A5132k790k3647o839j158j2743M7880J9851j0955K0943l7987K984L471J1923
$$ 15132 12342 -11305 -18144 -19302 -32045 15835 35686 24731 45674 7687 10671 14142 26065
1794B6065j4905o402k0741j1062Q627n760K2466j6701K829K1793q494l1659j7762
$$ 26065 11160 4758 -15983 -27045 -18418 -24178 -1712 -18413 -15584 6209 -2285 -33944 -51706
1781e1706O238J0803K6177r163j5286k018j7315k665J7360o476J8844j7866J7218
$$ -51706 -45468 -34665 -8488 -17651 -32937 -34955 -52270 -54935 -37575 -44051 -25207 -43073 -25855
1768b5855l792k9781o767m785P379K6991K2981l1247m267q547J2726J9986r177
$$ -25855 -29647 -59428 -66195 -70980 -63601 -36610 -13629 -44876 -49143 -57690 -44964 -24978 -34155
1755c4155r887J4395p204j5902L302J2767l4748J4579j916J5437J0010L0224k162
$$ -34155 -44042 -29647 -36851 -52753 -49451 -36684 -71432 -56853 -58769 -43332 -33322 -3098 -5260
1742e260J9106k938M861k1413j4404j1663K3379k5808k1588L4618M1867j203l3277
$$ -5260 13846 10908 15769 -5644 -20048 -31711 -8332 -34140 -55728 -21110 20757 19554 -13723
1729a3723l446j3363o396q882j5032K8508j6235q013J6282J4109M574m4797K949
$$ -13723 -17169 -30532 -36928 -45810 -60842 -32334 -48569 -56582 -40300 -26191 -21617 -66414 -63465
1716f3465p209J6201J1850K177K102Q823J177p622k0513K2798J4493j143J0197
$$ -63465 -70674 -54473 -42623 -40446 -38344 -29521 -28344 -35966 -56479 -33681 -19188 -20331 -10134
1703a0134j4301k0446j1849J0100J70j5026L8629L3475j837l1357j5370k7210
$$ -10134 -24435 -44881 -56730 -46630 -46460 -61486 -22857 10618 8781 -22576 -37946 -65156
1691f5156L6646J3991R404k8936N288j1657r339K7596r287j2629K6240O606l91
$$ -65156 -28510 -14519 -5115 -34051 -28763 -40420 -49759 -22163 -31450 -44079 -17839 -11233 -11624
1678a1624M782m24l349k6116K6436J4044l1480r426N741k111j3068j8281j3363
$$ -11624 -6842 -7266 -10615 -36731 -10295 3749 -27731 -37157 -31416 -33527 -46595 -64876 -78239
1665g8239K1749J6349p317M879l0152k170n52L9144L0411J0477j7576J7749k3158
$$ -78239 -56490 -40141 -47458 -42579 -72731 -74901 -75453 -36309 -5898 4579 -12997 4752 -18406
1652a8406k7028R877p92M1551l3182l931j4457K029K1037J5766J8496j2166q428
$$ -18406 -45434 -35557 -36349 5202 -27980 -31911 -46368 -44339 -23302 -7536 10960 -1206 -9634
1639i634r405m576q616l307l725N977L2964n498J121j6157k5322M836O733l5820
$$ -9634 -19039 -23615 -32231 -35538 -39263 -33286 -322 -5820 -4699 -20856 -46178 -41342 -34609 -70429
1625g0429j579J6465J3991K0692j3582k7618O600J1875r83K5595k0354j233k4341
$$ -70429 -72008 -55543 -41552 -20860 -34442 -62060 -55460 -43585 -44568 -18973 -39327 -40560 -64901
1612f4901R821N3342j5556k8494L477J5358J4347j4874l690J4542j617k3611m976
$$ -64901 -55080 -1738 -17294 -45788 -42311 -26953 -12606 -27480 -31170 -16628 -18245 -41856 -46832
1599d6832J3752K7680k8719J4332r431L689j5567J9983J0918l5056p538J2751
$$ -46832 -33080 -5400 -34119 -19787 -29218 -25529 -41096 -21113 -10195 -45251 -52789 -40038
1587d0038J8142k0010m855K0715k6267q64K5773J1636q036j6077J7711j0199J7844
$$ -40038 -21896 -41906 -46761 -26046 -52313 -53177 -27404 -15768 -23804 -39881 -22170 -32369 -14525
1574a4525M638j8368L0987k417l2150L0144l237q050l4269J7656K6523j0435k44
$$ -14525 -9887 -28255 2732 315 -31835 -1691 -4928 -12978 -47247 -29591 -3068 -13503 -13747
1561a3747k1889J292J0995q981J9231L7283n914k9142J021q116J1215r045l5331
$$ -13747 -35636 -34344 -23349 -32330 -13099 24184 18270 -10872 -9851 -17967 -6752 -15797 -51128
1548e1128O257o54n259J2534J6631J8002j9812Q354j3833L202R41k9491K700J4315
$$ -51128 -44871 -45525 -50784 -38250 -21619 -3617 -23429 -15075 -28908 -25706 -24765 -54256 -51556 -37241
1534c7241k7382K5785K6532j1509l924l022K8725M989j5436m0157j7760N845K8080
$$ -37241 -64623 -38838 -12306 -23815 -27739 -30761 -2036 2953 -12483 -52640 -70400 -64555 -36475
1521c6475j4140N605j0766Q552K2849K2905J2937m361l4709j1745j4250n136K4645
$$ -36475 -50615 -45010 -55776 -47224 -24375 -1470 11467 7106 -27603 -39348 -53598 -58734 -34089
1508c4089m630K7740M361J1950j7056K6670r449k5301K218p797j3406J3327J3667
$$ -34089 -38719 -10979 -6618 5332 -11724 14946 5497 -19804 -17586 -25383 -38789 -25462 -11795
1495a1795j3114k1282q618L8899l098J6996L5148j4111k3844j3187J1719k281
$$ -11795 -24909 -46191 -54809 -15910 -19008 -2012 33136 19025 -4819 -18006 -6287 -8568
1483h568J52k019k8240j0744K7338K0412L235O40l8487J7474J3914j4497p50q953
$$ -8568 -8416 -10435 -38675 -49419 -22081 -1669 1566 2206 -36281 -18807 -4893 -19390 -20140 -29093
1469b9093K642n10k057q653L556L5282j8158R974l294j1929N928M2213k9967n4196
$$ -29093 -26451 -26961 -29018 -37671 -34115 1167 -16991 -7017 -10311 -22240 -16312 25901 -4066 -58262
1455e8262K8472m155k3624O461M023j4786M0483J2252J7O504k5254j5674Q297
$$ -58262 -29790 -33945 -57569 -51108 -47085 -61871 -21388 -9136 -9119 -2615 -27869 -43543 -35246
1442c5246j113K9595k8816j7053J1095J6894L201p279l67o233L99j4041n546O11
$$ -35246 -36359 -6764 -35580 -52633 -41538 -24644 -21443 -28722 -29089 -35322 -34923 -48964 -54510 -53899
1428e3899J1107P959j6190L3375q174L143K3794j1785o501m3513L8431K5652l6070
$$ -53899 -42792 -34833 -51023 -17648 -25822 -22679 1115 -10670 -17171 -60684 -22253 3399 -32671
1415c2671M067K0924Q31m602j8467J3346J9789J4515l1404j6382j1324M921j519
$$ -32671 -28604 -7680 -6849 -11451 -29918 -16572 3217 17732 -13672 -30054 -41378 -36457 -37976
1402c7976L8189j1543M64O389J3526j1110m3767m83K7733k3265j1426J1243j262
$$ -37976 213 -11330 -10866 -4477 9049 -2061 -45828 -46311 -18578 -41843 -53269 -42026 -43288
1389d3288J0378j6099Q264j628J1438m0688k891L7272N07p293J8738M454M5200
$$ -43288 -32910 -49009 -40745 -42373 -30935 -71623 -74514 -37242 -36735 -44028 -25290 -20836 24364
1376B4364l2792N927k2154j7989M5036k2094n3273L9341P939R377j049j9601j3180
$$ 24364 -8428 -2501 -24655 -42644 2392 -19702 -72975 -33634 -25695 -16318 -17367 -36968 -50148
1363e0148P610L4896j0136o398K540R815j1681j203o796k596L430p278J3240k5654
$$ -50148 -42538 -7642 -17778 -24176 -21636 -11821 -23502 -24705 -31501 -34097 -30667 -37945 -24705 -50359
1349e0359L2465N589K237J8617k7799n241R282l4644q262M5253N196K0615j6930
$$ -50359 -17894 -12305 -10068 8549 -19250 -24491 -15209 -49853 -58115 -12862 -7666 12949 -3981
1336c981J8285m5701k5436K4363m934j279K7899O62j1043j1856J0383Q93J0729
$$ -3981 14304 -31397 -56833 -32470 -37404 -38683 -10784 -10122 -21165 -33021 -22638 -21745 -11016
1323a1016J0225j6262j6652j2690J8251K1976J0378k2924p881q165k0225J7647
$$ -11016 -791 -17053 -33705 -46395 -28144 -6168 4210 -18714 -26595 -34760 -54985 -37338
1311c7338K7207j8859L2403k7688k326N002r294L1332M903j3158l0168Q401M982
$$ -37338 -10131 -28990 3413 -24275 -26601 -21599 -30893 439 5342 -7816 -37984 -29583 -24601
1298b4601k913k016K7j7828K2525P447j1477j0647K6475l0368K8520j064j2802
$$ -24601 -27514 -29530 -29503 -47331 -24806 -17359 -28836 -39483 -13008 -43376 -14856 -15920 -28722
1285b8722m4O513J8905k749M441N884j0264Q107k2129p853M507j0899p408J6883
$$ -28722 -28766 -22253 -3348 -6097 -1656 4228 -6036 2071 -20058 -27911 -23404 -34303 -41711 -24828
1271b4828m1390k4775N5979M7927K8122k4861l1736M928p367l3646j0230K8224
$$ -24828 -66218 -90993 -35014 12913 41035 16174 -15562 -10634 -18001 -51647 -61877 -33653
1259c3653J8653l3525K2123J888K7784l7848q127K7735J7083k9577K0325P557
$$ -33653 -15000 -48525 -26402 -24514 3270 -34578 -42705 -14970 2113 -27464 -7139 418
1247D18n56J2170l806O915j3691l3311M350r548j4297R959L9051P659l6780k685
$$ 418 -138 12032 8226 15141 1450 -31861 -27511 -37059 -51356 -41397 -2346 5313 -31467 -34152
1233c4152L4311j1156j7408K4269j1098j4133K0847P58k9111J9757L1475k4482
$$ -34152 159 -10997 -28405 -4136 -15234 -29367 -8520 -7762 -36873 -17116 14359 -10123
1221a0123j9335K2395l5554O374J8936L329q793j5849J0325L3414l4940j5424
$$ -10123 -29458 -7063 -42617 -36243 -17307 -13978 -22771 -38620 -28295 5119 -29821 -45245
1209d5245l511j739P897j0163M3918J0808J6991k6614j4568K4133J3614j2420
$$ -45245 -48756 -50495 -42598 -52761 -8843 1965 18956 -7658 -22226 1907 15521 3101
1197C101j2118J8832q784k6339J6425j888m3168L2847K5041L303l5530j7909M3156
$$ 3101 -9017 9815 1031 -25308 -8883 -10771 -53939 -21092 3949 7252 -28278 -46187 -3031
1184c031K957J2713J0140k8563J3146k8490k6949O330K6457m556p722j312Q046
$$ -3031 -74 12639 22779 -5784 7362 -21128 -48077 -41747 -15290 -19846 -27568 -28880 -20834
1171b0834J4908k7228j7243L0161L5534n949k14n086P266j8445j066j3428N901
$$ -20834 -5926 -33154 -50397 -20236 15298 9349 9135 4049 11315 -7130 -8196 -21624 -15723
1158a5723J3831L3980j8276k4764k2657L8236j623M612k2985N182J4309L472M032
$$ -15723 -1892 32088 13812 -10952 -33609 4627 3004 7616 -15369 -10187 4122 7594 11626
1145A1626m2176N622J0038K1546k6071K3873J2368q903j5188L861l2128k9125
$$ 11626 -30550 -24928 -14890 6656 -19415 4458 16826 7923 -7265 -3404 -35532 -64657
1133f4657O6015J7663m4477N301J7201k4961j0396K1803Q189l845l7027K9572
$$ -64657 1358 19021 -25456 -20155 -2954 -27915 -38311 -16508 -8319 -12164 -49191 -19619
1121a9619J404K2277J9712o787q498j4276r118K1812K0145k0137j9474j4017j9171
$$ -19619 -18215 4062 23774 16987 8489 -5787 -14905 6907 27052 6915 -12559 -26576 -45747
1108d5747J1291K8269o392j8228P715o997J3103M209N113J4721q850J4247j4047
$$ -45747 -34456 -6187 -12579 -30807 -23092 -30089 -16986 -12777 -7664 7057 -1793 12454 -1593
1095a593k4271k8846R835n651J8225O1252j1373k5025j3526Q099K8864l8725j1370
$$ -1593 -25864 -54710 -44875 -50526 -32301 28951 17578 -7447 -20973 -12874 15990 -22735 -34105
1082c4105K1815r969J9500j1580K2549o257k1102j0908J8685J0548N920P031j1670
$$ -34105 -12290 -22259 -2759 -14339 8210 1953 -19149 -30057 -11372 -824 5096 12127 457
1069D57k8886J8366p141q63K0655j0527J2068k2700N356J9012k2527j5758J3257
$$ 457 -28429 -10063 -17204 -18067 2588 -7939 4129 -18571 -13215 5797 -16730 -32488 -19231
1056a9231k33j9236j9060M9205R986o918j6673k1530J0688P009K1812O692J1641
$$ -19231 -19464 -38700 -57760 -8555 1431 -5487 -22160 -43690 -33002 -25993 -4181 2511 14152
1043A4152j5308l0921K6538j3931O309J2079k3309m255K9641O963k3105q001J2861
$$ 14152 -1156 -32077 -5539 -19470 -13161 -1082 -24391 -28646 995 7958 -15147 -23148 -10287
1030a0287K665j0309J457j7668j5152j209L9514K0356o895N765j7339J2160J6008
$$ -10287 -7622 -17931 -16474 -34142 -49294 -50503 -10989 9367 2472 8237 -9102 3058 19066
1017A9066j3912j3020N383j9238O482J1328K0330k2504O877k3695L0665j0188
$$ 19066 5154 -7866 -2483 -21721 -15239 -3911 16419 -6085 792 -22903 7762 -2426
1005b426r76K4859j7036o418J9340o381q749k4497l627K1674j7505K064j059K5319
$$ -2426 -3402 21457 4421 -1997 17343 10962 2213 -22284 -25911 -4237 -21742 -19678 -20737 4582
991D582J6033j2899n150j763O961j1928J3964K568J641o462j9784q043J5800L0254
$$ 4582 20615 7716 2566 803 7764 -4164 9800 12368 14009 7547 -12237 -20280 -4480 25774
977B5774m6668j446J2699J3266J4611R600l5036r686L6715l6325j5470J9531l5075
$$ 25774 -20894 -22340 -9641 3625 18236 27836 -7200 -16886 19829 -16496 -31966 -12435 -47510
964d7510K0119J9710L4792O566J4951j8611r551l0689J828J0702j3672k3993L7445
$$ -47510 -27391 -7681 27111 33677 48628 30017 20466 -10223 -8395 2307 -11365 -35358 2087
951B087N540j1218R516M21K595j7360K121j76j0476o484M9491j6421o313l192
$$ 2087 7627 -3591 5925 6346 8941 -8419 -6298 -6474 -16950 -23434 26057 9636 3323 131
937A31J5022j4680j5289r191J0285L9575k9621q052n185m466J6322K7008P202
$$ 131 15153 473 -14816 -24007 -13722 25853 -3768 -11820 -17005 -21471 -5149 21859 29061
924B9061l3067L483P708k6805j0627j61M9172M06j7323n515l0395k063J7743O590
$$ 29061 -4006 -523 7185 -19620 -30247 -30408 18764 19170 1847 -3668 -34063 -36126 -18383 -11793
910a1793J6030r21N556Q25P630J4102j6548k5805J3806K782K3747K309r785j7867
$$ -11793 4237 3316 8872 9697 17327 31429 14881 -10924 2882 5664 29411 31720 21935 4068
896D068L468l3225m3741L0574K5132n624J0256L7417k3470K0117k2149k679K9454
$$ 4068 7536 -25689 -69430 -38856 -13724 -19348 -9092 28325 4855 24972 2823 144 29598
883B9598j7658k91k4357k3826j928j1236O439R818J6953k192R465j4565p509J8280
$$ 29598 11940 11649 -12708 -36534 -38462 -49698 -43259 -33441 -16488 -18680 -9215 -23780 -31289 -13009
869a3009M9254k2978j0393J1720M462j2863j538L0419j5024j0881J9928j4413
$$ -13009 36245 13267 2874 14594 19056 6193 4655 35074 20050 9169 29097 14684
857A4684l1478O835J545k689K4191J1203j6278J3499J9783k1408l1407J1088J7224
$$ 14684 -16794 -9959 -8414 -11103 13088 24291 8013 21512 41295 19887 -11520 -432 16792
844A6792N615J3418p567k6832K0728j5047j7788M0936j1615p040j5091j7451N4782
$$ 16792 22407 35825 28258 1426 22154 7107 -10681 30255 18640 11600 -3491 -20942 33840
831C3840J4720k3927l6896o021N336r501l4723R258M2228r957J7594J3941p981
$$ 33840 48560 24633 -12263 -18284 -12948 -22449 -57172 -47914 -5686 -15643 1951 15892 7911
818G911j1137J6288J7775j6117m3677p475L1230k76k739L992K0969K0051L1202
$$ 7911 -3226 13062 30837 14720 -28957 -36432 -5202 -5478 -8217 -4225 16744 36795 67997
805F7997m3090l1020K8949j9560j4099l1228J5465J3597o841N736M868L941O884
$$ 67997 24907 -6113 22836 3276 -10823 -42051 -26586 -12989 -19830 -14094 -9226 -5285 1599
792A599q738M460J5069Q481k2936J5930J9770j6986J908J6982J5245l1265K803
$$ 1599 -7139 -2679 12390 20871 -2065 13865 33635 16649 18557 35539 50784 19519 22322
779B2322o989j6869J6104Q338k225N033k536k0748J0541K8605O123k431J370k8632
$$ 22322 15333 -1536 14568 22906 20681 25714 23178 2430 12971 41576 47699 45268 46638 18006
765A8006M647P873K3246m2063N645N739O834O670l693k338j3759r077m848K1234
$$ 18006 22653 30526 53772 11709 17354 23093 29927 36597 32904 30566 16807 7730 2882 24116
751B4116j8608P033p717K2607j790J2475j4650j5938O657J2581J6756j5494N635
$$ 24116 5508 12541 4824 27431 25641 38116 23466 7528 14185 26766 43522 28028 33663
738C3663k6810R659J9802N517p713j0458K4658j2934j7043j8579l795K4726J4966
$$ 33663 6853 16512 36314 41831 34118 23660 48318 35384 18341 -238 -4033 20693 35659
725C5659j2614j2097k4591K8268r181m435l4937J1735N975K3159K5326J0058r899
$$ 35659 23045 10948 -13643 14625 5444 1009 -33928 -22193 -16218 6941 32267 42325 32426
712C2426j9463J9551K1249j21j1937q016N978r817k9905k0356K7160K5192J362
$$ 32426 12963 32514 53763 53642 41705 33689 39667 29850 -55 -20411 6749 31941 33303
699C3303l1055q969j8349j910q881L5568n83k435J8707L244k687j3237J7993l0859
$$ 33303 2248 -6721 -25070 -26980 -35861 -293 -876 -3311 15396 18640 15953 2716 20709 -10150
685a0150J7029J1337R903Q387j4123J9639R300m575q665N894j3568k059j998J263
$$ -10150 6879 18216 28119 36506 22383 42022 51322 46747 38082 43976 30408 28349 26351 27614
671B7614M421P22o337p485K5803k7022j6796j6565Q981j9530J1325j5178J1092
$$ 27614 32035 32757 26420 18935 44738 17716 920 -15645 -6664 -26194 -14869 -30047 -18955
658a8955p040K5711Q445n876K97J5641J519K6992p814K0809j1049k5342m541j2398
$$ -18955 -25995 -284 8161 2285 2582 18223 19742 46734 38920 59729 48680 23338 18797 6399
644F399j5343J7311L0185J8431j490k760j1368J6391o1304Q759O014j7438J9018
$$ 6399 -8944 8367 38552 56983 55493 52733 41365 57756 -3548 5211 11225 -6213 12805
631A2805j2686K1539l5270J3647J2489J521J0718K571q961J0736l8974O771O805
$$ 12805 119 21658 -13612 35 12524 14045 24763 27334 18373 29109 -9865 -3094 3711
618C711L9648k0967j1207J9504p457J2627j6336l3464O422K1805L559K9412k4821
$$ 3711 43359 22392 11185 30689 23232 35859 19523 -13941 -7519 14286 17845 47257 22436
605B2436q043k2858l881j5245K5827K1879j171M0493J9793n1287n211J8815k779
$$ 22436 14393 -8465 -12346 -27591 -1764 20115 18944 59437 79230 27943 22732 41547 38768
592C8768q484l3141J6480O971o511j3022M191J7383j353p808J273r627P510J6100
$$ 38768 30284 -2857 13623 20594 14083 1061 5252 22635 21282 13474 14747 5120 12630 28730
578B8730J0042K3906l6387q699L1467k6520l4891K5392J6587j9527Q302k6529
$$ 28730 38772 62678 26291 17592 49059 22539 -12352 13040 29627 10100 18402 -8127
566h127O1304j0544q002n261j493k2152J4875N029K6150J0761R826j096j2092
$$ -8127 53177 42633 34631 29370 27877 5725 20600 25629 51779 62540 72366 71270 59178
553E9178j2294J385J0446l0747J0174P233j2964l81k2099M9502j1057j0214j0791
$$ 59178 46884 48269 58715 27968 38142 45375 32411 32030 9931 59433 48376 38162 27371
540B7371J4239R284O544j7253K481k383m5733K4360K2649P688k2330K3917J1298
$$ 27371 41610 50894 57438 40185 42666 40283 -5450 18910 41559 49247 26917 50834 62132
527F2132j9586L571k5121R545M9557j3775j6864k8426j1633k3265M960K2854m958
$$ 62132 42546 46117 20996 30541 80098 66323 49459 21033 9400 -13865 -8905 13949 8991
514H991k3226L8368k0629K5733j0782M351o442l274k516J1044J020o252K0930
$$ 8991 -14235 24133 3504 29237 18455 22806 16364 13090 10574 21618 22638 16386 37316
501C7316K4736j860k1058k0989o117r366L5559Q762m3965P099M1228j0983L7593
$$ 37316 62052 60192 39134 18145 12028 2662 38221 46983 3018 10117 51345 40362 77955
488G7955j0436j1745J7970j053J976j8806O535k0135J2083K1307l9967k4470l034
$$ 77955 67519 55774 73744 72691 74667 55861 62396 42261 54344 75651 35684 11214 8180
475H180J2678J4191n412J4845k0178j5414j2362M8174j0507k5992K8674R189J5394
$$ 8180 20858 35049 29637 44482 24304 8890 -3472 44702 34195 8203 36877 46066 61460
462F1460J3552j7197K8848j1956j3347Q637j3028k1042R135L2054k4388l9939
$$ 61460 75012 57815 86663 74707 61360 69997 56969 35927 45062 77116 52728 12789
450A2789J1034L4508K1784n5227M654j8458n423M5798N683j858k9975L099J0211
$$ 12789 23823 58331 80115 24888 29542 11084 5661 51459 57142 55284 25309 28408 38619
437C8619M287k4445K1755o009K2480j4425k4272k973n71K5850N879J7524J236
$$ 38619 42906 18461 40216 34207 56687 42262 17990 15017 14446 40296 46175 63699 64935
424F4935l0951p109Q011j6719L462n199K9304J1133l129k5520R079K4621K3075
$$ 64935 33984 26875 34886 18167 21629 16430 45734 56867 53738 28218 37297 61918 84993
411H4993k8610k8707O089R377L0685J7098p927l1077j6693j8828J7481K7470J4183
$$ 84993 56383 27676 33765 43142 73827 90925 82998 51921 35228 16400 33881 61351 75534
398G5534k8753j4817l895J729K3881l3395J3165K1609P415k5367p31k5753o069
$$ 75534 46781 31964 28069 29798 53679 20284 33449 55058 62473 37106 36375 10622 4553
385D553L8166j8733P894J0018J41K5619N236j8543Q386j7189j0208k463N987J091
$$ 4553 42719 23986 31880 41898 42039 67658 72894 54351 62737 45548 35340 32877 38864 39955
371C9955L280n281J1455L6850j1043k6675n044p462Q541l7535M9127k0902K4620
$$ 39955 43235 37954 49409 86259 75216 48541 43497 36035 44576 7041 56168 35266 59886
358E9886J2602j1695n4749k3465N6449k8649J0003L4183J5291k0603j0278k6066
$$ 59886 72488 60793 6044 -17421 39028 10379 20382 54565 69856 49253 38975 12909
346A2909q218J0503J7141o738L2866K3858J1658p909r762k1550k4110n682N621
$$ 12909 4691 15194 32335 25597 58463 82321 93979 86070 76308 54758 30648 24966 30587
333C0587J9254p16N98J384r29J1690m243M5907m9839j1058K5617P33n487J3029
$$ 30587 49841 49125 49723 51107 50178 61868 57625 103532 53693 42635 68252 68985 63498 76527
319G6527J4564j3645k9495Q770p684j8007K4910L857J2076l0173K1213j925m101
$$ 76527 91091 77446 47951 56721 49037 31030 55940 59797 71873 41700 62913 60988 56887
306E6887o69k9260j4256L1667J4784J0019l013J575L1388k3357j7074m490J639
$$ 56887 56218 26958 12702 44369 59153 69172 66159 67734 99122 75765 58691 54201 55840
293E5840J148r314j7746J976J7335K4854j2601j5434k6965P199J8959l5385K4031
$$ 55840 56988 47674 29928 31904 49239 74093 61492 46058 19093 26292 45251 9866 33897
280C3897K2914j3532K0100r919k8803M444J6325r163j521m56k9150N4950J6156
$$ 33897 56811 43279 63379 53460 24657 29101 45426 36263 34742 34286 5136 60086 76242
267G6242l5387k2861J8587m014L989J4534J7959k6637k1683L5465l4852j0527
$$ 76242 40855 17994 36581 32567 36556 51090 69049 42412 20729 56194 21342 10815
255A0815J2410j7614R295P606J191K3648J6586l7873n666L2199j9218j6226M713
$$ 10815 23225 5611 14906 22512 23703 47351 63937 26064 20398 52597 33379 17153 21866
242B1866k2860J1379m66L8028j2480j6114L9694J7729j1058k2214K2388l6892
$$ 21866 -994 10385 9919 47947 35467 19353 59047 76776 65718 43504 65892 29000
230B9000j8596P77K2489K235K2185J7184l8660j0410J8084p687Q220Q267j7088
$$ 29000 10404 11181 33670 35905 58090 75274 36614 26204 44288 36601 44821 53088 36000
217C6000o594J5781J8473p394l60J7802K3401j3603n2521n68L2365p153L068p67
$$ 36000 29406 45187 63660 56266 55906 73708 97109 83506 30985 30417 62782 55629 58697 57930
203E7930K603J2476m907J588j4503m292K5248O004j299j9529n260o02j9951j2380
$$ 57930 60533 73009 68102 69690 55187 50895 76143 82147 80848 61319 56059 55457 35506 23126
189B3126J2335L3202P642l3976K7039Q82K65J1430m131k2157J1875j6631j9383
$$ 23126 35461 68663 76305 42329 69368 70250 70515 81945 77814 55657 67532 50901 31518
176C1518J08m415P315K54K6183j8187p194N46j1402j0937L8673R119k5499K3087
$$ 31518 31626 27211 34526 34780 60963 42776 35582 36128 24726 13789 52462 61581 36082 59169
162E9169o616k0648K6563M206l659j2743k0764j0855L9377k0967j4385K7888L2742
$$ 59169 52553 31905 58468 62674 59015 46272 25508 14653 54030 33063 18678 46566 79308
149G9308j0279M695j9412J2832K393J3406o270j1009J1202J615m3287j316K8536
$$ 79308 69029 73724 54312 67144 69537 82943 76673 65664 76866 78481 35194 33878 62414
136F2414J5000Q474k6050n212L391j2460o377j8264N723J5388k1342J0796o12
$$ 62414 77414 85888 59838 54626 58017 45557 39180 20916 26639 42027 20685 31481 30869
123C0869j0012j310J6017j0458K4440L307R972j8621J326n823J1972j346r217
$$ 30869 20857 19547 35564 25106 49546 52853 62825 44204 45530 39707 51679 50333 41116
$$ [...]
##END NTUPLES=NMR SPECTRUM
##END=
