##TITLE=1H_CA-9194-3
 CDCl3
 8 sc, 
 6.9.2023
##JCAMPDX= 6.0         $$ Bruker NMR JCAMP-DX V2.0
##DATA TYPE= NMR SPECTRUM
##DATA CLASS= NTUPLES
##ORIGIN= UXNMR, Bruker Analytische Messtechnik GmbH
##OWNER= root
$$ XWIN-NMR		Version 3.5
$$ Wed Sep  6 15:47:36 2023 Russian Standard Time (UT+4h)  she@DPX200
##.OBSERVE FREQUENCY= 200.13135
##.OBSERVE NUCLEUS= ^1H
##.ACQUISITION MODE= SIMULTANEOUS
##.ACQUISITION SCHEME= undefined
##.AVERAGES= 8
##.DIGITISER RES= 18
##SPECTROMETER/DATA SYSTEM= spect
##.PULSE SEQUENCE= zg30
##.SOLVENT NAME= CDCl3
##.SHIFT REFERENCE= (INTERNAL, CDCl3, 0, 15.7193)
##AUDIT TRAIL= $$ (NUMBER, WHEN, WHO, WHERE, WHAT)
$$ ##TITLE= Audit trail, XWIN-NMR		Version 3.5
$$ ##JCAMPDX= 5.01
$$ ##ORIGIN= Bruker BioSpin GmbH
$$ ##OWNER= she
$$ F:/spectra/data/she/nmr/H-F/1/pdata/1/auditp.txt
$$ ##AUDIT TRAIL=  $$ (NUMBER, WHEN, WHO, WHERE, WHAT)
(   1,<2023-09-06 15:45:23.48 +0400>,<she>,<DPX200>,
      <created by zg, POWCHK disabled, PULCHK disabled
       configuration hash MD5:
       00 E9 B6 7A A2 85 ED C7 34 08 36 98 17 FE 4E 26
       data hash MD5: 16K
       FC 8B C7 4C 05 13 4E 66 34 31 4E 0C 29 58 FF 25>)
(   2,<2023-09-06 15:45:31.76 +0400>,<she>,<DPX200>,
      <Start of raw data processing
       efp BC_mod = 2 LB = 0.24 FT_mod = 6 PKNL = 1 PHC0 = -21048.32 PHC1 = 18.85271 SI = 16K 
       data hash MD5: 16K
       39 C7 03 DE 42 1B 9E A3 AE 14 4F 70 44 00 D0 72>)
(   3,<2023-09-06 15:45:48.84 +0400>,<she>,<DPX200>,
      <pk PHC0 = -156.3754 PHC1 = -0.2 
       data hash MD5: 16K
       E3 4F 6C FE 2C E6 18 2B 8C 3C A8 D7 D3 74 9A 6C>)
(   4,<2023-09-06 15:45:52.29 +0400>,<she>,<DPX200>,
      <abs ABSG = 5 
       data hash MD5: 16K
       5B E9 68 3B 0E DF EE 1D 26 96 7C 1A 32 35 30 07>)
(   5,<2023-09-06 15:46:10.82 +0400>,<she>,<DPX200>,
      <pk PHC0 = 3.908735 PHC1 = -5.2 
       data hash MD5: 16K
       CC 8F 7C 43 89 EF D8 44 23 26 DC AE 92 62 6A 68>)
(   6,<2023-09-06 15:46:14.67 +0400>,<she>,<DPX200>,
      <abs ABSG = 5 
       data hash MD5: 16K
       8C 50 2F 6B F7 2B 2B 58 61 EB 4A D6 72 E4 E0 1C>)
(   7,<2023-09-06 15:46:29.67 +0400>,<she>,<DPX200>,
      <pk PHC0 = -0.001094045 PHC1 = -1.490116e-08 
       data hash MD5: 16K
       91 E9 05 EF 1F 52 EA 1F 0F 56 84 70 34 1C CE 1C>)
(   8,<2023-09-06 15:46:33.53 +0400>,<she>,<DPX200>,
      <abs ABSG = 5 
       data hash MD5: 16K
       CF 33 85 A6 28 B9 77 65 1C 00 27 EC 9F 35 5F B3>)
$$ ##END=
$$ 
$$ hash MD5
$$ 1B D9 FF 44 50 F3 BC EA 5E 37 11 9B BB 6B 79 C0
##$RELAX= 
##$RELAX= 
##$RELAX= 
##$RELAX= 
##$RELAX= 
##$RELAX= 
$$ Bruker specific parameters
$$ --------------------------
##$DU= <F:/spectra>
##$EXPNO= 1
##$NAME= <H-F>
##$PROCNO= 1
##$TYPE= <nmr>
##$USER= <she>
##$AMP= (0..31)
100 100 100 100 100 100 100 100 100 100 100 100 100 100 100 100 100 100 
100 100 100 100 100 100 100 100 100 100 100 100 100 100 
##$AQSEQ= 0
##$AQ_mod= 1
##$AUNM= <au_zg>
##$AUTOPOS= <>
##$BF1= 200.13
##$BF2= 200.13
##$BF3= 200.13
##$BF4= 200.13
##$BF5= 200.13
$$ [...]
##$SUBNAM3= <"">
##$SUBNAM4= <"">
##$SUBNAM5= <"">
##$SUBNAM6= <"">
##$SUBNAM7= <"">
##$SUBNAM8= <"">
##$SUBNAM9= <"">
##$SW= 18.05172834244
##$SWIBOX= (0..15)
0 0 2 0 0 0 0 0 0 0 0 0 0 0 0 0 
##$SW_h= 3612.71676300578
##$TD= 16384
##$TD0= 1
##$TE= 0
##$TE2= 300
##$TE3= 300
##$TEG= 300
##$TL= (0..7)
0 120 120 120 120 120 120 120 
##$TP= (0..7)
150 150 150 150 150 150 150 150 
##$TP07= 0
##$TPNAME0= <>
##$TPNAME1= <>
##$TPNAME2= <>
##$TPNAME3= <>
##$TPNAME4= <>
##$TPNAME5= <>
##$TPNAME6= <>
##$TPNAME7= <>
##$TPOAL= (0..7)
0.5 0.5 0.5 0.5 0.5 0.5 0.5 0.5 
##$TPOFFS= (0..7)
0 0 0 0 0 0 0 0 
##$TUNHIN= 0
##$TUNHOUT= 0
##$TUNXOUT= 0
##$USERA1= <user>
##$USERA2= <user>
##$USERA3= <user>
##$USERA4= <user>
##$USERA5= <user>
##$V9= 5
##$VALIST= <valist>
##$VCLIST= <CCCCCCCCCCCCCCC>
##$VD= 0
##$VDLIST= <DDDDDDDDDDDDDDD>
##$VPLIST= <PPPPPPPPPPPPPPP>
##$VTLIST= <TTTTTTTTTTTTTTT>
##$WBST= 1024
##$WBSW= 4
##$XGAIN= (0..3)
0 0 0 0 
##$XL= 0
##$YL= 0
##$YMAX_a= 342636
##$YMIN_a= -197475
##$ZGOPTNS= <>
##$ZL1= 120
##$ZL2= 120
##$ZL3= 120
##$ZL4= 120
##$ABSF1= 15.7535
##$ABSF2= -2.298349
##$ABSG= 5
##$ABSL= 3
##$ALPHA= 0
##$AQORDER= 0
##$ASSFAC= 0
##$ASSFACI= 0
##$ASSFACX= 0
##$ASSWID= 0
##$AUNMP= <proc_1d>
##$AZFE= 0.1
##$AZFW= 0.1
##$BCFW= 0
##$BC_mod= 2
##$BYTORDP= 0
##$COROFFS= 0
##$CY= -3
##$DATMOD= 1
##$DC= 0
##$DFILT= <>
##$DTYPP= 0
##$F1P= 0
##$F2P= 0
##$FCOR= 1
##$FTSIZE= 16384
##$FT_mod= 6
##$GAMMA= 0
##$GB= 0
##$INTBC= 1
##$INTSCL= 3.70164e-10
##$ISEN= 128
##$LB= 0.24
##$LEV0= 0
##$LPBIN= 0
##$MAXI= 10000
##$MC2= 0
##$MEAN= 0
##$ME_mod= 0
##$MI= 1.114404
##$NCOEF= 0
##$NC_proc= -7
##$NLEV= 6
##$NOISF1= 3.799351
##$NOISF2= 2.8
##$NSP= 0
##$NTH_PI= 0
##$NZP= 0
##$OFFSET= 15.71934
##$PC= 1
##$PHC0= -21200.79
##$PHC1= 13.45271
##$PH_mod= 1
##$PKNL= yes
##$PPARMOD= 0
##$PSCAL= 0
##$PSIGN= 0
##$REVERSE= no
##$SF= 200.130010446504
##$SI= 16384
##$SIGF1= 3
##$SIGF2= 2
##$SINO= 5.538805
##$SIOLD= 16384
##$SREGLST= <1H.CDCl3>
##$SSB= 0
##$STSI= 16384
##$STSR= 0
##$SW_p= 3612.71676300578
##$SYMM= 0
##$S_DEV= 0
##$TDeff= 16384
##$TDoff= 0
##$TI= <>
##$TILT= no
##$TM1= 0
##$TM2= 0
##$TOPLEV= 0
##$USERP1= <user>
##$USERP2= <user>
##$USERP3= <user>
##$USERP4= <user>
##$USERP5= <user>
##$WDW= 1
##$XDIM= 16384
##$YMAX_p= 399459074
##$YMIN_p= -432983
$$ End of Bruker specific parameters
$$ ---------------------------------
##NTUPLES= NMR SPECTRUM
##VAR_NAME=  FREQUENCY,     SPECTRUM/REAL,   SPECTRUM/IMAG
##SYMBOL=    X,             R,               I
##VAR_TYPE=  INDEPENDENT,   DEPENDENT,       DEPENDENT
##VAR_FORM=  AFFN,          ASDF,            ASDF
##VAR_DIM=   16384,         16384,           16384
##UNITS=     HZ,            ARBITRARY UNITS, ARBITRARY UNITS
##FACTOR=    0.220516191357247, 1,           1
##FIRST=     3145.9117433347, 0,             0
##LAST=      -466.805019671085, 0,           0
##MIN=       -466.805019671085, -432983,     0
##MAX=       3145.9117433347, 399459074,     0
$$ Real data points
##PAGE= N=1
##DATA TABLE= (X++(R..R)), XYDATA
$$ [...]
5587C681982J06438L2806P0757P2714K0721R372R3410j8005O1453J7464M5966
5576D195078j1777J1956L7591O276l816n1868M2708n40K9143l667l321j0421K3545
5563D260887j6528k008J0649P13O4829L0692n9551K0055J2008K088o8483M1055
5551D296406P1760M04k789J5688R885K2217N9983r697J0015P5302L6102K8066
5539D613342Q889P4158J21531N815J2330J26003L7876Q5262J04989N2502P6708
5528E319405M8551N0353K9532P1181O650K2905M9676N3389J00417N0501M6148
5517E848708O4124P4054Q9341Q1837J07077J18865J40471P9355M7454J16096J34895
5506F902277M9723O4339L8183L1963O6706O4959J17373J11662J01712J04656N020
$$ plain form
5587 3681982 3788420 3821226 3891983 3964697 3985418 3994790 4088200 4070195 4131648 4149112 4195078
5576 4195078 4183301 4195257 4232848 4239124 4235308 4183440 4226148 4225608 4254751 4251084 4247763 4237342 4260887
5563 4260887 4244359 4242351 4253000 4253713 4318542 4349234 4289683 4309738 4321746 4323834 4255351 4296406
5551 4296406 4368166 4368570 4365781 4381469 4391354 4413571 4473554 4463857 4473872 4549174 4585276 4613342
5539 4613342 4622231 4696389 4817920 4823735 4836065 4962068 4999944 5085206 5190195 5242697 5319405
5528 5319405 5367956 5418309 5447841 5519022 5525672 5548577 5598253 5651642 5752059 5802560 5848708
5517 5848708 5912832 5986886 6076227 6158064 6265141 6384006 6524477 6603832 6651286 6767382 6902277
5506 6902277 6952000 7016339 7054522 7086485 7153191 7218150 7335523 7447185 7548897 7653553 7658573
5495G658573R8675J13199J11365R3071P5086J22455Q1745J40159J17835J23117
5485H735280J12925J41479J99217Q3393Q0195J62853J06181J76266K32576N4413
5475A0084778J22413J68155J38518P3295M3903J37119J16703J10089J46593J41684
5465A1283250P4859J14045J64186J00784J64088J57871K19225K63820K48838K75401
5455A3066367K16284L02516K46985K59730J70133R1268L2547Q0108J10035J23193
5445A4699166J57519J47282K28921J44416K42449J79159J91828K09823L29743
5436A6530306K29428K08160L45482K79625L13312L26889L33690L43675L58969
5427A9269536M43442M36905M25850M92969O01967O60653P33970O84572O07505
$$ plain form
5495 7658573 7757248 7870447 7981812 8074883 8149969 8272424 8354169 8494328 8612163 8735280
5485 8735280 8848205 8989684 9188901 9272294 9352489 9515342 9621523 9797789 10030365 10084778
5475 10084778 10207191 10375346 10513864 10587159 10631062 10768181 10884884 10994973 11141566 11283250
5465 11283250 11358109 11472154 11636340 11737124 11901212 12059083 12278308 12542128 12790966 13066367
5455 13066367 13282651 13585167 13832152 14091882 14262015 14353283 14385830 14465938 14575973 14699166
5445 14699166 14856685 15003967 15232888 15377304 15619753 15798912 15990740 16200563 16530306
5436 16530306 16759734 16967894 17313376 17593001 17906313 18233202 18566892 18910567 19269536
5427 19269536 19712978 20149883 20575733 21068702 21670669 22331322 23065292 23749864 24357369
5418B4357369N37426M02346M66380N31003N34600O57062O46629P32498P47217
5409B9612530Q06526Q20568P67227Q73663Q32875Q23443Q54003Q53461Q23888
5400C7068184Q21392R25146R60506R67097J093221J177490J425149J561734J835073
5391D7834992K055404K304325K572225K861413L139198L413333L813733M247092
5383G2241715M794864N297164N840149O267348O487758O596359O609841O444879
5375A20580077O056659N388905M318936K779068P46178j331025l334780m773560
5367A30430458n815827o369850o875984p268686p297401p237150o905263o506806
5359G6153491o047952n542245m911812m369149l937756l533600l166599k917818
$$ plain form
5418 24357369 24894795 25297141 25763521 26294524 26829124 27486186 28132815 28865313 29612530
5409 29612530 30419056 31239624 32006851 32880514 33713389 34536832 35390835 36244296 37068184
5400 37068184 37889576 38814722 39775228 40742325 41835546 43013036 44438185 45999919 47834992
5391 47834992 49890396 52194721 54766946 57628359 60767557 64180890 67994623 72241715
5383 72241715 77036579 82333743 88173892 94441240 100928998 107525357 114135198 120580077
5375 120580077 126636736 132025641 136344577 139123645 139869823 138538798 135204018 130430458
5367 130430458 124614631 118244781 111368797 104100111 96802710 89565560 82660297 76153491
5359 76153491 70105539 64563294 59651482 55282333 51344577 47810977 44644378 41726560
5351D1726560k562095k204212k035668j861813j681324j471138j296602j236345
5343B7377363j259055j030854j054295q93607p61027p88642o78108p01490o96244
5334A9514041n09406m88387o06460n29313m31354l72999l84810m34646l82192
5325A5374474l28423l39235k96922k86196k11271l45818k26076k64973k52944
5316A2822616k30699k66089k69645j69602k26132k29783j46869j40826j84793
5307A0958178j74816p2083k23127q1271l8628p6838j65751q6809J9751j4580n0114
5296I993912p1826j42036n7019K2364O925p7680q3128o5863j07069j85239p5663
5285I157678k19973j67740p6417j05254j47621j56032n9528o9537p3579j09593
$$ plain form
5351 41726560 39164465 36960253 34924585 33062772 31381448 29910310 28613708 27377363
5343 27377363 26118308 25087454 24033159 23139552 22378525 21589883 20911775 20210285 19514041
5334 19514041 19004635 18516248 17909788 17380475 16949121 16576122 16191312 15756666 15374474
5325 15374474 15046051 14706816 14409894 14123698 13912427 13566609 13340533 13075560 12822616
5316 12822616 12591917 12325828 12056183 11886581 11660449 11430666 11283797 11142971 10958178
5307 10958178 10783362 10711279 10488152 10406881 10368253 10291415 10125664 10038855 10058606 10044026 9993912
5296 9993912 9922086 9780050 9723031 9745395 9752320 9674640 9591512 9525649 9418580 9233341 9157678
5285 9157678 8937705 8769965 8693548 8588294 8440673 8284641 8225113 8155576 8081997 7972404
5275G972404r7631q6597q1842o0738j09209j38663o6275j39289r8876q3566l1284
5264F978434o3036k0626k05622r0849k4611j32732n1837n4930q5302p4324p2785
5253F101780l9577j04704r8191o0300k4877o6742r8240m915m3014q9568k1633
5242E450019j3956N8550L251m9155o1845k4626J6413J2882k8992k2148o2134J0192
5230E288451Q026j2923l9731k6648L1153L9199L7549l6915m9310J5033M457O6927
5218E325268K3759l0867N396M4744J31573J09644n9719n4170N3876m0302K6397
5207E535599o913n369O0095r4552k3029N3937m5823L3384k0143p73N1016O7232
5195E604661J9229K1220m319k2689R2875J07205M5936N6989j8397K4005K8923
$$ plain form
5275 7972404 7874773 7788176 7706334 7645596 7536387 7397724 7331449 7192160 7093284 7009718 6978434
5264 6978434 6915398 6894772 6689150 6598301 6573690 6440958 6389121 6334191 6248889 6174565 6101780
5253 6101780 6062203 5957499 5859308 5799008 5774131 5707389 5609149 5604234 5561220 5471652 5450019
5242 5450019 5436063 5494613 5497864 5448709 5386864 5362238 5378651 5391533 5362541 5340393 5278259 5288451
5230 5288451 5296477 5283554 5243823 5217175 5248328 5287527 5325076 5288161 5238851 5253884 5258341 5325268
5218 5325268 5349027 5318160 5323556 5368300 5499873 5609517 5549798 5495628 5549504 5509202 5535599
5207 5535599 5528686 5523317 5583412 5488860 5465831 5519768 5473945 5507329 5487186 5486413 5537429 5604661
5195 5604661 5623890 5645110 5640791 5618102 5710977 5818182 5864118 5921107 5902710 5926715 5955638
5184E955638O9638k7696M261K3644K8707N7059O3354k4958K6898L4096o4840M6426
5172F192227M5554J492M9518R3181Q2061N0010L7221P8074J55252Q7880J43241
5161G015711J19870J23908R4045R2992J59569K3621M3321Q8494J27030J18112
5151H006673J24624J26710J72056R1092J43718J98690J34435P9225J56425J98401
5141I432049J09480J26443K19900K20735K27746K09680K12057L50403L64432L15073
5131A1787998L34002M66758M69777N51040N99293P09869Q12780Q85549J004540
5122A7621606J115893J260334J274685J317887J237487J088299P80702M73811
5114B6170704K35784K0181j8263j39280j76608j36553k80654k90145k60176m03760
$$ plain form
5184 5955638 6025276 5997580 6001841 6025485 6054192 6111251 6174605 6149647 6176545 6210641 6145801 6192227
5172 6192227 6237781 6239273 6288791 6381972 6464033 6514043 6551264 6629338 6784590 6872470 7015711
5161 7015711 7135581 7259489 7353534 7446526 7606095 7629716 7673037 7761531 7888561 8006673
5151 8006673 8131297 8258007 8430063 8521155 8664873 8863563 8997998 9077223 9233648 9432049
5141 9432049 9541529 9667972 9887872 10108607 10336353 10546033 10758090 11108493 11472925 11787998
5131 11787998 12122000 12588758 13058535 13609575 14208868 14918737 15731517 16617066 17621606
5122 17621606 18737499 19997833 21272518 22590405 23827892 24916191 25696893 26170704
5114 26170704 26406488 26426669 26408406 26269126 26092518 25955965 25675311 25385166 25124990 24721230
5104B4721230l10602k06171j51400J2548J78719K86712N01617P80384J022940
5095B6835977J209926J460204J651996J867360K033698K031980J831998J509328
5087D0432467J164165P66896M97972L53171K50924J50149K1383k29273o75215
5078D2732639j151595j658588k021267k063085j991631j882967j589652j370600
5070B9003254j195922q63387p42107m18761j99006j074J15735K17168L62109L72213
5060B6650222L63970K86427L23837K76994K37711K25530J69548L2467k28614n14721
5050B7823371q52726j174642j506764j493662j521596j505055j385429j199908
5042A7183589j110056j012951q75658q13705p24191o05334n84031m87065l87783
$$ plain form
5104 24721230 24410628 24204457 24053057 24065605 24244324 24531036 25032653 25813037 26835977
5095 26835977 28045903 29506107 31158103 33025463 35059161 37091141 38923139 40432467
5087 40432467 41596632 42363528 42861500 43214671 43465595 43615744 43637127 43407854 42732639
5078 42732639 41581044 39922456 37901189 35838104 33846473 31963506 30373854 29003254
5070 29003254 27807332 26943945 26201838 25783077 25584071 25582997 25698732 25915900 26278009 26650222
5060 26650222 27014192 27300619 27624456 27901450 28139161 28364691 28534239 28566706 28338092 27823371
5050 27823371 26970645 25796003 24289239 22795577 21273981 19768926 18383497 17183589
5042 17183589 16073533 15060582 14184924 13371219 12647028 12041694 11457663 10970598 10582815
5033A0582815l81261k97621l14336l19625k78032k83960k66186k74615j94556
5024G972623k16235j52819j17323j48399j29401q0502r5714j64442p6729j12425
5014F678634j19987o2700n2732j14682j08305q0036k8919p0336p7463m9429o1097
5003E852948l2990p469R788r1174o6307j4336q2938j8913J9615k1764o867l4154
4991E505439j9987n4290m7671M9333k9649l951M7740l389k2493N636J0747j3932
4979E423533K1537R829L3181K05J6218K9476k6898J31711M1610M5904P6142K687
4967E805135Q1142L3707K6644M2572P9047N2320M6077L5666Q5849J63639N4106
4956F505904Q6298J25263J17580N3662J18570J51997J30904J18967J34878J78434
$$ plain form
5033 10582815 10201554 9903933 9589597 9269972 8991940 8707980 8441794 8167179 7972623
5024 7972623 7756388 7603569 7486246 7337847 7208446 7127944 7032230 6867788 6791059 6678634
5014 6678634 6558647 6495947 6443215 6328533 6220228 6140192 6111273 6040937 5963474 5914045 5852948
5003 5852948 5819958 5812489 5822277 5731103 5664796 5650460 5567522 5548609 5568224 5546460 5539593 5505439
4991 5505439 5485452 5431162 5383491 5432824 5403175 5399224 5446964 5443575 5421082 5426718 5437465 5423533
4979 5423533 5445070 5454899 5488080 5488285 5504503 5533979 5507081 5638792 5680402 5726306 5802448 5805135
4967 5805135 5886277 5919984 5946628 5989200 6068247 6120567 6166644 6202310 6288159 6451798 6505904
4956 6505904 6592202 6717465 6835045 6888707 7007277 7159274 7290178 7409145 7544023 7722457
4946G722457Q5318J40723K23817J15418Q0651J39563K18807J58101J80910R3204
4936I158969K02944K05166J40225Q2759K43880K67478K41895K85528K18247L16292
4926A1363383L34464L71086L91221M10828M64879N59217N84779N81050O39071
4917A5699978P00782Q44139R57277J124413J309336J456195J522288J608743J604130
4908B6827281J472408J351133J059085P28159L02609q6641j79685l36245m42642
4899C0695462l44168l68152m49470m75071l68070l65516k91921j93134p0697J45347
4889B7914610L30894M57767O67625Q48271J184372J353597J575941J665704J725475
4880C7724256J607726J247063J013280O13683K82047J1378j27089j98416l97162
$$ plain form
4946 7722457 7807775 7948498 8172315 8287733 8368384 8507947 8726754 8884855 9065765 9158969
4936 9158969 9361913 9567079 9707304 9790063 10033943 10301421 10543316 10828844 11047091 11363383
4926 11363383 11697847 12068933 12460154 12870982 13335861 13895078 14479857 15060907 15699978
4917 15699978 16400760 17244899 18202176 19326589 20635925 22092120 23614408 25223151 26827281
4908 26827281 28299689 29650822 30709907 31438066 31740675 31654034 31474349 31138104 30695462
4899 30695462 30351294 29983142 29533672 29058601 28690531 28325015 28033094 27839960 27769263 27914610
4889 27914610 28245504 28703271 29370896 30219167 31403539 32757136 34333077 35998781 37724256
4880 37724256 39331982 40579045 41592325 42206008 42488055 42499433 42372344 42173928 41776766
4871D1776766m71735o44906r80580j411801j584089j784005j873804j819085j626758
4862B9580003j466113j240343j061025r46897p01568n49885l10759j72726j54999
4853B2975688P0545J28148Q2264K25348J30685J59922K16864L09497K45638N1013
4843B4595612m2033l18477o32823q59707j107292j317109j292116j225305j165579
4834A6635171j029451r14114p70499o87924o59582n73377n24875m86048m02446
4825A0586855l77761k93489k80171k29840k59504j95950k26369j70594j63621
4816H389556j56359j15711j97394j15264q6582j79270r4158p0540l4857K398q8446
4805G253373j01899j06070m5308p932P594K154r0952L792j2514q5214l357k7214
$$ plain form
4871 41776766 41305031 40660125 39679545 38267744 36683655 34899650 33025846 31206761 29580003
4862 29580003 28113890 26873547 25812522 24865625 24164057 23614172 23303413 23130687 22975688
4853 22975688 23046233 23174381 23256645 23481993 23612678 23772600 23989464 24298961 24544599 24595612
4843 24595612 24553579 24235102 23602279 22742572 21635280 20318171 19026055 17800750 16635171
4834 16635171 15605720 14691606 13921107 13233183 12573601 12000224 11475349 10989301 10586855
4825 10586855 10209094 9915605 9635434 9405594 9146090 8950140 8723771 8553177 8389556
4816 8389556 8233197 8117486 7920092 7804828 7718246 7538976 7444818 7374278 7339421 7341819 7253373
4805 7253373 7151474 7045404 7000096 6992164 6999758 7001912 6910960 6914752 6902238 6817024 6813667 6786453
4793F786453L0038O5873N4221l3969n2553J1354O3914K5707K978O715P1256K8989
4781G060976k4243k3366K2330J8156m284N5852L0642K0583n648J02808O5020m701
4769G314125l6854N8268J11637O1112M1657j6708l949R1913J13800P1388N2006
4758G858395P5876J14721K4376J57744O1211O1933J10210J21214J52521J69941
4748H908142Q8492J56543J12428K28680J62678K28306L18253J96429K40544K32118
4738A0872613J48984Q692r8611q1653J3973l9941J6582R6848N6935O8669J24424
4727A1187515J33890J67013K5882J97831J36718K17370K55233J37317J08487J93852
4717A2761108K11727J98069J76807J49366J60111K44567K43309K11875K47696
$$ plain form
4793 6786453 6816491 6882364 6936585 6902616 6850063 6861417 6925331 6951038 6954016 6960731 7031987 7060976
4781 7060976 7036733 7013367 7035697 7053853 7049569 7105421 7136063 7156646 7150998 7253806 7318826 7314125
4769 7314125 7277271 7335539 7447176 7508288 7549945 7533237 7529288 7621201 7735001 7806389 7858395
4758 7858395 7934271 8048992 8073368 8231112 8292323 8354256 8464466 8585680 8738201 8908142
4748 8908142 8996634 9153177 9265605 9494285 9656963 9885269 10203522 10399951 10640495 10872613
4738 10872613 11021597 11030289 10931678 10850025 10863998 10824057 10840639 10937487 10994422 11063091 11187515
4727 11187515 11321405 11488418 11514300 11712131 11848849 12066219 12321452 12458769 12567256 12761108
4717 12761108 12972835 13170904 13347711 13497077 13657188 13901755 14145064 14356939 14604635
4708A4604635K99137K81582L73915L78943L92426M28539M55571N11933N29513
4699A8256194N24377M88957M02258M03890K23505N7679J00753n038R6826J45717
4689B0695118J75879K48381K43746K84056M33086M24546L38162M66614M96405
4680B3805993M95345N01557L71027L54006K38155L08035K18017K16578K05308
4671B6714021N0439Q2060K7156N6672R8263N294m773R0911O0619O2394J32762
4660B7375818J81913K58310K38519K19172J86428K18727J72413J56330J78100
4651B9185730K05064J99988J93571K47451J99121K42666K52673K36991K88648
4642C1251903L10515K73123L08841M06597L92700L98725N07733N50825O06682
$$ plain form
4708 14604635 14903772 15185354 15559269 15938212 16330638 16759177 17214748 17726681 18256194
4699 18256194 18780571 19269528 19671786 20075676 20299181 20356860 20457613 20452575 20549401 20695118
4689 20695118 20870997 21119378 21363124 21647180 22080266 22504812 22842974 23309588 23805993
4680 23805993 24301338 24802895 25173922 25527928 25766083 26074118 26292135 26508713 26714021
4671 26714021 26764460 26846520 26873676 26930348 27028611 27033905 27029132 27120043 27180662 27243056 27375818
4660 27375818 27557731 27816041 28054560 28273732 28460160 28678887 28851300 29007630 29185730
4651 29185730 29390794 29590782 29784353 30031804 30230925 30473591 30726264 30963255 31251903
4642 31251903 31562418 31835541 32144382 32550979 32943679 33342404 33850137 34400962 35007644
4633C5007644O49086P04878Q01529Q14401R16716J122858J213107J336269J439131
4624D4005619J537095J730399J756187J816560J768365J595058J490797J327348
4616E7027428J041613Q33281O47068M29690L32873L00920J52983J51495L22612
4607F1239963L65618M69769O57296Q69905J155517J461205J696060J980694K320271
4598G2216298K628159K807849L119253L230626L246538L326177L155533K792346
4590I6522779K209227J263802K02262j159784k408674l170423l604720l666432
4582H6188037l467505l024619k622607k127898j643889j285319q81390l80808
4574G0754002p5637L91557O57473R87075J240976J291043J300655J063118O15392
$$ plain form
4633 35007644 35656730 36361608 37163137 37977538 38894254 40017112 41230219 42566488 44005619
4624 44005619 45542714 47273113 49029300 50845860 52614225 54209283 55700080 57027428
4616 57027428 58069041 58902322 59549390 59979080 60311953 60612873 60765856 60917351 61239963
4607 61239963 61605581 62075350 62732646 63602551 64758068 66219273 67915333 69896027 72216298
4598 72216298 74844457 77652306 80771559 84002185 87248723 90574900 93730433 96522779
4590 96522779 98732006 99995808 100198070 99038286 96629612 93459189 89854469 86188037
4582 86188037 82720532 79695913 77073306 74945408 73301519 72016200 71134810 70754002
4574 70754002 70678365 71069922 71727395 72714470 73955446 75246489 76547144 77610262 78225654
4565G8225654O1107n41433j287151j918497k338141k664326k867644k942228k905704
4556F0821637k763124k591790k430973k320704k084626j875190j667374j464223
4548D3623633j349293j175269j011779j047723q99087p01974p31279o34019n43303
4539C5529907m37470m81652m79486l29707l86450l91054k71885k30764k41645
4530C2279794j63397j45438p5875k2998m5230N1503N3275j6809J18294K9081N4502
4519C2116702J39025J14368J34640J73374J51862J69683K07613K29445K52449
4510C3689161K63847L64496M42798M53416M44052M66371N84554N96137O38840
4501C7943672O70410O73162P58466Q10593Q34647R41361J052206J155721J189261
$$ plain form
4565 78225654 78286761 77745328 76458177 74539680 72201539 69537213 66669569 63727341 60821637
4556 60821637 58058513 55466723 53035750 50715046 48630420 46755230 45087856 43623633
4548 43623633 42274340 41099071 40087292 39039569 38140482 37438508 36707229 36073210 35529907
4539 35529907 35092437 34610785 34131299 33801592 33415142 33024088 32752203 32521439 32279794
4530 32279794 32116397 31970959 31895084 31872086 31826856 31878359 31931634 31914825 32033119 32062200 32116702
4519 32116702 32255727 32370095 32504735 32678109 32829971 32999654 33207267 33436712 33689161
4510 33689161 33953008 34317504 34760302 35213718 35657770 36124141 36708695 37304832 37943672
4501 37943672 38614082 39287244 40045710 40856303 41690950 42632311 43684517 44840238 46029499
4492D6029499J407549J511183J630197J856853J839285J970745K006583K093723
4484F0345617K128013K213736K164225K196677K078886J990038J823210J700438
4476G6640840J412839J163194R82272O95226N49193L04694N6580o703M7336J1963
4466H1857434J01732K07315L55867N47173Q07450R76611J168032J409593J529630
4457H8960837J656833J772007J681339J672195J498053J375257R63898O22448
4449A00202867K25421j74472m93581q25388r91352j122338j338862j429669j438564
4440I2614062j293798j256893j127940r59442p78933n49675l29239j91681m7562
4431H6078899J06668J79427L72831L35365N28411O27076P41490R68325J108798
$$ plain form
4492 46029499 47437048 48948231 50578428 52435281 54274566 56245311 58251894 60345617
4484 60345617 62473630 64687366 66851591 69048268 71127154 73117192 74940402 76640840
4476 76640840 78053679 79216873 80199145 80894371 81443564 81748258 81804838 81798135 81845471 81857434
4466 81857434 81959166 82166481 82522348 83069521 83876971 84853582 86021614 87431207 88960837
4457 88960837 90617670 92389677 94071016 95743211 97241264 98616521 99580419 100202867
4449 100202867 100428288 100253816 99760235 98934847 97943495 96821157 95482295 94052626 92614062
4440 92614062 91320264 90063371 88935431 87975989 87197056 86647381 86318142 86126461 86078899
4431 86078899 86185567 86364994 86737825 87073190 87601601 88228677 88970167 89938492 91047290
4422I1047290J280625J499969J506059J712030J921228K165460K384540K762903
4414A06280104L094121L491641M068358M764022N809964P080121Q888451J1077999
4406A54554781J3880971J7063468K0431525K3671103K5338077K3989272J8058852
4399B96988049P167527o028607j7176736k3391418k4711417k3237824k0453189
4392A89156385j7515583j4815763j2488041j0548138q769369p303881n942744
4385A11772866m742557l858511k974455k621417k701739k938040l329668l509177
4377H5097302l555252l436094l452004l273776l101482k952705k712526k386110
4369F0227353k168186j962143j742861j585735j458612j321416j148504j034874
$$ plain form
4422 91047290 92327915 93827884 95333943 97045973 98967201 101132661 103517201 106280104
4414 106280104 109374225 112865866 116934224 121698246 127508210 134588331 143476782 154554781
4406 154554781 168435752 185499220 205930745 229601848 254939925 278929197 296988049
4399 296988049 304155576 298126969 280950233 257558815 232847398 209609574 189156385
4392 189156385 171640802 156825039 144336998 133788860 125019491 117715610 111772866
4385 111772866 107030309 103171798 100197343 97575926 94874187 91936147 88606479 85097302
4377 85097302 81542050 78105956 74653952 71380176 68278694 65325989 62613463 60227353
4369 60227353 58059167 56097024 54354163 52768428 51309816 49988400 48839896 47805022
4361D7805022r28610r41033q76738q23496p18267q24172p81466p49384p59362
4352D0402494p39843q35106q30938p81189p76876p39904p00222o33318o73860
4343C3691238o23420o08712o18788n02919m79595m16902m18311m66364l50557
4334B9205670l52303l75618l08433l05775l54361l05736l72925l73618l39650
4325B6117251l44203k87515k72192k88415k42978j96254k69471j88011k25018
4316B3803194k82232k32283j89328j31376j52321k80919r4059m9182j12213m0572
4306B2238709j5460p1959n0611k0829n0761P135P3437J1658J5806o5478m9825
4295B2021822n2615j29515m1994m6132n4802j17187j28704q4843j36865j09020
$$ plain form
4361 47805022 46876412 45935379 45058641 44235145 43516878 42692706 41911240 41161856 40402494
4352 40402494 39662651 38827545 37996607 37215418 36438542 35698638 34998416 34365098 33691238
4343 33691238 33067818 32459106 31840318 31337399 30857804 30440902 30022591 29556227 29205670
4334 29205670 28853367 28477749 28169316 27863541 27509180 27203444 26830519 26456901 26117251
4325 26117251 25773048 25485533 25213341 24924926 24681948 24485694 24216223 24028212 23803194
4316 23803194 23520962 23288679 23099351 22967975 22815654 22534735 22440676 22391494 22279281 22238709
4306 22238709 22223249 22151290 22100679 22079850 22029089 22036224 22109661 22121319 22137125 22071647 22021822
4295 22021822 21969207 21839692 21797698 21751566 21696764 21579577 21450873 21366030 21229165 21120145
4285B1120145r1681j1919n3853r3206j52877j76605k70643j57296j48320q8938
4275A9874807j97638j59845j26633p4346l9853R120M4784m3117J3032P1555O8531
4264A9440397P3807J32842L1606j1789J2822r8724q2913R983j16702j11171o0827
4253A9219331j20705j67339o2250o2981n5001j4086l4017r4263j7266K13M6506
4242A8638142L7810p4466q0310k0982k05q9605r2290p7944p1593n7002j0640M6664
4230A8147579k863L8389m5070k4178l885K6694n8245L7930O0896O4165m5337L4162
4218A8230237M4603J48793J63334Q0463r169J27113J17013Q2014K09427J04857
4208A9298685J04619J59362J71579J98371K18771K00729K71078M15593M54056
$$ plain form
4285 21120145 21028464 21016545 20962692 20869486 20716609 20540004 20269361 20112065 19963745 19874807
4275 19874807 19677169 19517324 19390691 19316345 19276492 19285612 19330396 19287279 19300311 19371866 19440397
4264 19440397 19514204 19647046 19678652 19666863 19679685 19580961 19498048 19508031 19391329 19280158 19219331
4253 19219331 19098626 18931287 18869037 18806056 18751055 18736969 18702952 18608689 18591423 18591636 18638142
4242 18638142 18675952 18601486 18521176 18500194 18499989 18410384 18318094 18240150 18168557 18111555 18100915 18147579
4230 18147579 18144716 18183105 18138035 18113857 18109972 18136666 18078421 18116351 18177247 18241412 18196075 18230237
4218 18230237 18274840 18423633 18586967 18667430 18658261 18785374 18902387 18984401 19193828 19298685
4208 19298685 19403304 19562666 19734245 19932616 20151387 20352116 20623194 21038787 21492843
4199B1492843M67838M50448L22974J04424j15853j25819j66630j27582p2089N2544
4189B2283098R1594N1730J56247K45883J88939J90301K07058J59583J80431J40679
4179B3895543J53316J00858J49204J74804K9236J12877J57027J71174K58671K74407
4169B5477117K67671M26660L03194L42012L50184L20343K80437K69390K74524
4160B8311532K09037J60489J15280J76170J41568J13874k0019q4864m2544k12474
4150B8868049k06841k35681k33750k89694k62247k40549j88120k54279k78107
4141B6678781l16995l66165l75010l88508l15391l17651k97257k95527k25633
4132B3780644k16903j70050j46958j32268m9177l4201l1651L9174J55018J13634
$$ plain form
4199 21492843 21960681 22411129 22734103 22838527 22722674 22596855 22430225 22302643 22230554 22283098
4189 22283098 22374692 22426422 22582669 22828552 23017491 23207792 23414850 23574433 23754864 23895543
4179 23895543 24048859 24149717 24298921 24473725 24502961 24615838 24772865 24944039 25202710 25477117
4169 25477117 25744788 26171448 26474642 26816654 27166838 27487181 27767618 28037008 28311532
4160 28311532 28520569 28681058 28796338 28972508 29114076 29227950 29207931 29123067 29080523 28868049
4150 28868049 28661208 28425527 28191777 27902083 27639836 27399287 27211167 26956888 26678781
4141 26678781 26361786 25995621 25620611 25232103 24916712 24599061 24301804 24006277 23780644
4132 23780644 23563741 23393691 23246733 23114465 23065288 23031087 22999436 23038610 23193628 23307262
4122B3307262J60533K06792K72025K95242M22567M97424N46956O81948P92259
4113B7183008Q88746Q20432Q31291P30941L38967j11638m37648o66373p50109
4104B8827617p34732n87651n92557m77244l28786k10233j85974r8493m0652n6061
4094B5515234j25007j73982k47790l49030l74300m32286k95963l03300k84846
4085B2928730j85669j61003j37283n9821k7966p1675r0720q9968k16788j47810
4075B1740027q5165j62643j9298n8360n3747l6890m4372n5040Q3194M466J1007
4064B1323179P4637Q0825J48849J66502J89053J54635K46704L26722K93651L32634
4054B3337391L27808M47339M20420M08339M65728M56345N36388N07631N56377
$$ plain form
4122 23307262 23467795 23674587 23946612 24241854 24664421 25161845 25708801 26390749 27183008
4113 27183008 28071754 28892186 29723477 30454418 30793385 30681747 30244099 29577726 28827617
4104 28827617 28092885 27505234 26912677 26435433 26106647 25896414 25710440 25611947 25571295 25515234
4094 25515234 25390227 25216245 24968455 24619425 24245125 23812839 23516876 23213576 22928730
4085 22928730 22743061 22582058 22444775 22384954 22356988 22285313 22194593 22104625 21887837 21740027
4075 21740027 21654862 21492219 21472921 21414561 21360814 21323924 21279552 21224512 21307706 21312172 21323179
4064 21323179 21397816 21478641 21627490 21793992 21983045 22137680 22384384 22711106 23004757 23337391
4054 23337391 23665199 24112538 24532958 24941297 25407025 25863370 26399758 26907389 27463766
4045B7463766O49266O73427N95122N15028O46265O98861O30517O74303P40466
4036C3287021Q74690Q45937J005131J106660J214378J321336J288078J282850
4028D2226081J202590J114754R27808O48123L81642J40221j47375k51332k36612
4019D6005900k46211k29075j22482j72396j09524k96448m40166n53858p88768
4010D3046972r02192q70349p84582p76359p40408n78106n04442n65666m73417
4001C6851451n70159o09676p42771q86033r61206j071383j155791j061186r91427
3992B8801819r25174r17854p93021p74048p31854p46389p75589p68309q10436
3983B1559145p68861p77595p90369p61140o73518o67829o72381n64719n21806
$$ plain form
4045 27463766 28113032 28786459 29381581 29896609 30542874 31241735 31872252 32546555 33287021
4036 33287021 34161711 35007648 36012779 37119439 38333817 39655153 40943231 42226081
4028 42226081 43428671 44543425 45471233 46119356 46500998 46641219 46493844 46242512 46005900
4019 46005900 45759689 45530614 45408132 45235736 45126212 44829764 44389598 43835740 43046972
4010 43046972 42144780 41274431 40489849 39713490 38973082 38394976 37890534 37324868 36851451
4001 36851451 36281292 35671616 34928845 34042812 33081606 32010223 30854432 29793246 28801819
3992 28801819 27876645 26958791 26165770 25391722 24659868 23913479 23137890 22369581 21559145
3983 21559145 20790284 20012689 19222320 18461180 17787662 17119833 16447452 15882733 15360927
3974A5360927n48020n33251m90356m85687m26445m72814m17743l08434m12349
3965A1265828l98500l17866m32651l69414l23835k44638k46089k27704j53761
3956H551370k54723k51623k52068j54573k11271j35140j80080k27003j96444j55355
3946F533090j87788l2399n3931j65080j12719j10014k7683j68774j30545l6151
3936E508006j11776j53611j27218j16197p0774r0090j04367j05520m9437p8679
3926D500337r7003o2822p0510M404Q893n7095j14949o9971j06520l4767l9951
3915C860046K2210r1017o5308n7973n8359m0122p2897k4955M014j9206o5569p176
3903C383688m2299k9704p3147k3189l7042l416o0107L3111K3536o6314j8406n44
$$ plain form
3974 15360927 14812907 14279656 13789300 13303613 12877168 12404354 11986611 11678177 11265828
3965 11265828 10867328 10549462 10116811 9747397 9423562 9178924 8932835 8705131 8551370
3956 8551370 8296647 8045024 7792956 7638383 7427112 7291972 7111892 6884889 6688445 6533090
3946 6533090 6345302 6312903 6258972 6093892 5981173 5871159 5843476 5674702 5544157 5508006
3936 5508006 5396230 5242619 5115401 4999204 4928430 4838340 4733973 4628453 4579016 4500337
3926 4500337 4403334 4340512 4270002 4274406 4283299 4226204 4111255 4041284 3934764 3899997 3860046
3915 3860046 3882256 3791239 3725931 3667958 3609599 3569477 3496580 3471625 3475639 3456433 3390864 3383688
3903 3383688 3341389 3311685 3238538 3215349 3178307 3174891 3114784 3147895 3171431 3105117 3086711 3086167
3891C086167N444o8384m5512j9030l5694p4511m4018N2847J1519N485J47o2252
3879B812208m0377M1870q5769o6568n152k5891K898q3190J9720J406m229k0047
3867B546879p7826L3513N7651j6975q0808l5491j3488o1590k1827O688q5794m906
3855B246026k9728L3117k6222K815m254m6617K9883n642m4122m5037n7878L3786
3843B086127J2401l0948k859l1176R484m1544L5420l6100l6329m6005N9637p0596
3831A907512l0374J7096L1201l5897m0173n1418R6259j7287j1926N1174n812r3032
3819A817323p2307L832O373M6438k5245J25899j6793q5181M039m1559q6019J9753
3807A696553M7233p0098j0506N7808M370n8492o2460J0852p0936N5189M4644n3041
$$ plain form
3891 3086167 3091611 3023227 2977715 2958685 2922991 2848480 2804462 2857309 2868828 2874313 2874460 2812208
3879 2812208 2771831 2813701 2727932 2661364 2656212 2630321 2633219 2550029 2569749 2571155 2566926 2546879
3867 2546879 2469053 2502566 2560217 2543242 2462434 2426943 2413455 2351865 2330038 2336726 2250932 2246026
3855 2246026 2216298 2249415 2223193 2226008 2221754 2175137 2205020 2199378 2155256 2110219 2052341 2086127
3843 2086127 2098528 2067580 2064721 2033545 2043029 2001485 2036905 2000805 1964476 1918471 1978108 1907512
3831 1907512 1877138 1894234 1925435 1889538 1849365 1797947 1894206 1876919 1864993 1916167 1910355 1817323
3819 1817323 1745016 1748848 1755221 1801659 1776414 1902313 1885520 1800339 1804378 1762819 1676800 1696553
3807 1696553 1743786 1673688 1663182 1720990 1725360 1666868 1604408 1615260 1544324 1599513 1644157 1591116
3795A591116p3306J6245N453P232p058J0379j6703J5960n0580o3437Q074J5945
3783A459320l8937j3969k4346l3249J9019M4705m013l4623J8959p547K620j2285
3771A375654k239k8694Q809J4754k0832L8535m3150l2082P9919j3823J0325p1789
3759A315387L481L5892n4584P4670J0250m8045L0733O143m6718J00260K3358n2070
3747A398757r612j9649K2535K651l2971J840O7572J7372j19274J0384M2335M7322
3735A429262m727j953J9242j05426K1429j2292Q7150P8359l7682K6133m194l4607
3723A460694J0452J9617L0211J0543k6197m3044m0555O3225L6984q3532j9502
3712A418896K2856K9057J896M5427p439J2267q481L3899J8311m6393k8126q442
$$ plain form
3795 1591116 1517810 1534055 1539508 1546740 1539682 1550061 1533358 1549318 1498738 1435301 1443375 1459320
3783 1459320 1420383 1406414 1382068 1348819 1367838 1412543 1408530 1373907 1392866 1385319 1387939 1375654
3771 1375654 1373415 1344721 1353530 1368284 1347452 1385987 1342837 1310755 1390674 1376851 1387176 1315387
3759 1315387 1318868 1354760 1300176 1374846 1385096 1337051 1367784 1373927 1327209 1427469 1450827 1398757
3747 1398757 1389145 1369496 1392031 1394682 1361711 1363551 1431123 1448495 1329221 1339605 1381940 1429262
3735 1429262 1424535 1422582 1441824 1336398 1357827 1345535 1432685 1511044 1473362 1499495 1495301 1460694
3723 1460694 1471146 1490763 1520974 1531517 1505320 1462276 1421721 1484946 1521930 1438398 1418896
3712 1418896 1441752 1470809 1472705 1518132 1510693 1522960 1514479 1548378 1566689 1520296 1492170 1483728
3700A483728m3249Q5032K3048p48J9764j23492O0738M4786K6112K9245j4354j376
3688A589234n0593k681J8226K1768j1290N0110N2559n1176l3186J0604M066M813
3676A602454J02637L9830k0821K4995k5822K8971K8555o8549j8127j0317M2160
3665A725966M6092n2734M7939K6702l5171O1703O543J2739j15240L0641K3735
3654A778915J4874o439J839J3780j3917r409J21696L8199k751K715O168J24173
3642B069843L2925o068k4554N561O8963N4811J701M1803Q5662l6382M8871K4807
3630B367943k5940J36928N7176N1380P9941O1497j7042L7864K7760P7774K4936
3619B880217O145l1710K5129J2121K3607K3272M943m788N1327O1541k0192K6763
$$ plain form
3700 1483728 1440479 1525511 1548559 1547811 1567575 1444083 1504821 1549607 1575719 1604964 1590610 1589234
3688 1589234 1538641 1535960 1554186 1575954 1564664 1614774 1667333 1616157 1582971 1593575 1597641 1602454
3676 1602454 1705091 1744921 1724100 1749095 1723273 1752244 1780799 1712250 1694123 1683806 1725966
3665 1725966 1772058 1719324 1767263 1793965 1758794 1820497 1827040 1839779 1724539 1755180 1778915
3654 1778915 1793789 1787350 1789189 1802969 1789052 1779643 1901339 1939538 1936787 1939502 1945670 2069843
3642 2069843 2102768 2096700 2072146 2077707 2146670 2201481 2203182 2244985 2330647 2294265 2343136 2367943
3630 2367943 2342003 2478931 2536107 2587487 2667428 2728925 2711883 2749747 2777507 2855281 2880217
3619 2880217 2886362 2854652 2879781 2891902 2915509 2938781 2943724 2938936 2990263 3051804 3031612 3058375
3607C058375R8381j6529J9943M0170J347L9861M9421n0038L5380K8128M0702j4701
3595C330440q1571O8287J119k628R404M5818J3139M0711L3016k3456k729p601
3583C423949o0189K7309J2525k7615j6372J3818r929j9707P680L800J4792m021
3571C366040l2746k0239l6500K0104O6181M0633m6080j8239J430R171J1857M8648
3559C410260o866o7209N5822J02339M8511j4207O2335K2474L2596k4887R3314
3548C714482L0235K551J15915O2615k6552K0925J26841N7094l542Q0194Q5751
3537D266509j3230J06755N5047N0224K6057l4291L5993O1841L9481P190K5091
3526D626667J9582O9597J18987M2439J09021K2780O0047K6742O1817R2889L7783
$$ plain form
3607 3058375 3156756 3140227 3160170 3200340 3201687 3241548 3290969 3240931 3276311 3304439 3345141 3330440
3595 3330440 3248869 3317156 3318275 3315647 3325051 3370869 3384008 3424719 3457735 3434279 3431550 3423949
3583 3423949 3363760 3391069 3403594 3375979 3359607 3373425 3363496 3343789 3351469 3355269 3370061 3366040
3571 3366040 3333294 3313055 3276555 3296659 3362840 3403473 3357393 3339154 3340584 3349755 3361612 3410260
3559 3410260 3403394 3336185 3392007 3494346 3542857 3528650 3590985 3613459 3646055 3621168 3714482
3548 3714482 3744717 3747268 3863183 3925798 3899246 3920171 4047012 4104106 4100564 4180758 4266509
3537 4266509 4253279 4360034 4415081 4465305 4491362 4457071 4493064 4554905 4594386 4601576 4626667
3526 4626667 4646249 4715846 4834833 4877272 4986293 5009073 5069120 5095862 5157679 5250568 5288351
3515E288351K9932L6723q839k812O8842N0087K9897Q7509M3416J1500K331M956
3503E641893M9963Q8934P7565M1550O0620M4095J2623Q1790J27716R9773K7137
3492F353659j5805L1007J02819J09516P9654R1980Q6322R8311J04709L8782L2461
3481G113415O5190P4215J40921R1466P7330J39037O7091J02403J39428R7342J62107
3470H269945R5298J62670J55080J30536J22596J73282J60022P4512J84932K09006
3460I737879J40758Q0572J63895J98317J29331K43202J88902J34969K29451J61995
3450A1409271J41225J90591Q4409J93695J53639J30475J42163J96557J56689K18531
3440A3017245J48087J69711K26966K50310K68289K07386K13764K22109K18919
$$ plain form
3515 5288351 5318283 5355006 5346167 5343355 5412197 5462284 5492181 5579690 5623106 5634606 5636937 5641893
3503 5641893 5691856 5780790 5858355 5899905 5960525 6004620 6017243 6099033 6226749 6326522 6353659
3492 6353659 6337854 6368861 6471680 6581196 6660850 6752830 6839152 6937463 7042172 7080954 7113415
3481 7113415 7178605 7252820 7393741 7485207 7562537 7701574 7768665 7871068 8010496 8107838 8269945
3470 8269945 8365243 8527913 8682993 8813529 8936125 9109407 9269429 9343941 9528873 9737879
3460 9737879 9878637 9959209 10123104 10321421 10450752 10693954 10882856 11017825 11247276 11409271
3450 11409271 11550496 11741087 11825496 12019191 12172830 12303305 12445468 12642025 12798714 13017245
3440 13017245 13165332 13335043 13562009 13812319 14080608 14287994 14501758 14723867 14942786
3431A4942786K57343K32354K00128K48555K88667K04863J52191K21140J72905
3422A6920932K33479J78869K25991J42557L04938K76669K04125K45162K76890
3413A9009612L24648K73522L34720K72467L49355M30909L53801L51157L86326
3404B2086517L68138L98638L95154M46681M01603L20216L90725L59314L76081
3395B5543067L55195L42899K86368L40001L01480K48895K79055K04999J19429
3386B8021388R0642M7761J26288N4277j24950p4346j27108j88803k96379l09546
3376B7219224k54755l18663l00439k18048k80724k85337l39750k42994j88058
3367B4790456k14024l18043l08623k95602k91901k50052j85972k33809k15966
$$ plain form
3431 14942786 15200129 15432483 15632611 15881166 16169833 16374696 16526887 16748027 16920932
3422 16920932 17154411 17333280 17559271 17701828 18006766 18283435 18487560 18732722 19009612
3413 19009612 19334260 19607782 19942502 20214969 20564324 20995233 21349034 21700191 22086517
3404 22086517 22454655 22853293 23248447 23695128 24096731 24416947 24807672 25166986 25543067
3395 25543067 25898262 26241161 26527529 26867530 27169010 27417905 27696960 27901959 28021388
3386 28021388 28112030 28159791 28286079 28340356 28215406 28141060 28013952 27825149 27528770 27219224
3376 27219224 26964469 26645806 26345367 26127319 25846595 25561258 25221508 24978514 24790456
3367 24790456 24576432 24258389 23949766 23654164 23362263 23112211 22926239 22692430 22476464
3358B2476464q7903p5469p3843o9976J2059R9440J00098J08120K60884J49513
3348B2899387K06294K46127K19975L42138L17928K93675L74621L50278L50026
3339B5600449M05329M05749M04792M23399M16660N39764M56440N02730N61180
3330B9716492N78099N95676N95920O48209P05964P86540P74986Q35715R67159
3321C6204760J024190J054624J101841J212087J366840J525571J633162J880322
3313D7003397J999996K215226K511395K587574K697856K989612L008641K976636
3305F7990333K757338K597781K289822J794662J631258J251118J036219P66654
3297H2115185O11588O82309O44853P34247Q07445P66771P54489O55163L86606
$$ plain form
3358 22476464 22388561 22313092 22239249 22169273 22181332 22280772 22380870 22488990 22749874 22899387
3348 22899387 23105681 23351808 23571783 23913921 24231849 24525524 24900145 25250423 25600449
3339 25600449 26005778 26411527 26816319 27239718 27656378 28196142 28652582 29155312 29716492
3330 29716492 30294591 30890267 31486187 32134396 32840360 33626900 34401886 35237601 36204760
3321 36204760 37228950 38283574 39385415 40597502 41964342 43489913 45123075 47003397
3313 47003397 49003393 51218619 53730014 56317588 59015444 62005056 65013697 67990333
3305 67990333 70747671 73345452 75635274 77429936 79061194 80312312 81348531 82115185
3297 82115185 82726773 83409082 84053935 84788182 85595627 86362398 87116887 87772050 88158656
3288H8158656J1226k99164n67806q57545j165265j224786j407939j400017j255329
3279G9992031j120308r75936q78475n75701l23990j12905L676K33425M56100O61931
3269G7359848Q90403J025603J201293J309852J555490J606886J738230J853739
3261H8541344J920088K081354K241114K257123K319689K273674K272764K313325
3253A06220475K295068K116540K160430K151298K116823K234551K280606K575914
3245A24151705K813811L068966L354810L715630M079830M162734M310337M342716
3237A54000539M097529L883637L411476K752131K162535J439846P71264K45998
3229A72764955k64430o51147p65536r48289j036843j023672j058145j184172j501008
$$ plain form
3288 88158656 88169882 87870718 87302912 86445367 85280102 84055316 82647377 81247360 79992031
3279 79992031 78871723 77895787 77017312 76441611 76117621 76004716 76008392 76241817 76697917 77359848
3269 77359848 78250251 79275854 80477147 81786999 83342489 84949375 86687605 88541344
3261 88541344 90461432 92542786 94783900 97041023 99360712 101634386 103907150 106220475
3253 106220475 108515543 110632083 112792513 114943811 117060634 119295185 121575791 124151705
3245 124151705 126965516 130034482 133389292 137104922 141184752 145347486 149657823 154000539
3237 154000539 158098068 161981705 165393181 168145312 170307847 171747693 172518957 172764955
3229 172764955 172500525 171849378 171083842 170135553 169098710 168075038 167016893 165832721 164331713
3220A64331713j941992k396517k838029l450699l980284m370097m644259m893004
3212A35816832m965481m985050m949907m862164m718578m384858l949579l648678
3204I9352537l143698k890017k449078k132160j938321j640312j565548j567009
3196H2026394j364952j341021j290154j288764j312138j314720j311701j298836
3188G1504108j292817j279448j227318j087109j066253p83745o76462m83528l84822
3179F3222606l12603l62118o39928q73940q58773q15772o48272n65576l81500
3170E7764124l53294l15651k24116j37679j14026j60059j19570p3525j76267k35256
3160E5854681j82740l36088m10130m15885m94774n07921m88736m13364j55991
$$ plain form
3220 164331713 162389721 159993204 157155175 153704476 149724192 145354095 140709836 135816832
3212 135816832 130851351 125866301 120916394 116054230 111335652 106950794 103001215 99352537
3204 99352537 96208839 93318822 90869744 88737584 86799263 85158951 83593403 82026394
3196 82026394 80661442 79320421 78030267 76741503 75429365 74114645 72802944 71504108
3188 71504108 70211291 68931843 67704525 66617416 65551163 64767418 64090956 63607428 63222606
3179 63222606 62910003 62547885 61907957 61034017 60175244 59359472 58711200 58145624 57764124
3170 57764124 57410830 57095179 56871063 56733384 56619358 56459299 56339729 56266204 56089937 55854681
3160 55854681 55671941 55335853 54925723 54509838 54015064 53507143 53018407 52605043 52449052
3151E2449052k15039m1101O8192J75035J16667J70947J70982O5096J54933L01117
3141E3415881M21539M77927O16776P53209Q16076R25213J027202J056173J121339
3132F0631335J110356J120447J077340J062860J043333J067048J185955J254897
3124F9553571J465584J667100K011283K349827K654802L056508L478736L781973
3116I0019384M121278M404017M544032M613286M573509M369720M008822L676423
3108A24330471L326916K776954K315043J819295J299042Q69758M54660R6150k77500
3099A37010789n47072q63162j267622j519768j834021k202376k456136k701894
3091A23618738k906194l028369k914077k868578k708977k583205k183226k029536
$$ plain form
3151 52449052 52234013 52192912 52261104 52436139 52552806 52723753 52894735 52959831 53114764 53415881
3141 53415881 53837420 54315347 54932123 55685332 56501408 57426621 58453823 59509996 60631335
3132 60631335 61741691 62862138 63939478 65002338 66045671 67112719 68298674 69553571
3124 69553571 71019155 72686255 74697538 77047365 79702167 82758675 86237411 90019384
3116 90019384 94140662 98544679 103088711 107701997 112275506 116645226 120654048 124330471
3108 124330471 127657387 130434341 132749384 134568679 135867721 136737479 137192139 137288289 137010789
3099 137010789 136463717 135600555 134332933 132813165 130979144 128776768 126320632 123618738
3091 123618738 120712544 117684175 114770098 111901520 109192543 106609338 104426112 102396576
3083A02396576j785638j587306j472401j347352j344267j381707j364490j459022
3075I0654393j476605j688079j920975k011737k206795k422924k448962k472847
3067G4005469k373910k218088k141173j946055j724754j512710j222149q73624
3059E9993006p10481l50891j49226K5559K20717L13415M53351N08239M39671M04204
3049F1147564J55031K700j59528m87778p00311r67152j240363j517065j652933
3040E4580165j870723j944544j951658k078432k021654j958943j875410j736255
3032C9142546j692120j562099j387178j294537j205859j084545r55536r07014
3024B9053658p98765q43304o98524n82621n89947o10486n14940m93312m11640
$$ plain form
3083 102396576 100610938 99023632 97551231 96203879 94859612 93477905 92113415 90654393
3075 90654393 89177788 87489709 85568734 83556997 81350202 78927278 76478316 74005469
3067 74005469 71631559 69413471 67272298 65326243 63601489 62088779 60866630 59993006
3059 59993006 59282525 58931634 58782408 58807967 59028684 59342099 59795450 60303689 60743360 61147564
3049 61147564 61302595 61305295 61145767 60657989 59957678 58990526 57750163 56233098 54580165
3040 54580165 52709442 50764898 48813240 46734808 44713154 42754211 40878801 39142546
3032 39142546 37450426 35888327 34501149 33206612 32000753 30916208 29960672 29053658
3024 29053658 28254893 27411589 26713065 26130444 25540497 24930011 24415071 23921759 23510119
3015B3510119m22996m42684m04857l68095m38134l36154l20149k05013k88570
3006B0283467k88383j33683j16903q3242R199k5612j9196Q9965M5276J44310J58472
2995B0063670J82189N0427Q8403N5294n002n4125j47953j79580k51037k85842
2985A9516444l08710m17228m65228m23432l50633l99634l33208l20359l80054
2976A6117958l00569k25959k50314k26696j28077j56061j86898j97121p4509q7441
2966A4284313j23335m5843p0541K0096K4132m3520k2189O5714J9237j3751R6142
2955A4190455J15339P8412J26803P0092J16912J54642J58453J30784J69631J68826
2945A5480349J12267K28580K62518K25973J58783K43145K93888K93637K29224
$$ plain form
3015 23510119 23087123 22644439 22239582 21871487 21433353 21097199 20777050 20572037 20283467
3006 20283467 19995084 19861401 19744498 19661256 19670455 19644843 19625647 19715612 19760888 19905198 20063670
2995 20063670 20245859 20296286 20384689 20439983 20434981 20380856 20232903 20053323 19802286 19516444
2985 19516444 19207734 18790506 18325278 17901846 17551213 17151579 16818371 16498012 16117958
2976 16117958 15817389 15591430 15341116 15114420 14986343 14830282 14643384 14446263 14371754 14284313
2966 14284313 14160978 14115135 14044594 14064690 14088822 14045302 14023113 14088827 14108064 14094313 14190455
2955 14190455 14305794 14384206 14511009 14581101 14698013 14852655 15011108 15141892 15311523 15480349
2945 15480349 15592616 15821196 16083714 16309687 16468470 16711615 17005503 17299140 17528364
2936A7528364L16151L14877K88811K52697L15372L10878K57825K95350L37443
2927B0217768L86304L48493M32624L68656M51535M86014M60473M20010N29393
2918B4101270N83295O23683P29805P49138P47910Q28492Q08026P19312P37573
2909C0628504P50398P37594P73292P33766Q00254Q57122R45057R50419J151080
2900C8327486J189348J292148J311736J282784J434558J466355J527474J469568
2892D9301457J596474J584777J684156J697965J757881J696513J710674J610535
2884F2640432J645334J614194J709616J817153J929994K034338K113932K334214
2876G7839207K598403K869714L192830L623714M019231M502523M992011N629194
$$ plain form
2936 17528364 17844515 18159392 18448203 18700900 19016272 19327150 19584975 19880325 20217768
2927 20217768 20604072 20952565 21385189 21753845 22205380 22691394 23151867 23571877 24101270
2918 24101270 24684565 25308248 26038053 26787191 27535101 28363593 29171619 29890931 30628504
2909 30628504 31378902 32116496 32889788 33623554 34423808 35280930 36225987 37176406 38327486
2900 38327486 39516834 40808982 42120718 43403502 44838060 46304415 47831889 49301457
2892 49301457 50897931 52482708 54166864 55864829 57622710 59319223 61029897 62640432
2884 62640432 64285766 65899960 67609576 69426729 71356723 73391061 75504993 77839207
2876 77839207 80437610 83307324 86500154 90123868 94143099 98645622 103637633 109266827
2868A09266827O100012O804529P535382Q370306R320309J0331253J1325811J2303704
2860A81358133J3320304J4396696J5914530J7945333K0266861K2617164K4535568
2853C10354589K5452900K4574373K1289083J4286200L501929q730244j9086506
2846C71642324k5167093k7142960k6304240k4206048k2018000k0018668j8326756
2839B08458559j6754789j5110718j3733614j2275603j0991825r798175q561455
2832A21232380p658832o850516o089751n463437n072149m722226m383939m095906
2824G6895624l843421l660403l355653l134375k944253k709320k441299k287307
2816E2519593k103973k021294j886864j731179j573017j516847j479105j391098
$$ plain form
2868 109266827 115366839 122171368 129706750 138077056 147397365 157728618 169054429 181358133
2860 181358133 194678437 209075133 224989663 242934996 263201857 285819021 310354589
2853 310354589 335807489 360381862 381670945 395957145 399459074 390728830 371642324
2846 371642324 346475231 319332271 293028031 268821983 246803983 226785315 208458559
2839 208458559 191703770 176593052 162859438 150583835 139592010 129793835 121232380
2832 121232380 113573548 106723032 100633281 95169844 90097695 85375469 80991530 76895624
2824 76895624 73052203 69391800 66036147 62901772 59957519 57248199 54806900 52519593
2816 52519593 50415620 48394326 46507462 44776283 43203266 41686419 40207314 38816216
2808C8816216j219093j201151j192594j043672r91516r48014r82625r32884q94388
2799B9410279r10884q91304q72803p54114p46337p33770o68570o90010p16968
2790B2425519n73947m99103n36663n62910n05869m28448m16559m35607m78587
2781A7987826m30303m55757l59661l95860m79354l51137l43317l59307l46742
2772A4466388k75451l28798k90545k99812l46297k39984l43453k65652k60280
2763A1816116k06446l02018k35157j84404j69771k19812k64819k01163j96933
2754I835593k20999j53165j44373k47920j73206j35366r4529j76013j08827p6606
2744H304589j44957j95435j18538o1425j39662j67369j14726n297j05087j56728
$$ plain form
2808 38816216 37597123 36395972 35203378 34159706 33168190 32220176 31237551 30304667 29410279
2799 29410279 28499395 27608091 26735288 25981174 25234837 24501067 23832497 23142487 22425519
2790 22425519 21851572 21352469 20815806 20252896 19747027 19318579 18902020 18466413 17987826
2781 17987826 17557523 17101766 16742105 16346245 15866891 15515754 15172437 14813130 14466388
2772 14466388 14190937 13862139 13571594 13271782 12925485 12685501 12342048 12076396 11816116
2763 11816116 11609670 11307652 11072495 10888091 10718320 10498508 10233689 10032526 9835593
2754 9835593 9614594 9461429 9317056 9069136 8895930 8760564 8666035 8490022 8381195 8304589
2744 8304589 8159632 7964197 7845659 7784234 7644572 7477203 7362477 7357180 7252093 7095365
2734G095365q6475q7746j10782j15769j19870j87727k04018m0112j06612j90548
2724E845706q1465o1300n5371p787o2968l5813k552j1867j03798o6014k6533j0623
2712E319615j26474j03733q0847q8041j16801m8657j23548q0366j2957k7073m9752
2701D461366j31811n6180l2750j4038Q178k7763K4099q563j18097p6257p7437
2690C950747l958J2387m5943j34049n1263q7918n4784L6461n8883p0043M38l2615
2678C460577o8042j32713o1220m2167l1928n8156q3087n6510q0207q1772k5489
2667B739286n0379j31065m8648j8470j09386n9157l5457J1003k5994m3390o8576
2656B159767k9127m4486J6027l3708m9010k0930K2210j25559L8707N9323O050
$$ plain form
2734 7095365 7008890 6921144 6810362 6694593 6574723 6386996 6182978 6142866 6036254 5845706
2724 5845706 5764241 5702941 5647570 5639783 5576815 5541002 5538450 5526583 5422785 5356771 5330238 5319615
2712 5319615 5193141 5089408 5008561 4920520 4803719 4755062 4631514 4551148 4538191 4511118 4461366
2701 4461366 4329555 4273375 4240625 4226587 4234765 4207002 4231101 4222538 4104441 4028184 3950747
2690 3950747 3946789 3959176 3913233 3779184 3727921 3640003 3585219 3621680 3562797 3492754 3493192 3460577
2678 3460577 3392535 3259822 3198602 3156435 3124507 3066351 2983264 2926754 2846547 2764775 2739286
2667 2739286 2688907 2557842 2509194 2490724 2381338 2322181 2286724 2297727 2271733 2228343 2159767
2656 2159767 2130640 2086154 2102181 2068473 2019463 1998533 2020743 1895184 1933891 1993214 1999264
2645A999264m0957j08578q5642J8426m0719j6066j6837j9650O252k5539J7425
2634A687379K201J1695o1971J64l674l2897q2522K9497N6654m3790m6273O3874
2622A580337j8336J3527M679L4804K5570m0015M265j8786r4953K313O3908n8856
2610A498457m4510N330l6821K7001O775j0964j0637M572j6203J581J9198O1519
2598A505298J1391k7997m8253L7876m3282m8791P6003K2342n5076J7123j6917
2587A429717N3251L2110P1113J51l6917P2867K9247M5693N3142O3105M9821L1754
2575A895054m397N5361R8722Q9766J14681R2782J31734Q8578L6641m6749l7080
2564B515093q3731j70032m4692q5379r3987j36629l7568j37066j05235q1509j17238
$$ plain form
2645 1999264 1958307 1849729 1764087 1782513 1741794 1725728 1708891 1689241 1695493 1669954 1687379
2634 1687379 1689580 1701275 1639304 1639468 1635794 1602897 1520375 1549872 1606526 1562736 1516463 1580337
2622 1580337 1562001 1575528 1580207 1615011 1640581 1600566 1604831 1586045 1491092 1493405 1557313 1498457
2610 1498457 1453947 1459277 1422456 1449457 1456232 1445268 1434631 1439203 1423000 1424581 1443779 1505298
2598 1505298 1516689 1488692 1440439 1478315 1435033 1386242 1462245 1484587 1429511 1446634 1429717
2587 1429717 1482968 1515078 1586191 1586342 1549425 1622292 1651539 1697232 1750374 1813479 1863300 1895054
2575 1895054 1890657 1946018 2044740 2134506 2249187 2341969 2473703 2562281 2598922 2552173 2515093
2564 2515093 2431362 2261330 2216638 2131259 2037272 1900643 1863075 1726009 1620774 1539265 1422027
2553A422027l2434k4369o285n2249m5694o3391k5452K8661m9900L4795n3610M9488
2541A181587L9120o8734n3628p0466N423k2809j231l5393k8662m6696K8214m8960
2529H77765m3052k4229L1556l561n5587m6272q1012L6813P7282Q042l2299o9940
2517F75506m447k6726L636J1976l8631J9727p4171l5101M8732k6747l8003k399
2505E13352l3171L4509M1569m1739k5310J5525M2604P970o2035o005R9277k8152
2493E58394m0866j3210k8347p575j16157p6473M6823P1604O7352J5908l0506J8718
2481D65665q3453L8743n9J3216j6194J6157L2098J4140k3815o6471L6392R649
2469D36068l3682j5814L7173J0003m0203L117o942O720L5286n0404l263J7997
$$ plain form
2553 1422027 1389593 1365224 1358939 1306690 1260996 1197605 1172153 1200814 1150914 1185709 1132099 1181587
2541 1181587 1220707 1151973 1098345 1027879 1033302 1010493 1009262 973869 945207 898511 926725 877765
2529 877765 834713 810484 842040 838479 782892 736620 655608 692421 769703 777745 745446 675506
2517 675506 671059 644333 647969 659945 621314 641041 566870 531769 580501 553754 515751 513352
2505 513352 480181 514690 556259 514520 489210 504735 547339 555309 493274 487269 586546 558394
2493 558394 517528 504318 475971 468396 352239 275766 322589 394193 461545 477453 446947 465665
2481 465665 382212 420955 420896 434112 417918 434075 466173 480313 456498 390027 426419 436068
2469 436068 402386 386572 423745 433748 393545 396662 389720 396440 431726 381322 378059 396056
2457C96056l2806l6126n5123o15N346J08254l9723o0561N8257P975p5464J6871
2445B92341O215m8151L8452j360l5424j5668K2532j9037k581j3275K2852l1717
2433B15179L7651m253j9104K616M741K7957p2343m5845Q344M0407K9946P238L294
2420B35828K7192j4270k2514m2376m0150L6007j8115k0234K0749K0118j6896o8292
2408I7047k6325N3911o534K545j0203J1360K1933n2642n931M6616j9067K0867
2396A33577m1614j0580Q2480o7766L39O4029K3997k4486P216L7318n9392m5472
2384I9646O6550M1924r361O0619q3229R091l0294L4249j1037n4794J8767J6507
2372A58638m6399P040j6947j7434K877L825N5316r763p3435Q583L4182l6419J0324
$$ plain form
2457 396056 363250 327124 272001 271386 276732 384986 345263 284702 342959 350934 275470 292341
2445 292341 298556 250405 288857 287497 252073 236405 258937 239900 237319 224044 246896 215179
2433 215179 252830 248577 229473 232089 236830 264787 192444 146599 154943 195350 225296 232534 235828
2420 235828 263020 248750 226236 183860 143710 179717 161602 141368 162117 182235 165339 97047
2408 97047 70722 124633 118099 120644 110441 121801 143734 91092 85161 131777 112710 133577
2396 133577 91963 81383 163863 96097 96436 160465 184462 159976 167192 204510 145118 99646
2384 99646 166196 208120 198759 259378 176149 185240 154946 189195 178158 123364 142131 158638
2372 158638 112239 119279 102332 84898 87775 91600 146916 137153 63718 72301 106483 70064 80388
2359H0388r093K820P03J6623j1255o778o966O732L0119j2120k5586k388j1488
2346E1711L3162K4670L932o0721J1314R704l029n2r712J6113J6036m3700J2636
2333F2064j2789P646K8457l4511M5782J5932l1328J6736K124o443j5366l0560
2321D7744m1082J1094N6441k7929L1987m183J9351l8147l0504N5053M5519k9214
2309I6130J4370l0874p861L1168p3272J7911K4297j8538j6071M1757L5823l466
2297A11374q2531M7955m8414r507N8173K7347j5931K550Q253j2829k2485m8383
2285A5572L6796p009q8026K6267M3650K4779j5854J8711N5637j9743l9201K7213
2273G8792m4654J965J5106L8525k3816J5742K3542J472l9434m1599N8595k2913
$$ plain form
2359 80388 71295 74115 74818 91441 80186 73408 66442 73174 103293 91173 65587 63199 51711
2346 51711 84873 109543 113475 52754 64068 73772 70743 70691 60979 77092 93128 49428 62064
2333 62064 49275 56921 85378 50867 96649 112581 81253 97989 100113 93670 78304 47744
2321 47744 6662 17756 74197 46268 78255 74072 93423 55276 24772 79825 125344 96130
2309 96130 110500 79626 71765 102933 29661 47572 71869 53331 37260 79017 114840 111374
2297 111374 28843 76798 28384 18877 77050 104397 88466 91016 99269 86440 63955 15572
2285 15572 52368 45359 -42667 -16400 27250 52029 36175 54886 110523 90780 51579 78792
2273 78792 34138 36103 51209 89734 65918 81660 105202 106674 67240 25641 84236 61323
2261F1323R875m1554J3333n691L3145O2160m2935m5915m316L6667N7347k5410
2249A08029n742l7789j8627k3661l0700M5223Q4222l7495j1885j9140r97L4631
2237H6069m6752o9735L3607N4294k9660j9690Q737L6259Q176P12k4549l8701M5315
2224D4082r630K586Q086L2027K667m4220P5753M3437L956k0591o2471K9499j2720
2211I2461k0892N743L6487J7064r795j1854j6888O012k2085M716J10806l3135
2199A58640m1658M6745k7513K3714M1791R870l2872L3416r581j4295J6393M128
2187B08778j2208K2204K4215J7904M8271k6170l4245K4948K5842O4157l4366K168
2175C31498K8733M0284k1394m0193j1128P9156n0035J9903N6946k4935Q1496l9231
$$ plain form
2261 61323 71198 29644 42977 37286 70431 132591 89656 43741 39425 76092 133439 108029
2249 108029 102287 64498 45871 22210 -8490 36733 120955 83460 71575 52435 51438 86069
2237 86069 39317 -30418 3189 57483 27823 8133 16870 53129 61305 62017 37468 -1233 44082
2224 44082 34452 37038 45124 77151 79818 35598 111351 154788 158744 138153 75682 105181 92461
2211 92461 71569 77312 113799 130863 121068 109214 92326 98338 76253 80969 191775 158640
2199 158640 116982 163727 136214 159928 201719 211589 178717 212133 202552 188257 204650 208778
2187 208778 196570 218774 242989 260893 309164 282994 248749 273697 299539 363696 329330 331498
2175 331498 360231 400515 379121 338928 327800 406956 356921 376824 433770 408835 490331 451100
2163D51100L7768Q2847n628K5918M8918l9477K3924P1132M9782K102K2113L1684
2151H02183R336N0378Q9515j7084M3354j6594N0303P3593k1387R46O8260R6212
2139A229015Q2856K3561J38982J71858J31044J30421K31173J12429N1462P7731
2129B380532O4711J57629K30148K67151M30892O16602P37790J096537J579177
2120G561169K142549K795203K452586M86727j827236k780947k340812j603254
2112F885985j116540q77168o69824n59705m31311l11037k83730k80927j80023
2103B175720k10138k5818j65634j33919j58991j67607j22772n7409j37881j3674
2093I81877P613p5454r2926p5298q1556q6135L3917k5965M111j23598n245L6845
$$ plain form
2163 451100 488868 571715 566087 592005 640923 601446 625370 696502 746284 748386 770499 802183
2151 802183 811519 861897 951412 934328 977682 961088 1011391 1084984 1063597 1064543 1132803 1229015
2139 1229015 1311871 1335432 1474414 1646272 1777316 1907737 2138910 2251339 2302801 2380532
2129 2380532 2445243 2602872 2833020 3100171 3531063 4147665 4885455 5981992 7561169
2120 7561169 9703718 12498921 14951507 15438234 13610998 10830051 8489239 6885985
2112 6885985 5769445 4892277 4222453 3662748 3231437 2920400 2636670 2355743 2175720
2103 2175720 1965582 1939764 1774130 1640211 1481220 1313613 1190841 1133432 995551 981877
2093 981877 989490 914036 821110 745812 664256 578121 612038 586073 590184 466586 461341 498186
2081D98186m8979J0775o8354j9061l5278k570r776m970r835m704l775L317j28477
2068A76499l9471Q6001j7007j556m0618N2268o612j9843L3130L539k5244j4990
2056A86096L950K6328o3081m5177m6044M4855J7628k9078J7936r245L2764j528
2044A35404r254k7184l0235k3408J7317J5562p8599M765J5526l036Q469M511l3648
2031c810O3491n8928j2769J1954k9319N4022K2809K7530l5600o768j7583j6963
2019a934n4021j9547N1865K3129J5058n0249n1090L9502K1453K6753j0079J3922
2007D762R189m3170n1740Q905M0266k0961m891J4705j4252M2987Q191q2669J9707
1994f8971O9810l9979j02597n913J7642M2731O6178k0431j3935j9270k6111o755
$$ plain form
2081 498186 449207 459982 391628 372567 337289 334719 324943 319973 310138 305434 301659 304976 176499
2068 176499 137028 223029 206022 204466 163848 216116 209504 189661 222791 226330 201086 186096
2056 186096 190046 216374 153293 108116 62072 106927 124555 95477 113413 104168 136932 135404
2044 135404 126150 98966 68731 45323 62640 78202 -397 4368 19894 16858 25327 29838 -3810
2031 -3810 59681 753 -12016 -62 -29381 24641 47450 74980 39380 32612 15029 -1934
2019 -1934 -55955 -75502 -23637 -508 14550 -35699 -86789 -47287 -25834 919 -9160 4762
2007 4762 13951 -29219 -80959 -72054 -31788 -52749 -57640 -42935 -57187 -14200 -6009 -88678 -68971
1994 -68971 839 -39140 -141737 -147650 -130008 -87277 -21099 -41530 -55465 -74735 -100846 -107601
1982a07601n4765L6558L371R220P1748K2540l6129M6948l0091J1853j3720M8453
1970H385r355q8100O0685k6948o7940P492J23449J8067p150M475p6540j0200o241
1957f9921K1199k0287l3986L3422j6587M6902K6805l0549k3296J6187l041j8555
1945g1707J5689l7525N6539n3315L2419j8562l6038k3442p8030P8139K6884l6568
1933a45517j9148N1451n215l6337J2341J6101K6218k3589R748r263l2338K7558
1921a27990L6766O7562o350k3217r0898L958P4938n89l9732j5560p471m4859m8881
1908b22323N2357M8707r788n4939J7903k2429K9169L5073m0075m875l5267Q942
1896a97545N4224l9968P0726L0137n3804l0204J2929M3870J2902R901K3678r617
$$ plain form
1982 -107601 -162366 -125808 -122437 -113217 -41469 -18929 -55058 -8110 -38201 -26348 -40068 8385
1970 8385 -970 -89070 -28385 -55333 -123273 -115781 7668 25735 18585 23060 -53480 -63680 -69921
1957 -69921 -48722 -69009 -102995 -69573 -86160 -39258 -12453 -43002 -66298 -50111 -53152 -71707
1945 -71707 -56018 -93543 -37004 -90319 -57900 -76462 -112500 -135942 -213972 -135833 -108949 -145517
1933 -145517 -164665 -113214 -118429 -154766 -142425 -126324 -100106 -123695 -113947 -123210 -155548 -127990
1921 -127990 -91224 -23662 -30012 -53229 -144127 -140169 -65231 -65820 -105552 -121112 -128583 -173442 -222323
1908 -222323 -169966 -121259 -131047 -185986 -168083 -190512 -161343 -126270 -166345 -171220 -206487 -197545
1896 -197545 -143321 -183289 -112563 -82426 -136230 -166434 -153505 -109635 -96733 -86832 -63154 -72771
1884g2771k764J3518k257j2835K8487l9817l2460K4348n690j5094K9232p1945
1872a60048k3814j8328P2782K4849j7566P2990j3846m2948J3419k0270k9894L4762
1860a07912Q434Q693J1046k7471k8802R9152j9440r893J9431q6589L5403K8613
1848f9335N0522N456m9265l8989K273N2270n7630n256L7873K0453r8680K2556
1836a27752j0148m3818K4225P991m3345N1433L33N3342j8042m2050j7791L753
1824a61869P0396J0527k8648J7626m9335J5595L5813L298j9062J9197k027r0278
1812a78767L5924k5811J5857N9377o309K9529m5124l8793M1610j3189J5927L8033
1800g1736J0594m3124K5523K631L0272K1248o2360l3328K174N7186l6015o2311
$$ plain form
1884 -72771 -75535 -62017 -64274 -77109 -48622 -88439 -120899 -96551 -102241 -117335 -88103 -160048
1872 -160048 -183862 -202190 -129408 -104559 -122125 -49135 -62981 -105929 -92510 -112780 -142674 -107912
1860 -107912 -99478 -90785 -79739 -107210 -136012 -36860 -56300 -66193 -46762 -133351 -97948 -69335
1848 -69335 -18813 -13357 -62622 -101611 -99338 -47068 -104698 -109954 -72081 -51628 -150308 -127752
1836 -127752 -137900 -181718 -157493 -149502 -192847 -141414 -141081 -87739 -105781 -147831 -165622 -161869
1824 -161869 -91473 -80946 -109594 -91968 -141303 -125708 -89895 -86597 -105659 -86462 -88489 -178767
1812 -178767 -142843 -168654 -152797 -93420 -99729 -70200 -115324 -154117 -112507 -125696 -109769 -71736
1800 -71736 -61142 -104266 -78743 -76112 -45840 -24592 -86952 -120280 -118106 -60920 -96935 -159246
1788a59246J9023M4400L148N0622j3791l8883n3478J5900j4392m7526M9987j7456
1776a61692J7162j1771o151K5146k6971R366j6801l6447K3661N3212M1981j7893
1764a07198k565K3991n1307m3636P7857n1296J8156L3464j002k8967o5495L6613
1752a61385P1746M1632p9259K5924k8128l5995k133j9202P7223M2001J1234N5319
1740a023n3285m7258l9605O331k7831N1583N5206n4245J6610j8472M236n0618
1728a58371L544K1681O3375J8211p3863l7984P518J8293L0564P4520l2029q2395
1716a46936p789l8640J2233R1086J8055k7979L1933k7917J2859m5178q368K463
1704a34178k1803j2319N8937L6490M6636j3250k8760j8067Q24l1141j0196L9979
$$ plain form
1788 -159246 -140223 -95823 -92675 -42053 -55844 -94727 -148205 -132305 -146697 -194223 -144236 -161692
1776 -161692 -144530 -156301 -162452 -137306 -164277 -154911 -171712 -208159 -184498 -131286 -89305 -107198
1764 -107198 -109763 -85772 -137079 -180715 -102858 -154154 -135998 -102534 -103536 -132503 -197998 -161385
1752 -161385 -89639 -48007 -127266 -101342 -129470 -165465 -167598 -186800 -109577 -67576 -56342 -1023
1740 -1023 -54308 -101566 -141171 -134840 -162671 -111088 -55882 -110127 -93517 -111989 -107753 -158371
1728 -158371 -154827 -133146 -69771 -51560 -125423 -163407 -155889 -137596 -107032 -32512 -64541 -146936
1716 -146936 -154725 -193365 -181132 -90046 -71991 -99970 -68037 -95954 -83095 -128273 -136641 -134178
1704 -134178 -155981 -168300 -109363 -72873 -26237 -39487 -68247 -86314 -85490 -116631 -126827 -86848
1692h6848J6136k9869k5110n4769j0854N1766M3498K9443j9546N065o5834l6917
1680a83839J4232N7059j3780Q172L9213q385l3128M3871k626l785j1892P453Q032
1667g9403m071m3118R770K8388j2612L7565o275n6890n8406N4431n5243l123M8961
1654a40026O7208q4940l2494N1082j2406n916m911O4130J3740J9081l8152k8497
1642a32101j9027K0561m4561P926P1640J7692J9022r0144m668M3536m3563j2460
1630a66147K3834M2266m1560k2918j3023M8282k9903m5767N3250k3721M3915J8445
1618a13047L1976k9615m5465L5959o465L4856k996K1169j5487m7643O9093J7828
1606d9837m6218L191j6937Q38m0318j8951q501R963N2164p890l3674N4766p27
$$ plain form
1692 -86848 -70712 -100581 -125691 -180460 -191314 -139548 -96050 -66607 -86153 -81088 -146922 -183839
1680 -183839 -169607 -112548 -126328 -118156 -78943 -87328 -120456 -76585 -79211 -82996 -94888 -87435 -79403
1667 -79403 -83474 -126592 -116822 -88434 -101046 -63481 -69756 -126646 -185052 -130621 -185864 -188987 -140026
1654 -140026 -72818 -157758 -190252 -139170 -151576 -157492 -162403 -98273 -84533 -65452 -103604 -132101
1642 -132101 -151128 -130567 -175128 -167202 -95562 -77870 -58848 -148992 -153660 -110124 -153687 -166147
1630 -166147 -142313 -100047 -141607 -164525 -177548 -129266 -159169 -204936 -151686 -175407 -131492 -113047
1618 -113047 -81071 -110686 -156151 -120192 -126657 -91801 -94797 -73628 -89115 -136758 -67665 -49837
1606 -49837 -96055 -92864 -109801 -108963 -149281 -168232 -176733 -166770 -114606 -122496 -156170 -101404 -102131
1593a02131K5961n4246l6839J5694N4573O5793l7116n6341l735O2612J1594k3951
1581g8132J0630p1253k5137J2575q5703J0628K6182K686K2291O1573J2588o089
1569a07161O6883j638o9036J7818L3171m838L2017q4143j1751O243K1338j4626
1557a15723J9488L3466p010N314M599l2619L1822K6688l3282M7006r434j2519
1545d2204Q077j9963J0576j0168K2552J7666j4105l8018n5396J4512q888M3412
1533g1947l4118j5377k0777N6603M4555m9734j17342O7991M54l3461J2136N9300
1521a01717l1446K7894o208o717J7759r564L838k0054m3217L1850K9408k9400
1509a37574k4113K768L0127L7662j4357j0698M2305M189o4238K2583J8530n2696
$$ plain form
1593 -102131 -76170 -130416 -167255 -151561 -96988 -31195 -68311 -124652 -128387 -65775 -54181 -78132
1581 -78132 -67502 -138755 -163892 -151317 -237020 -226392 -200210 -197524 -175233 -113660 -101072 -107161
1569 -107161 -40278 -41916 -110952 -93134 -59963 -64801 -32784 -116927 -128678 -122435 -101097 -115723
1557 -115723 -96235 -62769 -69779 -64465 -59866 -92485 -60663 -33975 -67257 -20251 -29685 -42204
1545 -42204 -34127 -54090 -43514 -53682 -31130 -13464 -27569 -65587 -120983 -106471 -115359 -71947
1533 -71947 -106065 -121442 -142219 -85616 -41061 -90795 -208137 -140146 -139692 -173153 -161017 -101717
1521 -101717 -133163 -105269 -111477 -118194 -100435 -109999 -106161 -126215 -169432 -137582 -108174 -137574
1509 -137574 -161687 -158919 -128792 -91130 -105487 -116185 -73880 -69691 -133929 -111346 -92816 -145512
1497a45512J7908N80O2009J0263m8895k8394j9725L6234N353p6092M02N745p693
1484a87817M0535K7249P752J1530r451K7679k2766j8503K1197P81p8017P7669
1472a02162j4861O6027j8383l3715N4669K4968l7782l4227p6163J9651J1546N3983
1460h6449J9615n6017K9069O1534l7170j1392L289n6414K6414L1231L8659m0893
1448g8524m352K9650K9062p5606l7135M4295L5901K148j4247o6369N4785K9367
1436e1025m0q862j6158O272m7462m5928K4392J8384m216k1417J5580l4484N4959
1423a10005n3005l1699L1434N1428J3267K6643o074m6647Q632N0768L2580j9542
1411e2220k9489n10q4580l4600N9198J012M0993J7161l6962q6135L7321O1493
$$ plain form
1497 -145512 -127604 -127024 -65015 -54752 -103647 -132041 -151766 -115532 -110179 -186271 -185869 -180124 -187817
1484 -187817 -147282 -120033 -112281 -100751 -110202 -82523 -105289 -123792 -102595 -101814 -179831 -102162
1472 -102162 -117023 -50996 -69379 -103094 -48425 -23457 -61239 -95466 -171629 -151978 -140432 -86449
1460 -86449 -66834 -122851 -93782 -32248 -69418 -80810 -77521 -133935 -107521 -76290 -37631 -78524
1448 -78524 -82876 -53226 -24164 -99770 -136905 -92610 -56709 -54561 -68808 -135177 -80392 -51025
1436 -51025 -51065 -59927 -76085 -69813 -117275 -163203 -138811 -120427 -124643 -146060 -130480 -164964 -110005
1423 -110005 -163010 -194709 -163275 -111847 -98580 -71937 -78011 -124658 -116026 -65258 -32678 -52220
1411 -52220 -81709 -82219 -166799 -201399 -142201 -141189 -100196 -83035 -119997 -206132 -168811 -107318
1399a07318K7316Q020J976j5264l0851J6319P2162j0367j3822k1580q915J1451
1387g0873r928l2095L5361n9003J095N7240R91Q601l4884K9500Q140n1489L8683
1374g8661K2907j3044k7219p132L5231k5471o9608K7795k1525N0097K8891P436
1362g0303j1020q403O1217M2295q817k1870k1814k5875L4312l8825k2104l5679
1350a26886K1253j9309k0204O2206J7761k149n5858O4761o749m481J1359J1685
1338d6611L7761j8008m3337K6928P877m8848l4615K6932J5990R465l0201K9441
1326f7226k285l1140n0790m22M3063L4514M7039l4226n9928n8611M4276K7223
1314a08513n600Q172P3531l6903P8292J0423M356n1172O765J198k2632R806O065
$$ plain form
1399 -107318 -80002 -71982 -70006 -85270 -116121 -99802 -27640 -38007 -51829 -73409 -82324 -70873
1387 -70873 -80801 -112896 -77535 -136538 -135443 -78203 -77212 -68611 -103495 -73995 -65855 -117344 -78661
1374 -78661 -55754 -68798 -96017 -103149 -67918 -93389 -162997 -135202 -156727 -106630 -77739 -70303
1362 -70303 -81323 -89726 -28509 13786 4969 -16901 -38715 -64590 -30278 -69103 -91207 -126886
1350 -126886 -105633 -124942 -145146 -82940 -65179 -67328 -123186 -58425 -65174 -69655 -58296 -46611
1338 -46611 -8850 -26858 -70195 -43267 -35390 -84238 -118853 -91921 -75931 -66466 -96667 -67226
1326 -67226 -69511 -100651 -151441 -151863 -108800 -74286 -27247 -61473 -121401 -180012 -135736 -108513
1314 -108513 -114113 -105941 -32410 -69313 8979 19402 23758 -27414 -20649 -19451 -42083 -32277 -26212
1301b6212j9973m6182L1749L3715J4928P413p5269J4765L0463P1916q4958J702
1289d5943K8788r4983J7676m8336J818n9949J1070M8112k1762O409P063O967K6686
1276a16384K260N4646k0106m3398n6953L3601M1557N3283P468k6335l6172K3261
1264h3272j9193L797N0744m8781J2039K646K6042o1841j4179j6902L6450o6256
1252a78706O3944K0470m3931M0229Q0476k9348m0069L7316J7136m8481j508N167
1240g7305P970N7492k1701J1638K6197q0344j9987n82k1889L2366P4769J5905
1228D529j18895M9671k874m3461L8269J9144k7438Q853L1218K7729L6563k0227
1216C081p1844j546p496m160O939K9213p8111N3350K120k4200R6660j1503q8835
$$ plain form
1301 -26212 -46185 -92367 -60618 -26903 -11975 -4562 -79831 -65066 -34603 37313 -47645 -45943
1289 -45943 -17155 -112138 -94462 -142798 -140980 -200929 -189859 -141747 -163509 -157100 -150037 -143070 -116384
1276 -116384 -114124 -59478 -79584 -122982 -179935 -146334 -104777 -51494 -44026 -70361 -106533 -83272
1264 -83272 -102465 -98668 -47924 -96705 -84666 -82020 -55978 -117819 -131998 -148900 -112450 -178706
1252 -178706 -114762 -94292 -138223 -97994 -17518 -46866 -86935 -49619 -32483 -80964 -82472 -77305
1240 -77305 -69335 -11843 -33544 -21906 4291 -76053 -96040 -96622 -118511 -86145 -11376 4529
1228 4529 -114366 -64695 -67569 -111030 -72761 -53617 -81055 -72202 -40984 -13255 23308 3081
1216 3081 -68763 -70309 -77805 -81965 -75026 -45813 -123924 -70574 -68454 -92654 4006 -7497 -96332
1203i6332K2752M5409k6750k7912K2677J7129P2297P810p0400n8340K2876J3973
1191e4811N6162j26735P0003O1195K884n3652j04820O5338o651L1215P340J8552
1179c3980O7169o1706l7314L0190m7260N168L1496m095M934M6356N052j00663
1167i4653k8847M470J3574N4492k0173K0745K8823P732o8860J0008k7702j1927
1155a12318L9718j6147N7951L0211l1021k0160p68K8682n7155K3790M983J654
1143e0580L4489N840K3379l3430r2753P2097n4386R636O5140j6623k705L4850
1131e046k7629J2131L9883q7538j2442P3803K710k4858j6513M8784j0098p62o007
1118a3582k5644k2973M5708K4487p5614K2383L5227j917l6121J4359J3674L4678
$$ plain form
1203 -96332 -73580 -28171 -54921 -82833 -60156 -43027 29270 37080 -33320 -91660 -68784 -54811
1191 -54811 1351 -125384 -55381 5814 8698 -44954 -149774 -84436 -91087 -59872 -52532 -33980
1179 -33980 33189 -28517 -65831 -35641 -82901 -77733 -46237 -50332 -45398 958 6010 -94653
1167 -94653 -123500 -119030 -105456 -50964 -71137 -50392 -21569 -13837 -82697 -72689 -100391 -112318
1155 -112318 -72600 -88747 -30796 -585 -31606 -51766 -52534 -23852 -81007 -57217 -52234 -50580
1143 -50580 -16091 -10251 13128 -20302 -113055 -40958 -95344 -85708 -20568 -37191 -39896 -5046
1131 -5046 -32675 -20544 19339 -68199 -80641 -6838 -4128 -28986 -45499 3285 -6813 -7575 -13582
1118 -13582 -39226 -62199 -16491 7996 -67618 -45235 -10008 -11925 -48046 -33687 -20013 14665
1106A4665M5287m4140P555K0313o1243j1952k0834k1568K5368J2130j1638L4406
1094a1651j6347l2780O6541l1027k1489R990k5990N4286l8450l4280L5399j9427
1082f5225P920p775J7467j2310N3319j4199q293m0077k0477O5259M1277M6018
1070F2904j01629J0758k4392o905L8972J5483l358j5378q2824J00243q6285M001
1058h8410K9485K2623L4564J463j9343m3360j438O9855r383K6921j0417m6312
1046c3752J0048m804J239j029k0826R352N9827r0366P9613l7318K5463K0215k9717
1033a2055M8180o0804J0518L0142M1578K1193o9837n0248M258K979l3088k8007
1021i5191M033J9281k024R850j6087J7001L7788J01737j1127n4592O0895j3940
$$ plain form
1106 14665 59952 15812 23367 43680 -17563 -29515 -50349 -71917 -46549 -34419 -46057 -11651
1094 -11651 -27998 -60778 5763 -25264 -46753 -36763 -62753 -8467 -46917 -81197 -45798 -65225
1082 -65225 -57305 -65080 -47613 -59923 -6604 -20803 -29096 -69173 -89650 -24391 16886 62904
1070 62904 -38725 -27967 -52359 -59264 -20292 -4809 -8167 -23545 -106369 -6126 -92411 -88410
1058 -88410 -58925 -36302 -1738 -275 -19618 -62978 -64416 5439 -3944 22977 12560 -33752
1046 -33752 -23704 -28508 -27269 -28298 -49124 -39772 20055 -70311 9302 -28016 -2553 17662 -12055
1033 -12055 36125 -24679 -14161 15981 57559 78752 8915 -41333 -37075 -34096 -67184 -95191
1021 -95191 -91158 -71877 -73901 -64051 -80138 -63137 -25349 76388 65261 10669 71564 57624
1009E7624o0828K5339p7762M9220R938j0609m6918L6869Q627M231N694q0103J6031
996f2647N3286n71p545j0603J956j216R064j8727j8067J9385k3109M7226K3293
983A1725r529k7797j0968J7303M8576Q0356j3031m0565j4037O628l0811o5268
971d7418M6352K4376Q577L58m9326N284J7376q750O4795L1497m2734m7283q7781
958h4677M3399R0754Q242q52j8728J6669k1320L2505o7496k6859L1481L1801p1952
945c7033l2672J14231k0157n4900m69L8245K4769j9649M796l0106m7783K6284
933c4444M4692J3336P967l7994k435k4107l6006N6463O2207Q052k2217K7766l5966
920B7314m5477M0481L603k5232L1309N4487n4176n4861k9275j2982P6650O4106
$$ plain form
1009 57624 -3204 22135 -55627 -6407 3531 -7078 -53996 -17127 -8500 -4269 1425 -78678 -62647
996 -62647 -9361 -9932 -17477 -28080 -26124 -27340 -18276 -37003 -55070 -35685 -58794 -11568 11725
983 11725 2196 -25601 -36569 -19266 29310 109666 96635 56070 42033 48661 17850 -47418
971 -47418 -1066 23310 31887 32245 -17081 -11797 5579 -3171 61624 93121 50387 3104 -84677
958 -84677 -41278 49476 57718 56866 38138 54807 33487 65992 -1504 -28363 3118 34919 -37033
945 -37033 -69705 44526 24369 -30531 -31000 7245 32014 12365 17161 -12945 -60728 -34444
933 -34444 10248 23584 31551 -6443 -8878 -32985 -68991 -12528 49679 57731 35514 63280 27314
920 27314 -18163 22318 25921 689 31998 86485 32309 -22552 -51827 -64809 11841 75947
908G5947q3670K8029j2392l4591N701N1836n1496k6278O6345J7726J885L2201
896G1243n8236J7254M8695k7582K4130m7384l9388L3827m6937j5868L0267N2174
884D2195M0045j6363K7815n827l528l1382K1917q6763J7530K6111j3148j0265
872H337J01894j1928j20501K7652l0373P3204K5882K7750J2581l9664l8877k5065
860A0892P773k5401J1808K1538L3030m488q431j3825o1039m8381O6271K8410j6613
847A544q312m0382L6760Q8394n4419M3832l1956k1045M1261L4242N4702k3692
835A20929p4491p085m5561k410O614J9577J1675M7388J9665L620j6792m041K4020
822A03108K2372n7545m0860O1905L460r9112L3391N0888k8619M3104n6680m2861
$$ plain form
908 75947 -7723 20306 7914 -26677 -20976 30860 -20636 -46914 19431 37157 39042 71243
896 71243 13007 30261 78956 51374 75504 28120 -11268 22559 -24378 -40246 -9979 42195
884 42195 82240 65877 93692 87865 84337 52955 74872 -11891 5639 31750 18602 8337
872 8337 110231 98303 -22198 5454 -24919 48285 74167 101917 114498 74834 35957 10892
860 10892 18665 -6736 5072 26610 59640 55152 46721 32896 -28143 -76524 -10253 18157 1544
847 1544 -6768 -47150 -10390 78004 23585 67417 35461 14416 55677 89919 144621 120929
835 120929 46438 39353 -6208 -8618 -2004 17573 29248 76636 96301 99921 83129 79088 103108
822 103108 125480 67935 27075 88980 92440 -6672 26719 77607 48988 92092 35412 -7449
810g449j8072K6276K4715K8140J688p304l5095J2927N0108j8829j5574l8751J722
797D502Q975l4580j273j8930o229k901O0682m7340M2021R1466j7757M8307k5501
784A01442j4918o8794k0766Q6312L341n7497M4271K6014l9154K1429M0628L266
772A25574n5458L188q1859P2470q0208q855M4801M3424j9968J3460K4517l1841
760D9245l4801J8031P1022j8375M5322j2509n7192P651L5027k5418m4837p6747
748d3581L2154P3459J5183k2059q385l6408R7552m2465q9488M8827L3149M7521
736A05459k4679j05590k3769j4612L1741J9477j1071P7580M858o5225o3468J306
724f7993M4048N4365K0103k6833k4135M8591L8474k7538j2685J5057J8803O29
$$ plain form
810 -7449 -25521 755 25470 53610 55298 47994 12899 25826 75934 57105 41531 2780 4502
797 4502 13477 -21103 -22376 -41306 -47535 -50436 10246 -37094 4927 96393 78636 126943 101442
784 101442 86524 17730 -3036 83276 86617 29120 73391 99405 60251 81680 122308 125574
772 125574 70116 73304 -8555 63915 -16293 -25148 19653 63077 43109 56569 81086 49245
760 49245 14444 32475 103497 85122 130444 117935 60743 68394 103421 78003 33166 -43581
748 -43581 -11427 62032 77215 55156 46771 10363 107915 65450 -24038 24789 57938 105459
736 105459 80780 -24810 -48579 -63191 -31450 -11973 -23044 54536 59394 -5831 -69299 -67993
724 -67993 -23945 30420 50523 23690 -445 48146 86620 59082 46397 61454 80257 80886
712H0886o512J3317J5592N1163l5076n0308j0769J3910q191M6300q45q61R536
699A18142q4771N2875j1590k983J895J0714N4181p0804j8124M600M0427K5347
687A19909m5027J2674O300j5659K9860j9047L5755n8554n3586m3391p041M5334
675G527k2158J7974L5899O6210J7262k4069k131l5864j5861k0219R1194j3739
663A02025r7355K1492N4614L7049j7652J5239j013k1848m1182l1314K5613M4675
651I0343n6885L5954j0147J8905k2025p994j1611L5475L9343r224J4300q671J7581
638A25344J6069l3330k0305j380n614J5015j2937M3334r196m5945J62M376K2104
625I7697L4873k2166m4116N1725L713L841l7855l2660o211L8770J9597K052l7776
$$ plain form
712 80886 74374 87691 103283 154446 119370 69062 58293 72203 64012 110312 109467 108606 118142
699 118142 33371 86246 74656 71673 73568 84282 138463 67659 49535 54135 94562 119909
687 119909 74882 87556 93856 78197 108057 89010 124765 66211 12625 -30766 -37807 7527
675 7527 -14631 3343 39242 105452 122714 98645 96514 60650 44789 24570 115764 102025
663 102025 4670 26162 80776 117825 100173 115412 114399 92551 51369 20055 45668 90343
651 90343 33458 69412 59265 78170 56145 48151 36540 72015 111358 102134 116434 107763 125344
638 125344 141413 108083 87778 86398 80784 95799 82862 126196 117000 71055 71217 75593 97697
625 97697 132570 110404 66288 118013 121726 125567 87712 55052 48841 87611 107208 109260 71484
612G1484O4073j3770l9149k3993O9293j1835j3846j3419j156L8924m4498k4604
600E7504J3805L0583M3811m6361k3808J6176l8176j307l2131O8091K8270N639
588A22096o2909r287j89K2842m213J4269J2292q185k2656l3288K5603J8459l2798
575D2036J3061K6863k4521k1028L9580j305K570L1184L7126p8448l0088J2182
563D9212M6655P778L7315l3797J508K3498j9405n8998L6343M1298l4217k1393
551G5797O9622o604o2339O5713o2284n4062M6648K5220l5742P559M7372L4751
539A51651l0034l6397k9532K2319L3180R469J0131K3067k1191J2901K711J719
527A49994r5739j3795L0992L1064J1960M1954M2982m8556j1269k7088n5657m460
$$ plain form
612 71484 135557 121787 82638 58645 127938 116103 102257 88838 87682 126606 82108 57504
600 57504 71309 101892 145703 99342 75534 91710 53534 52227 20096 88187 116457 122096
588 122096 59187 49900 49711 72553 68340 82609 94901 86716 64060 30772 56375 74834 42036
575 42036 55097 81960 57439 36411 75991 74686 77256 108440 145566 67118 37030 49212
563 49212 95867 103645 140960 107163 108671 132169 112764 53766 90109 131407 97190 75797
551 75797 145419 138815 76476 142189 79905 25843 72491 97711 61969 69528 116900 151651
539 151651 121617 85220 55688 78007 111187 120656 130787 153854 132663 145564 148275 149994
527 149994 54255 40460 71452 102516 114476 156430 199412 150856 139587 112499 56842 52382
515E2382M6254m153m6425j3746K7666N894m1801K7969Q7256K8804k3544J0267
503A56823K249o4476L3692p773k14l198M700o3545j2375K2757L9317L891o1921
490D9927n4952N1849M3970N0713J6254k4096l5998j0673O462l8651k0905L6082
478F9982M0879J8157N8539R478J9971k5688k1620j2434o0425L724L2177k0246
466A12494k209j0969o1383K0095P4808k0326J5164k0076r090k0487m2100N5091
454I1012N5852m5713K902n150J9616J3069j2123J208L8409K2905p3350K4750l3438
441I9949K673j8847l4087J12615l5999L543p1918n5650M1045L3629L9407J7399
429A33759K3643j9401j8534M8010q4691k7989R4746O582Q974o415k1000p821Q631
$$ plain form
515 52382 98636 94483 48058 34312 61978 67872 26071 54040 141296 170100 146556 156823
503 156823 159072 94596 128288 120515 120301 117103 121803 58258 45883 68640 107957 111848 49927
490 49927 -5025 46824 90794 141507 157761 133665 97667 86994 93456 54805 33900 69982
478 69982 110861 129018 187557 197035 217006 191318 169698 157264 96839 100563 132740 112494
466 112494 110285 99316 37933 58028 132836 112510 127674 107598 98508 78021 35921 91012
454 91012 146864 101151 104053 98903 118519 131588 119465 120673 159082 181987 108637 133387 99949
441 99949 102622 83775 49688 162303 126304 129847 57929 2279 43324 76953 116360 133759
429 133759 157402 138001 119467 167477 82786 54797 149543 156125 165099 158684 137684 129863 138494
416A38494R764o360J4170p885m3857J3762N3393L4780k3763q9594O435o4892M0961
403G5408O7807q77N6410k7533p82P612p3431K9347l8518L5706M340J4880q3376
390F6993N170o593Q386K1217r132L7799j1578K9906j9444M937l003J8644j16017
377B7285L4422M9921l0689k8846M8839M1123M7596r6090l3031N7870q657n230
365A04513J1520o404J040J0164K6071l1969L17N3092N752o241l2545p2770m1739
352B0801L5519R1151l7722r19J8647j4787K4232J1936l4584K2118k8848K9263
340A36807L7648j1087J3366P605r264J2644L147l9904P034M340o648k46o297M5495
326A94640J2188j6536L0596l6049j5756M5030o5849k4489L015J8485l481j1552
$$ plain form
416 138494 148258 141898 156068 148183 104326 118088 171481 206261 182498 92904 99339 34447 75408
403 75408 143215 142338 198748 171215 170433 178045 104614 133961 95443 131149 135489 150369 66993
390 66993 72163 65570 73956 95173 86041 123840 112262 142168 122724 127661 124658 143302 27285
377 27285 61707 111628 80939 52093 100932 142055 189651 93561 60530 118400 109743 104513
365 104513 116033 109629 110669 120833 146904 114935 115252 168344 174096 167855 135310 62540 20801
352 20801 56320 147471 109749 108830 127477 112690 136922 148858 114274 136392 107544 136807
340 136807 174455 163368 176734 184339 175075 187719 190866 150962 157996 162336 155688 155442 149145 194640
326 194640 206828 190292 220888 184839 169083 214113 148264 123775 126790 145275 141794 130242
314A30242J9780n1731J9262L2706o0305j6918N1809K999K3806J0031o2662m3854
302E5165J1303J6277Q4864j6173l985J6368k1787L1403j4424L1278r163l687o3088
289A14351l1023j1272L9193R1234n4722N5051m7305J2139j8748m9439P1858m707
277A66610N541m6762j5702M0053p8208n013L6102K3539k0305p647O3524J1674
265A73406j4985p32M1103m5965Q168k1650m7112O1593R894J2665j6933J815l6765
252A24502L8057M221k4239m882M2940m7043k9795M9593K5616K2131j03249L6372
240A34224O5694l3000q1463K718M1339P27K677J7270n962L998J23124k8735n3276
227A89335m3325N6626l353o472K2352p2327K5597k8995M5654P6351m0524R485
$$ plain form
314 130242 150022 98291 117553 150259 89954 73036 124845 127844 151650 161681 99019 55165
302 55165 66468 82745 167609 151436 147451 163819 142032 173435 159011 190289 181126 177439 114351
289 114351 83328 72056 111249 202483 147761 202812 155507 167646 148898 99459 171317 166610
277 166610 172151 125389 109687 149740 71532 66519 102621 126160 105855 98208 161732 173406
265 173406 158421 157689 198792 152827 160995 139345 92233 153826 163720 176385 159452 161267 124502
252 124502 162559 166780 142541 137659 180599 133556 103761 153354 178970 201101 97852 134224
240 134224 199918 166918 85455 88173 129512 130239 132916 150186 144224 148222 271346 242611 189335
227 189335 146010 202636 199283 192811 215163 142836 168433 139438 185092 261443 220919 230404
215B30404k5499k5529n8719O631l3678M5679Q8050p5759j5603J364j1642J6808
203A42507M8700J3593l9257l3027K2182J0711j0469k7777K9887K9832J6514k1081
191A82315n688m6757o3405N4955j9119K3379O9700o118J3233k1767j1213l7016
179A32499J7211j7684r6441P1621M7494Q513O0679r849k7331J5976L7269j2937
167B27020o7198K094L254l2476J5574j3646J1156l0279O0275J0360j1501R217
155A83850N0838K7541m8723k1933k6707J4741j1509j5609L556m250N1730l1903
143A71622L0193j9667o5897M2076K4125p158j2480n1771M216M8410L9590j6658
131A86601l3545K5863K7428j2514R891J5070L908j6619O124J9377m9620J6607
$$ plain form
215 230404 204905 179376 120657 127288 93610 139289 227339 151580 135977 137341 125699 142507
203 142507 191207 204800 165543 132516 154698 165409 154940 127163 157050 186882 203396 182315
191 182315 176627 129870 66465 121420 102301 125680 195380 189262 202495 180728 169515 132499
179 132499 149710 132026 35585 107206 154700 163213 223892 214043 186712 202688 239957 227020
167 227020 159822 161916 165170 132694 148268 134622 145778 115499 175774 186134 174633 183850
155 183850 234688 262229 213506 191573 164866 179607 168098 152489 156045 151795 203525 171622
143 171622 201815 182148 116251 158327 182452 175294 162814 111043 115259 163669 203259 186601
131 186601 153056 178919 206347 193833 203724 218794 222702 206083 212207 231584 181964 198571
119A98571K4949n8697l8563M7559J754K4642k2130n3965K3501K7595K9316l5859
107A68673K194O0865L1635m1278m5088J8450j3585o913J7046J5179j6745J6370
95B06803J2776o641k8221L1865K7095q538n8866J6474J8246k5247M4187J4948
83B44881o5855k9762K9238J6871R818j278K3200k7235l8684J1413J4009L1426
71B18042J1371K6237k6540n2800R673J1034l7892O483J5204j5511L7221k0198
59A82324m288L0171K4039l7593j2585O8512m2254k9930k9125j3481J4730K338
47A52858k7584M8671j5997J0558N6595l9992j4165q71l0732L2708j5647K4770
35A81172P0934j8653j8174k4404L7191j1239n859L7465L062J540n0007L018p335
$$ plain form
119 198571 223520 164823 126260 173819 175573 200215 178085 124120 147621 175216 204532 168673
107 168673 170867 231732 263367 222089 177001 195451 181866 174953 191999 207178 190433 206803
95 206803 219579 212938 184717 216582 243677 235139 176273 192747 210993 185746 229933 244881
83 244881 179026 149264 178502 195373 205191 203913 227113 199878 161194 172607 186616 218042
71 218042 229413 255650 229110 176310 185983 197017 159125 165608 180812 165301 202522 182324
59 182324 178036 208207 232246 194653 182068 250580 208326 178396 149271 135790 150520 152858
47 152858 125274 173945 157948 168506 225101 185109 170944 170073 139341 172049 156402 181172
35 181172 252106 233453 215279 190875 228066 216827 210968 248433 251495 253035 203028 206046 198711
22A98711k1472M6891L03J8539j7104k2905J5149j1762R192j2744o356O382k5969
9A76855L7823K1086L503l0339j9823L2432j438l6341L3463
0B17221
$$ plain form
22 198711 177239 224130 224433 242972 225868 202963 218112 206350 215542 202798 196442 202824 176855
9 176855 214678 235764 239267 208928 189105 221537 220099 183758 217221
0 217221
$$ Imaginary data points
##PAGE= N=2
##DATA TABLE= (X++(I..I)), XYDATA
16383b537525M1131L0173P4366K5362o77L6254L1382J8305N8803O8899M2195M4941
16371b066391O1409J6409R514N3675R4700J5766L3660K8200J4302J0609K1368
16360a706779L4726R9356m675K4983P2672M6478N3171K0549M0121L5260K0422
16349a263716N2204J8928M4097Q7133N2215j2570M0224O1373K7634L5123L3961
16338h23394L7599O6176K9329J5918M0006M4261K354M8527L9236L1176L6553K9552
16326d02707K3866M9225P3571O7380K6675N402J6435O0433O0771N987L9628K8057
16314E4723P648K2412L5352N4591P435K0240R5672J1912J1602N7917Q545j4110
16302C73939N4863M6096J9235J150M5536K6764R6775N0010L3351K649K7893R0685
$$ plain form
16383 -2537525 -2496394 -2466221 -2391855 -2366493 -2367170 -2330916 -2299534 -2281229 -2222426 -2153527 -2111332 -2066391
16371 -2066391 -2004982 -1988573 -1979059 -1925384 -1830684 -1814918 -1781258 -1753058 -1738756 -1728147 -1706779
16360 -1706779 -1672053 -1572697 -1577372 -1552389 -1479717 -1433239 -1380068 -1359519 -1319398 -1284138 -1263716
16349 -1263716 -1211512 -1192584 -1148487 -1061354 -1009139 -1021709 -981485 -920112 -892478 -857355 -823394
16338 -823394 -785795 -719619 -690290 -674372 -634366 -590105 -587751 -539224 -499988 -468812 -432259 -402707
16326 -402707 -378841 -329616 -256045 -188665 -161990 -156588 -140153 -79720 -18949 -12962 26666 54723
16314 54723 62371 84783 120135 174726 182161 202401 298073 309985 321587 379504 388049 373939
16302 373939 428802 474898 494133 495283 540819 567583 664358 714368 747719 750368 778261 868946
16290H68946L0670p877L8510O5208k1442K9754J5156l3511L5183N7806M5482K4511
16278A148396n834O816O5142M3734J1767L3780K8402N1408O3276j1671j372j2690
16266A421154K0926j4714R0883M1623m346M9490J5303N5503K5228K1274M0080
16255A762404m0099J6382O0468N6113O2610j5502l634O1849J2887m3052L9335
16244A969761Q784K2123O0120k5890M834J18638m0239M9756N4576l9506J6244
16233B199201P6914r101k6721j918N5682N5766J5058o171k5654M7637K6254K1539
16221B428486L1828N3544O171K0590M7001j5572m1695J7377j1334N9050J9752
16210B615198O6290L0485j3888k9307K9662K017R136K8802M3937J3781L0345l0548
$$ plain form
16290 868946 899616 891739 930249 995457 974015 1003769 1018925 985414 1020597 1078403 1123885 1148396
16278 1148396 1142562 1149378 1214520 1258254 1270021 1303801 1332203 1383611 1446887 1435216 1433844 1421154
16266 1421154 1442080 1427366 1518249 1559872 1555526 1605016 1620319 1675822 1701050 1722324 1762404
16255 1762404 1722305 1738687 1799155 1855268 1917878 1902376 1898742 1960591 1973478 1930426 1969761
16244 1969761 1978545 2000668 2060788 2034898 2039732 2158370 2118131 2167887 2222463 2182957 2199201
16233 2199201 2276115 2267014 2240293 2238375 2294057 2349823 2364881 2358710 2333056 2380693 2406947 2428486
16221 2428486 2460314 2513858 2520029 2540619 2587620 2572048 2530353 2547730 2536396 2595446 2615198
16210 2615198 2681488 2711973 2698085 2668778 2698440 2700457 2709593 2738395 2782332 2796113 2826458 2795910
16198B795910j8509M9672Q444P7710N708K4412K7292j2614k374N8136k6961k3778
16186B963048M0450N9612l0271j7320M3823O1608n7392J0256k2550l5558J18383
16175C134089O9455j13612L3304L0361N510o2292p9895N7763O7480J742O7116
16164C211021L6792l3514j9554Q7330m9173K9906O1815k8315L2862K5315r774
16153C344711M180m1604M0067O6220o9380J3209l2825M1353N5569O8480q3473
16142C406507o9729N1816n706l0238N8559J6978k9501J3233J6799Q6523j9742
16131C495499J6781M8822p8450l0175K090L3847j422N8068l8301j5287Q79K1024
16119C513375j3967n7479O4724K5944n0587M5935j6883M198J239L9811L0849l5932
$$ plain form
16198 2795910 2777401 2827073 2835517 2913227 2918935 2943347 2970639 2958025 2955651 3013787 2986826 2963048
16186 2963048 3003498 3063110 3032839 3015519 3059342 3120950 3063558 3073814 3051264 3015706 3134089
16175 3134089 3203544 3089932 3123236 3153597 3159107 3096815 3016920 3074683 3142163 3143905 3211021
16164 3211021 3247813 3214299 3194745 3282075 3232902 3262808 3324623 3296308 3329170 3354485 3344711
16153 3344711 3348891 3307287 3347354 3413574 3344194 3357403 3324578 3365931 3421500 3489980 3406507
16142 3406507 3336778 3388594 3382888 3352650 3411209 3428187 3398686 3411919 3428718 3515241 3495499
16131 3495499 3512280 3561102 3482652 3452477 3454567 3488414 3486992 3545060 3506759 3491472 3492351 3513375
16119 3513375 3499408 3441929 3506653 3532597 3482010 3527945 3511062 3515260 3516499 3556310 3587159 3551227
16107C551227j3087J8192Q1149r120r430k9651j5414P1812k7794J0928L0366R863
16095C669041K3340k9450P037j3096j7457j0404K175p708M2835M5858m3821m7839
16083C620511M4450K8684j9185J037M349L526o3134M2869k0606j1078J6912m7581
16071C600754r866J3226Q0172j5553M504k5148N4866M982m8132L8737j9967j7487
16059C661088M1832M7831q2370p9147L4728K6664J3905P5023j1009l5974Q88K7355
16047C720814j7944L1907m8164n3788L7709L8240l6039J3020j9219K3181p9014
16036C610703O4649J3396j0876J8050m8943K0996J043L1867o948L0082k5955N785
16024C703849o1327K987K8528J9411Q314J5589P478k2072J5314j1144m7239P9508
$$ plain form
16107 3551227 3538140 3556332 3637481 3628361 3618931 3589280 3573866 3645678 3617884 3628812 3659178 3669041
16095 3669041 3692381 3662931 3669968 3656872 3639415 3629011 3631186 3623478 3666313 3712171 3668350 3620511
16083 3620511 3664961 3693645 3674460 3675497 3679846 3683372 3620238 3663107 3642501 3631423 3648335 3600754
16071 3600754 3590888 3604114 3684286 3668733 3673237 3648089 3702955 3707937 3659805 3698542 3678575 3661088
16059 3661088 3702920 3750751 3668381 3589234 3623962 3650626 3664531 3739554 3728545 3692571 3693459 3720814
16047 3720814 3702870 3734777 3686613 3632825 3670534 3708774 3672735 3685755 3666536 3689717 3610703
16036 3610703 3675352 3688748 3677872 3695922 3646979 3667975 3669018 3700885 3693937 3724019 3698064 3703849
16024 3703849 3642522 3645509 3674037 3693448 3701762 3717351 3724829 3702757 3718071 3706927 3659688 3739196
16012C739196J0209J704l3529o3899L992R377O0174k8669m641M5178m1840L5727
16000C732979m451m270k2808K4678J528L69k8597J2304L1966k9478O2377M30n7162
15987C719865P701n4279L986L9308P4219m4681q3075L5169M9894J5709K1642J5161
15975C800619J0459o5385l1602j0245L0468M3959o2181p25l648j497L9757j3972
15963C736007K3531l8165M4635j6391k9618k8056P8339j1995n2372J293K0160
15952C727368K0829m0304Q0870j6063k4170l0278M825M2046N8377k5020m7447
15941C751033j2611q094J9241J0966N666J3585n3239j7266k1120J4815N6834M0309
15929C800119j3046l6702K3984N6707l5666O040l6383k0557N3108M0839l7484
$$ plain form
16012 3739196 3749405 3751109 3717580 3653681 3657673 3667050 3727224 3698555 3693914 3739092 3697252 3732979
16000 3732979 3728528 3724258 3701450 3726128 3727656 3728025 3699428 3711732 3743698 3714220 3776597 3777027 3719865
15987 3719865 3727566 3673287 3677273 3716581 3790800 3746119 3663044 3698213 3748107 3763816 3785458 3800619
15975 3800619 3811078 3745693 3714091 3703846 3734314 3778273 3716092 3715367 3711719 3710222 3749979 3736007
15963 3736007 3759538 3721373 3766008 3749617 3719999 3691943 3770282 3758287 3705915 3707208 3727368
15952 3727368 3748197 3707893 3788763 3772700 3748530 3718252 3723077 3765123 3823500 3798480 3751033
15941 3751033 3738422 3730328 3749569 3760535 3766201 3779786 3726547 3709281 3688161 3702976 3759810 3800119
15929 3800119 3787073 3750371 3774355 3831062 3795396 3801436 3765053 3744496 3797604 3838443 3800959
15918C800959k6233m8276M9624O124J2977M4134p600k2491p739p0257k9917K0654
15906C721959K7119K1029o379l2102k1685K4623N3891l2430M0890l196o4262n2544
$$ plain form
15918 3800959 3774726 3726450 3776074 3782198 3795175 3839309 3831709 3809218 3801479 3731222 3701305 3721959
15906 3721959 3749078 3770107 3763728 3731626 3709941 3734564 3788455 3756025 3796915 3793719 3729457 3676913
$$ [...]
##END NTUPLES=NMR SPECTRUM
##END=
