##TITLE=1H_CA-9194-2
 CDCl3
 8 sc, 
 6.9.2023
##JCAMPDX= 6.0         $$ Bruker NMR JCAMP-DX V2.0
##DATA TYPE= NMR SPECTRUM
##DATA CLASS= NTUPLES
##ORIGIN= UXNMR, Bruker Analytische Messtechnik GmbH
##OWNER= root
$$ XWIN-NMR		Version 3.5
$$ Wed Sep  6 15:54:58 2023 Russian Standard Time (UT+4h)  she@DPX200
##.OBSERVE FREQUENCY= 200.13135
##.OBSERVE NUCLEUS= ^1H
##.ACQUISITION MODE= SIMULTANEOUS
##.ACQUISITION SCHEME= undefined
##.AVERAGES= 8
##.DIGITISER RES= 18
##SPECTROMETER/DATA SYSTEM= spect
##.PULSE SEQUENCE= zg30
##.SOLVENT NAME= CDCl3
##.SHIFT REFERENCE= (INTERNAL, CDCl3, 0, 15.7326)
##AUDIT TRAIL= $$ (NUMBER, WHEN, WHO, WHERE, WHAT)
$$ ##TITLE= Audit trail, XWIN-NMR		Version 3.5
$$ ##JCAMPDX= 5.01
$$ ##ORIGIN= Bruker BioSpin GmbH
$$ ##OWNER= she
$$ F:/spectra/data/she/nmr/H-F/1/pdata/1/auditp.txt
$$ ##AUDIT TRAIL=  $$ (NUMBER, WHEN, WHO, WHERE, WHAT)
(   1,<2023-09-06 15:53:07.76 +0400>,<she>,<DPX200>,
      <created by zg, POWCHK disabled, PULCHK disabled
       configuration hash MD5:
       00 E9 B6 7A A2 85 ED C7 34 08 36 98 17 FE 4E 26
       data hash MD5: 16K
       BE 94 2D FD B6 85 E2 A4 98 67 33 34 8C 6B 44 01>)
(   2,<2023-09-06 15:53:12.96 +0400>,<she>,<DPX200>,
      <Start of raw data processing
       efp BC_mod = 2 LB = 0.24 FT_mod = 6 PKNL = 1 PHC0 = -21200.79 PHC1 = 13.45271 SI = 16K 
       data hash MD5: 16K
       2C 07 77 97 EA F0 5A F8 FB 17 15 04 0A F3 33 E8>)
(   3,<2023-09-06 15:53:29.82 +0400>,<she>,<DPX200>,
      <pk PHC0 = -5.493114 PHC1 = 0 
       data hash MD5: 16K
       FC 97 71 13 7F 19 CC 3D 20 D8 43 49 6E 05 0F 11>)
(   4,<2023-09-06 15:53:34.39 +0400>,<she>,<DPX200>,
      <abs ABSG = 5 
       data hash MD5: 16K
       1D 30 DC A3 15 F7 CE D0 11 40 48 C8 3E AA 3E 9A>)
(   5,<2023-09-06 15:53:52.01 +0400>,<she>,<DPX200>,
      <pk PHC0 = 0.5909482 PHC1 = -1.2 
       data hash MD5: 16K
       A4 F3 24 46 B7 D0 F2 85 EC 04 D5 71 B9 B6 9B 3E>)
(   6,<2023-09-06 15:53:55.51 +0400>,<she>,<DPX200>,
      <abs ABSG = 5 
       data hash MD5: 16K
       1F 54 2A C5 6E 7D 9F 79 F8 26 D4 D5 0E 23 6D A5>)
$$ ##END=
$$ 
$$ hash MD5
$$ 46 CB 94 34 13 83 C0 FE 4C 76 91 07 0A 3A 8B F7
##$RELAX= 
##$RELAX= 
##$RELAX= 
##$RELAX= 
##$RELAX= 
##$RELAX= 
$$ Bruker specific parameters
$$ --------------------------
##$DU= <F:/spectra>
##$EXPNO= 1
##$NAME= <H-F>
##$PROCNO= 1
##$TYPE= <nmr>
##$USER= <she>
##$AMP= (0..31)
100 100 100 100 100 100 100 100 100 100 100 100 100 100 100 100 100 100 
100 100 100 100 100 100 100 100 100 100 100 100 100 100 
##$AQSEQ= 0
##$AQ_mod= 1
##$AUNM= <au_zg>
##$AUTOPOS= <>
##$BF1= 200.13
##$BF2= 200.13
##$BF3= 200.13
##$BF4= 200.13
##$BF5= 200.13
##$BF6= 200.13
##$BF7= 200.13
##$BF8= 200.13
##$BYTORDA= 1
##$CFDGTYP= 0
##$CFRGTYP= 5
##$CHEMSTR= <none>
##$CNST= (0..31)
1 1 145 1 1 1 1 1 1 1 1 1 1 1 1 1 1 1 1 1 1 1 1 1 1 1 1 1 1 1 1 1 
##$CPDPRG= <>
##$CPDPRG1= <>
##$CPDPRG2= <>
##$CPDPRG3= <>
##$CPDPRG4= <mlev>
##$CPDPRG5= <mlev>
##$CPDPRG6= <mlev>
##$CPDPRG7= <mlev>
##$CPDPRG8= <mlev>
$$ [...]
##$SUBNAM3= <"">
##$SUBNAM4= <"">
##$SUBNAM5= <"">
##$SUBNAM6= <"">
##$SUBNAM7= <"">
##$SUBNAM8= <"">
##$SUBNAM9= <"">
##$SW= 18.05172834244
##$SWIBOX= (0..15)
0 0 2 0 0 0 0 0 0 0 0 0 0 0 0 0 
##$SW_h= 3612.71676300578
##$TD= 16384
##$TD0= 1
##$TE= 0
##$TE2= 300
##$TE3= 300
##$TEG= 300
##$TL= (0..7)
0 120 120 120 120 120 120 120 
##$TP= (0..7)
150 150 150 150 150 150 150 150 
##$TP07= 0
##$TPNAME0= <>
##$TPNAME1= <>
##$TPNAME2= <>
##$TPNAME3= <>
##$TPNAME4= <>
##$TPNAME5= <>
##$TPNAME6= <>
##$TPNAME7= <>
##$TPOAL= (0..7)
0.5 0.5 0.5 0.5 0.5 0.5 0.5 0.5 
##$TPOFFS= (0..7)
0 0 0 0 0 0 0 0 
##$TUNHIN= 0
##$TUNHOUT= 0
##$TUNXOUT= 0
##$USERA1= <user>
##$USERA2= <user>
##$USERA3= <user>
##$USERA4= <user>
##$USERA5= <user>
##$V9= 5
##$VALIST= <valist>
##$VCLIST= <CCCCCCCCCCCCCCC>
##$VD= 0
##$VDLIST= <DDDDDDDDDDDDDDD>
##$VPLIST= <PPPPPPPPPPPPPPP>
##$VTLIST= <TTTTTTTTTTTTTTT>
##$WBST= 1024
##$WBSW= 4
##$XGAIN= (0..3)
0 0 0 0 
##$XL= 0
##$YL= 0
##$YMAX_a= 295781
##$YMIN_a= -220138
##$ZGOPTNS= <>
##$ZL1= 120
##$ZL2= 120
##$ZL3= 120
##$ZL4= 120
##$ABSF1= 15.71934
##$ABSF2= -2.332509
##$ABSG= 5
##$ABSL= 3
##$ALPHA= 0
##$AQORDER= 0
##$ASSFAC= 0
##$ASSFACI= 0
##$ASSFACX= 0
##$ASSWID= 0
##$AUNMP= <proc_1d>
##$AZFE= 0.1
##$AZFW= 0.1
##$BCFW= 0
##$BC_mod= 2
##$BYTORDP= 0
##$COROFFS= 0
##$CY= -3
##$DATMOD= 1
##$DC= 0
##$DFILT= <>
##$DTYPP= 0
##$F1P= 0
##$F2P= 0
##$FCOR= 1
##$FTSIZE= 16384
##$FT_mod= 6
##$GAMMA= 0
##$GB= 0
##$INTBC= 1
##$INTSCL= 3.70164e-10
##$ISEN= 128
##$LB= 0.24
##$LEV0= 0
##$LPBIN= 0
##$MAXI= 10000
##$MC2= 0
##$MEAN= 0
##$ME_mod= 0
##$MI= 1.114404
##$NCOEF= 0
##$NC_proc= -8
##$NLEV= 6
##$NOISF1= 3.799351
##$NOISF2= 2.8
##$NSP= 0
##$NTH_PI= 0
##$NZP= 0
##$OFFSET= 15.73257
##$PC= 1
##$PHC0= -21205.69
##$PHC1= 12.25271
##$PH_mod= 1
##$PKNL= yes
##$PPARMOD= 0
##$PSCAL= 0
##$PSIGN= 0
##$REVERSE= no
##$SF= 200.130007799735
##$SI= 16384
##$SIGF1= 3
##$SIGF2= 2
##$SINO= 5.538805
##$SIOLD= 16384
##$SREGLST= <1H.CDCl3>
##$SSB= 0
##$STSI= 16384
##$STSR= 0
##$SW_p= 3612.71676300578
##$SYMM= 0
##$S_DEV= 0
##$TDeff= 16384
##$TDoff= 0
##$TI= <>
##$TILT= no
##$TM1= 0
##$TM2= 0
##$TOPLEV= 0
##$USERP1= <user>
##$USERP2= <user>
##$USERP3= <user>
##$USERP4= <user>
##$USERP5= <user>
##$WDW= 1
##$XDIM= 16384
##$YMAX_p= 517672644
##$YMIN_p= -1673578
$$ End of Bruker specific parameters
$$ ---------------------------------
##NTUPLES= NMR SPECTRUM
##VAR_NAME=  FREQUENCY,     SPECTRUM/REAL,   SPECTRUM/IMAG
##SYMBOL=    X,             R,               I
##VAR_TYPE=  INDEPENDENT,   DEPENDENT,       DEPENDENT
##VAR_FORM=  AFFN,          ASDF,            ASDF
##VAR_DIM=   16384,         16384,           16384
##UNITS=     HZ,            ARBITRARY UNITS, ARBITRARY UNITS
##FACTOR=    0.220516191357247, 1,           1
##FIRST=     3148.55929567397, 0,            0
##LAST=      -464.15746733181, 0,            0
##MIN=       -464.15746733181, -1673578,     0
##MAX=       3148.55929567397, 517672644,    0
$$ Real data points
##PAGE= N=1
##DATA TABLE= (X++(R..R)), XYDATA
$$ [...]
7596 -296667 -242013 -304632 -356821 -481015 -350465 -335548 -444369 -450655 -377287 -441908 -442668 -397952
7584 -397952 -405447 -380630 -330686 -393394 -434825 -376409 -394637 -409767 -390437 -359773 -329131 -254926
7572 -254926 -119469 -215244 -176092 -96074 -233774 -239268 -249414 -67087 -121326 -24834 -52551
7561 -52551 -152128 -246077 -272327 -182650 -160855 -240707 -115586 -219069 -207810 -166889 -186663
7550 -186663 -223015 -253627 -197223 -163089 -73917 -87967 -118345 -69629 23075 -189447 -207561
7539 -207561 -191374 -74017 -39897 -207870 -124626 21395 -185223 -119853 -77443 8705 -59697
7528 -59697 -177131 -105119 8743 -73917 -75504 -89521 -106916 -193435 -32528 150747 49191
7517 49191 -33968 -48990 -25599 -159660 -105912 54924 135630 12039 105440 -16878 99110
7506 99110 223451 142312 129624 248361 222727 115831 113455 95037 75797 251894 360134
7495 360134 252827 251468 259559 302897 256204 184613 309122 372522 394251 427180 379461 449226
7483 449226 450626 388136 313353 453951 533548 487040 512738 418232 571760 495808 470715
7472 470715 467157 417873 488508 466075 405101 405664 358299 376545 387583 430949 400503 404599
7460 404599 447591 419752 368625 368483 387342 524243 531567 353906 419163 387315 381488 485086
7448 485086 395432 373221 337628 411304 552510 614023 526025 448113 622563 667631 679645
7437 679645 739108 737559 837569 790675 688576 674409 680735 769209 836688 905588 887326 906478
7425 906478 991459 878338 884529 911386 959991 911242 815189 888407 868646 916616 814635
7414 814635 830821 973976 985438 791907 794914 688660 700639 553991 626911 773966 793239
7403 793239 776316 761332 882509 819695 619915 665399 673625 571843 534939 438119 488209
7392 488209 571748 646966 736425 589698 716795 796305 548568 450428 404786 430057 549776
7381 549776 705335 654889 567118 666276 711159 635895 612509 594274 728778 648810 662116
7370 662116 677815 770668 896982 888353 960594 996284 964079 912277 903439 871930 862444 925693
7358 925693 1097347 1116529 1014251 1110412 1279754 1237465 1061855 1096547 1280620 1385922
7348 1385922 1457709 1384419 1368385 1380403 1439885 1350861 1325248 1304511 1334218 1281235 1323604
7337 1323604 1201544 1152094 1248284 1202490 1111581 1087046 1099478 989847 1037041 1062421 1142369
7326 1142369 1090450 981331 983897 1119120 1052570 949224 947952 1003368 1028542 993291 861934
7315 861934 942654 911268 816487 827435 823699 830343 851428 795204 744606 716254 713578 729428
7303 729428 818974 832244 828697 825480 829713 938283 957120 1052439 986142 1083710 1161206 972415
7291 972415 992418 987523 983943 970828 1069924 1206226 1222994 1221952 1314644 1251357 1327817 1433674
7279 1433674 1469040 1370744 1369193 1407326 1449830 1396871 1424892 1529413 1587255 1598108 1517236
7268 1517236 1682758 1723984 1794643 1815782 1785955 1802317 1858020 1692074 1759323 1995087 2103814
7257 2103814 2201906 2258136 2175450 2232014 2350331 2359426 2285730 2153166 2266832 2254310 2242924
7246 2242924 2159223 2199060 2201205 2216238 2188161 2191718 2416202 2445853 2537333 2528718 2536386 2598176
7234 2598176 2710223 2918216 3025806 3058823 3157601 3168934 3256899 3344692 3169073 3047007
7224 3047007 2971315 2840401 2913022 2883641 2941680 2958793 3057118 3026161 3059360 3195111 3200994
7213 3200994 3333767 3304046 3207306 3269153 3342069 3252290 3297146 3338872 3119241 3114578 3136908
7202 3136908 3041121 3137297 3181476 3078422 3110278 3287962 3586940 3573123 3670100 3861704 4083556
7191 4083556 4357471 4635461 4966094 5160219 5376890 5504309 5648941 5458392 5193869 4975223
7181 4975223 4787071 4582733 4364984 4137790 3934626 3786522 3587376 3435862 3432639 3486836
7171 3486836 3458725 3413911 3257091 3291834 3261339 3274116 3292612 3293746 3232085 3292921 3309184
7160 3309184 3291625 3431933 3469874 3622200 3631968 3683287 3791877 3854051 3916593 4131791 4106182
7149 4106182 4148481 4214240 4176857 4078422 3987980 3915159 3814692 3776479 3823854 3893794 3957635
7138 3957635 3976532 3966069 4051209 4169806 4279849 4370743 4528594 4600270 4438127 4476795 4395098
7127 4395098 4389708 4460713 4476768 4373874 4284510 4328825 4365672 4439627 4388854 4365050 4307208
7116 4307208 4341191 4464546 4677080 4762006 4819005 4983515 5187390 5369446 5456354 5683370
7106 5683370 5879333 5804701 5695162 5495838 5242761 5048972 4823385 4505507 4183676 3982621
7096 3982621 3703943 3590645 3549227 3538580 3485526 3429693 3350571 3197795 3080242 3011937 3042993
7085 3042993 3057493 3006644 3018537 3019371 3117461 3116982 3198468 3230886 3179967 3257617 3257955 3355730 3361138
7072 3361138 3528938 3502203 3460444 3601967 3764473 3747592 3653777 3605884 3564999 3555460 3578076
7061 3578076 3542245 3524479 3508669 3617281 3531873 3499622 3592933 3656675 3846328 3919871 3901860
7050 3901860 3903037 3956168 3963612 3922237 3860148 3877764 3885939 3841142 3956091 3907885 3911987 3946892
7038 3946892 3892881 3859721 3899117 3840481 3852245 3845735 3794811 3802500 4002451 3955869 3867486 3929681
7026 3929681 3962399 3964282 4029170 4200478 4144965 4191412 4086539 4143783 4154228 4102418 4213357
7015 4213357 4323980 4449983 4488235 4505077 4523963 4650775 4890322 4891951 4851993 4842805 4901981
7004 4901981 4880125 4696380 4867100 5035832 5165756 5424405 5483440 5520046 5460480 5626668
6994 5626668 5754203 5791514 6007701 6001766 6018712 6168773 6259713 6425722 6505229 6558320 6521142
6983 6521142 6611241 6635947 6522578 6579880 6626748 6433961 6312787 6366327 6133320 6011000
6973 6011000 6079067 5925026 5861416 5903070 5992626 6021444 6057311 6033943 6035380 6091510 5996353
6962 5996353 5920402 5982156 5946636 5962556 6093167 6134429 6052794 5967995 6058043 6215661 6142087
6951 6142087 6134729 6067006 6157838 6152857 6010356 6060116 6083834 6043709 6067446 6155810 6181411 5993299
6939 5993299 5928706 5881445 5855258 5864600 5799044 5720942 5772588 5877849 5826388 5885976 5752902
6928 5752902 5799214 5749548 5781985 5827484 5813665 5782972 5733034 5912708 5940125 5932991 5997533
6917 5997533 5978807 6288720 6348601 6439914 6607646 6724042 6889620 7165821 7307226 7499010
6907 7499010 7758325 7925035 8106363 8269866 8475003 8540609 8468984 8445437 8311269 8079742
6897 8079742 7984210 7846641 7861115 8054031 8064509 8127239 8279112 8574224 8949536 9231005
6887 9231005 9695956 9901344 10093797 10290499 10409762 10412566 10275727 10113867 9945380 9911914
6877 9911914 9881244 9958747 10198364 10675998 11046326 11430820 11791129 11996478 12049816 12025559
6867 12025559 11788881 11466506 10913005 10335086 9875425 9570588 9444622 9242144 9186356 9171401
6857 9171401 9077077 9181267 9252205 9240836 9359489 9451123 9529025 9604851 9513895 9384903 9385969
6846 9385969 9359746 9366096 9348466 9488253 9703570 9825443 10017079 10336315 10677860 11218379
6836 11218379 11505421 12040641 12456843 12680660 12879207 12913737 12860732 12895254 12868304 12811512
6826 12811512 12836897 13021386 12991035 12914531 12909769 12607813 12247561 11935930 11583694 10906496
6816 10906496 10419951 9924536 9447747 8748647 8191500 7816017 7400155 7192194 6858996
6807 6858996 6575894 6425280 6354897 6176918 6023517 5790837 5664424 5658588 5474834 5342190
6797 5342190 5203384 5123291 5013097 4927152 4898817 4833694 4618146 4617459 4595855 4567149 4558472
6786 4558472 4460066 4486634 4353971 4284583 4305746 4337523 4194784 4083172 3948182 3923311 3805280
6775 3805280 3763092 3696537 3585678 3580334 3542479 3617853 3515532 3473608 3462235 3437426 3295461
6764 3295461 3116105 3037343 3076345 3155561 3099323 3008935 2909544 3104298 2964637 2813129 2792589
6753 2792589 2759564 2616417 2559650 2649377 2615760 2593797 2559668 2603184 2630208 2667151 2546099
6742 2546099 2414451 2403499 2592422 2565381 2632932 2770644 2685900 2609352 2627277 2679627 2642610
6731 2642610 2584396 2600355 2299196 2365050 2403218 2350811 2446923 2488146 2508983 2473887 2547771
6720 2547771 2471911 2458804 2342895 2305516 2330578 2266688 2265690 2217412 2324414 2297649 2173109
6709 2173109 2254881 2362443 2497124 2511075 2488808 2484349 2552104 2561531 2563049 2449673 2420028
6698 2420028 2547583 2441091 2374791 2323189 2351411 2375257 2418095 2333485 2190611 2280719 2132184
6687 2132184 2147469 2256087 2332197 2277634 2230801 2267543 2062768 2091417 2249160 2401913 2452524
6676 2452524 2403063 2360670 2436878 2350115 2290190 2379935 2308528 2161669 2235271 2268829 2270656
6665 2270656 2187268 2138763 2219540 2109872 2055310 2121848 2171983 2196252 2126697 2142392 2217895
6654 2217895 2037862 2034994 2265472 2265230 2213352 2276314 2260848 2346786 2435878 2389444 2355400 2403437
6642 2403437 2520527 2573381 2545340 2506421 2588865 2586434 2426509 2369088 2368330 2291659 2442592
6631 2442592 2564712 2496442 2340536 2250849 2188487 2129532 2112333 2200945 2166636 2172788 2089719
6620 2089719 2097934 2131974 2022517 1884803 1835217 1879426 1855273 1867153 1842711 1916934 1805130
6609 1805130 1791547 1631183 1754602 1848880 1865199 1734781 1760660 1746174 1680835 1784564 1839660
6598 1839660 1850613 1867816 1854769 1823936 1876678 1875418 1806220 1822219 1802458 1796470 1812015 1796072
6586 1796072 1813720 1776274 1740279 1832672 1818211 1880495 1971460 2064993 2185062 2140535 2156952
6575 2156952 1984966 1953752 2142299 2257273 2197148 2114533 2050520 2022446 2070523 2111060 2100337
6564 2100337 2025359 2082449 2279641 2286608 2224154 2324551 2371507 2230123 2126586 2137306 2162576
6553 2162576 2297475 2258902 2164282 2291907 2448186 2510150 2429314 2361538 2402253 2446641 2510551
6542 2510551 2487283 2476343 2608694 2514870 2517445 2583894 2579183 2705831 2697533 2597838 2615899 2581682
6530 2581682 2542915 2504339 2431364 2437878 2514327 2457442 2329834 2322709 2307105 2388327 2389611 2369330
6518 2369330 2384156 2268535 2359085 2456771 2437074 2464647 2418212 2361876 2364650 2393054 2530953
6507 2530953 2383585 2251206 2250418 2345554 2411475 2291750 2374852 2394747 2302377 2378905 2430658
6496 2430658 2429460 2453474 2431618 2383644 2522763 2289937 2242336 2452585 2587706 2516453 2535045
6485 2535045 2552895 2448082 2557490 2652382 2762199 2658281 2717753 2731038 2725460 2796994 2743742
6474 2743742 2889595 2821918 2817399 2874566 2929612 3105895 3176603 3187185 3134778 3160651 3144975
6463 3144975 3052119 3099777 3133226 3194688 3167199 3100431 3083391 3187060 3140832 3231472 3155754
6452 3155754 3135512 3260114 3064571 3144039 3209197 3376976 3411756 3394242 3438361 3511082 3437887
6441 3437887 3414875 3359719 3322439 3322815 3403951 3448611 3351422 3281797 3236039 3143662 3285391 3355160
6429 3355160 3372695 3376250 3211597 3398825 3567408 3530991 3609034 3541131 3555953 3616804 3620184
6418 3620184 3672611 3684160 3697461 3746873 3761059 3808294 3799985 3746132 3838138 3928741 4020331 4134064
6406 4134064 4117030 4227112 4389958 4432891 4375513 4511317 4772914 4828529 4695112 4589121
6396 4589121 4820054 4956850 5087852 5110334 5174292 5270671 5306837 5391855 5453087 5558005 5590916
6385 5590916 5678762 5737623 5798841 5803367 5923161 5912372 6144148 6271115 6241166 6257107 6251349
6374 6251349 6333826 6392320 6452750 6626496 6684961 6761045 6816820 6964397 6977817 6859311 7086218
6363 7086218 7274760 7524056 7629876 7810981 7840970 7997983 8119988 8381756 8581794 8589999
6353 8589999 8696073 8903006 9010958 9212053 9411756 9459821 9703820 9778217 9854243 9920835
6343 9920835 10127722 10256373 10407664 10806434 10897105 11086321 11177606 11546668 11817280 12058582
6333 12058582 12486334 12787990 13156355 13437508 13692721 13967340 14404865 14960042 15424065
6324 15424065 15911131 16357141 16877109 17593896 18195445 18762431 19475274 20228144 21028565
6315 21028565 22081647 23302387 24576557 26166605 28041936 29912852 32089622 34637451
6307 34637451 37277442 40473717 43717320 46846841 49890154 52685643 55136681 56795344
6299 56795344 57638612 57574741 56653614 54678225 51840288 48292972 44685645 40975473 37710705
6290 37710705 34932361 32619411 30855571 29193209 27780532 26989467 26238996 25510259 25060008
6281 25060008 24633194 24244011 24047856 23919652 23925513 23753408 23416310 23061388 22500108 22026673
6271 22026673 21735996 21320391 20586281 19852481 19081162 18326211 17571731 16807602 16101464
6262 16101464 15433487 14940464 14374253 13777544 13267806 12848732 12410255 11904093 11643360
6253 11643360 11242248 10837373 10508661 10231967 9889431 9801315 9588146 9348595 9181669 9018349
6243 9018349 8869582 8629129 8478891 8354512 8144126 8073683 7959193 7946770 7795258 7722030
6233 7722030 7661578 7643700 7607846 7607064 7595187 7540129 7634168 7720158 7666379 7743416 7866050 7967039
6221 7967039 8107947 8243999 8356082 8358685 8728962 8818329 9147262 9382986 9526441 9825250
6211 9825250 10126231 10232712 10181978 10087706 9938311 9939241 9829652 9695860 9575270 9592920 9449970
6200 9449970 9338975 9496867 9399078 9314077 9396914 9376721 9225107 9106759 9141048 8898943
6190 8898943 8811222 8687847 8574706 8657985 8457264 8492662 8445775 8469011 8351876 8196937
6180 8196937 8000293 7906722 7710086 7479225 7310716 7230655 7006825 6922066 6935726 6861898
6170 6861898 6773205 6749562 6765769 6799217 6703803 6707137 6850470 6825758 6775826 6821548 6906961
6159 6906961 7067990 7105457 7227483 7460604 7511957 7726094 7968582 8195279 8455271 8595034
6149 8595034 8582034 8610366 8421522 8237584 7947026 7748823 7586218 7476521 7415983 7365141
6139 7365141 7300848 7359466 7179718 7102922 7177650 6996239 7068234 7124199 7046777 6980958 6910282
6128 6910282 7034229 6993981 7049395 7053377 7131868 7225515 7369493 7410661 7479871 7699076 7812433
6117 7812433 7924719 8051622 8106909 8262486 8297876 8375515 8627289 8477388 8259116 7839983
6107 7839983 7500668 7227293 7026764 6867819 6835349 6781039 6714760 6785457 6765097 6631915
6097 6631915 6426291 6339703 6273637 6128337 5958873 5790883 5688452 5681837 5560929 5452597
6087 5452597 5394529 5396887 5374357 5376595 5424721 5479388 5538586 5588553 5694401 5908219 6033558
6076 6033558 6069572 6229424 6388710 6346564 6248330 6013252 5817123 5592323 5482407 5445789
6066 5445789 5255439 5280720 5186107 5056091 5018239 4980011 4971007 5082487 5159958 5067437 4889219
6055 4889219 4802018 4827790 4780802 4676181 4830272 4989337 4937817 4821391 4955720 4967884
6045 4967884 5010778 4980574 4979187 4955330 4894037 4825444 4922418 4907767 5022023 5002939 5002106 4974584
6033 4974584 4789732 4947516 4900093 4971317 5050836 5120410 5132951 5182429 5200674 5353552 5473590
6022 5473590 5503104 5730163 5930644 5990191 5852836 5743912 5679783 5459065 5371242 5237966
6012 5237966 5178078 5066223 5018641 5021786 5144058 5132832 5116680 5097898 4952747 4951043 5040051
6001 5040051 5053857 5093740 5146137 5216655 5373562 5338344 5296435 5372314 5500201 5627421 5793602
5990 5793602 6012156 6010449 6102718 6002449 6004134 5951045 5847014 5923316 5939569 5852045 5833286
5979 5833286 5815753 5695166 5425013 5383272 5540056 5512776 5404520 5456679 5689521 5688347 5594546
5968 5594546 5670748 5814636 5744434 5792727 5773305 5746638 5758318 5785645 5796884 5765030 5713245
5957 5713245 5698141 5799258 5896786 6086379 6198402 6206715 6170946 6240361 6194221 6078151 6174960
5946 6174960 6172969 6299540 6311734 6356244 6270081 6279672 6205217 6256809 6304797 6227557 6054133
5935 6054133 6112887 5915887 5998149 6062246 5975339 5806812 5891728 5988822 5955545 6030571 6088151
5924 6088151 6032921 5996369 6016322 6130733 6357188 6288214 6280407 6247777 6342975 6472800 6546543
5913 6546543 6625991 6737569 6692660 6661999 6589445 6537255 6622561 6617380 6453279 6381647 6333803
5902 6333803 6385349 6439831 6384028 6458720 6615458 6534278 6494668 6524794 6588162 6493630 6613596
5891 6613596 6651930 6715132 6766380 6809585 6772173 6748172 6819298 6935585 6953164 6906815 7057488
5880 7057488 7132836 7171743 7189190 7212851 7296399 7392078 7361518 7432583 7449701 7307339 7363877
5869 7363877 7514937 7596260 7389941 7322538 7561073 7635321 7493675 7464498 7447331 7435984 7424297
5858 7424297 7334511 7437224 7524102 7425960 7464920 7473616 7453876 7481228 7511052 7520869 7495810 7461465
5846 7461465 7533254 7536913 7549745 7464713 7474734 7502655 7517077 7538250 7670777 7592407 7595196 7663971
5834 7663971 7673286 7677850 7721357 7851588 7869763 7802920 7722902 7954930 8007430 8060566 8092143
5823 8092143 8261370 8365902 8464705 8627049 8721180 8693432 8854666 8997321 8986205 9261219
5813 9261219 9249295 9419020 9657646 9788321 9994294 10110857 10264725 10633063 10999478 11212499
5803 11212499 11396084 11603057 11972979 12313215 12824917 13180692 13574129 14064425 14733524
5794 14733524 15406016 16213662 17086488 17714739 18423975 19238320 20102590 20742228 21033357
5785 21033357 21031527 20541109 19762112 18869890 17973362 17044620 16101619 15398854 14863703 14541344
5775 14541344 14200749 13912271 13680555 13295195 13172689 13152173 13086505 13019034 13140038 13226685
5765 13226685 13302723 13457992 13584180 13511050 13379781 13396891 13347184 13395149 13527020 13655156
5755 13655156 13807592 13845336 13926497 14069155 14104965 14125251 14241670 14505588 14668120 14804468
5745 14804468 15014145 15323297 15779560 15976436 16366997 16657132 17018650 17470261 17775034
5736 17775034 18428840 19083266 19590691 20172343 20850811 21758256 22705585 23807457 24977079
5727 24977079 26375013 27777330 29366499 31000459 32825790 34842062 36609832 38409689
5719 38409689 39689761 40613490 40859367 40342451 39360549 38099593 36537920 34877115 33476161
5710 33476161 32156617 31090636 30159898 29428060 28896055 28310566 27953707 27377850 26857238
5701 26857238 26162116 25123318 24180139 23267568 22446715 21919913 21313946 20744991 20315663
5692 20315663 19981727 19586993 19357930 18991318 18504731 18143982 17733635 17278244 16841721
5683 16841721 16485339 16244263 15821605 15464373 15060671 14817631 14525108 14204343 13981714
5674 13981714 13747683 13504002 13218331 12964985 12701603 12621916 12581175 12464072 12373633 12336061
5664 12336061 12236275 12165566 12018591 11930191 11768542 11793095 11588026 11495990 11472430 11408505 11336868
5653 11336868 11287045 11241429 11244479 11027697 10972494 11000447 11013051 10875177 10782111 10720013 10675247
5642 10675247 10854931 10943873 10933575 10836949 11028598 11060029 11096392 11136512 11100586 11151765 11229201
5631 11229201 11247123 11230291 11116160 11177389 11315008 11357593 11297196 11240365 11255902 11367998 11325350
5620 11325350 11229592 11162597 11133230 11210124 11310236 11289303 11292502 11404855 11419707 11516460 11701558
5609 11701558 11663978 11719604 11803099 11939443 12086263 12043230 11962721 12111292 12185282 12135582 12099922
5598 12099922 12233907 12434629 12561627 12548667 12617652 12680681 12621178 12724788 12791519 12846372
5588 12846372 12874237 12941817 12920368 13051508 13270639 13285554 13228858 13271826 13473279 13760882
5578 13760882 13976940 14085338 14059086 14273053 14497077 14418692 14494973 14477279 14551586 14541250
5568 14541250 14623322 14696326 14705967 14718024 14593395 14552322 14642564 14676782 14695508 14643194 14623620
5557 14623620 14820407 14787648 14877883 14885780 14849630 14829440 14970805 15047404 15104404 15252777 15472962
5546 15472962 15499871 15711933 15973826 16067977 16234779 16539515 16652883 16817820 16877837 16966216
5536 16966216 17170418 17232795 17401275 17685900 17790963 17971887 18184282 18120896 18042096 18269613
5526 18269613 18357377 18533874 18640404 18615394 18752626 18794088 18877154 19014664 19062267 19234214
5516 19234214 19326138 19303800 19548889 19676969 19746938 19730841 19809242 19899166 20080351 20215550
5506 20215550 20311787 20366855 20386881 20380934 20460687 20514969 20638909 20701302 20739300 20954057 21068230
5495 21068230 21130060 21330668 21617522 21875755 21988449 22064800 22108932 22273383 22265484 22368796
5485 22368796 22423890 22428404 22680289 22678980 22814000 23036957 23169026 23168955 23340768 23446387 23561353
5474 23561353 23662181 23852418 24090588 24207423 24283558 24364448 24447998 24562450 24592999 24864005
5464 24864005 25072570 25300097 25387173 25434408 25629055 25870545 26288068 26461778 26451272 26544600
5454 26544600 26675140 26692266 26871843 26972014 27115667 27232913 27405536 27595863 27772273 27942386
5444 27942386 28193224 28475708 28771733 29047050 29371702 29517213 29676744 29803752 30021762
5435 30021762 30008396 29968543 30030267 30255894 30321330 30380588 30418579 30433185 30413064 30385089 30551659
5424 30551659 30723892 30817149 31025882 31155777 31130772 31281956 31449666 31616167 31715077 31835936
5414 31835936 32148937 32434223 32629583 32785660 33123762 33443987 33867740 34158222 34412397
5405 34412397 34685546 34922268 35294563 35881572 36369162 36897318 37424380 38003320 38630723
5396 38630723 39373296 40247844 41075191 41951037 42816047 43609912 44232477 45133069 45740060
5387 45740060 46261818 46762590 47201955 47528994 47863921 48018197 48007260 47988473 47910227 47785325
5377 47785325 47605389 47618919 47703936 47619636 47686577 47987360 48263250 48664333 49246688 49962424
5367 49962424 50940486 52063970 53317026 54722674 56365534 57940395 59635610 61267172
5359 61267172 62923043 64221939 65148256 65223271 64245411 62588902 60363799 57662925 55041107
5350 55041107 52226949 49539129 47025020 44672381 42507054 40491225 38788708 37224298
5342 37224298 35891229 34754784 33674398 32916417 32054864 31359032 30821358 30261543 29955560
5333 29955560 29652923 29176383 28996704 28880470 28664675 28662048 28667763 28882044 29103747 29271891
5323 29271891 29205845 29099731 28792799 28166669 27730511 27306152 26581921 25943143 25491552 25163594
5313 25163594 24746711 24274009 24044302 23861691 23733303 23748021 23765201 23799773 23825536 23780092
5303 23780092 23749355 23692434 23456574 23239558 23075193 22907656 22699282 22447377 21975818 21856233
5293 21856233 21693935 21513348 21344020 21133334 21092991 21023434 21012136 21166369 21279352 21298832
5283 21298832 21520204 21635624 21863558 21930782 21947495 22020061 21929022 21993584 21884715 21826436
5273 21826436 21652495 21597735 21415705 21241773 21038979 20829792 20587512 20476770 20328991 20089653
5263 20089653 19872920 19873865 19769789 19450440 19358721 19408884 19379055 19288983 19215060 19157205 19150841
5252 19150841 19150371 19061332 19139748 19225285 19225139 19133357 19014897 18968561 18963299 18858794 18857552 18734202
5240 18734202 18610283 18572790 18403388 18398039 18226017 18127717 17932145 17775631 17670682 17579873
5230 17579873 17492356 17301565 17137868 16954273 16891890 16832217 16888273 16861143 16766563 16781897 16851152
5219 16851152 16929096 16956895 16964450 16899325 17072895 17144572 17121120 17229010 17471659 17697654 17833000
5208 17833000 17961607 18126721 18122744 18178146 18173532 18418248 18686624 18816853 18842995 18877411 18945406
5197 18945406 19038278 18934729 18687881 18419256 18096336 17820156 17718977 17574654 17386626 17423372
5187 17423372 17233337 17111157 17173140 17060592 17064039 17242395 17388829 17488059 17643182 17726242
5177 17726242 17946322 18066112 18185009 18358190 18377505 18531297 18683607 18694410 18710986 18745138
5167 18745138 18679911 18508098 18511890 18271126 17907604 17541445 17446607 17333660 17142240 16825782
5157 16825782 16699043 16669678 16503762 16412707 16268125 16302403 16180812 16044484 16103296 16086485
5147 16086485 16088506 16165563 16300474 16427963 16518715 16688005 16728957 16834243 16864011 17085564
5137 17085564 17032782 17263322 17451827 17587510 17801376 17861238 17626086 17504635 17376695 17216097
5127 17216097 17101157 16926570 17006830 16982845 16774683 16664710 16479414 16472924 16535924 16506740
5117 16506740 16454816 16364367 16342286 16459965 16543644 16518746 16543694 16605059 16487210 16469127 16631545
5106 16631545 16720202 16838927 16817604 16911167 16919622 16976437 16871196 16695108 16690093 16598210 16526984
5095 16526984 16430810 16321610 16324862 16181928 16121317 16051963 16155286 16150144 16032601 16074952 16109286
5084 16109286 16295528 16382010 16474913 16470584 16428868 16429672 16346974 16184500 16173701 16136634 16032311
5073 16032311 15874055 15670810 15543119 15559160 15545377 15571510 15490182 15303743 15255238 15183885
5063 15183885 15230932 15290225 15241059 15271807 15358427 15420338 15470653 15491117 15740881 15827986 15965453
5052 15965453 16011246 16027871 16124519 16138808 16147549 16007779 15833729 15862029 15726708 15696814 15685866
5041 15685866 15513541 15293867 15390684 15476057 15457243 15471982 15315479 15364956 15422793 15447289 15473159
5030 15473159 15530288 15564761 15688552 15686472 15743342 16011820 15981789 15960975 16043674 16173141 16360027
5019 16360027 16475135 16578924 16668058 16779953 16871693 16948350 17111244 17106067 17152428 17364023
5009 17364023 17563471 17669774 17718764 17675349 17522794 17424727 17257829 17213966 17077858 17065966
4999 17065966 17104784 17146276 17217926 17279776 17436019 17401058 17556007 17691264 17804315 17872777
4989 17872777 17992595 18079621 18202784 18276046 18086785 18116557 17978786 17912087 17903433 17873332 17832587
4978 17832587 17843030 17838325 17696464 17538233 17590716 17601072 17597514 17782725 17650531 17686529 17804516
4967 17804516 17678912 17822783 17758326 17759932 17806937 17793476 17816949 17979457 18036126 18132090 18165792
4956 18165792 18233585 18395042 18402667 18519227 18749170 18727402 18660690 18631455 18788536 18826927 18862958
4945 18862958 18996319 18977871 18971508 19048596 19023232 18798433 18747864 18815143 18871439 18833536 18648289
4934 18648289 18638631 18740048 18707546 18755767 18804605 18873261 18905273 19057744 19045553 18997074 18919238
4923 18919238 19032545 18978362 19034815 19137588 19266399 19198551 19202828 19241682 19245114 19267237 19311937
4912 19311937 19529832 19549405 19497030 19562645 19530610 19665536 19873311 19736229 19661980 19522993
4902 19522993 19564399 19615696 19590558 19587176 19487793 19322306 19240992 19196860 19154995 19154433 19120388 18989893
4890 18989893 19011866 18945140 19016138 19248500 19289009 19367212 19434687 19546763 19617234 19745345 19700478
4879 19700478 19697325 19590798 19498382 19650789 19654107 19518565 19477753 19467048 19407718 19451247 19529990
4868 19529990 19580915 19593671 19581344 19639344 19703325 19534195 19542152 19586590 19590043 19556293 19528783
4857 19528783 19534030 19477754 19500665 19479556 19421832 19455283 19480369 19551456 19764012 19788872 19926286
4846 19926286 20000967 19992951 20064958 20258971 20276455 20389544 20545253 20528495 20724112 20712808 20756902
4835 20756902 20985699 21102317 21253033 21349481 21310744 21269588 21360963 21486764 21611972 21774921
4825 21774921 21843933 21814478 21884170 21993430 22063794 22145266 22388440 22506465 22473529 22773854
4815 22773854 22956866 23136873 23467097 23601953 23692294 23866010 24002450 24106994 24220025 24415481
4805 24415481 24716761 24966818 25125209 25370207 25532954 25866486 26320470 26606439 26697561 26954860
4795 26954860 27223540 27514976 27873965 28452561 28746547 29158584 29598795 29804459 30251697
4786 30251697 30684320 31211156 31705557 32215602 32795559 33337459 33990317 34610765 35382800
4777 35382800 36151316 36810132 37599183 38512901 39224117 39815476 40517250 41093747 41737701
4768 41737701 42320105 42886805 43403532 44124154 44983194 45763255 46623951 47657092 48826808
4759 48826808 50176175 51496366 52852020 54397647 56443570 58836060 61564171 64687985
4751 64687985 68555906 72953557 77918248 83509147 90185887 98905737 110631750 126421255
4743 126421255 145559251 163052279 171794349 169417617 156395641 136843625 117504744
4736 117504744 102413571 91736307 84115849 78723864 75212529 72772857 71288386 70304508
4728 70304508 69457274 69021390 68722240 68499252 68429039 68612538 68833031 69067063 69576796 70095012
4718 70095012 70747661 71443288 72358897 73523101 74741639 76397863 78362998 80520942 82950989
4709 82950989 85767148 88878976 92233718 95889370 99973841 104418637 109396267 114805032
4701 114805032 121405625 130098439 141908056 157700529 175949805 191238654 199170401
4694 199170401 200177442 193931553 179926871 162551014 146642882 134533614 125881205
4687 125881205 119635647 115338620 112385250 110467519 109231159 108362877 107841514 107380758
4679 107380758 106836310 106135221 105370077 104452548 103613129 102693225 101701031 100806141 99839494
4670 99839494 98978834 98217360 97643345 97120029 96778021 96632158 96631830 96490077 96418429 96382217
4660 96382217 96241821 95955495 95549294 95240884 94830236 94238613 93742945 93201913 92704378
4651 92704378 92428079 91988693 91654124 91388808 91055912 90750787 90525157 90209258 90033567
4642 90033567 89757097 89412990 89133747 88521274 88005649 87480215 87160127 86852232 86383797
4633 86383797 86266398 86322256 86339207 86463616 86732227 87196973 87871263 88784960 89632069 90736148
4623 90736148 91910730 93293097 95045877 96998877 99285781 101954738 104973503 108282731
4615 108282731 112043515 116131169 120296324 124473687 128608617 132394816 135203535 137044652
4607 137044652 137187433 135561534 132156775 127596469 122272548 116594079 111110176 106152218
4599 106152218 101671239 97781337 94413586 91567635 89190023 87289208 85681236 84058509
4591 84058509 82784005 81706990 80623101 79472923 78307075 77116521 76118373 74961908
4583 74961908 73883327 72695629 71649054 70663655 69858466 68996401 68155792 67307139 66564498
4574 66564498 65873612 65184470 64714734 63950754 63257201 62836129 62134414 61644500 61081116
4565 61081116 60456120 59719307 59069401 58512174 58101684 57592709 57167708 56830032 56304455
4556 56304455 56084057 55839705 55485329 55277617 54971725 54573336 54295994 54013690 53565094
4547 53565094 53151046 52939090 52645853 52309279 52016501 51785515 51486137 51352271 51139503
4538 51139503 50744860 50652862 50490085 50372155 50277032 50138285 49952056 49813475 49756166 49660435
4528 49660435 49684167 49574491 49654013 49748535 49912376 50044765 50337124 50385701 50647084 50757703
4518 50757703 50787302 50904931 51089266 51163882 51208133 51235902 51262056 51323330 51345292 51361863 51279841
4507 51279841 51294126 51223788 51331047 51235099 51233695 51083323 51119739 50985727 50838584 50645147
4497 50645147 50419675 50217516 49899546 49729652 49535490 49489198 49394447 49408369 49410708 49691221
4487 49691221 49703797 49860126 50150839 50227976 50622983 50890836 51050277 51233240 51508744 51777184
4477 51777184 51845220 51951160 52038220 52154371 52208525 52129906 52144961 52115252 52137875 52172266 52242115
4466 52242115 52334111 52330340 52395501 52474318 52715772 53100922 53407337 53605700 53896560 54292313
4456 54292313 54643337 55092129 55641302 56253822 56759786 57192757 57918750 58578607 59128549
4447 59128549 59586650 59835430 59856097 59783819 59590911 59261937 59139194 59019915 59091778 59317932
4437 59317932 59593550 59798304 60080915 60471114 60772637 61270394 62001867 62752168 63692892
4428 63692892 64391338 64963067 65458676 65811230 66300590 67012497 67654203 68645210 69686327
4419 69686327 70728462 71784384 72843743 74170598 75691839 77411423 79115149 80878716
4411 80878716 82477607 83752964 84836856 86102066 87537831 89235738 91218762 93493451
4403 93493451 96307340 99485277 102940959 107177554 112061263 117774662 124644500 132953644
4395 132953644 142238998 151565461 159049636 163023710 162537677 159095078 154692919 150642380
4387 150642380 148254778 147515635 148240570 150152275 152645834 155435161 157948506 160132679
4379 160132679 162081397 163350861 163882373 163834981 162993234 160210281 155250490 148402067 140364795
4370 140364795 132132041 124302331 117483765 111693753 106881109 102745074 99350475 96759159
4362 96759159 94218517 92157439 90414238 88768996 87247051 85851178 84689406 83372993
4354 83372993 82137369 80951976 79780042 78803899 77718948 76426282 75218783 74239522
4346 74239522 73186080 72056152 70998789 69944619 69152722 68394209 67597061 66945088 66388152
4337 66388152 65842806 65422126 65004540 64600550 64417190 64057775 63375957 62404852 61407846
4328 61407846 60296638 59440188 58386287 57454213 56553909 55940921 55310405 54646950 54260834
4319 54260834 53911979 53715897 53470921 53316248 53329284 53334220 53332172 53435301 53701955 54171934
4309 54171934 54597465 54927919 55151658 55151835 54637224 54060617 53401268 52655496 52034885 51577829
4299 51577829 51026880 50737131 50487074 50062018 49832835 49545283 49371616 49223020 48952297
4290 48952297 48666091 48331442 48153816 48140888 47932896 47742607 47600456 47580919 47553760 47439746
4280 47439746 47331729 47367576 47411368 47300749 47471098 47707506 47889005 48104267 48065484 48120968
4270 48120968 48250240 48303425 48620630 48854341 49092868 49114001 49331514 49538945 49706800 49838088
4260 49838088 50218963 50795343 51361739 51916661 52154108 52148110 51724433 51244266 51047460 50922077
4250 50922077 50868234 50933834 51028731 51160549 51331336 51595931 51857166 52186000 52575394 52895710
4240 52895710 53153348 53440784 53861703 54344031 54795094 55218346 55791003 56443781 57076837
4231 57076837 57587230 58294198 59083256 59974611 60975986 62112351 63248164 64496163 65703291
4222 65703291 66364301 66523814 66283701 65856645 65209948 64265667 63354901 62405629 61580524
4213 61580524 60798315 60232335 59768443 59443440 59261295 59150480 59044737 58758747 58498665
4204 58498665 58298732 58266067 58347518 58546026 58564246 58795035 59052579 59394691 59632521 60004147
4194 60004147 60368681 60527632 60671451 60913344 61094675 61244552 61497118 61627873 61880570
4185 61880570 62259609 62548640 62881680 62932443 63371387 63836048 64060016 64342466 64671786 65010473
4175 65010473 65294437 65665736 65837808 65953086 66195298 66336306 66554034 66746684 67021574
4166 67021574 67335274 67506843 68104954 68663932 69194171 69845386 70406922 71156534 72028850
4157 72028850 73062934 74121800 75400415 76727346 78315114 79946371 81788791 83819712
4149 83819712 85590053 87411152 88903957 90108175 91276131 92177493 92708745 93021971 93171059
4140 93171059 93204611 92866966 91549183 89313532 86667667 84089125 81317173 79046573 77394548
4131 77394548 76164052 75180004 74336862 73930728 73521605 73152914 72933557 73003907 73063495 73258689
4121 73258689 73711749 74226670 74970764 76001471 76944706 77638462 77618368 77289291 76660465
4112 76660465 76306669 76201118 76632467 77112363 77255636 77036202 76311457 75043858 73654267
4103 73654267 72285238 71080870 69918582 68879101 68156601 67229549 66534491 65991625 65582897
4094 65582897 65143021 64818585 64732012 64694552 64437524 64348735 64077697 63786301 63463740 63058270
4084 63058270 62660285 62525929 62452176 62292530 62567543 62785010 63123216 63636101 64208960 64922210
4074 64922210 65525751 65654274 65316570 64538424 63396991 62291660 61318842 60672177 60249635
4065 60249635 60012511 60075195 60175897 60295191 60492993 60863895 61072728 61198701 61385802 61589785
4055 61589785 61869877 62267893 62654526 62999728 63357821 64212095 64836383 65266564 65820080
4046 65820080 66453169 66979041 67673304 68245566 68654200 68953480 69352960 69708606 70067855
4037 70067855 70557961 70875157 71120763 71322404 71605064 71591920 71780360 71711246 71703507 71876220
4027 71876220 71976957 71965109 71756931 71701075 71444989 70926780 70517572 70191593 69747046 69237950
4017 69237950 68852200 68244261 67734769 67154877 66560670 65756621 65070344 64288052 63485338
4008 63485338 62426481 61375130 60218990 59006591 57852154 56670121 55662707 54612731
4000 54612731 53486465 52311400 51382691 50448002 49489225 48568965 47592253 46562421 45500298
3991 45500298 44247452 43077720 41868053 40666217 39628091 38564472 37350339 36500603
3983 36500603 35855591 35204241 34717331 34245648 33561570 32481682 31365488 30450547 29518274
3974 29518274 28713739 28010958 27267218 26609007 26041183 25583054 24980218 24395089 24050976
3965 24050976 23547100 23061980 22556445 22053136 21735062 21274525 20917132 20621556 20304699
3956 20304699 19867151 19493152 19103361 18642143 18306632 18074697 17765597 17440239 17184181
3947 17184181 16928355 16657090 16501898 16243743 15921747 15740257 15476203 15317804 15176630
3938 15176630 14958535 14681075 14422320 14181950 13901684 13781308 13650501 13329060 13259676 13055489
3928 13055489 12905984 12743843 12633363 12627758 12432634 12392139 12334933 12247486 12195501 11988733
3918 11988733 11771734 11785902 11708065 11535792 11588563 11373393 11312589 11338188 11298921 11258002 11156901
3907 11156901 10957934 10946919 10914617 10815358 10657582 10621112 10607314 10591509 10439881 10388056 10224490
3896 10224490 10177056 10211452 10184400 10271123 10094068 9975003 9949615 9869330 9767496 9771311 9660232
3885 9660232 9638117 9530011 9669821 9598880 9471676 9421599 9366633 9265159 9234127 9123107
3875 9123107 9025829 9010284 9107157 9188476 9217057 9049398 8880821 8768675 8721234 8708446 8575463
3864 8575463 8614785 8547963 8498001 8351357 8397230 8396363 8274405 8257392 8265476 8333146 8235020 8326230
3852 8326230 8351669 8342169 8335020 8239146 8192930 8071452 8080230 8137940 8052140 8078243 8022286 7995411
3840 7995411 8004042 7955661 7976796 8123852 8035423 7916487 7895307 7961205 7942759 7889882 7966571
3829 7966571 8087023 7909447 7926147 7973342 7859326 7984743 7980873 8021552 7930578 7999896 8041251
3818 8041251 8147214 8243565 8229232 8288201 8333680 8318175 8357105 8397154 8463299 8429942 8402755
3807 8402755 8264186 8209047 8276919 8383144 8359094 8180931 8189705 8256170 8228737 8243345 8290297
3796 8290297 8340226 8394401 8557958 8475951 8593735 8745521 8728362 8783976 8686819 8772961 8881645
3785 8881645 8927197 8945857 8934804 8912593 8962759 8920987 8853187 8979993 9061273 9097615 9205271
3774 9205271 9340479 9332641 9334083 9434853 9440571 9513970 9664000 9816688 9881579 9937606 10296581
3763 10296581 10404865 10457055 10649613 10784276 10961737 11097520 11013518 11055502 11094942 11134888
3753 11134888 11182186 11120873 11134671 11118533 11110120 11082036 11114463 11153538 11328404 11359336 11461596
3742 11461596 11513734 11242807 11229574 11269213 11208096 11071520 11132854 11260232 11094787 10904531
3732 10904531 10684381 10515846 10713292 10829886 10750114 10711354 10873153 10966310 10914178 10938437
3722 10938437 10995594 11149802 11216189 11180385 11212088 11256225 11314110 11423443 11520733 11752241 11907011
3711 11907011 11976777 12015568 12197638 12380535 12514364 12702278 12895379 12908280 13127074 13278780
3701 13278780 13413928 13616486 13840099 14066510 14353490 14500068 14533661 14763689 14980603 15159836
3691 15159836 15300284 15283146 15468613 15627841 15816572 15714810 15775130 15971519 16083765 16097586
3681 16097586 16107427 16170278 16233704 16324073 16217530 16135915 16235690 16175578 16158099 16085684 16106494
3670 16106494 16143834 16231675 16149298 16209474 16201875 16092680 16316142 16383029 16534144 16633426 16770521
3659 16770521 17009701 17308313 17588574 17826080 17995409 18357255 18609169 18763753 18871646
3650 18871646 19109933 19326157 19401414 19433799 19527120 19513071 19602788 19742950 19856296 19995637
3640 19995637 20222359 20321741 20524807 20570372 20619584 20568130 20571263 20578116 20549063 20570523 20479284
3629 20479284 20316447 20101305 20057779 20105916 20087872 19917312 20032476 20158799 20223276 20363099
3619 20363099 20386973 20456875 20424865 20505583 20511453 20421876 20332838 20391139 20377840 20455425 20369169
3608 20369169 20379853 20298440 20269238 20361004 20406505 20285872 20356967 20527978 20730843 20771813 20750797
3597 20750797 20874139 20966834 21030984 21169570 21384029 21456172 21545140 21650044 21932130 22187040
3587 22187040 22397842 22782697 23264537 23721235 24242298 24692586 25350147 25887861 26412257
3578 26412257 26848369 27326555 27733325 28016593 28143341 28203885 28297848 28236184 28119683 28033328
3568 28033328 28143025 28178824 27924648 27837514 27731085 27585991 27368554 27264619 27066056 26716916
3558 26716916 26468937 26125189 25740549 25507428 25302033 25235282 25324629 25315325 25314600 25366626 25314722
3547 25314722 25412280 25635161 25736355 25850015 26102157 26341604 26667680 26868246 27029248 27289970
3537 27289970 27476226 27811317 28118860 28376235 28832389 29131748 29518294 29837217 30302782
3528 30302782 30696426 31068911 31461546 31767260 32097350 32477482 32872527 33266767 33761085
3519 33761085 34246745 34491811 34954805 35402211 35834945 36349842 36876163 37549263 38169848
3510 38169848 38788281 39398207 39861661 40433011 41073102 41499807 41955932 42409683 42994702
3501 42994702 43397014 44084033 44724635 45199646 45678075 46405722 47184809 47894399 48804003
3492 48804003 49755486 50625499 51529771 52542258 53632114 54838463 55863479 56934823 58041872
3483 58041872 58995160 59911242 60909937 61688727 62298386 63054491 63583453 63997528 64290976
3474 64290976 64548322 64911159 65299127 65451159 65690175 66134485 66457476 66841958 67291588
3465 67291588 67784380 68362764 69175473 69803344 70447336 71274623 72049458 72844426 73654604
3456 73654604 74319105 75124780 75820467 76413518 77096161 77611524 78129208 78517995 78855185
3447 78855185 79094067 79385158 79652308 79975825 80183242 80311846 80325743 80441733 80380676 80285000
3437 80285000 80140029 79899098 79596285 79268331 78951161 78576130 78167155 77790190 77477751
3428 77477751 77186207 76910862 76732759 76554657 76390090 76403724 76372353 76407488 76498263 76624916
3418 76624916 76654887 76740194 77069605 77337892 77571722 77780498 78056444 78445805 78732123 79013462
3408 79013462 79404592 79856421 80198523 80642472 81102238 81560315 81923008 82189988 82549058
3399 82549058 82849411 83169737 83473543 83864716 84273286 84476015 84727023 84884993 85251314
3390 85251314 85658872 86096875 86836283 87322905 87888871 88449481 88977795 89360489 89719607
3381 89719607 89893531 89913226 89724216 89298641 88984738 88714320 88191981 87710051 87447822 87027665
3371 87027665 86735957 86643897 86503627 86124212 85922003 85566651 84948043 84363132 83658258 83100630
3361 83100630 82517017 81794217 81144683 80510243 80028637 79785826 79541173 79221476 79077044
3352 79077044 78836128 78733773 78761339 78992598 79260857 79538040 79975871 80523642 81082538 81872226
3342 81872226 82565625 83363319 84169407 85055959 86136499 87139997 87978907 88978070 90147162
3333 90147162 91300307 92616787 93844595 95131986 96499552 97884884 99108659 100413403
3325 100413403 101781206 103157132 104605524 106088185 107775125 109375912 111269789 113194873
3317 113194873 115219457 117384757 119610030 121903712 124233435 126745173 129400790 132075809
3309 132075809 134803614 137615433 140325215 143026003 145510747 147732238 149790493 151640228
3301 151640228 153294797 154832499 156384177 158073711 159628179 161211818 162966313 164980467
3293 164980467 167159339 169456742 171774413 174141864 176494053 178744793 180931518 183029876
3285 183029876 185133804 187043602 188953370 190974601 193058994 195379105 197865542 200651458
3277 200651458 203643157 206971671 210526268 214395067 218535859 222905488 227557622 232325660
3269 232325660 237480303 242677655 247955051 253520969 258958222 264469043 270081811 275847252
3261 275847252 281356722 286886654 292428757 297922776 303295111 308593073 313961320 318887994
3253 318887994 323794028 328419617 332481067 336220568 339297132 341384766 342877666 343567878
3245 343567878 343293212 342435164 340963941 339124944 337186488 335245721 333151988 331006938
3237 331006938 328365987 325562926 322451677 318697656 314362687 309541675 304263025 298798556
3229 298798556 293119927 287458075 281964462 276563701 271391620 266423828 261588754 256814897
3221 256814897 252067961 247235286 242474799 237570016 232591616 227809006 222903620 217967435
3213 217967435 213138858 208341050 203887852 199629537 195545802 191654315 188038125 184583068
3205 184583068 181687101 179157332 176788961 174698556 172830800 171134715 169686543 168285323
3197 168285323 166961146 165581828 164195422 162935107 161658110 160269706 158856878 157083632
3189 157083632 154772650 152249918 149811793 147434104 145074564 142713014 140521824 138363226
3181 138363226 136459836 134552601 132778136 131084863 129674717 128155391 126731229 125385706
3173 125385706 123876895 122529102 121102656 119478325 117973332 116692309 115297600 114062040
3165 114062040 112825163 111782947 110745038 109960852 109487985 108914397 108436798 107940488 107336160
3156 107336160 106883700 106453158 106142355 105912391 105663549 105341597 105056418 104826855 104739227
3147 104739227 104617583 104444081 104439218 104472044 104397663 104405413 104542211 104908660 105158462 105320042
3137 105320042 105371393 105496312 105702421 105970300 106085603 106198653 106228831 106123998 105777460 105568089
3127 105568089 105340219 104778872 104211208 103563366 102903501 101982878 101165299 100434606 99680087
3118 99680087 98924101 98316688 97787520 97435085 97221240 97005137 97249806 97626229 97863333
3109 97863333 98304755 98983411 99713400 100619742 101691790 102785793 104031994 105066602 106245471
3100 106245471 107524677 108793113 110161643 111386042 112576446 113738234 114912059 115872340
3092 115872340 116806463 117757672 118950130 120030231 120792348 121582293 122339547 123098179 123729119
3083 123729119 124259039 124873336 125212777 125333670 125282020 124982546 124268086 123310010 122201344
3074 122201344 120830287 119231397 117322664 115404237 113161584 110567842 108036829 105393849
3066 105393849 102639703 99868175 97192660 94634482 92145471 89858784 87555468 85548118
3058 85548118 83696080 81809909 79861217 78250186 76433743 74586641 72846949 71109144
3050 71109144 69430297 67706449 66045524 64348802 62638253 61125460 59654749 58196602
3042 58196602 56770549 55496804 54294518 53214867 52331825 51402842 50447482 49504831 48608753
3033 48608753 47931802 47250912 46543075 45846435 45353259 44901183 44358831 43929981 43736151
3024 43736151 43333077 43028725 42802045 42442313 42164111 41886044 41600368 41387270 41211874
3015 41211874 40996565 40798545 40439018 40246260 39956422 39764112 39372648 39102346 38768362
3006 38768362 38487736 38318042 37964229 37671045 37439501 37365828 37221955 36936563 36678140 36506550
2996 36506550 36248330 35902426 35553848 35314513 35238397 34934188 34799003 34653468 34666782 34643145
2986 34643145 34702976 34898252 35167507 35310650 35467477 35869884 36369927 36790326 37163344 37710419
2976 37710419 38174339 38391557 38752319 39035205 39163357 38958405 38772968 38534321 38347259
2967 38347259 38644429 38623910 38638027 38670952 38698437 38783751 38760622 38596939 38555115 38537910 38583818
2956 38583818 38790707 39050140 39174283 39568623 40059740 40685686 41277306 41810201 42513784
2947 42513784 43210963 44136487 44954400 45827118 46840871 47830415 48892357 49992575 51079281
2938 51079281 52015451 52949101 53856167 54859769 55714214 56467026 57610887 58743068 59966213
2929 59966213 61332959 62596483 63943099 65326169 66731672 68180386 69701643 71128986
2921 71128986 72586064 74146956 75811783 77531057 79362949 81485138 83899463 86371049
2913 86371049 89048558 92269600 95750019 99480917 103580967 108006644 112969556 118015141
2905 118015141 123265120 128458208 133673817 138866480 144197276 149643048 155167361 160977006
2897 160977006 167140718 173508505 179536659 184834233 189021474 191810066 193488413 194214871
2889 194214871 193653945 192462725 191285651 190815615 191495372 193721113 197067894 201285688
2881 201285688 205856898 210479767 215441038 220882157 227062420 234589019 242845974 251105431
2873 251105431 258599148 265410600 272236755 279867288 288971540 299886415 313013083 327903881
2865 327903881 344184487 360889611 377596687 394078451 410211036 426684043 443417102
2858 443417102 459274043 472953253 483691396 491806621 498286690 504539675 510501140 515542912
2850 515542912 517672644 513099719 499464972 477714055 451443405 424036399 397914445
2843 397914445 374343630 353614234 336019193 321045052 308090167 296793057 285734003
2836 285734003 274373499 262378516 249985149 237530826 225599857 214440406 204332302
2829 204332302 195148412 186481836 178726070 171433214 164621130 158121593 152005652 146054155
2821 146054155 140431561 135030163 129653279 124493894 119640976 115087586 110756405 106638298
2813 106638298 102595805 98873492 95289016 91849222 88528403 85379809 82237283 79312771
2805 79312771 76659001 74083547 71706850 69314893 67046516 64814907 62765695 60914379
2797 60914379 59038509 57332878 55531815 53861151 52214505 50617279 49097929 47602130
2789 47602130 46088672 44660529 43279620 42098496 40950087 39859896 38772447 37540603
2781 37540603 36668271 35741404 34748792 33848647 32949824 32040595 31213328 30455435 29793354
2772 29793354 29074063 28422415 27811992 27249408 26663424 26026783 25560469 25108189 24603399
2763 24603399 24239957 23683212 23105688 22569122 22133270 21675481 21226052 20935226 20570810
2754 20570810 20212003 19866176 19521839 19294487 19122272 18781070 18399483 18191236 17933668
2745 17933668 17739474 17399295 17079900 16676476 16517216 16423547 16246508 16013912 15819482 15628549
2735 15628549 15425091 15370882 15065435 14881562 14810459 14563293 14298297 14275337 14133273 13921833
2725 13921833 13776420 13835086 13796198 13787744 13727918 13593596 13496824 13652626 13629055 13779826 13839219
2714 13839219 14049483 14342044 14527406 14669356 14702771 14470997 14017974 13549016 13300479 13043328
2704 13043328 12816557 12610549 12408319 12454035 12425660 12433936 12340714 12610905 12702294 12872002
2694 12872002 12984120 12935366 12672931 12190283 11667356 11068330 10495167 10171517 9761766 9423789
2684 9423789 9172530 8874811 8616846 8355730 8073087 7859858 7690895 7644921 7529349 7303372
2674 7303372 7270050 7211342 7042229 7020351 7103173 7065558 6952601 6808953 6814120 6842073 6828091
2663 6828091 6783483 6612524 6661581 6797830 6788557 6707842 6635816 6631349 6546260 6471974 6509576
2652 6509576 6558627 6531847 6339008 6230904 6260804 6151559 6072584 6066613 6104046 6066999 5965764
2641 5965764 6072333 6117613 6046516 6066452 6089895 6066483 6104571 6226317 6232548 6303436 6358239
2630 6358239 6268103 6280953 6371630 6283329 6283665 6268903 6403141 6327353 6302147 6388137 6475029 6435994
2618 6435994 6507426 6618921 6502905 6459318 6534483 6496651 6563081 6480843 6272509 6364205 6416123
2607 6416123 6442758 6431583 6424116 6307225 6205973 6411926 6453001 6538839 6679182 6806720 6868205
2596 6868205 6707271 6652217 6570461 6583851 6494967 6451925 6385845 6277745 6329547 6315040 6355568
2585 6355568 6313775 6263832 6321963 6312506 6346996 6405598 6455236 6417909 6443112 6416470 6439634 6510880
2573 6510880 6482666 6588123 6604090 6549614 6543730 6550971 6613366 6775716 6880158 6726892 6674005
2562 6674005 6555224 6356907 6124455 5917005 5697354 5630622 5312010 5141106 4948716 4676858
2552 4676858 4445676 4256564 4180169 4029395 3891896 3875777 3826841 3693564 3553056 3464451
2542 3464451 3535878 3305584 3196125 3330017 3159573 3021320 2877551 2777934 2687943 2684650
2532 2684650 2502548 2490179 2429659 2430752 2323473 2302062 2243449 2216484 2185871 2214444 2178328
2521 2178328 2009327 2035907 1990518 1869053 1664319 1721935 1697693 1666035 1459710 1469446 1368092
2510 1368092 1443150 1409571 1452986 1419119 1374798 1322965 1336092 1292965 1374739 1349404 1322184
2499 1322184 1257582 1236168 1072941 975027 1030793 1034118 1128892 1070012 918962 859852 944076
2488 944076 920412 819448 737692 757499 831118 745409 758597 788913 793538 859040 885222 756761
2476 756761 737349 831029 860972 781022 748831 933906 917391 850985 660074 696357 690190
2465 690190 586736 702491 743170 726682 646009 652295 652386 553938 639514 850679 936914 815392
2453 815392 673022 607705 712711 762298 751644 603435 666792 630546 710008 582627 438646
2442 438646 614118 621067 789934 833739 737748 670148 569606 591800 600241 727330 727727 610202
2430 610202 626639 515173 461184 595004 624869 598835 589321 599425 575627 525822 578388
2419 578388 678022 719742 675242 701823 735273 634462 524509 478027 570826 604160 701901
2408 701901 763067 746738 729660 620158 645572 699205 676465 645760 673182 601370 526405
2397 526405 642366 592259 483706 563713 588315 578857 513804 489001 520075 586603 623671
2386 623671 617814 684066 587865 418762 553133 508851 415880 527529 632541 603064 591340
2375 591340 639257 592260 583099 523975 497476 513534 579372 527569 462223 499944 487861 472056
2363 472056 513356 345058 228540 197439 231674 165662 76859 263864 319765 302681 162974
2352 162974 -40062 -92579 16786 107323 68943 108829 68444 216415 205738 107595 249993
2341 249993 158847 139114 138235 89272 124026 240293 248753 270142 294502 212512 215635 222096
2329 222096 90974 193051 229576 305588 254613 122472 71662 130163 71621 93034 223280
2318 223280 261706 164166 91007 88765 78482 59441 73054 204533 349244 392436 236711
2307 236711 144127 202081 155022 203583 120061 153304 242717 255128 275450 264831 201340 114043
2295 114043 135057 107426 171859 51772 157554 217982 245178 170751 166344 193493 291799
2284 291799 254487 211181 186628 104596 104859 71392 131970 137608 20709 -26627 2574 120786
2272 120786 232659 286661 124136 78426 55842 405 -11004 18131 114381 223590 174128
2261 174128 204673 108873 191093 284229 227589 199576 147807 50528 84634 88460 70497 109214
2249 109214 -113711 -30823 125554 129092 222488 232276 124875 121470 126961 159731 145530 311847
2237 311847 195398 60513 182531 163236 62057 65198 88727 136920 45102 108339 234415
2226 234415 159682 8064 104972 164888 276250 253807 191864 82460 46336 104144 234357
2215 234357 90542 36531 25155 98141 119444 118014 286665 368556 350864 343083 226683
2204 226683 199805 331880 357583 365614 293348 268543 286329 398873 305553 302349 327149 285835
2192 285835 270244 461623 448231 365690 440203 402174 401101 528142 454765 534183 511687
2181 511687 612852 577906 549537 588004 603761 559641 550470 473121 463524 451170 425850 584573
2169 584573 610722 623649 562637 646993 633232 612805 644030 575348 674990 792287 679207
2158 679207 740332 778945 756870 871052 812558 913890 942140 871430 919232 1037702 1120551
2147 1120551 1136736 1183093 1231820 1266679 1389871 1462427 1474426 1628140 1734311 1811731 1666837
2136 1666837 1747465 1966924 1965039 2157197 2154883 2175492 2356206 2372071 2497439 2682504 2890343
2125 2890343 3112670 3273505 3510356 3961368 4291213 4470725 4695121 5094140 5483279 5978258
2115 5978258 6715638 7527273 8510197 9647648 11073492 13121978 16534584 21622054 27320888
2106 27320888 29204107 25912123 21511387 16934975 13151687 10384389 8232641 6688385
2098 6688385 5646293 4875323 4405715 4031034 3778362 3717762 3625975 3410209 3182521 3009835
2088 3009835 2664170 2395788 2109234 1899049 1643174 1523783 1630724 1622487 1532363 1517464
2078 1517464 1390788 1185062 1242101 1412027 1343083 1197068 1047919 1017462 1017865 1038443 865034
2067 865034 900865 845679 745741 718962 742129 770838 641357 635527 614156 593013 481619
2056 481619 409144 453754 391972 511180 465533 479181 457462 392307 377057 354292 369309
2045 369309 260165 340341 378690 330026 196420 181616 380874 351058 260520 232509 244880
2034 244880 204626 79375 118013 92920 192850 180787 197701 127934 7636 93400 119807
2023 119807 33368 -31895 39601 65720 131760 122961 142758 78264 3857 135546 -3649
2012 -3649 -67741 -14086 69235 73439 105602 161685 96803 60561 30954 108803 36346 54909
2000 54909 81484 144376 78683 8847 100735 50077 90890 59603 -58009 -79767 -81900 -59064
1988 -59064 141600 166745 176662 128354 137065 99262 62914 14963 -95669 -22972 -28966 37847
1976 37847 58872 18291 28624 -40850 46657 79354 2604 17814 23834 -29296 -31481 76061
1964 76061 33445 -10116 49473 55570 111573 -30497 -76228 -22323 -127227 -92934 -96444 -218632
1952 -218632 -253170 -9938 -37448 -107089 -203569 -121930 -104407 -51312 -121426 -70887 -162451
1941 -162451 -179338 -129638 -170055 -157012 -197277 -167978 -148903 68406 -46234 77575 96556
1930 96556 -25046 -183576 -103692 -192243 -230290 -82369 -90535 41289 22209 37240 -36252
1919 -36252 -134621 -293144 -364668 -266888 -181250 21458 87251 17937 -52970 -47776 -64181 -133791
1907 -133791 -51112 -139146 -172275 -35468 -28398 -104256 -132083 -154855 -239107 -113571 -70091
1896 -70091 -73416 -158770 -244606 -221635 -15815 35326 1706 41825 -75668 -76356 -123104 -91875
1884 -91875 100726 9673 -13493 -162716 -93744 -28708 -113647 -13411 -121163 -64812 -101842
1873 -101842 33976 66312 6510 -58061 -187358 -133069 -67045 -17286 66472 -123515 -69158
1862 -69158 45327 78586 63160 -52142 -20211 72644 14077 -31435 106733 134912 55626
1851 55626 147546 15708 -144924 -106048 -61077 -20279 -154012 -57286 89038 35570 -8172
1840 -8172 1288 -19066 78153 46774 4146 21365 -18637 -12984 -44891 -88944 -83704 -102143 -83809
1827 -83809 -59769 58650 -41461 -24669 -38788 -87895 -157075 -27365 -121285 -116419 2803
1816 2803 -38805 68424 25158 -42150 -180855 -196281 -145697 -95691 -36661 -86322 -144320 -166080
1804 -166080 -67463 64332 39855 -54285 -50374 9195 71989 20501 -79085 -108567 -17638 -38986
1792 -38986 -129184 -121377 -85950 -87078 -107205 -151873 -223251 -178475 -134344 -172643 -133594 -110536
1780 -110536 -171585 -146070 -19757 81234 20874 48084 33939 -26817 -70691 43786 -20978
1769 -20978 4779 -133757 -107011 4805 107310 32951 -48168 -199900 -179636 -139775 -69074
1758 -69074 -74239 -96991 -138236 -207350 -208302 -227901 -186522 -35863 -74834 -61123 7351 -3105
1746 -3105 -45283 -152375 -288773 -197998 -149049 -98698 -65882 -83564 -135671 -234523 -191246 -198636
1734 -198636 -219448 -189051 -86628 -104671 -149611 -253246 -159292 -220536 -146762 -199196 -176518
1723 -176518 -161240 -199031 -113064 7210 26333 56970 -109983 -120934 -74046 20146 -51191
1712 -51191 -123799 -168293 -125520 -73365 -52374 -106410 -151458 -266624 -136481 -111882 11795
1701 11795 82558 28226 46912 11253 -21045 -56682 -69499 -114557 -42575 10805 -130793 -173628
1689 -173628 -138349 -146718 -118692 -68394 -72357 -65467 -215289 -169686 -176719 -111040 4045 -91260
1677 -91260 -111061 -281375 -112446 -125873 -211618 -234131 -172326 -204830 -203287 -183627 -127177 -124936
1665 -124936 -124822 -145588 -275363 -303292 -258114 -195794 -200331 -110514 -139669 -231179 -91777 -78221
1653 -78221 -57090 -128263 -122359 -137105 -205995 -149808 -141737 -252536 -240844 -215366 -105673 -156345
1641 -156345 -312535 -347884 -183321 -154809 -53850 -122231 -109431 -160908 -213962 -214757 -90349
1630 -90349 -42659 -139414 -106968 -132857 -113566 -267094 -265462 -287921 -293870 -229607 -187971 -242624
1618 -242624 -167628 -97907 -161649 -84047 20538 -128349 -158034 120290 122286 3497 17389
1607 17389 -105493 -177112 -203193 -140497 -189214 -130111 -71929 -100206 -124861 -24940 -151756
1596 -151756 -195521 -55744 -82928 -48887 -30093 -84180 -146957 -103816 -142266 -158518 -78791
1585 -78791 -100027 -180708 -99496 -200916 -181549 -81392 -73588 -29999 13347 -38243 -76631 -148521
1573 -148521 -122402 -174849 -110655 -129000 -212032 -34939 -44378 -74049 -148336 -186752 -194870 -116817
1561 -116817 -206520 -94153 -132972 -242051 -137934 -197717 -64492 -47805 -134585 -37159 -116598
1550 -116598 -184146 -226389 -196723 -21654 27894 -122480 -204778 -29369 10281 -95329 -95961
1539 -95961 -43971 -60449 -128937 -194382 -257345 -202050 -237995 -269455 -154675 -165787 -162234 -195388
1527 -195388 -130444 -207001 -151112 -58853 -172928 -170070 -192158 -123305 -111754 -147504 -28699
1516 -28699 -124770 -150859 -29080 -44480 -66130 -118299 -141596 -123094 -178495 -194124 -195421 -294186
1504 -294186 -169935 -59895 -119803 -60277 -78352 -85027 -147554 -148644 2032 -59745 -35779
1493 -35779 -140266 -210550 -144421 -81713 -70850 -17513 -67392 -44246 -108670 -149433 -105426 -95813
1481 -95813 -52033 -205718 -286586 -173292 -61214 -127847 -205315 -57611 -69769 -3101 -210114
1470 -210114 -262908 -58296 -8541 -67804 -210774 -96470 -137256 -170245 -127228 -132176 -108900
1459 -108900 -102955 -110072 -201848 -194379 -149259 -136085 -161835 -149130 -162344 -20019 -30122 -214866
1447 -214866 -163206 -263844 -259829 -242894 -104944 -80229 -47209 -104836 -130315 -201741 -236916
1436 -236916 -241336 -205928 -264223 -190409 -38725 -100515 -174358 -172058 8289 -89321 -191848
1425 -191848 -180833 10698 69960 -25725 -17857 -58474 -112508 30103 82411 -56525 -200428
1414 -200428 -127927 -28024 44255 52415 -95561 -154294 -105765 19099 -67842 46709 34576
1403 34576 -22030 -39141 -150934 -115457 -73859 -211695 -210885 -465 -17421 -11387 53840 120075
1391 120075 89167 -87872 -78895 -204804 -209172 -138967 -75738 -61211 -78778 -95087 -57002 -68310
1379 -68310 -190926 -122479 -192337 -235742 -1353 -53821 -129441 -155688 -189815 -97585 -47261
1368 -47261 -17608 -52259 -91647 -172886 -140950 -172202 -292927 -145016 -58849 -57890 -92614 -105059
1356 -105059 -158629 -217025 -292581 -239896 -25487 -131826 -180203 -109342 -43363 -82593 -26061
1345 -26061 20209 53121 41703 64187 130047 38128 -87175 -93222 -47337 -25146 21480 -36757
1333 -36757 -133394 -13225 53126 80248 -41225 -95932 -77421 -114314 -86260 -9297 -82483
1322 -82483 -136205 -87700 -183247 -130487 -19876 -18461 -92653 -181050 -133581 -181567 -178739 -89174
1310 -89174 -118986 -98059 -21662 47608 -49472 -149961 -107034 -283612 -255083 -196701 -258679
1299 -258679 -142112 -228817 -348668 -232555 -157192 -118845 22351 -37698 -93064 -89010 -208247
1288 -208247 -255906 -41235 71587 96968 -59141 -191775 -122109 -60903 -315 22869 83012
1277 83012 -5690 -108966 -140084 -106120 -70135 -145048 -146366 -30906 -71744 -89912 -134088 -300374
1265 -300374 -194738 -113064 -283975 -206851 -118965 -144415 -39545 92863 73363 44175 574
1254 574 -51394 -178867 -176050 -128371 -164186 -101315 -12150 -57643 42430 -76778 -269592 -19181
1242 -19181 132199 -13351 -116074 -145617 -82795 -10237 -109640 -104340 -54290 -29080 -44780
1231 -44780 -90874 43374 65101 -29974 -18441 -56014 -71813 -86085 -140480 -159322 -151922 -207675
1219 -207675 -116409 -90005 -111562 -66763 -60726 -52930 -119223 -144359 -91713 -124782 -179249 -177138
1207 -177138 24989 -4215 -109543 -25040 27317 -85475 -61583 -162058 -143226 -90650 -81340
1196 -81340 -100720 -85534 -99664 -223553 -179772 -157293 -191736 -211464 -159558 -231596 -140817 -86751
1184 -86751 -202274 -159598 -161207 -154122 -146108 -157901 -137729 -174057 -112216 -118241 -15961 29755
1172 29755 -80445 -158961 -236535 -167627 -171378 -115972 -83308 141815 62316 -112017 -133736
1161 -133736 -26000 15575 -85916 -72935 -97157 -153252 -166031 -153293 -146627 -199023 -91482
1150 -91482 3378 -96909 -90130 -146552 -39330 -7569 -118551 -59487 -126763 -199705 -108890
1139 -108890 -146662 -200227 -150167 -129325 -142891 -62586 -91452 -80295 -147896 -147263 -165783 -91405
1127 -91405 -81621 -121852 -27277 74135 22500 127928 87136 -32014 -50851 -136405 -74040
1116 -74040 -47677 -18040 -117743 -64106 -39448 -62397 1103 -82202 -57523 29467 -13628 -81418
1104 -81418 -188075 -241726 -174379 -66669 -79209 -6075 -44260 -133887 -106883 -67228 -99673
1093 -99673 -177023 -78062 -104478 -15450 -119785 -88349 -4340 -41718 25180 -44318 -106168 -170802
1081 -170802 -98032 -76683 -68889 17559 -57450 -10046 94712 16326 90155 51495 15727 -27644
1069 -27644 -27421 -13346 -90544 -16981 -44015 -145487 -131140 -76861 -170349 -284451 -269323 -72973
1057 -72973 -132910 -230178 -156174 -21885 -60880 -71512 -65167 560 -18147 -65298 -88189 -45667
1045 -45667 -87747 -130709 -213875 -145505 -20113 -82612 -13883 -3439 -99967 -14995 36623 -6353
1033 -6353 -121732 -98611 -49638 -9481 72961 83905 340712 268543 134747 130811 133586 180572
1021 180572 119499 132581 50317 -48473 -17754 -43619 11302 -31016 -40960 -104166 29837 11240
1009 11240 -14873 -47966 -115167 -131002 -160404 -73509 -68217 46311 75106 -81980 -80939 -60759
997 -60759 -76360 -214 64457 16364 -68838 -36556 -9480 -29708 -136117 -76139 35746 -62345
985 -62345 -80448 -164954 -121163 -220242 -98228 -124655 -90337 -116791 -145485 -35423 -197007
974 -197007 -270367 -119288 -550 -67806 -21468 12556 -26986 -1456 2447 21013 -220163
963 -220163 -96616 -60430 -174987 -151883 -150333 -32588 39337 90664 41659 23914 -19465
952 -19465 -173032 -119825 -36740 -43176 -68432 -161276 -40658 -22045 9871 -8270 -73918 -162734
940 -162734 -83635 69544 -40527 -194761 -117625 -4623 2273 -148174 -130667 -64420 55740
929 55740 92249 95211 86734 8298 -110588 -45462 58541 78521 30943 -43201 -18128 18090
917 18090 68827 90916 -22315 -30634 453 48508 35849 -54861 -147428 -134171 74182 172702
905 172702 693 -86052 -57620 -56856 25596 36982 29797 11324 -36305 48747 22926 88540
893 88540 46745 31851 33560 36195 -7368 -81972 -49335 4112 72550 63633 38569 -110849
881 -110849 -105070 -108139 -49108 -38216 109465 93325 -135608 -38217 73280 80601 -85840 -9091
869 -9091 139038 67421 -74444 -56933 27783 107345 87145 -58262 -44073 -63604 -6556 27029
857 27029 -24554 -21871 12989 -11473 -114479 -4550 -34319 -36747 -40491 -119675 -32615 59184
845 59184 24511 3582 101100 85560 50099 55150 -16212 -140020 -78655 -27034 10143 -38
833 -38 -49338 -69822 -82420 -161555 72720 103056 57098 45172 -29339 -49226 17281 -40085
821 -40085 -169388 -171066 -130451 -91337 -62530 -6220 -47990 -100402 -235858 -235598 124 -42554
809 -42554 -92256 41427 23568 -18813 -7108 153053 169793 66551 -10042 -47839 -21242
798 -21242 8435 27891 47239 67528 54020 139420 134375 -50696 -128743 37333 -37505 -37254
786 -37254 29425 90292 43685 -29211 -6993 -42416 -73873 87959 187885 115835 92492 176785
774 176785 192376 104238 193822 135289 110659 110415 -5202 -119105 -29021 -79889 -7788 82580
762 82580 124847 138357 127788 52305 -3967 -32997 -40408 6182 71853 123517 54316 74521
750 74521 67583 45456 159253 91179 18756 76645 -4662 -34462 115229 101641 20797 -5392
738 -5392 56949 76049 182520 124974 9591 60609 -10591 78371 124057 -17848 -101779 -46967
726 -46967 46898 146900 217738 52761 -64651 -134232 -81492 -91218 -48303 -177518 -130774
715 -130774 -74652 3938 165076 8908 -13350 -82605 -26726 8084 38066 -20380 106194
704 106194 -17597 -59787 66375 26338 -44000 3642 37543 71921 99600 49958 -43519
693 -43519 -51122 -61590 -33643 -16979 114487 62242 -17239 26683 114710 -12144 -69037 -18393
681 -18393 -84236 -38071 103300 112075 30854 -83752 -84317 -47735 -68843 -122913 70267 143756
669 143756 48446 137448 -52430 -25923 -57089 -170702 -35608 62213 15272 75078 3719
658 3719 15504 26861 125932 60211 -38610 -58122 -108205 -52546 -29754 18018 -66904 -49697
646 -49697 -101730 -50257 170725 144698 218950 154472 51945 2125 60875 -43930 -77569
635 -77569 -71046 -131938 -170863 -147900 8982 46153 46966 25760 -57924 -21781 6859 56581
623 56581 73368 80537 81010 7935 41434 -5761 -40551 17855 6170 -29146 -16308 -6929 -19049
610 -19049 -59853 -113311 -81500 22440 -19717 -28047 -26214 -29366 58446 35010 2977 -7864
598 -7864 30653 20157 -23293 -108318 -19275 1143 36781 93385 188644 48922 71103 58197
586 58197 -83376 56635 182872 221949 230180 229875 77308 87547 12366 89280 217409 239709
574 239709 111083 43639 73421 40755 45172 201867 177074 222016 56174 114452 47697
563 47697 72075 145620 -13132 28987 -38917 -78747 5763 2003 94717 41437 -4748 108450
551 108450 115427 78665 90465 138689 120278 9478 50970 85377 -152162 -47642 -37561
540 -37561 80980 -24813 68960 203004 176364 98199 -55885 -34750 8434 25813 -35978
529 -35978 32611 -21696 -15387 74848 107820 86535 -7441 -35771 131747 161768 50748 51304
517 51304 45341 129823 184869 162786 91158 92241 164681 194138 78463 70466 64843 -4244 42443
504 42443 112751 197857 69836 77988 107339 2469 73051 98461 110919 153067 88830 172454
492 172454 157746 64118 7476 89528 136593 47686 89724 179309 92886 32895 180545 185168
480 185168 153733 186690 67740 27383 148628 17210 109822 105998 -40929 33629 78224
469 78224 31478 -66748 -35192 41074 138581 91673 86821 20430 77713 75101 122192 -38450
457 -38450 -7054 98811 -8745 59864 198759 101407 76696 -101519 -51073 78052 -27194
446 -27194 -55245 41033 191663 82133 179107 250064 229595 123126 185825 124615 102876
435 102876 131824 182337 113350 29268 -22859 7246 7931 85269 225646 187266 81441 85856
423 85856 29297 122736 88847 -8813 -31063 4640 60683 106818 49871 -17289 62708 136420
411 136420 242622 269527 366110 314841 290329 234417 289406 282030 165641 164135 162272 129907
399 129907 69536 9546 9548 134812 73164 59659 158222 148537 228129 301159 176232 210632
387 210632 129106 42725 235106 329171 74742 -15852 6419 113970 240326 159593 234204
376 234204 318812 384472 248277 38639 1989 71726 228640 98312 164751 188727 156622
365 156622 191638 181459 221132 232050 239545 327167 277544 205852 207334 135304 171794 291639
353 291639 260810 154582 255411 274596 251054 242906 249644 250483 301938 80253 28178 279215
341 279215 378409 234001 194901 208609 200357 128671 154296 157106 168219 152700 131230 131615
329 131615 273256 361566 224266 80893 40705 30942 74325 141113 225391 156694 93743
318 93743 210221 313402 190336 214142 190960 131236 233070 238316 332317 349155 247086
307 247086 281192 298986 227442 264585 274631 275197 195205 174976 225023 207671 154755 121286
295 121286 118534 122888 117360 210445 287246 149740 90739 217412 297908 318293 196540 300703
283 300703 286607 254528 297956 308045 216275 153276 202053 238372 174299 111071 130102 116028
271 116028 131552 50602 174594 187903 163197 294118 340828 292776 143636 36330 96885
260 96885 63871 20705 19640 251336 134814 189018 235127 307588 285183 330270 410384 327928
248 327928 193717 159632 275454 261799 172173 24965 133262 142816 303522 251633 226584
237 226584 179814 265436 297122 157061 200190 148913 172149 322062 176100 240845 203606
226 203606 224023 239710 268120 337943 385808 402188 337829 324064 179286 232145 201363 187988
214 187988 241190 107426 91097 126446 344395 364540 279383 166399 174987 178593 113882 138938
202 138938 267925 262359 290988 403051 318145 248907 233710 225834 227826 233694 351982 353698
190 353698 215851 171590 110268 67502 106770 157924 159731 201009 280272 270645 209425 141584
178 141584 183945 187795 130100 242398 154695 131358 100634 -37086 81172 189859 175689
167 175689 180407 275024 284896 286754 242522 205447 271588 282108 378578 259126 256388 270751
155 270751 258936 290443 329872 290271 275864 329447 310215 270191 250137 191685 198897 201089
143 201089 328742 368480 340657 171637 92650 147381 178696 161250 182541 269050 185999
132 185999 98874 106402 130017 222321 178695 310803 280443 228093 249405 259588 298635 310702
120 310702 278519 178947 208512 291261 333392 247888 337186 347361 314202 303254 249579 282961
108 282961 220632 299303 354008 304624 269366 244562 262311 287260 128731 158622 279555
97 279555 224326 341233 227345 221165 191043 174714 297248 384572 318985 263045 236112 375370
85 375370 374448 273411 260455 212521 255956 282785 253671 184879 248414 253548 96504 129390
73 129390 287103 268944 280542 254447 140649 258605 175797 221079 276758 253123 171888
62 171888 278047 344889 203881 191378 176519 236146 317619 315713 212231 229677 288465 235703
50 235703 242043 246874 250959 215716 206897 228864 157947 230057 335685 286180 236574 281274 245164
37 245164 221542 294442 277816 277639 271373 284562 239158 213768 294029 298885 280691 299652 316409
24 316409 314973 339844 282767 335236 253340 227710 151259 109457 212123 218139 254001 315547
12 315547 351184 321687 307247 288871 286096 317602 292980 243709 241007 274600 256174 214458
0 214458
$$ Imaginary data points
##PAGE= N=2
##DATA TABLE= (X++(I..I)), XYDATA
16383 -5235148 -5156102 -5125894 -5086046 -4948523 -4895844 -4779009 -4656363 -4568417 -4517266 -4527671 -4372112
16372 -4372112 -4234701 -4263648 -4164892 -4114285 -4027989 -3998772 -3931601 -3817421 -3738128 -3634893 -3620171
16361 -3620171 -3548938 -3433092 -3368715 -3291429 -3173668 -3149150 -3114506 -3083095 -2942692 -2864652 -2770578
16350 -2770578 -2566467 -2526919 -2460426 -2455004 -2387998 -2282258 -2253256 -2233063 -2133198 -2021173 -1912146
16339 -1912146 -1848343 -1803542 -1721539 -1628566 -1714370 -1686373 -1558695 -1513257 -1376239 -1277251 -1231977
16328 -1231977 -1190330 -1087291 -1115773 -1065867 -898746 -774371 -697858 -614759 -538437 -431636
16318 -431636 -446702 -404300 -491675 -372356 -311822 -213860 -84023 -37665 -10144 37072 40749
16307 40749 77906 210016 273063 264106 358835 504000 504258 618807 709889 742049 896048
16296 896048 984672 932179 1018922 1014154 1139871 1217311 1302729 1248008 1289354 1340845 1394071
16285 1394071 1574129 1555006 1495263 1558016 1669672 1680958 1736887 1845728 1928691 1932877 1969869
16274 1969869 2027329 2093393 2163108 2161283 2219214 2356238 2301396 2355981 2496845 2612084 2672606
16263 2672606 2588640 2526176 2706898 2780069 2740151 2814559 2934319 2974376 2969107 2922765 2903141
16252 2903141 3061853 3132786 3280235 3276856 3219883 3300061 3438369 3454894 3460025 3623995 3578232
16241 3578232 3563454 3559050 3651829 3761405 3768113 3747460 3775272 3828036 3880778 3981705 3945318
16230 3945318 4047710 4050761 4136007 4216138 4176630 4103761 4225239 4221071 4240127 4342629 4376245
16219 4376245 4421693 4421029 4500420 4591437 4601863 4530396 4572695 4646791 4680784 4620994 4704634 4706312
16207 4706312 4698185 4843913 4814464 4824901 4944173 4981207 4957788 4951491 4920694 4957763 4972102
16196 4972102 5089893 5167205 5052034 5028909 5126571 5151388 5162792 5109965 5052342 5188026 5219459
16185 5219459 5185805 5250790 5372403 5226465 5293538 5395402 5452296 5523569 5499815 5531442 5556073
16174 5556073 5576268 5545985 5591277 5701552 5754639 5752315 5775146 5749045 5701082 5690425 5643125
16163 5643125 5616534 5620466 5672693 5831070 5784772 5718723 5860288 5994125 5802971 5801631 5840472
16152 5840472 5810273 5809048 5916123 5919123 5981454 6053382 5981841 6023788 6050441 6021540 5932490
16141 5932490 5866344 6035882 6096890 6110712 6212026 6211654 6222132 6145274 6090677 6107095 6128805
16130 6128805 6149547 6210534 6124258 6218893 6217368 6313246 6553240 6519581 6432670 6501691 6357808
16119 6357808 6297097 6251177 6335189 6393624 6337185 6330077 6304357 6392954 6256134 6240648 6266408
16108 6266408 6263778 6365774 6326316 6301364 6381539 6486253 6435912 6367180 6362687 6287246 6314424
16097 6314424 6382869 6447653 6492944 6511425 6452464 6386328 6543215 6619773 6634826 6633727 6505889
16086 6505889 6479682 6609487 6672360 6556701 6532580 6685842 6661633 6670966 6539772 6584000 6464726
16075 6464726 6398384 6488134 6592943 6556925 6527778 6469296 6399533 6416478 6492448 6516817 6486070
16064 6486070 6522741 6598124 6672390 6613268 6639460 6788179 6735336 6591858 6549438 6574033 6518387
16053 6518387 6454245 6471823 6632306 6665464 6585483 6628504 6610232 6659433 6596038 6590628 6618050
16042 6618050 6711419 6595940 6517439 6506221 6682107 6704140 6573314 6663573 6736129 6702338 6756410
16031 6756410 6632651 6657607 6679159 6702892 6630676 6597286 6472016 6596218 6632439 6585628 6647188
16020 6647188 6671898 6598018 6590211 6639872 6689304 6726893 6745416 6711466 6749506 6660163 6515788
16009 6515788 6670921 6742461 6631139 6594108 6549469 6523967 6648006 6737060 6723587 6837369
15999 6837369 6805195 6674418 6657087 6647067 6672574 6696924 6646828 6698871 6694297 6511951 6514546
15988 6514546 6694829 6728599 6615056 6753726 6769292 6635432 6530046 6439433 6497688 6716332
15978 6716332 6722077 6606844 6626951 6708266 6672670 6693387 6679038 6704024 6678747 6705803 6621144
15967 6621144 6553907 6527514 6743460 6689823 6672046 6823854 6845041 6716192 6550547 6685209
15957 6685209 6724651 6724906 6722723 6683317 6788430 6795697 6757316 6778525 6711976 6814996 6675016
15946 6675016 6679540 6737223 6786333 6747780 6715779 6796143 6950186 6889163 6793782 6807507 6801224
15935 6801224 6788316 6723462 6726013 6767821 6822487 6792841 6773132 6667338 6724464 6735837 6694772
15924 6694772 6636760 6681376 6665727 6641130 6564677 6630246 6717811 6833600 6714552 6684328 6643461
15913 6643461 6811666 6779854 6705402 6549205 6559635 6729524 6697457 6728946 6873995 6751317
15903 6751317 6682386 6719321 6827631 6789136 6782660 6779321 6684708 6779013 6698888 6695654 6702003 6744293
15891 6744293 6743021 6780215 6788087 6703577 6640821 6668488 6610095 6659365 6700735 6718994 6622012 6696252
15879 6696252 6868010 6935466 6805508 6947594 6895255 6728444 6800968 6794421 6763732 6660496
15869 6660496 6699940 6685308 6699995 6670981 6622903 6695688 6749836 6683026 6647874 6696422 6656039
15858 6656039 6789763 6713867 6713540 6760342 6744617 6829564 6780774 6838102 6820059 6841558 6907866
15847 6907866 6890569 6870553 6798662 6738754 6702620 6773687 6757873 6768421 6646673 6699358 6787605
15836 6787605 6788158 6849947 6912971 6722803 6702252 6701012 6918066 6774309 6783334 6828577 6807311
15825 6807311 6838354 6837150 6786650 6706582 6721885 6749667 6722053 6754375 6815525 6794926 6832071
15814 6832071 6800266 6773847 6675033 6848127 6794405 6657427 6741929 6852003 6826927 6877486 6817543
15803 6817543 6806590 6813901 6792576 6846132 6857975 6786814 6908347 6771682 6653213 6581691 6642534
15792 6642534 6614615 6582795 6783842 6780168 6865794 6927336 6926687 6907526 6934111 6894499 6970538 6810918
15780 6810918 6844943 6913886 6970376 6975304 6832170 6731847 6758980 6723611 6708543 6851106 6800819
15769 6800819 6908695 6911438 6876951 6746954 6762400 6764101 6804367 6896184 6819604 6822146 6864818
15758 6864818 6906458 6936361 6895118 6718129 6776831 6863693 6817480 6889135 6791132 6948038 6939662
15747 6939662 6748516 6783118 6870036 6826796 6781985 6828769 6806292 6742698 6801102 6816359 6889613
15736 6889613 6756502 6704903 6947274 6903486 6868696 6926348 6923855 6886478 6731503 6738172 6847460
15725 6847460 6764790 6706246 6756629 6870580 6773750 6793061 6797991 6807533 6867485 6826462 6712183
15714 6712183 6689284 6841220 6779551 6829481 6822927 6913488 6884761 6865440 6839656 6849448 6812276
15703 6812276 6917600 7052505 6951528 6873239 6881610 6907962 6933462 6950727 6921198 6783275 6910763
15692 6910763 6875636 6844134 6878485 6805589 6792994 6919672 6976380 6967036 6950368 6875401 6824330
15681 6824330 6899312 6894298 6792383 6946916 7012580 6976309 6942542 6906967 6906542 6895799 6824147
15670 6824147 6923567 6940206 6966144 6902345 6963192 6882727 6869269 6841588 6858913 6964909 6875576
15659 6875576 6893225 6976135 6976149 6910085 6881569 6916128 6779358 6725115 6863140 6864744 6875111 7020781
15647 7020781 6911362 6919010 6952120 6900894 6895791 7013844 6972110 7006253 6890789 6893482 6853125
15636 6853125 6892544 6861361 6922689 7035699 7007387 7027772 7007276 7029628 7042750 6968417 6968326 6944369
15624 6944369 6910205 6955488 6946781 6828545 6949171 7069367 7001547 6975984 6811877 6951412
15614 6951412 7019075 7027904 6922243 6909537 6941674 6873795 6910635 7029525 6969302 6922135 6993755
15603 6993755 6955481 6998538 7069466 7011669 6874801 6868713 6845521 6979746 6997538 6963806 6980262
15592 6980262 6958378 6940313 6958859 7016384 6998202 7025213 6868276 6959389 7050900 6987768 6837828
15581 6837828 6859237 6926187 6919925 7006530 7075422 6942368 6806752 6758292 6843331 6886943 6927733
15570 6927733 6866145 6968832 7020322 7046247 7042491 6923988 6994611 6991424 7024829 6982485 6965322
15559 6965322 6924338 6910448 6936377 7034925 7143608 7073460 7004091 6911263 6875970 6972637 6910006
15548 6910006 6885138 6965104 7057545 7176938 6979796 6983162 7026357 6915960 6915742 6983384 7088132
15537 7088132 7047143 7032770 6944154 6846486 6842646 6865137 6910589 6970344 6995661 7049726 7022817
15526 7022817 7001358 7093438 7067125 6940737 6985489 6943827 6870854 7010071 6916278 6849942 6812382
15515 6812382 6836434 6860508 6874277 6917808 6869056 6893397 7045304 7002515 7089775 7153250 7016817
15504 7016817 7048936 6994644 7041794 7135010 7051504 6941264 6983055 6965584 7087066 7193093 7028583
15493 7028583 7072777 7022128 6999865 7073252 7061382 7047749 7086689 7020283 7119894 7061980 6991380
15482 6991380 6889602 6910616 7042977 7074864 6981399 6985937 7033357 7141907 7064535 6953583 6964388
15471 6964388 6904447 6922398 6936123 6927593 6878240 6915843 6868969 6902264 6927920 7061414 7102745
15460 7102745 7131523 7028871 7034609 7037941 7059670 7017235 6990359 7094377 7039571 7032767 7090028
15449 7090028 7023276 7046863 7017352 6981583 7000747 7128319 7152424 6984600 7017130 7101655 7061404
15438 7061404 7066274 6957698 7000540 7074902 7103989 7094397 7130388 7074069 7203573 7247362 7191092
15427 7191092 6938811 6924286 6956226 6999864 7004700 7053461 7091846 7054209 7047817 6993000 7067301
15416 7067301 7092452 7182381 7089555 7141642 7086840 7050916 7091053 7187551 7132862 6947419 6961987
15405 6961987 6982944 7083881 7160514 7160949 7056985 7119367 7192870 7042592 6931828 6898164 6945762
15394 6945762 7022926 7154616 7161239 7054552 7030009 7186098 7185554 7120183 7182137 7129998 7044019
15383 7044019 7221569 7173346 7048513 7115067 7094043 7052532 7013945 7020722 7141078 7111039 7085801
15372 7085801 7088609 7083947 7051293 7051653 6945362 7064158 7069267 7126998 7200871 7129337 7095587 7112977
15360 7112977 7114199 7088067 7218183 7240345 7270482 7137694 7007738 7030468 7047406 7098322 7105901
15349 7105901 7165356 7229967 7220632 7051467 7014165 7132083 7134370 7067499 7017477 7035385 7119083
15338 7119083 7075398 7147557 7223919 7231521 7133011 7048983 7130476 7031765 7055230 7185131 7140142
15327 7140142 7101615 7127842 7277301 7394604 7270733 7114427 7183892 7222605 7045733 7016536
15317 7016536 7058192 7094427 7015156 6988572 7011479 7080744 7157644 7340630 7201056 7059612 7119913
15306 7119913 7135508 7176642 7183312 7275381 7156942 7100956 7108369 7066531 7064581 7076649 7121756 7218172
15294 7218172 7321318 7314787 7293891 7245599 7336730 7419410 7246619 7178226 7300193 7315206 7155891
15283 7155891 7219650 7196750 7175062 7205683 7257404 7238549 7129480 7170908 7159245 7100433 7125100
15272 7125100 7171090 7163249 7218720 7084839 7145669 7173276 7102927 7130527 7158168 7219626 7228472
15261 7228472 7216820 7221888 7218612 7191099 7268441 7189489 7119634 7115757 7154863 7090005 7094170 7174404
15249 7174404 7237682 7205842 7199006 7203968 7151027 7195298 7144734 7173387 7233429 7234497 7153411 7262981
15237 7262981 7272478 7331651 7185977 7160213 7272314 7295234 7221522 7189931 7104251 7227267 7220022
15226 7220022 7237335 7343646 7301488 7276215 7101452 7031073 7036162 7076910 7167676 7225542 7183393
15215 7183393 7198937 7160400 7204902 7254725 7148023 7089179 7215361 7257021 7196990 7203687 7123523
15204 7123523 7176913 7158141 7224770 7319139 7194632 7187869 7029743 7089525 7164664 7198109 7274831
15193 7274831 7236883 7122772 7256086 7341312 7386729 7277083 7172264 7291168 7339560 7275028
15183 7275028 7335053 7361219 7298454 7307530 7231023 7213671 7160662 7240694 7228368 7216994 7260539
15172 7260539 7312323 7376301 7331262 7354963 7239081 7221197 7303348 7269945 7226275 7180460 7187208
15161 7187208 7218982 7167378 7237033 7346516 7334887 7281551 7355714 7339197 7306286 7234054 7274710
15150 7274710 7328565 7262689 7297038 7319985 7278547 7170801 7129590 7316239 7328785 7267592 7248308
15139 7248308 7247813 7303415 7314516 7292658 7249655 7314386 7365395 7357509 7318567 7284561 7234473 7162467
15127 7162467 7234301 7273755 7182455 7114901 7079705 7223272 7358406 7266666 7251218 7288867 7276798
15116 7276798 7226204 7267409 7345245 7361225 7445045 7466857 7354336 7241810 7236979 7235152 7234210 7225152
15104 7225152 7293016 7325161 7401897 7385907 7410112 7368448 7386924 7361899 7357698 7348508 7453471
15093 7453471 7457838 7405876 7380287 7248320 7332005 7426432 7326156 7305397 7208802 7248284 7400527
15082 7400527 7386251 7287603 7315068 7394583 7454818 7495137 7265844 7358660 7374195 7336719 7268615
15071 7268615 7233619 7290214 7339584 7321781 7267666 7315011 7322944 7280550 7261804 7211230 7150727
15060 7150727 7183127 7298208 7309390 7211106 7290000 7270066 7262680 7303062 7370373 7411338 7301334
15049 7301334 7265623 7283300 7307859 7330142 7266219 7274803 7280656 7302113 7215570 7237174 7284609 7295604
15037 7295604 7319835 7295999 7430112 7489077 7476766 7540363 7460144 7432333 7469775 7363657 7366763
15026 7366763 7385382 7321497 7357446 7425434 7450201 7522062 7472657 7523750 7415744 7398028 7532364
15015 7532364 7390102 7328316 7390551 7423679 7393977 7341440 7327510 7305186 7336529 7332057 7438358
15004 7438358 7454976 7405897 7469803 7568213 7446117 7416180 7559146 7542739 7473015 7391834 7399604
14993 7399604 7449999 7329181 7178852 7286473 7282842 7356825 7447022 7312022 7314768 7426188 7436151
14982 7436151 7401428 7406204 7325709 7409072 7431615 7323666 7318533 7303422 7261156 7476586 7505813
14971 7505813 7504628 7347580 7291736 7412508 7406829 7282985 7266003 7472761 7419759 7438009 7490967
14960 7490967 7387232 7353540 7314259 7304322 7403825 7434714 7385628 7362505 7493890 7468156 7377340
14949 7377340 7470165 7486271 7394768 7384610 7277893 7234895 7214479 7285145 7232196 7280457 7265409
14938 7265409 7429048 7520397 7415370 7396356 7481055 7512924 7557815 7522178 7471874 7516635 7486383
14927 7486383 7403656 7404197 7525281 7538368 7390076 7450607 7500327 7542132 7510260 7509002 7597094
14916 7597094 7498756 7382945 7433080 7477896 7508787 7467358 7442177 7429883 7416737 7435970 7341288
14905 7341288 7468079 7459275 7408598 7437966 7576505 7509445 7428134 7412218 7541138 7596093 7499222
14894 7499222 7486046 7542390 7506303 7394939 7450194 7571333 7436815 7409440 7487641 7491048 7408453
14883 7408453 7445942 7383504 7552911 7645340 7654707 7569368 7511226 7607561 7613505 7447131 7315633
14872 7315633 7332062 7423288 7416895 7434253 7375913 7286916 7431817 7479335 7449812 7476494 7430886
14861 7430886 7453085 7517017 7561624 7680927 7612499 7606889 7571959 7615632 7638272 7563289 7519555
14850 7519555 7664369 7719733 7665222 7538158 7547108 7421426 7485915 7364167 7430807 7551078
14840 7551078 7523374 7615396 7509330 7461428 7379109 7385220 7424029 7414311 7462523 7472259 7451616 7403807
14828 7403807 7482934 7558797 7666457 7720291 7603194 7542779 7587214 7632610 7654004 7652998 7523744
14817 7523744 7510604 7499889 7503006 7588113 7545464 7503443 7471666 7395803 7461699 7431210 7531603
14806 7531603 7634447 7623860 7501223 7503246 7668454 7634797 7549346 7551871 7624516 7646205 7704673
14795 7704673 7694087 7538342 7542112 7626564 7688942 7708076 7614812 7495144 7485363 7545670 7482120
14784 7482120 7491259 7479113 7490997 7561407 7386651 7457822 7489518 7416047 7457373 7570307 7612982
14773 7612982 7507642 7495056 7506232 7589830 7705456 7722707 7567967 7611710 7565272 7529183 7598704
14762 7598704 7648327 7544459 7438136 7544373 7512658 7479298 7651786 7830768 7750843 7603637
14752 7603637 7534470 7480994 7623593 7639698 7582628 7634315 7715028 7724296 7608014 7671602 7715427
14741 7715427 7682584 7654113 7517968 7605271 7576903 7512599 7643214 7615778 7621950 7745652 7805835
14730 7805835 7783281 7816373 7731767 7723098 7704965 7543213 7618508 7643865 7639019 7626846 7610825
14719 7610825 7670950 7670322 7663774 7495681 7569010 7571476 7596874 7671540 7655609 7678286 7594818 7651542
14707 7651542 7702344 7621861 7509964 7418209 7551885 7636552 7748652 7685568 7774516 7758821 7702210
14696 7702210 7620395 7537334 7506019 7354894 7455698 7623022 7642634 7636349 7741642 7811200 7737799
14685 7737799 7841020 7812324 7732990 7741847 7656370 7659199 7652441 7608937 7639157 7616394 7743557
14674 7743557 7699221 7718662 7675189 7633252 7698104 7692306 7823200 7758226 7900210 7805222 7748662
14663 7748662 7762567 7835779 7744745 7822841 7775479 7781764 7851811 7775051 7716637 7676812 7787153
14652 7787153 7829099 7671975 7715804 7721759 7692784 7637960 7716032 7710031 7672398 7752362 7727726
14641 7727726 7743613 7648539 7715827 7660673 7665093 7694245 7799054 7837257 7768524 7703946 7619897
14630 7619897 7588925 7564887 7560018 7510922 7660096 7570398 7531994 7614451 7714405 7707804 7577146
14619 7577146 7624550 7659765 7665389 7697743 7754421 7698916 7751930 7800511 7766412 7701822 7808453
14608 7808453 7833547 7604839 7591482 7760664 7863091 7865606 7895103 7784759 7764596 7670192 7639513
14597 7639513 7805940 7745331 7713380 7679358 7644360 7680008 7765754 7796050 7919238 7927042 7882948
14586 7882948 7805506 7750764 7741126 7758300 7752296 7688231 7700448 7827380 7808544 7678829 7658672
14575 7658672 7706361 7692795 7641643 7709276 7702328 7785824 7785529 7732039 7642690 7734824 7644470 7713192
14563 7713192 7917379 7894042 7850605 7858616 7834534 7698600 7691004 7582425 7612734 7631558 7679960
14552 7679960 7650888 7640571 7786235 7742108 7759607 7740708 7791163 7847055 7805700 7863765 7756658
14541 7756658 7693768 7576758 7607314 7584237 7663418 7724537 7723356 7628483 7728384 7647536 7671239
14530 7671239 7722635 7670332 7808878 7744243 7605170 7741900 7816471 7853348 7831356 7734737 7738161
14519 7738161 7735629 7746863 7692230 7677321 7683189 7804875 7757514 7844136 7986566 8057720 7951216
14508 7951216 7830693 7805263 7823439 7962041 7907815 7904155 7880034 7802669 7869661 7731652 7695936
14497 7695936 7911897 7970012 7858701 7916445 7905208 7720204 7840141 7951176 7841625 7769129
14487 7769129 7802224 7883563 7756682 7796602 7651792 7536233 7676338 7772298 7803413 7840472
14477 7840472 7780969 7800629 7754709 7787588 7818037 7963625 8031891 7865132 7752497 7853991
14467 7853991 7813746 7790295 7812008 7750270 7766420 7795835 7631593 7652232 7591244 7692293 7707108
14456 7707108 7705014 7928262 7896214 7936750 7943310 7847378 7940046 8039070 7878057 7895363 7861103
14445 7861103 7881949 7854969 7847646 7831211 7746367 7778986 7877208 7858960 7799949 7871514 7954296
14434 7954296 7790294 7754637 7764256 7931384 7882557 7909376 8001019 8056223 7906509 7839380 7921752
14423 7921752 7894471 7928228 7868508 7805713 7868882 7827275 7770513 7814683 7844035 7896029 7935269
14412 7935269 7944809 7937273 7939560 7948829 7896611 7900972 7931176 7871356 7831937 7860880 7890076 7889215 7741955
14399 7741955 7887113 7949585 7935287 8011183 7962119 7890332 7944499 7846485 7829529 7814735 7787998
14388 7787998 7923990 7956565 8065730 7972930 8018097 7886390 7864109 7877196 8003079 8058690
14378 8058690 7920377 7818076 7842972 7954225 7943764 7845595 7842133 7865024 8043595 8142179 7932694
14367 7932694 7904627 7891861 7819156 7914799 7897329 7891151 7924251 7975251 8060331 7957764 7879622
14356 7879622 8070973 8020544 7976599 7870215 7804557 7922777 8009575 7936589 7954794 7882289 7833029
14345 7833029 7934811 7937142 8034815 7960379 7987985 8072205 8149739 8085687 8080473 8066740 8015455
14334 8015455 7927359 8071810 8121519 7825692 7703008 7789620 7953619 7972127 7912056 7883970
14324 7883970 7895483 7839894 7832515 7830571 7952660 7893037 7876454 8020911 8136507 8113502 8135499
14313 8135499 8207479 8062217 8098293 8147561 8095804 8083915 8196288 8051591 8041994 8075904 8081526
14302 8081526 8091359 7993286 7944388 7918371 7943285 8067419 8043616 8071229 8071445 7957838 8061114
14291 8061114 8039819 8024649 8087013 7985908 7933496 7931854 8001221 7996679 7879346 8071603 8001189
14280 8001189 7937382 7965065 7981488 8034210 8093411 8189441 8219456 8210824 8119537 8075048 7962657
14269 7962657 7948906 8018305 8043051 7904078 7976350 8058475 8015310 8051368 8060354 8007771 8046204
14258 8046204 7965240 7913698 7970418 8172620 8112886 7947709 8012576 8011340 8040144 8086148 8061646
14247 8061646 8166504 8220573 8146439 8136582 8227846 8120337 8040299 8013374 8078083 8184700 8192147
14236 8192147 8123153 8015690 7992224 7990502 8017817 7987247 8241080 8199659 8208106 8173739 8171932
14225 8171932 8161008 8200607 8182767 8162036 8252838 8127044 8052765 8064019 8038501 8056873 8134676
14214 8134676 8139707 8203725 8118400 8062185 8165300 8129901 8032165 8096845 8123897 8163313 8209314
14203 8209314 8131735 8058405 8055821 8059998 8013598 7970408 7952374 8038252 8144576 8114928 8057817
14192 8057817 7998256 8076284 8093598 8112881 8215447 8165832 8125079 8274310 8162053 8073884 8106371
14181 8106371 8185555 8102544 8050170 8206131 8094082 8278028 8227949 8190385 8118849 8135656 8070436
14170 8070436 8119534 8168839 8226039 8286265 8331535 8176758 8089786 8159448 8094657 8256346 8253271
14159 8253271 8226985 8098953 8055232 8082199 8063463 8105213 8125471 8149195 8205199 8191938 8231603
14148 8231603 8165284 8226419 8232625 8175820 8330860 8370168 8273657 8128183 8093469 8141553 8146918
14137 8146918 8254015 8195477 8087814 8134568 8221834 8278390 8254458 8268584 8211971 8202163 8200256
14126 8200256 8114065 8140150 8167667 8187956 8167661 8034364 8153113 8100330 8131663 8242251 8222477
14115 8222477 8254568 8142345 8124232 8210959 8181686 8135925 8229375 8187036 8320732 8192850 8097093
14104 8097093 8114362 8054425 7997783 8099689 8202048 8198998 8168325 8108998 8152572 8183281 8090752
14093 8090752 8128435 8230754 8196599 8294895 8159496 8116654 8162124 8266151 8321118 8236779 8305474
14082 8305474 8276839 8167201 8115564 8216234 8153696 8103273 8159925 8189479 8142694 8141050 8223337
14071 8223337 8249217 8317315 8284395 8211784 8231302 8339236 8227222 8198524 8289378 8225071 8209386
14060 8209386 8181937 8171404 8143288 8160144 8173787 8274555 8265620 8240130 8187290 8148380 8201371
14049 8201371 8215808 8259456 8289950 8391028 8346158 8280891 8292532 8322989 8307196 8215521 8253393
14038 8253393 8202417 8170946 8273006 8291492 8221979 8188589 8147849 8104139 8302291 8357222 8225143
14027 8225143 8233822 8143689 8161649 8288269 8328548 8266710 8397914 8445157 8377014 8325880 8274813
14016 8274813 8295325 8244648 8259049 8269180 8293421 8136953 8282352 8433566 8415009 8355589 8147473
14005 8147473 8181024 8243713 8349701 8179678 8193910 8126289 8246162 8247256 8209052 8443834 8367494
13994 8367494 8366578 8287564 8297006 8339473 8250729 8210577 8416417 8327243 8282102 8134172 8172937
13983 8172937 8227540 8295212 8235969 8310333 8240732 8163460 8217363 8188231 8223156 8293540 8353533
13972 8353533 8289681 8272637 8218931 8172077 8153418 8136445 8364524 8416511 8275675 8332235 8431206
13961 8431206 8365319 8341972 8312676 8273324 8335218 8383744 8408898 8383800 8420967 8413991 8232144
13950 8232144 8231580 8343204 8384501 8296401 8299297 8320086 8360911 8373157 8340304 8439616 8429902 8401460
$$ [...]
##END NTUPLES=NMR SPECTRUM
##END=
