##TITLE=1H_CA-9192-1
 CDCl3
 8 sc, 
 1.9.2023
##JCAMPDX= 6.0         $$ Bruker NMR JCAMP-DX V2.0
##DATA TYPE= NMR SPECTRUM
##DATA CLASS= NTUPLES
##ORIGIN= UXNMR, Bruker Analytische Messtechnik GmbH
##OWNER= root
$$ XWIN-NMR		Version 3.5
$$ Fri Sep  1 14:20:48 2023 Russian Standard Time (UT+4h)  she@DPX200
##.OBSERVE FREQUENCY= 200.13135
##.OBSERVE NUCLEUS= ^1H
##.ACQUISITION MODE= SIMULTANEOUS
##.ACQUISITION SCHEME= undefined
##.AVERAGES= 8
##.DIGITISER RES= 18
##SPECTROMETER/DATA SYSTEM= spect
##.PULSE SEQUENCE= zg30
##.SOLVENT NAME= CDCl3
##.SHIFT REFERENCE= (INTERNAL, CDCl3, 0, 15.7337)
##AUDIT TRAIL= $$ (NUMBER, WHEN, WHO, WHERE, WHAT)
$$ ##TITLE= Audit trail, XWIN-NMR		Version 3.5
$$ ##JCAMPDX= 5.01
$$ ##ORIGIN= Bruker BioSpin GmbH
$$ ##OWNER= she
$$ F:/spectra/data/she/nmr/H-F/1/pdata/1/auditp.txt
$$ ##AUDIT TRAIL=  $$ (NUMBER, WHEN, WHO, WHERE, WHAT)
(   1,<2023-09-01 14:19:30.56 +0400>,<she>,<DPX200>,
      <created by zg, POWCHK disabled, PULCHK disabled
       configuration hash MD5:
       00 E9 B6 7A A2 85 ED C7 34 08 36 98 17 FE 4E 26
       data hash MD5: 16K
       DF 8F 69 0E ED 52 79 44 35 31 56 F9 71 4E 10 55>)
(   2,<2023-09-01 14:19:39.26 +0400>,<she>,<DPX200>,
      <Start of raw data processing
       efp BC_mod = 2 LB = 0.24 FT_mod = 6 PKNL = 1 PHC0 = -21044.1 PHC1 = 3.85272 SI = 16K 
       data hash MD5: 16K
       64 E1 E4 A3 D9 FF 61 E5 8D 46 92 CB 82 99 60 C9>)
(   3,<2023-09-01 14:19:57.31 +0400>,<she>,<DPX200>,
      <pk PHC0 = -7.139569 PHC1 = 10.2 
       data hash MD5: 16K
       E2 84 0C 6F 7C 91 52 D5 61 D8 F3 10 0E 4F 8F 1D>)
(   4,<2023-09-01 14:20:01.03 +0400>,<she>,<DPX200>,
      <abs ABSG = 5 
       data hash MD5: 16K
       09 6A C0 36 84 86 0B 07 11 44 0C 2C 0E D8 F9 80>)
$$ ##END=
$$ 
$$ hash MD5
$$ FC 9F 24 93 36 97 C7 01 86 4C A2 AA 1A 02 93 8B
##$RELAX= 
##$RELAX= 
##$RELAX= 
##$RELAX= 
##$RELAX= 
##$RELAX= 
$$ Bruker specific parameters
$$ --------------------------
##$DU= <F:/spectra>
##$EXPNO= 1
##$NAME= <H-F>
##$PROCNO= 1
##$TYPE= <nmr>
##$USER= <she>
##$AMP= (0..31)
100 100 100 100 100 100 100 100 100 100 100 100 100 100 100 100 100 100 
100 100 100 100 100 100 100 100 100 100 100 100 100 100 
##$AQSEQ= 0
##$AQ_mod= 1
##$AUNM= <au_zg>
##$AUTOPOS= <>
##$BF1= 200.13
##$BF2= 200.13
##$BF3= 200.13
##$BF4= 200.13
##$BF5= 200.13
##$BF6= 200.13
##$BF7= 200.13
##$BF8= 200.13
##$BYTORDA= 1
##$CFDGTYP= 0
##$CFRGTYP= 5
##$CHEMSTR= <none>
##$CNST= (0..31)
1 1 145 1 1 1 1 1 1 1 1 1 1 1 1 1 1 1 1 1 1 1 1 1 1 1 1 1 1 1 1 1 
##$CPDPRG= <>
##$CPDPRG1= <>
##$CPDPRG2= <>
##$CPDPRG3= <>
##$CPDPRG4= <mlev>
##$CPDPRG5= <mlev>
##$CPDPRG6= <mlev>
##$CPDPRG7= <mlev>
##$CPDPRG8= <mlev>
##$CPDPRGB= <>
##$CPDPRGT= <>
##$D= (0..31)
0 1.2 0 0 0 0 0 0 0 0.06 0 0.03 0 0 0 0 0.0002 0 0 0 0 0 0 0 0 0 0 0 0 
0 0 0 
##$DATE= 1693563570
##$DBL= (0..7)
120 120 120 120 120 120 120 120 
##$DBP= (0..7)
150 150 150 150 150 150 150 150 
##$DBP07= 0
##$DBPNAM0= <>
##$DBPNAM1= <>
##$DBPNAM2= <>
##$DBPNAM3= <>
##$DBPNAM4= <>
$$ [...]
##$SUBNAM3= <"">
##$SUBNAM4= <"">
##$SUBNAM5= <"">
##$SUBNAM6= <"">
##$SUBNAM7= <"">
##$SUBNAM8= <"">
##$SUBNAM9= <"">
##$SW= 18.05172834244
##$SWIBOX= (0..15)
0 0 2 0 0 0 0 0 0 0 0 0 0 0 0 0 
##$SW_h= 3612.71676300578
##$TD= 16384
##$TD0= 1
##$TE= 0
##$TE2= 300
##$TE3= 300
##$TEG= 300
##$TL= (0..7)
0 120 120 120 120 120 120 120 
##$TP= (0..7)
150 150 150 150 150 150 150 150 
##$TP07= 0
##$TPNAME0= <>
##$TPNAME1= <>
##$TPNAME2= <>
##$TPNAME3= <>
##$TPNAME4= <>
##$TPNAME5= <>
##$TPNAME6= <>
##$TPNAME7= <>
##$TPOAL= (0..7)
0.5 0.5 0.5 0.5 0.5 0.5 0.5 0.5 
##$TPOFFS= (0..7)
0 0 0 0 0 0 0 0 
##$TUNHIN= 0
##$TUNHOUT= 0
##$TUNXOUT= 0
##$USERA1= <user>
##$USERA2= <user>
##$USERA3= <user>
##$USERA4= <user>
##$USERA5= <user>
##$V9= 5
##$VALIST= <valist>
##$VCLIST= <CCCCCCCCCCCCCCC>
##$VD= 0
##$VDLIST= <DDDDDDDDDDDDDDD>
##$VPLIST= <PPPPPPPPPPPPPPP>
##$VTLIST= <TTTTTTTTTTTTTTT>
##$WBST= 1024
##$WBSW= 4
##$XGAIN= (0..3)
0 0 0 0 
##$XL= 0
##$YL= 0
##$YMAX_a= 413169
##$YMIN_a= -522595
##$ZGOPTNS= <>
##$ZL1= 120
##$ZL2= 120
##$ZL3= 120
##$ZL4= 120
##$ABSF1= 15.71274
##$ABSF2= -2.339109
##$ABSG= 5
##$ABSL= 3
##$ALPHA= 0
##$AQORDER= 0
##$ASSFAC= 0
##$ASSFACI= 0
##$ASSFACX= 0
##$ASSWID= 0
##$AUNMP= <proc_1d>
##$AZFE= 0.1
##$AZFW= 0.1
##$BCFW= 0
##$BC_mod= 2
##$BYTORDP= 0
##$COROFFS= 0
##$CY= -3
##$DATMOD= 1
##$DC= 0
##$DFILT= <>
##$DTYPP= 0
##$F1P= 0
##$F2P= 0
##$FCOR= 1
##$FTSIZE= 16384
##$FT_mod= 6
##$GAMMA= 0
##$GB= 0
##$INTBC= 1
##$INTSCL= 3.70164e-10
##$ISEN= 128
##$LB= 0.24
##$LEV0= 0
##$LPBIN= 0
##$MAXI= 10000
##$MC2= 0
##$MEAN= 0
##$ME_mod= 0
##$MI= 1.114404
##$NCOEF= 0
##$NC_proc= -5
##$NLEV= 6
##$NOISF1= 3.799351
##$NOISF2= 2.8
##$NSP= 0
##$NTH_PI= 0
##$NZP= 0
##$OFFSET= 15.73367
##$PC= 1
##$PHC0= -21051.24
##$PHC1= 14.05272
##$PH_mod= 1
##$PKNL= yes
##$PPARMOD= 0
##$PSCAL= 0
##$PSIGN= 0
##$REVERSE= no
##$SF= 200.13000758012
##$SI= 16384
##$SIGF1= 3
##$SIGF2= 2
##$SINO= 5.538805
##$SIOLD= 16384
##$SREGLST= <1H.CDCl3>
##$SSB= 0
##$STSI= 16384
##$STSR= 0
##$SW_p= 3612.71676300578
##$SYMM= 0
##$S_DEV= 0
##$TDeff= 16384
##$TDoff= 0
##$TI= <>
##$TILT= no
##$TM1= 0
##$TM2= 0
##$TOPLEV= 0
##$USERP1= <user>
##$USERP2= <user>
##$USERP3= <user>
##$USERP4= <user>
##$USERP5= <user>
##$WDW= 1
##$XDIM= 16384
##$YMAX_p= 320768675
##$YMIN_p= -503880
$$ End of Bruker specific parameters
$$ ---------------------------------
##NTUPLES= NMR SPECTRUM
##VAR_NAME=  FREQUENCY,     SPECTRUM/REAL,   SPECTRUM/IMAG
##SYMBOL=    X,             R,               I
##VAR_TYPE=  INDEPENDENT,   DEPENDENT,       DEPENDENT
##VAR_FORM=  AFFN,          ASDF,            ASDF
##VAR_DIM=   16384,         16384,           16384
##UNITS=     HZ,            ARBITRARY UNITS, ARBITRARY UNITS
##FACTOR=    0.220516191357247, 1,           1
##FIRST=     3148.77954332965, 0,            0
##LAST=      -463.937219676128, 0,           0
##MIN=       -463.937219676128, -503880,     0
##MAX=       3148.77954332965, 320768675,    0
$$ Real data points
##PAGE= N=1
##DATA TABLE= (X++(R..R)), XYDATA
$$ [...]
5972d7910L0382R803j3450J2611j8355M0087N4939k3828k9556K5403k0619l9937
5960b0430J105M1091M8686j8498j9583K9073l4562J7358K5311n813K0906l9982
5948D4662l0368M2915k1424K0355M770K6618K9962o1479n085n19k7701m141n128
5935A3437Q617m353J1319K2285l4726j0308L692K4142q835M9728K2109M6012N812
5922A48931N4077J4110k1173l661p4577J7668k3586m4814j9908j9071P5556J4170
5910A17722n0509j168K199K7156J871J9909k3149l819j5869k6313P675J6270k5937
5897D6038o211J5681N3091j5037M8444K1126m2567l2426J8069L2218m3701p268
5885H7457j084Q780m5614k082K1539j8789m3584O351K7504K7923l8448M3378J1577
$$ y = [-47910, -17528, -7725, -21175, -8564, -26919, 13168, 68107, 44279, 14723, 40126, 19507, -20430, -19325, 21766, 70452, 51954, 32371, 61444, 26882, 44240, 69551, 63738, 84644, 44662, 14294, 57209, 35785, 56140, 60910, 87528, 117490, 56011, 50926, 50407, 22706, 18565, 13437, 22054, 17701, 29020, 51305, 16579, 6271, 9963, 34105, 25270, 74998, 97107, 143119, 148931, 203008, 217118, 195945, 192284, 117707, 135375, 111789, 66975, 47067, 27996, 103552, 117722, 67213, 66045, 68244, 95400, 97271, 117180, 94031, 90212, 74343, 48030, 55705, 71975, 46038, 39827, 55508, 108599, 93562, 142006, 163132, 120565, 88139, 106208, 138426, 94725, 87457, 86373, 95153, 49539, 47457, 68996, 50207, 6623, 12974, 40478, 68401, 29953, 73331, 84908]
5872H4908R190j9787L0469l436o088K5314N260n063j5656L9038j1497j0928K9884
5859A51608l3414m7383M2802l8318L3360M2941M3124m8626n4512j2165J8867K1884
5847A20168J1735R621k0750q124K6871L587L902q845J8009K8725l596M6076j0602
5834B16777k5547J9365L6018Q732K6370j539J0953R438j8594L4464M8260M16L3207
5821C98320k1375K2172R873N061Q2030L3461k6847m0776Q4059L2652L2117p941
5809F02806J6603O1941l2116r708L1371m198m2438P276K3680m19l0041M1471K0471
5796F86699k8030l2577k1351k3682L3419L4433k834k4941j1035O5062l6999P327
5784F45491L559j5369l3394j8779J8077J6238j0228O934k275k3528M2969l775
$$ y = [84908, 94098, 74311, 104780, 101344, 95256, 120570, 125830, 120767, 105111, 144149, 132652, 121724, 151608, 118194, 70811, 113613, 75295, 108655, 151596, 194720, 146094, 91582, 79417, 98284, 120168, 131903, 141524, 120774, 112650, 139521, 143108, 147010, 138165, 156174, 184899, 181303, 227379, 216777, 191230, 210595, 246613, 255345, 281715, 280176, 291129, 300567, 281973, 316437, 364697, 365113, 398320, 376945, 399117, 408990, 414051, 496081, 529542, 502695, 461919, 545978, 578630, 610747, 602806, 619409, 681350, 649234, 639526, 670897, 666699, 624261, 631537, 655217, 654798, 624757, 666228, 686699, 658669, 626092, 604741, 581059, 614478, 648911, 646077, 621136, 610101, 675163, 638164, 645491, 649050, 633681, 600287, 581508, 599585, 615823, 605595, 612529, 610254, 586726, 629695, 625920]
5772F25920O812q060j7798K4579M1737p2176j5603J421p1976K5447k0368o1367
5760D58568k281l9371n18M5P454P078p309o4798l8266m5998k3207m3161m0352
5747A67884M3266l7199L0741J9906m4626n8633l8895m8071K9653L6350p4592K517
5735B8301M0475k1040m050M4154L329k8081J0115j8596k7350p737L8937J0062
5723F8519M3840j3940k2580l8384l3477N474P0355k6718l3217K5553L6542J152
5711H3119p0580O0844q464m5701k113J9784L8827k3539K9571l4815k964L5436
5699G9405m5995j7652J6469R326j8371j1193k668K7312k5144j8835j14L9646m919
5686B7267j8024J5517k0981o023K870N3566k6738L5213N3999j7818L093m5971
$$ y = [625920, 632732, 624672, 606874, 631453, 673190, 601014, 585411, 586832, 514856, 540303, 519935, 458568, 456287, 416916, 416398, 416443, 423897, 430975, 423666, 358868, 320602, 274604, 251397, 208236, 167884, 211150, 173951, 204692, 224598, 179972, 121339, 82444, 34373, 64026, 100376, 25784, 28301, 68776, 47736, 43686, 87840, 91169, 63088, 73203, 54607, 27257, 19520, 58457, 68519, 112359, 98419, 75839, 37455, 3978, 9452, 79807, 53089, 19872, 45425, 81967, 83119, 12539, 73383, 64919, 19218, 17105, 36889, 75716, 52177, 81748, 46933, 43969, 79405, 33410, 15758, 32227, 41553, 23182, 11989, 9321, 36633, 11489, -7346, -7460, 32186, 27267, 9243, 24760, 3779, -2244, 626, 54192, 27454, 62667, 116666, 98848, 101941, 55970]
5674E5970j3176O513j2902J0498q418m4172L257J1573K9j5426M1788N0520j1118
5661G4936m5699J0606M6403l8876p979m084r432L0217n4233M1071j1336K125j8061
5648A5658Q144L31m339j8056M209j723J7966O5308k6410k7904K6247l0991k6143
5635B297L2225L1438j0127m4659p512J8284j1090L1939J0871n7763J9173K1385
5623C6461L9298k4328k3803J7748K0488R937q3677k2466L3087J77K136J2688L8847
5610E6593j5951N139j0693l673q66o453m0255p812l0438q23L5229L3542l738j0791
5596i90L0172j5866L832P3490K7987l6470M641j7902j9163L3182K792m9182J6005
5583E2528j4752P301r692J6358J710l6560o76r238J2915L2449K9529m594j908
$$ y = [55970, 42794, 49307, 36405, 46903, 38485, -5687, -2430, 9143, 9172, -6254, 35534, 86054, 74936, 29237, 39843, 86246, 47370, 39391, 35307, 25875, 56092, 1859, 42930, 31594, 33719, 15658, 23802, 24133, 19794, 1738, 5947, 4224, 22190, 87498, 61088, 33184, 59431, 28440, 2297, 34522, 65960, 55833, 11174, 3662, 21946, 10856, 42795, 53666, -4097, 15076, 36461, 75759, 51431, 27628, 45376, 65864, 75801, -7876, -30342, 2745, 2922, 5058, 17746, 56593, 40642, 45781, 35088, 31415, 30549, 24096, -16159, -23971, -54409, -55232, -20003, 13539, 9801, -990, 29182, 13316, 17148, 90638, 118625, 82155, 86796, 68894, 49731, 82913, 85705, 36523, 52528, 37776, 45077, 35385, 51743, 53453, 16893, 16217, 6979, 19894, 52343, 81872, 77278, 75370]
5570G5370j4852k0464J9248L3443l4090p314N61k4785J6573K0791J775K0991K574
5557H9821R879l0209l5528J0289L9560l4933n306M7808l7204K1391J3409m826
5545H4151R85j9204J1665M0481L8891k7122q544M8644k5335q3368j7173N0696
5533I4767K1487m977L3730K5868l2585m4182K9148m5634m9233r92Q3150l3694
5521G6853j7644J5927J4744n808j1462L2148K7660L5084M3659l3879l3566Q088
5509A51804O3578q903l4719M2672L0290M3210l2543O8358L0009J9462K7814J0821
5497D11853k5387k0456N1417r737j34624m759j495k8868p242l3072L4423n3106
5485A78947o2165L0337J2271J4352o2104N263Q5477j2735k0851m3569k8721M2204
$$ y = [75370, 60518, 40054, 59302, 92745, 58655, 51341, 51902, 27117, 43690, 64481, 66256, 87247, 89821, 99700, 69491, 33963, 44252, 83812, 48879, 43573, 91381, 54177, 75568, 88977, 84151, 85136, 65932, 77597, 118078, 156969, 129847, 121303, 169947, 144612, 61244, 44071, 94767, 116254, 111277, 145007, 170875, 138290, 94108, 123256, 77622, 28389, 27397, 110547, 76853, 59209, 75136, 89880, 84072, 72610, 104758, 132418, 167502, 211161, 177282, 143716, 151804, 215382, 206479, 171760, 214432, 244722, 287932, 255389, 323747, 353756, 373218, 401032, 411853, 386466, 366010, 417427, 407690, 273066, 268307, 266812, 237944, 230702, 197630, 232053, 178947, 116782, 147119, 159390, 173742, 111638, 116901, 202378, 189643, 168792, 125223, 96502, 138706]
5473A38706L4201j673j9998J7877J0981k5078n712J7486L8109k2033k9960L5567
5461A88473K4085k7969p380k9933p390M6202l679n400n6016L4075L8412J982l3990
5448A61472j7014M6725j0479P27j8340j6324m583N3900o865l166J9337k9144k6396
5435A49850J1306K6893L147K6942n0345K6117M2751k0025J9367J1723l6111K806
5423B14421j0410L3068L1485p246L2533Nm9179Q263m870K1050k7351j2588K4815
5410B53996r600k1635L1146N1629K9114k2127P182J4038L1585n0391l3056r601
5398B72280k9722j5121L8788M3164l2827J1956M9134J7329j3042j6488q836K0429
5386C37044j65P0654o5383l9177L5969l1525P7861j8763l8168L4453L9843L5737
$$ y = [138706, 172907, 171234, 151236, 169113, 180094, 155016, 149304, 166790, 204899, 182866, 152906, 188473, 212558, 184589, 177209, 147276, 139886, 186088, 182409, 177009, 120993, 155068, 193480, 195462, 161472, 144458, 191183, 180704, 181431, 163091, 146767, 142184, 196084, 189219, 186053, 205390, 176246, 149850, 161156, 188049, 191196, 218138, 167793, 193910, 236661, 216636, 236003, 247726, 211615, 214421, 204011, 237079, 268564, 261318, 293851, 293856, 244677, 252940, 248070, 269120, 241769, 229181, 253996, 244396, 222761, 253907, 305536, 334650, 312523, 319705, 333743, 365328, 314937, 281881, 272280, 242558, 227437, 266225, 309389, 276562, 288518, 337652, 354981, 341939, 325451, 316615, 337044, 336879, 407533, 342150, 302973, 338942, 307417, 385278, 366515, 328347, 362800, 402643, 438380]
5374D38380k1953j6752R335L8386j886O8260j2983k893l8123R939l2231Q376O33
5361D46488j1171O2499M5860j3676n1634L550J632p680M1900p6196L1859M0963
5349E14394J8697o511K789j1973k5360J0109J4825j9810K2416L9506K1659J2649
5337E93390o785m976j8016K9574k7979L4649k6978O0000j3328m3249K0524K6144
5325F22970Q77o693L6782N3671j6399l720M1649N0799k5953k5652L2058m7707
5313G12682j3873M1035P8722p712K9891M9748l8768j7019O6928N7918J2605l8675
5301I33482L0545O6748J7388r948k8185M4144P7681N4019j5845Q1717O5992j1466
5289A306272M5486J21941o452k841L1614L7851Q0996M0224O8724K9619J7589K7489
$$ y = [438380, 416427, 399675, 409010, 447396, 445510, 513770, 500787, 497894, 459771, 469710, 437479, 445855, 446488, 435317, 497816, 543676, 530000, 478366, 481916, 483548, 475868, 517768, 441572, 473431, 514394, 533091, 526580, 529369, 517396, 492036, 502145, 516970, 497160, 519576, 559082, 580741, 593390, 586605, 581629, 563613, 593187, 565208, 599857, 572879, 632879, 619551, 576302, 596826, 622970, 623847, 617154, 653936, 707607, 691208, 687488, 729137, 779936, 753983, 728331, 760389, 712682, 698809, 739844, 818566, 810854, 840745, 890493, 851725, 834706, 901634, 959552, 972157, 933482, 964027, 1030775, 1048163, 1038215, 1010030, 1054174, 1131855, 1185874, 1170029, 1251746, 1317738, 1306272, 1351758, 1473699, 1467247, 1464406, 1496020, 1533871, 1614867, 1655091, 1723815, 1753434, 1771023, 1798512]
5277A798512L0326K6312O9744O8450l516K5255J06667j8276j1817k866N1802O7747
5265B208340M1765O7556N8476O5075N6172L8415R4718K572Q4443R8781R1592J03365
5253C011270J16904J64516R0868J44555J23309J50387Q6727J16531J48256J88644
5243D341967J02377J10530J39299J09402J86214J72919J68436K25092J21618J60089
5233E837943J74382J65497J95669J94298J48960K37900K76388K39023K63019K77055
5223H010134K93244L62198L86738M13110M42847N37747N95670O56043P98931Q80704
5213A3377366J047390J229907J373728J593232J877717K240886K583196L164771
5205B8488193L653607M152706M701446M858383M521935M304082L393007J100359
$$ y = [1798512, 1828838, 1855150, 1924894, 1993344, 1989828, 2015083, 2121750, 2103474, 2091657, 2088791, 2140593, 2208340, 2250105, 2317661, 2376137, 2441212, 2497384, 2535799, 2630517, 2633089, 2717532, 2816313, 2907905, 3011270, 3128174, 3292690, 3383558, 3528113, 3651422, 3801809, 3888536, 4005067, 4153323, 4341967, 4444344, 4554874, 4694173, 4803575, 4989789, 5162708, 5331144, 5556236, 5677854, 5837943, 6012325, 6177822, 6373491, 6567789, 6716749, 6954649, 7231037, 7470060, 7733079, 8010134, 8303378, 8665576, 9052314, 9465424, 9908271, 10446018, 11041688, 11697731, 12496662, 13377366, 14424756, 15654663, 17028391, 18621623, 20499340, 22740226, 25323422, 28488193, 32141800, 36294506, 40995952, 45854335, 50376270, 54680352, 58073359, 59173718]
5197E9173718q46115j816692l298191n145848n822780n569624n222258m689355
5189B6762855l868696l141833k463506j922853j547194j267448j108430r38198
5181A0504697q51462o99633o50787n74547m85353n12902l87717l96540l02793
5172E642963l24930k81299k58721k36202k01144j59717j99799j60680j62156j53913
5162C504402j52967j18761j81113j15671r9113j99116p3746j14683j62644j31241
5152B155347p7869j26372o7625j9757j00929q2230n0269j3244m9113n9008j8980
5141A489951n335q4926J7428j8867j21002o0450J9850o3513n9909p4892L6753
5130A075088L4613m8104q6782P269J628J1766l5872m9393N277k3659p6628j12744
$$ y = [59173718, 58327603, 56510911, 53212720, 48066872, 42244092, 36674468, 31452210, 26762855, 22894159, 19752326, 17288820, 15365967, 13818773, 12551325, 11442895, 10504697, 9653235, 8953602, 8302815, 7728268, 7242915, 6730013, 6342296, 5945756, 5642963, 5318033, 5036734, 4778013, 4541811, 4340667, 4180950, 3981151, 3820471, 3658315, 3504402, 3351435, 3232674, 3051561, 2935890, 2836777, 2637661, 2563915, 2449232, 2286588, 2155347, 2077478, 1951106, 1883481, 1863724, 1762795, 1680565, 1630296, 1617052, 1567939, 1508931, 1489951, 1484616, 1399690, 1417118, 1398251, 1277249, 1216799, 1236649, 1173136, 1113227, 1038335, 1075088, 1109701, 1061597, 974815, 982084, 983712, 995478, 959606, 910213, 915490, 891831, 815203, 702459]
5118G02459j3913L5042p936o864q832l0347j8704j4081J9311n2506l904j1472
5106E88253O950j1192P7869k8892M89n422o807l8937k8181Q459m0923R920J9101
5093E50687l6821O028J7285j4927k6764K2680p925L1069j6745J004r138n4760
5081D61673o2557l6070J6895m8760K7547Q6930n699p0204K2117K0662K32K3576
5069D36342j0125k6343n7962L4935L1636j4472o5102p0065J3181J3495J2884J9148
5057C17552L9694k1148j2149k4897l5996J6654M7890o976k042l2035m2887r016
5045B34644J2594L3006n0237p8543j832j1913l7005K7812K3886j3604N1770L994
5033A94572L458n7132o2772j7906P796K3051q703K1360j6676N068K6659J3276
$$ y = [702459, 688546, 723588, 715652, 708788, 699956, 669609, 650905, 636824, 656135, 603629, 599725, 588253, 595203, 584011, 661880, 632988, 633477, 628055, 621248, 582311, 554130, 562589, 521666, 531586, 550687, 513866, 519894, 537179, 522252, 495488, 518168, 510243, 541312, 524567, 525571, 516433, 461673, 399116, 363046, 379941, 331181, 358728, 445658, 439959, 369755, 391872, 412534, 412766, 436342, 426217, 399874, 341912, 376847, 408483, 394011, 328909, 258844, 272025, 285520, 298404, 317552, 357246, 336098, 323949, 299052, 263056, 279710, 327600, 320624, 318582, 286547, 243660, 234644, 247238, 280244, 230007, 151464, 149632, 137719, 100714, 128526, 152412, 138808, 190578, 194572, 198030, 140898, 78126, 60220, 68016, 91067, 82364, 103724, 87048, 92116, 118775, 132051]
5021A32051J3884l161j329q886J2112Q409L5100J9600J8444p684k262l4625o12
5008A81041J6787J9860J3669J2004L8165k9890k4406m2201R673L3628m5737R614
4996A92207K1256J481o6485O0025M2942m7493l501j5250K3177k4037K0855l2765
4984A72412o310o5764M9179l509J2195J7412j8155o911m453k4357M2469k0929
4972A43279J1766N084j5588L4001n923R725j5462m8790K0180k8852J5865N3594
4960A78879L8071j2147k7129R840k6827j6818k6084K5515l9545J0639M1383j2988
4948A42789o7082L2316L0479N329k6888l5278K2313J0507k6642P588j6801j4905
4936F3725N01R1278k2225l3916k2036N6338K5010J4797m7248J465m084M915J8206
$$ y = [132051, 145935, 142774, 141445, 132559, 144671, 153080, 188180, 207780, 226224, 218540, 216278, 181653, 181041, 197828, 217688, 231357, 243361, 281526, 251636, 227230, 185029, 194702, 228330, 182593, 192207, 213463, 214944, 148459, 208484, 251426, 203933, 200432, 185182, 208359, 184322, 205177, 172412, 166102, 100338, 149517, 146008, 158203, 175615, 157460, 150549, 146096, 121739, 164208, 143279, 155045, 160129, 144541, 178542, 172619, 182344, 166882, 118092, 138272, 109420, 125285, 178879, 216950, 204803, 177674, 187514, 160687, 143869, 117785, 143300, 103755, 114394, 155777, 142789, 75707, 108023, 138502, 143831, 116943, 81665, 103978, 114485, 87843, 95431, 78630, 63725, 64226, 155504, 133279, 99363, 77327, 133665, 158675, 173472, 126224, 127689, 123605, 128520, 146726]
4923A46726J2524K1169k3143L3299q34j4101j1572n140m828j6961K1349M5305
4911B03793k0154P6391L8410o9074J0981M223j5406L3548p848j6178k1743J6093
4899B33036L4269J0402P4813M8073J4838K1478j2929J9508J0911l8819o8121j5765
4887C31694n0043j5371l7321j899j4795k060j486l6594l2281J0243O7768j7613
4875B00242m2258L04L418K4753J5925o478l613N3452m4959m8998M9329J6952m738
4862B13331o1721m970K1863O746J0018J9246o6677j04036J0825Q2088p909N638
4850A24442m993q431o949K0330K4720l6924j2242K9837L592k347J2989n4347R269
4837I8946Q765J2572l7996M872O2588L5663j3448n0900o747l379K1472Q408L924
$$ y = [146726, 159250, 180419, 157276, 190575, 189741, 175640, 164068, 158928, 154100, 137139, 158488, 203793, 183639, 260030, 298440, 229366, 240347, 244570, 229164, 262712, 254864, 238686, 216943, 233036, 267305, 277707, 352520, 400593, 415431, 436909, 423980, 443488, 454399, 415580, 347459, 331694, 281651, 266280, 228959, 227060, 212265, 210205, 208719, 172125, 139844, 150087, 217855, 200242, 157984, 158288, 161706, 186459, 202384, 195906, 192293, 245745, 200786, 151788, 201117, 218069, 213331, 151610, 146640, 168503, 175249, 185267, 204513, 137836, 33800, 44625, 126713, 118804, 124442, 119449, 111018, 104069, 124399, 149119, 112195, 99953, 129790, 133382, 131035, 144024, 89677, 98946, 107711, 120283, 82287, 87159, 149747, 185410, 171962, 121062, 114315, 110936, 132408, 140816, 144740]
4824A44740J4316k1227M2365k7342k7304J642j1020J5056P610O0258l7478l7584
4812A24032K5386R80j4893l7495k1698j3960O462N3423j0018o85q417L6789M7001
4799A86907o1944L949j7403l9370J282J1831M1117m0086J1987M9550K1040l9859
4787A29001m7932J0716K4332K2959L5323o145k7788J7853r341l0953q243J0663
4775A20445k5419M6620J4769P479L31K0184J0913j7328K0682l2544M6791j7764
4763A95159o2334m1258M339P1186k00m3475K887P761J3799K7722J1086k0570p1874
4750I4228j1252K8660P268l9853M2256M3106K700k2458L1610k167l9589k9107
4738A05402M919L1658m587j393k6627O8556l2705k8660M194J2223k0462K093M5870
$$ y = [144740, 159056, 137829, 180194, 152852, 125548, 127190, 116170, 131226, 138836, 199094, 161616, 124032, 149418, 150398, 135505, 98010, 76312, 62352, 68814, 122237, 112219, 111534, 103117, 139906, 186907, 124963, 128912, 111509, 72139, 73421, 85252, 126369, 86283, 98270, 147820, 168860, 129001, 81069, 91785, 116117, 139076, 174399, 168254, 140466, 158319, 148978, 118025, 109782, 120445, 95026, 141646, 156415, 163894, 164225, 184409, 195322, 177994, 198676, 166132, 212923, 195159, 132825, 91567, 95906, 167092, 166892, 123417, 126304, 134065, 147864, 175586, 186672, 166102, 94228, 82976, 111636, 118904, 79051, 121307, 164413, 167113, 144655, 176265, 174098, 134509, 105402, 110321, 141979, 137392, 135999, 109372, 177928, 145223, 116563, 120757, 132980, 112518, 114611, 160481]
4725A60481j4864l9039m3892P415P0993N1479r177K5219k2436L1098l1948K4300
4713B09629N1833J024J2745J3850m4200m424M6336R189o6438K6014M3129k0540
4701B78147J7437j4413L174J9635J2748J0495M5924m073M2667N9033L702O1068
4689E35544k3429k1412k506o7422j3699J0521l0386m8949l8685n7765k3720J256
4677B19348J3682j2300m7260q606L5521l4666k04j4869P2283k231q0751J0482
4665A50429K2853J1363M9639k1477L2653k3331n4498J2846K602k9710n5249L9125
4653A37245Q0480m2912n607L4873m0414Q270q088L4552K5660l8618j5116j078
4641A69247K238j5874k4069l1861O6873M4633k3197l5341n5171L7834L4842J5035
$$ y = [160481, 145617, 106578, 62686, 70101, 141094, 192573, 183396, 208615, 186179, 217277, 185329, 209629, 261462, 262486, 275231, 289081, 244881, 240457, 286793, 295982, 229544, 255558, 298687, 278147, 295584, 281171, 284345, 303980, 316728, 327223, 373147, 369074, 411741, 470774, 474476, 535544, 512115, 490703, 488197, 420775, 407076, 417597, 387211, 338262, 299577, 241812, 218092, 219348, 233030, 220730, 173470, 164864, 200385, 165719, 165515, 150646, 222929, 220698, 139947, 150429, 173282, 184645, 234284, 212807, 245460, 222129, 167631, 180477, 183079, 153369, 98120, 137245, 217725, 174813, 169206, 204079, 163665, 171935, 163847, 198399, 224059, 185441, 170325, 169247, 171485, 155611, 131542, 99681, 166554, 211187, 187990, 152649, 97478, 135312, 170154, 185189]
4629A85189j3322j9993j4600J0839n744N1996L894p2914k737M8308j728m6602
4617A22586K6993j2859j8923K408L5514Rl4830L0428L0891k4065k2998J9848M3293
4604A98295k5060P3671J9833o1304L9206j4778m273m2007K4223K713Q373p302
4592B11590k2761k4930K0960L3718J6628J140n514l8818j4309M3587J4829j5080
4580B21040j8978J4812j2020L572R245k4633K8425L9866P573k0745m3726k4875
4568A79556K380O6124k4532K8583L5300j5680k1605j5791M3313Q892Q244m0322
4556B54462J4460L4348K1041M7786M0063m6704o7516O816L4630n712K7124m073
4544C56725J7889j1762j0511K7785K986m342N4741k0389k2639Q748l019J1662
$$ y = [185189, 171867, 151874, 137274, 148113, 142369, 194365, 198259, 125345, 122608, 170916, 169188, 122586, 149579, 136720, 117797, 120205, 155719, 155728, 120898, 151326, 182217, 158152, 135154, 155002, 198295, 173235, 246906, 266739, 205435, 244641, 229863, 225590, 183583, 207806, 210519, 218892, 211590, 188829, 163899, 184859, 218577, 235205, 236345, 230831, 192013, 177704, 221291, 236120, 221040, 202062, 216874, 204854, 208426, 217671, 193038, 221463, 261329, 268902, 248157, 204431, 179556, 181936, 248060, 223528, 252111, 287411, 271731, 250126, 234335, 277648, 286540, 294784, 254462, 268922, 303270, 324311, 372097, 412160, 365456, 297940, 304756, 339386, 333674, 360798, 356725, 374614, 362852, 352341, 380126, 383112, 378770, 433511, 413122, 390483, 399231, 396212, 407874]
4532D07874K9223M593o749K2010K0202O0879M9161Q1570K8271N6864M3424J0336
4520H07658J4044k6634q781q0676p7645p376k6086m6850o8627o843L1432J4102
4508E17718l10K641n519j3551K5175n801j1683j9373k0615K6887R13K023k3719
4495D74786j5370P205K9643k1483J394J8144K7153j1452J4037m5770k8251l636
4483D46400L273K2582m7360M1673n817n5938K3675K9233J5072O698M7940l0658
4471D96773M6379j2318J0438L8746K7570Q955m2825k4287m629K2490P7628j4591
4459F30329j04736J2348M6466L8805N468J6339O1969j7381p0134K1608O2357N6869
4447G60307K66l6442J9930J7422q165K760k3515L9580k5227j2653K2572M2476
$$ y = [407874, 437097, 441690, 434941, 456951, 477153, 538032, 587193, 668763, 697034, 753898, 797322, 807658, 821702, 795068, 786287, 705611, 627966, 620590, 594504, 547654, 479027, 472184, 503616, 517718, 517408, 520049, 514530, 500979, 526154, 520353, 508670, 489297, 468682, 495569, 496482, 498505, 474786, 459416, 466621, 496264, 474781, 476175, 494319, 521472, 510020, 524057, 478287, 450036, 446400, 449673, 472255, 424895, 466568, 460751, 404813, 428488, 457721, 472793, 479491, 527431, 496773, 543152, 530834, 541272, 580018, 607588, 616543, 573718, 549431, 544802, 567292, 644920, 630329, 525593, 537941, 584407, 623212, 628680, 645019, 706988, 689607, 619473, 641081, 703438, 760307, 760573, 724131, 744061, 761483, 753318, 756078, 732563, 772143, 746916, 734263, 756835, 799311]
4435G99311q437j753J1354j0996K9439N7961M8593j2076n9203L716j4851O5319
4423I08377N486J4326P3705j3243l0290M6763K9154j0747k1661n6301M4014Q5018
4411A074601K3956k3836j3393o1223M5730M4153J1861N2222j350Q444m0092M405
4399A125478J8338j7720L288M4378L4104J3534J8448J9200L6579N840L6708L3071
4387A371246k0098k7904J6396O5018M9963j356O2687J7005M3134L4098Q7191R2970
4375A790350J7051J8932K6745N9248L4289o3523m6634N4741j23021n4318o0565
4364A653295p009k2458J3766O9009j4542K8725j4513n248L164J8777L8443L6184
4352A797593k3950Q202N6042K3642J6386P300L8613N7987K2466M0633M1549K6480
$$ y = [799311, 790874, 789121, 800475, 789479, 818918, 876879, 925472, 913396, 854193, 857909, 843058, 908377, 913863, 928189, 1001894, 988651, 958361, 1005124, 1034278, 1023531, 1001870, 945569, 989583, 1074601, 1098557, 1074721, 1061328, 1000105, 1045835, 1089988, 1101849, 1154071, 1152721, 1161165, 1121073, 1125478, 1143816, 1126096, 1129384, 1173762, 1207866, 1221400, 1239848, 1259048, 1295627, 1301467, 1338175, 1371246, 1351148, 1323244, 1339640, 1404658, 1454621, 1453265, 1515952, 1532957, 1576091, 1610189, 1697380, 1790350, 1807401, 1826333, 1853078, 1912326, 1946615, 1883092, 1836458, 1891199, 1768178, 1713860, 1653295, 1646286, 1623828, 1637594, 1706603, 1692061, 1720786, 1706273, 1701025, 1704189, 1722966, 1761409, 1797593, 1773643, 1781845, 1837887, 1861529, 1877915, 1885215, 1923828, 1981815, 2004281, 2044914, 2086463, 2112943]
4340B112943m84M7265J6729M1679P4564K1728P8621P1770L1856k715J1476R5485
4328B600917O8121L3045M6358N3390P4814O2739N4509M6628R1036M7220M6248
4317C225025Q1859R4797P7369Q4937R2220P6754Q0731l197M526l752Q3683R4812
4305C989764P4270K5518O4708O7819J03544O8848Q7469M0196O3725J39819J05442
4294D831122O8593O5158J44837J17056K36289K02563J54171K02079K16570K11198
4284F449636J64804J65575J87317J95547J55631J77937K24437K11172K17735K43343
4274H393134K54233K19426K52100K08945K56070L07989K74487K39381L12145L27566
4264A1045476K88933L53133M40758N27548M93047M95558N56806O40473P62265
$$ y = [2112943, 2112459, 2159724, 2176453, 2218132, 2292696, 2314424, 2393045, 2464815, 2496671, 2493956, 2505432, 2600917, 2669038, 2702083, 2748441, 2801831, 2876645, 2939384, 2993893, 3040521, 3131557, 3178777, 3225025, 3306884, 3401681, 3479050, 3563987, 3656207, 3732961, 3813692, 3810495, 3815021, 3811269, 3894952, 3989764, 4064034, 4089552, 4154260, 4222079, 4325623, 4394471, 4481940, 4522136, 4585861, 4725680, 4831122, 4899715, 4964873, 5109710, 5226766, 5463055, 5665618, 5819789, 6021868, 6238438, 6449636, 6614440, 6780015, 6967332, 7162879, 7318510, 7496447, 7720884, 7932056, 8149791, 8393134, 8647367, 8866793, 9118893, 9327838, 9583908, 9891897, 10166384, 10405765, 10717910, 11045476, 11334409, 11687542, 12128300, 12655848, 13148895, 13644453, 14201259, 14841732, 15603997]
4255A5603997Q19751R51362J027665J144819J293341J462428J690998J972760
4247B5967121K294277K677492L210441L866834M665104N655618O710799P721025
4239F2768711Q054729P568301O202000L647613K61245l103479o029899q179923
4231G1189298r137350q956976q111880o946393n470122m156573l224121k525396
4223B2660487j966713j649353j372375j260257j058357q94654p50516o23963o48955
4214A2435344o44318p12688n77261n10351m94628l70814l47770k80917k62053
4205H234544k26029j89995k06285j84869j75564j51071j03229j91635j82826j44579
4195F478462j90424j51830j38389r1769p7285j42387j48509j14780N026m6579
$$ y = [15603997, 16423748, 17375110, 18402775, 19547594, 20840935, 22303363, 23994361, 25967121, 28261398, 30938890, 34149331, 38016165, 42681269, 48336887, 55047686, 62768711, 70823440, 78391741, 84593741, 88241354, 88502599, 85399120, 79369221, 71189298, 62051948, 53094972, 44983092, 38036699, 32566577, 28410004, 25185883, 22660487, 20693774, 19044421, 17672046, 16411789, 15353432, 14458778, 13708262, 13084299, 12435344, 11791026, 11078338, 10501077, 9990726, 9496098, 9125284, 8777514, 8496597, 8234544, 8008515, 7818520, 7612235, 7427366, 7251802, 7100731, 6997502, 6805867, 6623041, 6478462, 6288038, 6136208, 5997819, 5906050, 5828765, 5686378, 5537869, 5423089, 5428115, 5381536]
4185E381536j10892l2377O8081N3820J002M4428J1868J07694K6531Q025R0104
4174E649820N2102J5539Q8270R1035M9602Q5259R3140R9156Q3835J05026Q0260
4163F493044P5871J28053J08211K9757J7287K2592O9219J14403J68678J54510
4153G381625J25660K15896K52778J00584M5504j8350K1525n8391o2168N4540J5733
4142H074936O8812J63140J43791J31274K32305J68870K47510K74652K26351K63434
4132I995075L53032K86462K90322K87425L20538L03645L42419L23240L37194M38818
4122A3278170M17238L95585L90192M23345L80840L22620L20530L29862K48321
4113A6506703K94934K63671L51065L36041L81312L73791M73583N45817N33027
$$ y = [5381536, 5270644, 5238267, 5306348, 5360168, 5361170, 5405598, 5417466, 5525160, 5551691, 5559716, 5649820, 5701922, 5717461, 5805731, 5896766, 5946368, 6031627, 6124767, 6223923, 6307758, 6412784, 6493044, 6568915, 6696968, 6805179, 6834936, 6852223, 6874815, 6944034, 7058437, 7227115, 7381625, 7507285, 7723181, 7975959, 8076543, 8122047, 8103697, 8125222, 8066831, 8004663, 8059203, 8074936, 8143748, 8306888, 8450679, 8581953, 8814258, 8983128, 9230638, 9505290, 9731641, 9995075, 10348107, 10634569, 10924891, 11212316, 11532854, 11836499, 12178918, 12502158, 12839352, 13278170, 13695408, 14090993, 14481185, 14904530, 15285370, 15607990, 15928520, 16258382, 16506703, 16801637, 17065308, 17416373, 17752414, 18133726, 18507517, 18981100, 19526917, 20059944]
4104B0059944P01331Q19802Q39403R52346J109833J284722J494130J679688J872465
4095C0813664K167619K491066K985426L513758M134120M860423N864660O996714
4087F3827450P863350Q888952R376141P848572N808362M214921N44835m812204
4079A03560379q017196q981064r798842r985095q789710o962235n214578l854569
4071D1957090k880372k009503j400631q76140n93472l53891l35858n53027p41135
4062C2213061r40794j071333j014851q66538o03241l11272k6399K86680N37315
4053B8202628N40986N82201M17156J41981l74195p68964j117962j238605j101581
4044B5283645q24078n88124l31443j06876J01726K83983L26844K36900k7372l46101
$$ y = [20059944, 20761275, 21581077, 22420480, 23372826, 24482659, 25767381, 27261511, 28941199, 30813664, 32981283, 35472349, 38457775, 41971533, 46105653, 50966076, 56830736, 63827450, 71690800, 80579752, 89955893, 97804465, 103612827, 107827748, 108372583, 103560379, 95543183, 86562119, 76763277, 66778182, 57988472, 51026237, 45811659, 41957090, 39076718, 37067215, 35666584, 34790444, 34196972, 33843081, 33507223, 32954196, 32213061, 31272267, 30200934, 29186083, 28319545, 27716304, 27405032, 27378633, 27665313, 28202628, 28743614, 29325815, 29742971, 29884952, 29510757, 28741793, 27623831, 26385226, 25283645, 24459567, 23871443, 23540000, 23433124, 23534850, 23818833, 24145677, 24382577, 24355205, 24009104]
4034B4009104p71215j092827j218247j149529j001495q28669n59646m70605l12038
4025A6604833j15532j9346N1757n3895j87507k50283l56057m84931m88119l89547
4015A4311373m19729m86040n12347m96238m84071l91719l17549l34891k89457
4006A0579332l10943k53432k33206k19245k45456j62511j88668j87614j01515
3997H676742o8174r1600o5320j08508n0745n2086r1811p3092j1037k5891q8513
3986G949965p7725r0625j31283j7711K0424p0457r5482K6913o1994j8162l5560
3975G398303j9669j5329j9998q5633P00n2394l2542n3714m9208P147k6291M4021
3963G095393l8684l9060J336Q088L902K8197O1196P1570J6438L1212N6968O4300
$$ y = [24009104, 23237889, 22145062, 20926815, 19777286, 18775791, 17947122, 17387476, 16916871, 16604833, 16489301, 16469955, 16521712, 16467817, 16280310, 16030027, 15673970, 15189039, 14700920, 14311373, 13891644, 13405604, 12893257, 12397019, 11912948, 11521229, 11203680, 10868789, 10579332, 10268389, 10014957, 9781751, 9562506, 9317050, 9154539, 8965871, 8778257, 8676742, 8608568, 8516968, 8451648, 8343140, 8292395, 8240309, 8148498, 8075406, 8064369, 8038478, 7949965, 7872240, 7781615, 7650332, 7632621, 7653045, 7582588, 7487106, 7514019, 7452025, 7433863, 7398303, 7378634, 7363305, 7343307, 7257674, 7258374, 7205980, 7173438, 7119724, 7070516, 7077663, 7051372, 7095393, 7056709, 7017649, 7018985, 7027073, 7030975, 7059172, 7120368, 7191938, 7208376, 7239588, 7296556, 7360856]
3951G360856P729P328k9745R320q397j08780j00807o7162n1329r0121p6573l9620
3939F812699l1828m3537o7163m1650o0199J3037m1871l5935K93o8671k4818N51
3927F410908k5959M2641j4788k337L3271j9824l5739k9058k2792K5845o9394n1756
3915F241018m8832q0379j16265q1468o0353j25902j36153m2627j52822p4867k3651
3904E297699m2773q4208j03744l3544n8185J9895K8228j7050l8520J9177O9196
3893E056171O0806k305Q930o1795K0460J00526P6244L8416O7302M7386N2787O8104
3881E533032L5315P6539O1493r701K3282P0139R2138M6986Q6978Q5781K6926O2067
3869F190975P0814Q8600J15878J56831J44421R6973J23698J45160R7477J39067
$$ y = [7360856, 7368585, 7375913, 7346168, 7355488, 7347091, 7238311, 7137504, 7070342, 7019013, 6928892, 6852319, 6812699, 6780871, 6737334, 6670171, 6628521, 6568322, 6581359, 6539488, 6503553, 6503846, 6435175, 6410357, 6410908, 6384949, 6427590, 6412802, 6410465, 6443736, 6423912, 6388173, 6359115, 6336323, 6362168, 6292774, 6241018, 6192186, 6111807, 5995542, 5914074, 5853721, 5727819, 5591666, 5549039, 5396217, 5321350, 5297699, 5254926, 5170718, 5066974, 5033430, 4975245, 4995140, 5023368, 5006318, 4967798, 4986975, 5056171, 5116977, 5114672, 5123602, 5061807, 5082267, 5182793, 5259037, 5297453, 5364755, 5412141, 5464928, 5533032, 5568347, 5644886, 5706379, 5696678, 5719960, 5790099, 5882237, 5929223, 6016201, 6101982, 6128908, 6190975, 6261789, 6350389, 6466267, 6623098, 6767519, 6864492, 6988190, 7133350, 7230827, 7369894]
3859G369894K12469K05564J55101J91362J71273J77679K15682J63594K40044K12552
3849I315214K05924J60404J63104K14212K59078K52520K41252K67017K49336K38471
3839A1566532K75157K88764L36133L23889K80423L51638K78330M13355L95792
3830A4510013M11539M02374N03216N16240N49178O32304O70460O64837P64184
3821A9624345R06023J028625J074665J225549J405744J563213J792231K063813
3813C0684208K292061K551265K874298L112379L275223L315142L288042L043382
3805E4436000K679116K235530J655896J002778M67965o2575m73155p45811q68847
3796F0326897q15900o15494m63840j97932o8953j44735l82213p15465j121738
$$ y = [7369894, 7582363, 7787927, 7943028, 8134390, 8305663, 8483342, 8699024, 8862618, 9102662, 9315214, 9521138, 9681542, 9844646, 10058858, 10317936, 10570456, 10811708, 11078725, 11328061, 11566532, 11841689, 12130453, 12466586, 12790475, 13070898, 13422536, 13700866, 14114221, 14510013, 14921552, 15323926, 15827142, 16343382, 16892560, 17524864, 18195324, 18860161, 19624345, 20530368, 21558993, 22633658, 23859207, 25264951, 26828164, 28620395, 30684208, 32976269, 35527534, 38401832, 41514211, 44789434, 48104576, 51392618, 54436000, 57115116, 59350646, 61006542, 62009320, 62477285, 62414710, 61941555, 61195744, 60326897, 59510997, 58895503, 58431663, 58233731, 58164778, 58020043, 57637830, 56922365, 55800627]
3787E5800627j571089k065580k451903k875997l197757l273124l252648l098442
3779C4014087k925339k679765k352915k079424j737804j545860j389098j178562
3771A8125320j013767q59232p45747o39493o27491n86294m58789m04818m32700
3762A2356989m10940k77352l20650k55169k11005k59758k25185j67292j45482
3753A0084156j83708j39057q4409j06102j46596j57952n4409l0430o7958o0253
3743I053282j23012m9838J6537o919r6241n3754M9658J5290K4081n209J05203
3732H929078R8140K0684N2086P0004P5173J08109R8858O6530J01532K27033J33460
3721I980687J19611J73487J59238J55722J95639K06972J61432K06357J88015J87615
$$ y = [55800627, 54229538, 52163958, 49712055, 46836058, 43638301, 40365177, 37112529, 34014087, 31088748, 28408983, 26056068, 23976644, 22238840, 20692980, 19303882, 18125320, 17111553, 16252321, 15506574, 14867081, 14239590, 13653296, 13194507, 12789689, 12356989, 11946049, 11668697, 11348047, 11092878, 10881873, 10622115, 10396930, 10229638, 10084156, 9900448, 9761391, 9676982, 9570880, 9424284, 9266332, 9211923, 9181493, 9113535, 9053282, 8930270, 8880432, 8896969, 8890050, 8793809, 8740055, 8789713, 8805003, 8829084, 8823875, 8929078, 9027218, 9047902, 9099988, 9169992, 9245165, 9353274, 9452132, 9518662, 9620194, 9847227, 9980687, 10100298, 10273785, 10433023, 10588745, 10784384, 10991356, 11152788, 11359145, 11547160, 11734775]
3711A1734775J76810J62368K12344K00316J59954K66754K53027K17644K37029
3702A3621021K60446K08720K45462K12552K05435K41661K48194K47072K49555
3693A5740118L03014L74065L76126M07576M25022M24894M74303L91203L93799
3684A9310120M38689L59688L16016K27412K67812K23690J73975J46664J94788
3675B1658854J55588J51799J18471K33793K41986K50438K19019K52499K54965
3666B3537412L36614L05441K44114L49611L78844M44901M09575N01744N68587
3657B7076843O26054O30987P67830Q77768R89573J077659J183473J430409J661193
3648C6321789J800121K061645K416262K776738L230095L692941M154088M839493
$$ y = [11734775, 11911585, 12073953, 12286297, 12486613, 12646567, 12913321, 13166348, 13383992, 13621021, 13881467, 14090187, 14335649, 14548201, 14753636, 14995297, 15243491, 15490563, 15740118, 16043132, 16417197, 16793323, 17200899, 17625921, 18050815, 18525118, 18916321, 19310120, 19748809, 20108497, 20424513, 20651925, 20919737, 21143427, 21317402, 21464066, 21658854, 21814442, 21966241, 22084712, 22318505, 22560491, 22810929, 23029948, 23282447, 23537412, 23874026, 24179467, 24423581, 24773192, 25152036, 25596937, 26006512, 26508256, 27076843, 27702897, 28333884, 29101714, 29979482, 30969055, 32046714, 33230187, 34660596, 36321789, 38121910, 40183555, 42599817, 45376555, 48606650, 52299591, 56453679, 61293172]
3640F1293172N608039O410718P268442Q121872Q966419R542374R822792R722099
3632A26755927Q918840P678268N775506L562737R72725j684866m308304o653499
3624A41017334q454410r730598j0294818j0331347r901687r177160q420276p555204
3616F7151834o685647n944157n252268m577523l955085l485128k975902k610512
3608C1665612k209007k007963j796282j538709j357536j279953j080443q83650
3600A9512069r25431q29612o75665o37722o06873n76639n67725m75462m00088
3591A3816852m80220l75313l46556l56424l43305k85880k75258k52685k50301
3582A0850910k69037j94353p7986l4437p9196r5796j09485P516k4870k7248k3101
$$ y = [61293172, 66901211, 73311929, 80580371, 88702243, 97668662, 107211036, 117033828, 126755927, 135674767, 143353035, 149128541, 152691278, 153664003, 151979137, 147670833, 141017334, 132562924, 122832326, 112537508, 102206161, 92304474, 83127314, 74707038, 67151834, 60466187, 54522030, 49269762, 44692239, 40737154, 37252026, 34276124, 31665612, 29456605, 27448642, 25652360, 24113651, 22756115, 21476162, 20395719, 19512069, 18586638, 17757026, 17081361, 16443639, 15836766, 15260127, 14692402, 14216940, 13816852, 13336632, 12961319, 12614763, 12258339, 11915034, 11629154, 11353896, 11101211, 10850910, 10581873, 10387520, 10309534, 10275097, 10195901, 10100105, 9990620, 9998136, 9973266, 9946018, 9922917]
3571I922917q8056j47034j54870j56416k41962l13844k63067k32271k20675k20208
3561G884514k39401k57535j77710j61855j37067j02298q9129j13972j36668j18551
3551F350328j22556o6793j06793q9318m9857j13869m6494j4335k6076n0275n3368
3540E610594m5721n4237k0459K6006r893l14p5343J9434j0590M3143P8608R0991
3528E652219P2297P554O2725J00908P5428M6901J01211J11508O3650P4153J08048
3517F476602J59447J67652J11635J28963J16516J69210J19445P4274J04084Q9793
3507G717621M0824L2666q29p9661j02190j03531j69650k61479k60862k06027k75106
3496F331776k26762k17947k03883k63896j74372j16445j68755j03094j05589r1237
$$ y = [9922917, 9834861, 9687827, 9532957, 9376541, 9134579, 8820735, 8557668, 8325397, 8104722, 7884514, 7645113, 7387578, 7209868, 7048013, 6910946, 6808648, 6719519, 6605547, 6468879, 6350328, 6227772, 6160979, 6054186, 5964868, 5915011, 5801142, 5754648, 5740313, 5714237, 5663962, 5610594, 5564873, 5510636, 5490177, 5516183, 5506290, 5505976, 5430633, 5450067, 5439477, 5482620, 5561228, 5652219, 5724516, 5732070, 5794795, 5895703, 5971131, 6018032, 6119243, 6230751, 6294401, 6368554, 6476602, 6636049, 6803701, 6915336, 7044299, 7160815, 7330025, 7449470, 7523744, 7627828, 7717621, 7758445, 7791111, 7790282, 7710621, 7608431, 7504900, 7335250, 7073771, 6812909, 6606882, 6331776, 6105014, 5887067, 5683184, 5419288, 5244916, 5128471, 4959716, 4856622, 4751033, 4659796]
3486D659796j15482p7843o3871k4457l8723o3181l2149q7697K9660n0216o8063
3475D067774k3381m9009j7936J267K0969J7810P767O830K5228P1j1291l9923L7561
3462D043737N3674K0112K0248L3301L8201M8469O7336J3595L8555M7024Q2814
3451D507066L6118O1987L8092Q5969Q8165O5558P1865K1676Q9443J08008O3001
3440E236948J06140J70886P2793N2480J26334R0338J05056J35976R4576J50035
3430F341562R9998J45042J93428R0358J07211J33521J63148J68859J79692K24778
3420G847597K22828J86884K95126L39148L33380L97602M39053M54700N44005O02352
3410A1662675O75414O49680O78801O95090P32959O80658N71213N30354M54072
$$ y = [4659796, 4544314, 4466471, 4402600, 4378143, 4339420, 4276239, 4244090, 4156393, 4186053, 4135837, 4067774, 4044393, 3995384, 3977448, 3978715, 3999684, 4017494, 4025261, 4032091, 4057319, 4057390, 4046099, 4006176, 4043737, 4097411, 4117523, 4137771, 4171072, 4209273, 4257742, 4325078, 4338673, 4377228, 4424252, 4507066, 4543184, 4605171, 4643263, 4729232, 4817397, 4882955, 4954820, 4976496, 5065939, 5173947, 5236948, 5343088, 5513974, 5586767, 5639247, 5765581, 5855919, 5960975, 6096951, 6191527, 6341562, 6441560, 6586602, 6780030, 6870388, 6977599, 7111120, 7274268, 7443127, 7622819, 7847597, 8070425, 8257309, 8552435, 8891583, 9224963, 9622565, 10061618, 10516318, 11060323, 11662675, 12338089, 12987769, 13666570, 14361660, 15094619, 15775277, 16346490, 16876844, 17330916]
3401A7330916M09024K78578K90653K98055K52419J72409J35166R7168L4884L6281
3391A9335553N002l2113n5678m8786m5642n1283j88973j92144k03940k82074k89053
3380A7950869l46100m36260l80121k43575k69653j51223q7507K3122P5762J22684
3370A6257998K78695K89076K86892M28349M24812N35997O09014P56632P65485
3361B0632950R15834J065292J151885J396270J630013J767506J988094K136018
3353C2683862K272757K230794K139555K061741J890203J652909J561602J420189
3345D7913612J307171J267744J111026Q65185O09916M08587J99667l875j53289
3336E3525744k30636l49771n67449o85769p11348o60689n68088p69109r22286
$$ y = [17330916, 17739940, 18018518, 18309171, 18607226, 18859645, 19032054, 19167220, 19264388, 19299272, 19335553, 19340555, 19308442, 19252764, 19203978, 19158336, 19107053, 18918080, 18725936, 18521996, 18239922, 17950869, 17604769, 17168509, 16788388, 16544813, 16275160, 16123937, 16036430, 16059552, 16135314, 16257998, 16536693, 16825769, 17112661, 17541010, 17965822, 18501819, 19110833, 19867465, 20632950, 21548784, 22614076, 23765961, 25162231, 26792244, 28559750, 30547844, 32683862, 34956619, 37187413, 39326968, 41388709, 43278912, 44931821, 46493423, 47913612, 49220783, 50488527, 51599553, 52464738, 53074654, 53483241, 53682908, 53679033, 53525744, 53295108, 52945337, 52377888, 51692119, 50980771, 50320082, 49751994, 48982885, 48060599]
3327D8060599j240560j506072j706217j792834j741191j569245j300121j109684
3319C6094675r17749m89442j67527J43530M62788P19027R96074J243046J371973
3310C9456395J530354J590607J654608J620635J442006J320406J125874Q35086
3302E0575971O36736M09741J93809M8544q1397j31763j74241k90956l20454l40103
3292E0525887m83475o50448q04774j033075j300463j518276j792497j926877k001089
3283C9014913k114026k110530k185322k081796j891718j751689j605964j513590
3275B3760278j312433j078209r46143q17781o94047n41580m67031m22849l40475
3266A7139730k23995j75635j28263r4589j04279L2768J79091J62748K38028K62676
$$ y = [48060599, 46820039, 45313967, 43607750, 41814916, 40073725, 38504480, 37204359, 36094675, 35176926, 34687484, 34519957, 34663487, 35126275, 35845302, 36841376, 38084422, 39456395, 40986749, 42577356, 44231964, 45852599, 47294605, 48615011, 49740885, 50575971, 51212707, 51622448, 51816257, 51864801, 51783404, 51651641, 51477400, 51186444, 50865990, 50525887, 50042412, 49391964, 48587190, 47554115, 46253652, 44735376, 42942879, 41016002, 39014913, 36900887, 34790357, 32605035, 30523239, 28631521, 26879832, 25273868, 23760278, 22447845, 21369636, 20423493, 19605712, 18911665, 18370085, 17903054, 17480205, 17139730, 16915735, 16740100, 16611837, 16517248, 16412969, 16445737, 16624828, 16787576, 17025604, 17288280]
3256A7288280L70376M67874M49427N37160M80049M95372M87063N03842L53540
3247B1432983K84968K61957J36678O4367q4187j14071j65141k39267k22671k43273
3237B1112343k47579j92281k47112k56281k59080l20352l66031m07637l85816
3228A8430174l82004m25644m74030m16313l78044m81192n08930m18673m50714
3219A4494630l76655k68799k37402j77768k26327k93395k82665k19306k73933
3210A2138380j82521q6691j89253o4619p0891p1217l5551j0559P811P8859J06408
3199A1620156O0292M6145J13268J64224J40941J45586J93087J72903K44407K46076
3189A3147085K23404K78288L00140L45427M23177M41739M78643M99168O13143
$$ y = [17288280, 17658656, 18126530, 18575957, 19113117, 19593166, 20088538, 20575601, 21079443, 21432983, 21717951, 21979908, 22116586, 22180953, 22096766, 21982695, 21817554, 21578287, 21355616, 21112343, 20864764, 20672483, 20425371, 20169090, 19910010, 19589658, 19223627, 18815990, 18430174, 18048170, 17622526, 17148496, 16732183, 16354139, 15872947, 15364017, 14945344, 14494630, 14117975, 13849176, 13611774, 13434006, 13207679, 12914284, 12631619, 12412313, 12138380, 11955859, 11869168, 11679915, 11615296, 11544405, 11473188, 11437637, 11427078, 11434889, 11513748, 11620156, 11680448, 11726593, 11839861, 12004085, 12145026, 12290612, 12483699, 12656602, 12901009, 13147085, 13370489, 13648777, 13948917, 14294344, 14717521, 15159260, 15637903, 16137071, 16750214]
3180A6750214P00964P90364Q88217R94884J182697J369425J536295J761491J962592
3171B7937143K102166K246878K226991K099876J894319J769461J641294J814344
3163D3732472K007984K293862K348846K103608J689138J154360Q05020N13642
3155E6648932N20114N25796M24539J14520m17680q48202j392471j934084k366891
3146E1274573k629218k922893l181606l255585l308890l135403k943635k753470
3138B7143873k471848k201409j872066j610037j315776j122873j033281r13658
3130A4602925p65329o76060n62247n30354m76899m15738l42181k85263k43672
3121A0305182k74519l14471j35453j62102j53733j37787j08577p3645m9565p3284
$$ y = [16750214, 17451178, 18241542, 19129759, 20124643, 21307340, 22676765, 24213060, 25974551, 27937143, 30039309, 32286187, 34513178, 36613054, 38507373, 40276834, 41918128, 43732472, 45740456, 48034318, 50383164, 52486772, 54175910, 55330270, 56135290, 56648932, 57169046, 57694842, 58119381, 58233901, 57816221, 56968019, 55575548, 53641464, 51274573, 48645355, 45722462, 42540856, 39285271, 35976381, 32840978, 29897343, 27143873, 24672025, 22470616, 20598550, 18988513, 17672737, 16549864, 15516583, 14602925, 13837596, 13161536, 12599289, 12068935, 11592036, 11176298, 10834117, 10548854, 10305182, 10030663, 9716192, 9580739, 9418637, 9264904, 9127117, 9018540, 8944895, 8895330, 8822046]
3111H822046p5832p8670j00772m9463r9531n2627o5958n6428n3608n2108K3449
3100H160498k3942k8283j71O78J6060M8600R468p8787j01249j22944j36331k30211
3088G513386l02087l43137k98887l09522k65284k37970k62250k74224j83813j57398
3078D878814j97310j01782q5138j36029p9697p9157j13635l7876q5507q221L4901
3067C989363J9k0326q6255j4248m383n6532O3852K9484l8570K5617l6042O2229
3055C914208N3100m1573n664J447P314K763R98k0030M5988K1273J7291L7376q565
3042D025926l7112J5689p3024n425K397J3007N4010M247j6319k034q67P6551m8778
3029D008268L33P8114m3623j2782k6473m0576O8839K1780J9938M2539Q7525Q4649
$$ y = [8822046, 8746214, 8667544, 8566772, 8517309, 8417778, 8365151, 8299193, 8242765, 8189157, 8137049, 8160498, 8136556, 8108273, 8108102, 8108780, 8124840, 8173440, 8182908, 8104121, 8002872, 7879928, 7743597, 7513386, 7211299, 6868162, 6569275, 6259753, 5994469, 5756499, 5494249, 5220025, 5036212, 4878814, 4681504, 4579722, 4494584, 4358555, 4278858, 4199701, 4086066, 4048190, 3962683, 3954462, 3989363, 3989382, 3969056, 3882801, 3868553, 3864170, 3807638, 3871490, 3900974, 3862404, 3888021, 3851979, 3914208, 3967308, 3925735, 3920071, 3921518, 3928832, 3931595, 3932593, 3912563, 3958551, 3979824, 3997115, 4034491, 4025926, 3988814, 4004503, 3931479, 3926054, 3928451, 3941458, 3995468, 3999715, 3983396, 3981362, 3980495, 4057046, 4008268, 4008601, 4086715, 4043092, 4030310, 4003837, 3963261, 4032100, 4053880, 4073818, 4116357, 4203882, 4288531]
3017D288531R6225L1480K5307J17815Q6853J09089j7641P7292Q9467N8297L2412
3006D995127M3026M6021K7493k0786O643j8383N0369L2140L5386L3418L9727L6397
2994E306578L0031L0404k5212j6530m701J5371J7212M8945R1308P2418J08012
2983E673836J26770J68321J19513K02385J45110J64146K18507J91202J92927K48094
2973G450811K67192K54182K75608K51811K59899J41560J34413J15799J26092N7778
2963I335145J66210Q9293J15540J18043J74271J69782J95315R7155J15961R7183
2953A0673898Q5913J13886J90734J10647J31707J82366J60467K11624J76497K45038
2943A2282777L02955L15329K66053L01283K93907L28384L36733L00766K74322
$$ y = [4288531, 4384756, 4416236, 4441543, 4559358, 4646211, 4755300, 4737659, 4814951, 4904418, 4962715, 4995127, 5038153, 5084174, 5111667, 5090881, 5097524, 5079141, 5129510, 5161650, 5197036, 5230454, 5270181, 5306578, 5336609, 5367013, 5341801, 5325271, 5320570, 5335941, 5353153, 5402098, 5493406, 5565824, 5673836, 5800606, 5968927, 6088440, 6290825, 6435935, 6600081, 6818588, 7009790, 7202717, 7450811, 7718003, 7972185, 8247793, 8499604, 8759503, 8901063, 9035476, 9151275, 9277367, 9335145, 9501355, 9590648, 9706188, 9824231, 9998502, 10168284, 10363599, 10460754, 10576715, 10673898, 10759811, 10873697, 11064431, 11175078, 11306785, 11489151, 11649618, 11861242, 12037739, 12282777, 12585732, 12901061, 13167114, 13468397, 13762304, 14090688, 14427421, 14728187, 15002509]
2934A5002509L54522K94728M24494L67048L90064M30440M93170N65370P12726
2925A9035071O59265O61908O24389O32881P04897O22659N82866O06990O11771
2916B4742697O61785P08661P53418Q51701P66993Q44099Q98098Q97118R49671
2907C2074241R45559R95390R81406R90938J152686J247748J309503J444012J609295
2898D2750778J713549J867476J998349K147193K410673K860994L230130L713518
2890F2692660M220079M824226N580422O361694P246282Q225409R322827J0587677
2882A19061276J2281684J4449189J7129522J9963947K3123608K6429459K8765683
2875B61204368K8481090K2836001Q247216j2794182l0742390l8431268l6967820
$$ y = [15002509, 15357031, 15651759, 16076253, 16443301, 16833365, 17263805, 17756975, 18322345, 19035071, 19694336, 20356244, 20980633, 21613514, 22318411, 22941070, 23523936, 24130926, 24742697, 25404482, 26113143, 26866561, 27718262, 28485255, 29329354, 30227452, 31124570, 32074241, 33019800, 34015190, 34996596, 35987534, 37140220, 38387968, 39697471, 41141483, 42750778, 44464327, 46331803, 48330152, 50477345, 52888018, 55749012, 58979142, 62692660, 66912739, 71736965, 77317387, 83679081, 90925363, 99150772, 108473599, 119061276, 131342960, 145792149, 162921671, 182885618, 206009226, 232438685, 261204368, 289685458, 312521459, 320768675, 307974493, 277232103, 238800835, 201833015]
2868B01833015l1227610k4712640j9140230j4782039j1588345r401311q155740
2861H2825100p205761o363186n579166m833718m195310l631076l130987k757415
2853D5128481k492684k279623k025869j719584j440879j168801r55129p26530
2845C2319382o05342o10839o75657o84151o63144p25840p61090r48409j175575
2836B5469335j349584j484459j509070j338978j255772j136801r96178r59628
2828A5438865q79273p11986o86686n55358m83866m87511m43489m04183k92789
2819A0493724k48064k28589k57040k75556k47675l39906k72055l16941k86007
2810H021891k30359j99855k00122j70261j73506k08710j48170q2404j56199j76320
$$ y = [201833015, 170605405, 145892765, 126752535, 111970496, 100382151, 90980840, 82825100, 75619339, 69256153, 63676987, 58843269, 54647959, 51016883, 47885896, 45128481, 42635797, 40356174, 38330305, 36610721, 35169842, 34001041, 33045912, 32319382, 31714040, 31103201, 30427544, 29743393, 29080249, 28354409, 27593319, 26644910, 25469335, 24119751, 22635292, 21126222, 19787244, 18531472, 17394671, 16398493, 15438865, 14559592, 13847606, 13160920, 12605562, 12121696, 11634185, 11190696, 10786513, 10493724, 10245660, 10017071, 9760031, 9484475, 9236800, 8896894, 8624839, 8307898, 8021891, 7791532, 7591677, 7391555, 7221294, 7047788, 6839078, 6690908, 6608504, 6452305, 6275985]
2800F275985j61143k39335k23178k09814j52219j97788j72466j31354q0530j23083
2790D585075j19360n6718l9725o6795k2944p4499n1345o8067n0170n6465q2026
2779C896961m3836K1070p1639n8911o6934o1383j7575m2713n1385l4947o2113
2768C406595o0466o1734n1244l1462n6733m3184l1420p8843o7404k7116r0312
2757B806677m7393r4269n0788o3302l7938o6847o6616J539K283j8953n9314l7940
2745B267139q5623L5620m5903j4000m3024p4900o8685j04178j7283L2689k097
2734A879755p6621j5349p6750l4533r210q812K7684M583n6589m9156n0062j1685
2722A523255m0155p9472l4454n8450n1868k1052j3393m8654l4879m576J2988R519
$$ y = [6275985, 6114842, 5875507, 5652329, 5442515, 5290296, 5092508, 4920042, 4788688, 4708158, 4585075, 4465715, 4408997, 4369272, 4302477, 4279533, 4205034, 4153689, 4085622, 4035452, 3978987, 3896961, 3853125, 3874195, 3802556, 3743645, 3676711, 3615328, 3597753, 3555040, 3503655, 3468708, 3406595, 3346129, 3284395, 3233151, 3201689, 3144956, 3101772, 3070352, 2991509, 2924105, 2896989, 2806677, 2759284, 2665015, 2614227, 2550925, 2512987, 2446140, 2379524, 2381063, 2383346, 2364393, 2305079, 2267139, 2181516, 2217136, 2171233, 2157233, 2114209, 2039309, 1970624, 1866446, 1849163, 1881852, 1879755, 1803134, 1787785, 1711035, 1676502, 1667292, 1658480, 1686164, 1690747, 1634158, 1585002, 1534940, 1523255, 1483100, 1403628, 1369174, 1310724, 1258856, 1237804, 1224411, 1175757, 1140878, 1136302, 1149290, 1158809]
2710A158809L2270j8555r0149j2998M8020l1628k8851p5321l0524J1542L9316
2699A001931k198K6517L1258l9348M1401l3329m8510n8910N9587K0832k0058O4680
2687A043853K9771n7641J7272L7557m5521O995K0799k2321K9199K8062k8960N7920
2675A116985j3795l2132J6646p194P961K834p380j5515k0477J5580M5052l1415
2663A077150m565k037j0686o08M6635L3968J2516J3940P4213m7511Q352R206N617
2650A216190j2715M975N6889o0173M7136R258L7119k3516o3883K9289L8136J4992
2638A293697R59K2810J4231M1344J1828j3341K1326O7350L7192J7866l4178k8112
2626A452972K4541m6911k4081j6997m2234K4870L8724R490M7891j1471M3712r866
$$ y = [1158809, 1191079, 1172524, 1082375, 1069377, 1117397, 1085769, 1056918, 981597, 951073, 962615, 1001931, 999733, 1026250, 1057508, 1018160, 1059561, 1026232, 977722, 918812, 978399, 999231, 979173, 1043853, 1073624, 1015983, 1033255, 1070812, 1025291, 1032286, 1053085, 1030764, 1059963, 1088025, 1059065, 1116985, 1103190, 1071058, 1087704, 1080510, 1088471, 1091305, 1083925, 1068410, 1047933, 1063513, 1108565, 1077150, 1072585, 1070548, 1059862, 1059254, 1105889, 1139857, 1152373, 1166313, 1240526, 1193015, 1201367, 1210573, 1216190, 1203475, 1208450, 1265339, 1205166, 1252302, 1261560, 1298679, 1275163, 1211280, 1240569, 1278705, 1293697, 1294656, 1317466, 1331697, 1373041, 1384869, 1371528, 1392854, 1460204, 1497396, 1515262, 1481084, 1452972, 1477513, 1430602, 1406521, 1389524, 1347290, 1372160, 1410884, 1420374, 1468265, 1456794, 1500506, 1490640]
2614A490640J81j6999k2308K5489k6442j4377J6857L8073P5703M6117L1773K9397
2602A674104J5715Q2434P6757L3903J41881J48880P8583J54148J85599J42498
2592B734502J60185J23836k53j3191j23332j80730k10694k18562j85469j24870
2582A961422r6586m0898j14689r4201n1728n7847j5191m1990l3393o2505j784
2571A350610j4312m814n3632J2528k0550n7353q170Q18n690J4664J7982k267L2648
2558A262462Q821O671k3073K20k9735n2987l5212o1082p613l6497l3038n426l0646
2545I62865o5699l7753p90k7700j1848N722m4624n9346k216j1930m0818j4558
2533F51305L1258j6570q2215l8271L4822l1293l121n950N3197j5085m6129J080
$$ y = [1490640, 1490821, 1473822, 1451514, 1477003, 1450561, 1436184, 1453041, 1491114, 1566817, 1612934, 1644707, 1674104, 1689819, 1772253, 1849010, 1882913, 2024794, 2173674, 2252257, 2406405, 2592004, 2734502, 2894687, 3018523, 3018270, 3005079, 2881747, 2701017, 2490323, 2271761, 2086292, 1961422, 1864836, 1823938, 1709249, 1615048, 1563320, 1505473, 1490282, 1448292, 1414899, 1352394, 1350610, 1336298, 1331484, 1277852, 1290380, 1269830, 1212477, 1204307, 1205125, 1199435, 1214099, 1232081, 1229814, 1262462, 1271283, 1277954, 1254881, 1255101, 1225366, 1172379, 1137167, 1076085, 1068472, 1031975, 998937, 993511, 962865, 897166, 859413, 858623, 830923, 819075, 824797, 780173, 720827, 718611, 706681, 665863, 651305, 682563, 665993, 583778, 545507, 580329, 549036, 545915, 539965, 593162, 578077, 531948, 533028]
2521E33028l9949O398K2962P980j4299l1982L0034K5643j3770o2884J0493k1500
2509D52154n2516j782j3168o303l1496J3763L6757j0222n993J2000p5933j6554
2497C00707O6886M7690p0402l1533K616L1588k8436K2956R459p335k65j8527j013
2484C24391K019Q871l0338l2280l0340l5068J6620P0740K8744j8158k7204k9089
2472B48908j8325K7234L3196l0581J0628l2415o3801N5763k1564o2539P5145N2016
2460B73665l8533k0019k2410o431j8122k6220j1222j1978M0795M0829l8271n3857
2448A08226L9232P923J1876O2914j1566k5986K0478m7286k1402Q627n3734M2631
2436A41933J6986J9484l559k9421j2584L9697j7610M3782j5726J0489p393N420
$$ y = [533028, 493079, 499477, 522439, 530419, 516120, 484138, 514172, 539815, 526045, 463161, 473654, 452154, 399638, 397856, 384688, 378385, 346889, 360652, 397409, 387187, 381194, 393194, 317261, 300707, 367593, 415283, 344881, 313348, 315964, 347552, 319116, 342072, 351531, 344196, 343931, 325404, 324391, 326410, 335281, 304943, 272663, 242323, 207255, 223875, 294615, 323359, 305201, 277997, 248908, 230583, 257817, 291013, 260432, 271060, 238645, 174844, 230607, 209043, 146504, 221649, 273665, 235132, 215113, 192703, 186272, 168150, 141930, 130708, 118730, 159525, 200354, 162083, 108226, 147458, 155381, 167257, 230171, 218605, 192619, 213097, 165811, 144409, 153036, 99302, 141933, 158919, 178403, 174844, 145423, 132839, 172536, 154926, 198708, 182982, 193471, 186078, 191498]
2424A91498j8812K173j3478l7355L6228L132l9495K6095l3080l9783J1835R557
2412I8515K0241l8196J5365J0282L8723j0284l0181M85L1071r747p1176j161L0754
2399H4691j2641l004l2277j6607j2124K7062M5696l972P227L4090J7829J679m4968
2386I2681o636J6860L6259o26M4057j1927n2190L7086N4414k8484j1823m1720
2374A27951K7291L5084K3439L3304k8537n0108L891k548n9683o0563K1303K5928
2362I6752L360J3961m8285K0871J115o00j8110K6688L3037k5175K4371Q253l7837
2349I8401j469j7017K5969K2811m9070k8699J4760K0174k5500j301J1021l8784
2337C1296K5414K2971J3953K3030K8547k6650l3359m666N4217L8584o7293l4270
$$ y = [191498, 172686, 174859, 161381, 124026, 160254, 163386, 123891, 149986, 116906, 77123, 88958, 98515, 118756, 80560, 95925, 106207, 144930, 134646, 104465, 104950, 136021, 126274, 55098, 53937, 84691, 72050, 69046, 36769, 20162, 8038, 35100, 80796, 76824, 84051, 118141, 135970, 137649, 92681, 86045, 102905, 139164, 138538, 182595, 170668, 118478, 155564, 209978, 181494, 169671, 127951, 155242, 190326, 213765, 247069, 218532, 168424, 172315, 169767, 110084, 49521, 70824, 96752, 100112, 114073, 65788, 86659, 87774, 87174, 69064, 95752, 128789, 103614, 127985, 136238, 98401, 96932, 79915, 105884, 128695, 79625, 50926, 65686, 85860, 60360, 59059, 70080, 31296, 56710, 79681, 93634, 116664, 145211, 118561, 85202, 80536, 134753, 173337, 106044, 71774]
2325G1774k1089J1514J4852L8636J3986m2356l4375L6493P891N878K0923M1381
2313A65508O712r8748K0386O450j4210K0838N4956k8888l0449K7712j0827K1165
2301A40605J0188l3566n1050r775M9848K3081l7771m520R024l8902l0299L2925
2289E9788Q119K201K5165J7460J3811k4698R159K3117m9750L9547L6396j0346
2277A49969k6346l3338K7829O869L4442j6335j2164o58K7045K1173j9247p565
2265A51674l8083J5328K5428j4345j4446M186l2492J370j4119l1791J2547k8089
2253C7168K1495N9319k2320j4713N720K9874m2195p256L8046L1359j9761k9345
2241H7391k6773K3359N5028J0844M5376o0428n0440o609Q643L6101J4031r835
$$ y = [71774, 50685, 62199, 77051, 115687, 129673, 87317, 52942, 89435, 97326, 103204, 124127, 165508, 172220, 73472, 93858, 100308, 86098, 106936, 161892, 133004, 102555, 130267, 119440, 140605, 150793, 117227, 66177, 56402, 106250, 129331, 91560, 87040, 96064, 57162, 26863, 59788, 67907, 70108, 95273, 112733, 126544, 101846, 111005, 134122, 84372, 123919, 160315, 149969, 123623, 90285, 118114, 124983, 159425, 143090, 130926, 130268, 157313, 178486, 159239, 151674, 113591, 128919, 154347, 140002, 125556, 129742, 97250, 98620, 84501, 52710, 65257, 37168, 58663, 117982, 95662, 80949, 86669, 116543, 74348, 67092, 105138, 136497, 116736, 87391, 60618, 83977, 139005, 149849, 195225, 134797, 84357, 77748, 86391, 122492, 136523, 126688]
2229A26688p221l6708J7300R3012o328L920L70n3580k1145M0392Q091k264j9038
2216A43489l0901M151P032N4009J2560j1871k8400K0596r945N999k9969M4033
2204A80783o267k4083M6778m8l2288J9860L5607q244j2395k8655j2204Q3385L3285
2191B75514O067j2786j1749j2189J8548M2665K7149o7954J7400N3616k5512J8895
2179C29664l3876L9323q722O395N816M7387j7686m3334O954l837L9954M2573j8027
2166C92584k184m207L1077J8622N6176j2902l6985M6254L2760K0471O2601M3800
2154F48067k8169K7592N0032m8241O841K9306L074L6669L9604L9951L2293j1780
2142H25239J6717O9281R314j8359L5611K2725J2218L2265K3755M7538L0240Q3303
$$ y = [126688, 119467, 82759, 100059, 193071, 186743, 190663, 191033, 137453, 116308, 156700, 164791, 162527, 143489, 112588, 116739, 123771, 177780, 190340, 178469, 150069, 170665, 160720, 166719, 136750, 180783, 174516, 150433, 197211, 197163, 164875, 184735, 220342, 212098, 199703, 171048, 158844, 242229, 275514, 281581, 268795, 257046, 244857, 263405, 306070, 333219, 265265, 282665, 336281, 310769, 329664, 295788, 335111, 326389, 332784, 338600, 385987, 368301, 324967, 331921, 328084, 368038, 410611, 392584, 390400, 386193, 417270, 435892, 492068, 479166, 442181, 488435, 521195, 541666, 604267, 648067, 619898, 647490, 697522, 649281, 656122, 685428, 688502, 725171, 764775, 804726, 837019, 825239, 841956, 911237, 920551, 902192, 937803, 960528, 972746, 1005011, 1028766, 1076304, 1106544, 1189847]
2130A189847K2805Q1323M5377L4147J19856O9768O6976J27141J67911J57755K10742
2119B293648J46660J57414J53924J85710K17430K60415L86534N51297O97852P19136
2109E770020Q06185J080344J167250J372109J440791N19994j201065k070586j823946
2100G061096j402894r87897p15407n96808m78539k79489k44997j94242j16421
2091B044402j59232p6570j14635j32913j20236j45860r2215o6696q1134p7602
2081I77309q2287r5953n8038k1188J8523k6714m5219l1639J2541p2272l5781M001
2069E43283n768j7812n9504o2945k3111m126J1767l9480N79j4370J3037m4015
2057B97535K2631n929j6096J1105l7308L76k743q882L9622m0236K4356J5960l3344
$$ y = [1189847, 1212652, 1293975, 1339352, 1373499, 1493355, 1563123, 1630099, 1757240, 1925151, 2082906, 2293648, 2440308, 2597722, 2751646, 2937356, 3154786, 3415201, 3801735, 4353032, 5050884, 5770020, 6576205, 7656549, 8823799, 10195908, 11636699, 12156693, 10955628, 8885042, 7061096, 5658202, 4670305, 3954898, 3358090, 2879551, 2600062, 2355065, 2160823, 2044402, 1885170, 1808600, 1693965, 1561052, 1440816, 1294956, 1202741, 1136045, 1054911, 977309, 895022, 799069, 741031, 719843, 738366, 711652, 666433, 634794, 647335, 575063, 539282, 543283, 537515, 519703, 460199, 397254, 374143, 370017, 381784, 342304, 342883, 328513, 341550, 297535, 320166, 314237, 298141, 309246, 271938, 272314, 269571, 260689, 300311, 260075, 284431, 300391, 267047]
2044B67047q740m0359j9735l1456m8657N4323J9454j4671J539m582l3708M9208
2032A89663r26p6262k2342K3207K0613n3729K0904J1069N9056L4672k3476n8548
2020A23901O509j5060l1927J4020K0613j0671k5622r744M4969P174p1679j6087
2008C6396Q7325n802r930K2317J2441p097n0928n1645P246M9745N4231n0173l6300
1995E7826P989L367q938N5026o9173J269r414O864K4140J2388M7147m5713j7296
1982F5482K2359l6726q3430J8448R0136P460J9224k7087l1229L9280o892k2430
1970E4595n3302J1741K5279K6314K1392r583n6140p360J5486L3571L8031n5876
1958D4148p562J4450L6480l9824m4467K6387O557j7404j7825n055K9022K948n15
$$ y = [267047, 258307, 217948, 198213, 166757, 118100, 172423, 191877, 177206, 178745, 174163, 140455, 189663, 188737, 112475, 90133, 113340, 133953, 80224, 101128, 112197, 171253, 205925, 182449, 123901, 130410, 115350, 83423, 97443, 118056, 107385, 81763, 72019, 116988, 124162, 52483, 36396, 123721, 117919, 107989, 130306, 142747, 135650, 84722, 33077, 40323, 90068, 144299, 94126, 57826, 65815, 69182, 60244, 115270, 46097, 47366, 37952, 44816, 68956, 81344, 128491, 82778, 65482, 87841, 51115, -32315, -13867, 76269, 83729, 102953, 75866, 44637, 83917, 77025, 54595, 1293, 13034, 38313, 64627, 86019, 76436, 20296, 12936, 28422, 61993, 100024, 44148, 36586, 51036, 87516, 47692, 3225, 29612, 36169, 18765, 940, -4115, 24907, 27855, 27340]
1945B7340N1100J5235K9242q0125L5978J5624N8655m1220l9477m0506o047J3358
1933C9157j3925K7881q779r400M5473J0311l8057k1687j0791m800l6437K2250
1921A196l3100K1882K086K2142K6583O661J4637n587R949k9207n5160j4860N8602
1908B5824J8064j3633k5682l7841P7518o260L2806k4990N224j0109k8669N3799
1896F6051o97j7755j0465k4801K3214Q00N127l9718K4669K4219l1974N396j3614
1883A0452J0373O599m471m4827K7436j5555O417j914o07L107P0760j4572p263
1870D5935l3725K3797L6388L868o0157K87M3590j5195q629j7584k1488j5959K9474
1857A0602k316l499M5073J6214j155m3296j8013M687J5965Q404q416J411j3030
$$ y = [27340, 78440, 93675, 122917, 42792, 78770, 94394, 153049, 111829, 72352, 31846, 25799, 39157, 25232, 53113, 44334, 34934, 80407, 90718, 52661, 30974, 20183, 15383, -21054, 1196, -31904, -10022, -7936, 14206, 40789, 47450, 62087, 56500, 66449, 37242, -17918, -32778, 25824, 43888, 30255, 4573, -33268, 44250, 37990, 70796, 45806, 51030, 40921, 12252, 66051, 65354, 47599, 37134, 12333, 35547, 36347, 41474, 1756, 26425, 50644, 18670, 24066, 10452, 20825, 27424, 22953, -21874, 5562, -9993, -3576, -5490, -6097, -2990, 67770, 53198, 45935, 12210, 36007, 72395, 76263, 16106, 16393, 59983, 44788, 36159, 18575, -2913, -18872, 10602, 8286, 4787, 49860, 66074, 64919, 21623, 3610, 8297, 24262, 32666, 24250, 25661, 12631]
1844A2631M0596q375j4328N6818K3507k1666r610q53K1315J6625m278k8518L0322
1831A14186l9857m299J9875l8709j9604l166J2107j3688O943k4522l324K112l2838
1818b4784N5268J4644j9039N0438L121r2854J4182N1903k2485M86J2287j4786
1806B8381K9832P961P086j9876m2922j3244p889K1367j7747P446k4404K9456K0181
1793B5628m358o235R219o988k3097M8010l7241P027K7101j8048q482j1580j5856
1780a4900K1479l5603j9466M0207k705J6095l7412J4387M6899p137R141k4164
1768F821L2141l6008l739n9553P1672p29m4574l3011K8174J163N873N4023K9405
1755E1658l1636m92P118l5208N2942k2397j7798k6679k2246L0335O8687O901m4914
$$ y = [12631, 53227, 44852, 30524, 87342, 110849, 89183, 79573, 78720, 100035, 116660, 112382, 83864, 114186, 74329, 70030, 89905, 51196, 31592, 28426, 40533, 26845, 33788, 9266, 5942, 8054, -24784, 30484, 45128, 26089, 76527, 79648, -13206, 976, 52879, 30394, 30880, 43167, 28381, 58213, 66174, 73260, 53384, 10462, -2782, -10671, 10696, -7051, 395, -24009, 5447, 25628, 21270, 15035, 24254, 17266, -5831, 42179, 4938, 11965, 39066, 21018, 12536, 956, -14900, 6579, -29024, -48490, -8283, -10988, 5107, -32305, -17918, 28981, 21844, 30985, 6821, 38962, 2954, -785, -60338, 11334, 10605, -33969, -66980, -38806, -37643, -31770, 22253, 51658, 20022, 19530, 26648, -8560, 44382, 21985, 4187, -22492, -44738, -14403, 54284, 61185, 16271]
1742A6271j9246M301r660Q3273L306o2914l8229J7792O4385j6063j9960J0609
1730C3865k9615J4741q982l7176k643L8761J2505J6529J2737p720r894N2315m0977
1717D4446n6269k0962Q886K0879o650P469j5616l0250L2649L2736K8654j1310
1705C4662m315J5468n5088l4417P957J6874M9356k4536k405j625j3079N1692J9864
1692F0408k1190k4263j7067l3322N0609j7863j8364K1788j7961p274l7982J3707
1680d8774N0499j3942j8854Q7102m8352m0187N0849O281k060m2195J5462L0591
1668B6420m2632P358L1619O454k5225K2702K4861J5796j1690n1606L3044j5664
1656B1437l0552o3811L1522L0641m6622J7527O317L9883l9817O989J0636Q879
$$ y = [16271, -2975, 1326, -8334, 74939, 78245, 15331, -22898, -5106, 59279, 43216, 23256, 33865, 4250, 18991, 10009, -27167, -29810, 8951, 21456, 37985, 50722, 43002, 33108, 85423, 44446, -11823, -32785, -23899, -3020, -9670, -2201, -17817, -48067, -15418, 17318, 45972, 34662, 30347, 45815, -9273, -43690, -35733, -18859, 30497, 5961, 3556, 1931, -11148, 40544, 60408, 39218, 14955, -2112, -35434, 15175, -2688, -21052, 736, -17225, -24499, -62481, -48774, 1725, -12217, -31071, 56031, 7679, -32508, 18341, 24622, 22562, -19633, -4171, 26420, -16212, -8854, 22765, 29219, 3994, 26696, 51557, 67353, 55663, 4057, 37101, 21437, -9115, -72926, -41404, -10763, -57385, -39858, -33541, 6342, -33475, -26486, -15850, -6971]
1644f971M1838j042J1441N685m8566l5725K4704K8942M564j6240J615k1848J3270
1631A667k2781J7912k5363l5019K8120j9250L8780j0818k51m841K0086K4784n166
1618G860j1802n1251L1648J2651N8k4032J3157J0018O063p682k1315Q062K3146
1605c419j5894J3888K8459p666j2710j0553l268o768j8920J7662K0834L7044o7703
1592b9014m294J5699L4005O2663j0348l379k811m8321J2137k2663L317l2184j0168
1579c5361K9035k0781M0754j3694r786K5039K6651l1352p375K6439l1257q9968
1567i1656J3122K0709K4169L8650J1689k3887Q643L2667l0237j5740k7866j862
1555d1599M8425j4763j7224l202L2949Q296K4497l4779K0433j813m0206p575J4902
$$ y = [-6971, 34867, 33825, 45266, 50951, 2385, -33340, -8636, 20306, 24870, 8630, 10245, -11603, 1667, -21114, -3202, -28565, -63584, -35464, -54714, -15934, -26752, -27003, -31844, -11758, 13026, 7860, -3942, -55193, -23545, -10894, -10836, -34868, -21711, -11693, -5630, -13312, -34627, -26565, -3419, -19313, -5425, 23034, 15368, 2658, -7895, -11163, -17931, -36851, -19189, 1645, 38689, -29014, -33308, -17609, 16396, 79059, 68711, 65332, 62521, 14200, 26337, 3674, 6991, -25193, -35361, -6326, -27107, 13647, -47, -9833, 15206, 41857, 10505, 3130, 29569, -1688, -91656, -78534, -57825, -33656, 4994, 16683, -7204, 1439, 34106, 3869, -11871, -39737, -41599, 6826, -7937, -25161, -28363, 4586, 12882, 37379, 2600, 23033, 21220, -18986, -26561, -11659]
1542a1659K6717r471k0482J9432K7018q3625N2579m474j6895l408k712O951J2929
1529g100k9821j646K8702k6115Q226j3861J0496L1029o82l1101J6404M2816K3982
1516E1329l5013K5248j2689j6322p806J09k507n9006N1857L3440k2962j4231k4292
1503c2845K6287j6339k0094J5361l8234O5200K1051k611J115l8215K9802K6588
1491C7066M441j1677j7694Q308j3633p832J6576l6043r16J3872k631k4847o951
1478d1961J2873j5795K9673M2290k2214J2560n1458L774J7445l2490N856M1454
1466B007l0046K5729j4634R8K735J8464P184r049q940k7722m92k0401L0326o036
1452c0777l1206j7220m78O0919J3789n0733j6202L3129K0698j2495J7577K1486
$$ y = [-11659, 15058, 5587, -14895, 4537, 31555, -52070, 509, -3965, -20860, -24268, -26980, -20029, -7100, -36921, -38567, -9865, -35980, -27754, -41615, -31119, -90, -772, -31873, -15469, 27347, 51329, 16316, 41564, 28875, 12553, 4747, 4856, 2349, -56657, -4800, 28640, 5678, -8553, -32845, -6558, -22897, -42991, -27630, -65864, -664, 20387, 17776, 18891, -19324, 10478, 37066, 41507, 29830, 12136, 20444, 6811, -1021, 15555, -20488, -21404, -7532, -10163, -35010, -41961, -29088, -44883, -15210, 27080, 4866, 17426, -34032, -30258, -12813, -45303, -39447, 2007, -28039, -2310, -16944, -16846, -14111, 4353, 11537, 2488, -6452, -34174, -34666, -55067, -24741, -30777, -61983, -79203, -79681, -18762, -4973, -55706, -71908, -38779, -18081, -30576, -12999, 8487]
1440H487j3643o916K8619n9269K5504K2890J6403p672m788j6269j2911L1246J8823
1427C0504K7341l6019l4388J2403k382L6946o3171j280L9932n7934R051k752L2802
1414h947K4253m2645k8811J2423J2894j9285M470L3286R138k7188N1232l5868
1402a5048J7969K5079o2269J5038J176k0266K3664K2675J6266j568n477l169k1724
1389g654j0868k6105M7246j3728L7976M717k9562O037K7511K434n4215L1153J3256
1376B8198K3634j2727n6095q415J5044j1633l1497n71n357L3536j4001m9216L6744
1363e2356j5707Q464k3154J7327L3065k5328N3066M8682n7144k0757j319M1640
1351F479k3488N0j4633Q980M6641n2841p686L7072L0555j5104R610j4361J244
$$ y = [8487, -5156, -12072, 16547, -42722, -17218, 5672, 22075, 14403, 9615, -6654, -19565, 11681, 30504, 57845, 21826, -12562, -159, -2541, 34405, -28766, -30046, 9886, -48048, -38997, -41749, -8947, 15306, -27339, -56150, -43727, -30833, -50118, -45648, -12362, -3224, -30412, 20820, -15048, 2921, 28000, -34269, -19231, -18055, -38321, -14657, 8018, 24284, 22716, 17239, 14070, -7654, -18522, -44627, 2619, -11109, 26867, 31584, 2022, 8059, 35570, 38004, -16211, 14942, 28198, 51832, 39105, -16990, -25405, -10361, -21994, -53491, -54062, -59419, -25883, -39884, -89100, -52356, -68063, -59599, -82753, -65426, -32361, -57689, -4623, 44059, -13085, -33842, -35161, 6479, -17009, -16959, -31592, -22612, 24029, -28812, -36498, 574, 31129, 16025, 25635, 11274, 12518]
1338A2518J3949m1246k5768O339J5846l7805K5043N9567n8972k646j1554K3710
1326b1019K2185J0905l639J3100k7243k5152L73o2621Q122M6831J2137j0752J2857
1313b3916m837L4764k8723L4061J00979n7153m1712l2695L4125K7264m7725O821
1301A253J8777m994J2300o682j6624J8818r106m2780o441N536J7343k9159j555
1288d3314p663L9295l7563k2509M4139q478J0013L1343R350K5769j9657j7817
1276B908k1084j0459L8799Q295r6L6280J9023r5738l2758K6272J8152O88K5429
1263A5711m1546J6110M5J7701J2877j2277L4589l134l5689k88M4031K0969k6893
1250D2206r608n6253J3231M0152L270j4040k1711j42k1924M4475K2301m091k8163
$$ y = [12518, 26467, -14779, -40547, -34208, -18362, -56167, -31124, 28443, -30529, -33175, -44729, -21019, 1166, 12071, 8432, 21532, -5711, -30863, -30490, -93111, -84989, -38158, -26021, -36773, -23916, -28753, 6011, -22712, 11349, 112328, 55175, 13463, -19232, 14893, 42157, -5568, 1253, 20030, 15036, 27336, 20654, 4030, 22848, 13742, -29038, -35479, -29943, -12600, -41759, -43314, -50977, -11682, -49245, -71754, -27615, -36093, -26080, 5263, 14613, 40382, 20725, 2908, -18176, -28635, 10164, 18459, 18363, 54643, 73666, -22072, -54830, -28558, -10406, -9718, 15711, -25835, -9725, -9680, 8021, 20898, 8621, 43210, 40076, 4387, 4099, 48130, 69099, 42206, 32598, -23655, -10424, 29728, 32998, 18958, -2753, -2895, -24819, 19656, 41957, 37866, 9703]
1237I703L3403J2320M918l9565m4464k6645Q565N1807j3274j0486M7265J888j7498
1224A7937l7627l0036K7833K5946N82j0667k4795j2681J989M3248O436K6406L3942
1211F8513o9573k3747m0391l644L0651M371j8183J5047M478J7728J9047K2603
1199B6900l2437k9011J0554R045P036J3146k1290j3001j8812J5368O741J3812
1187a1949K0232M3754k0674m5155K1596Q997L0194k1381q301k5495K1631M173
1175A7622n6808K6950m6186l0998P6745l4067M4688j2881J9150k0765J7855k8543
1163b7238k9088J7010J5592N7444n8353L9353r092j1478j6303L2917K4035j3999
1151B0800K0326l192j8214K1212j9045o0827R230J3828O0897n42l4337K588n9118
$$ y = [9703, 43106, 55426, 60344, 20779, -23685, -50330, -41765, 10042, -3232, -13718, 33547, 35435, 17937, -19690, -49726, -21893, 4053, 4635, -6032, -30827, -43508, -41519, 1729, 8165, 34571, 68513, -1060, -24807, -65198, -68842, -38191, -33820, -52003, -36956, -32478, -14750, 4297, 26900, -5537, -34548, -23994, -14949, -7913, 5233, -16057, -29058, -47870, -32502, -25761, -11949, 8283, 52037, 31363, -13792, 7804, 16801, 46995, 25614, 17313, -8182, 13449, 17622, -39186, -12236, -58422, -89420, -12675, -46742, -2054, -14935, 4215, -16550, 1305, -27238, -56326, -39316, -23724, 33720, -24633, 14720, 5628, -5850, -22153, 10764, 34799, 20800, 41126, 37934, 19720, 40932, 21887, -38940, -29710, -15882, 45015, 44473, 10136, 12724, -46394]
1138d6394k8229O57J1192L9748J4531j1631O695O9349n322m5857k4218k592K169
1125a9902k587J6992k2558m1564J2443K6488J8286m6211J268K2981N2650K437
1113B0723m7517R91k214N8080j8514j0036K3331K6178r613K5476n7825m3500K0909
1100a3531l4168k8625J00160L080j3038k1382q5336J0362K6031R512J5099K677
1088b9159K3741m4901P622K7698j4532l1952K4217M5348j7917l461k0858O5537
1076C1383K4650k4112p062q454J9776L3473n4994j7773J5516J1180j5954Q186
1064A5815q277M4565l6386l6334J7942m7557M7044O325j2002M3574L790j7243
1052B1256m5370j8390L2528k6676j4685L1175j1481L434l059J490J1503L689J5799
$$ y = [-46394, -74623, -73966, -62774, -23026, -8495, -20126, -13431, 55918, 50596, 4739, -19479, -22071, -19902, -22489, -5497, -28055, -69619, -57176, -30688, -12402, -58613, -57345, -34364, 18286, 20723, -26794, -25803, -28017, 30063, 11549, 1513, 24844, 51022, 41409, 66885, 9060, -34440, -13531, -47699, -76324, 23836, 26916, 13878, -7504, -92840, -82478, -56447, -46935, -31836, -29159, -5418, -50319, -42697, -14999, -29531, -61483, -37266, 8082, -9835, -13296, -34154, 31383, 56033, 31921, 24859, 16405, 36181, 69654, 14660, -3113, 12403, 23583, 7629, 15815, 7538, 52103, 15717, -20617, -2675, -50232, -3188, 3137, -8865, 34709, 38499, 21256, -24114, -42504, -9976, -36652, -51337, -20162, -31643, -28209, -31268, -29778, -18275, -14586, 1213]
1039A213l1363k1219L5649M3028L3636k7382m1924j6476Q517N203m7271P578K5235
1026b5576K3984J2753m9434M512l2511J6091J345K3047J617o642K243Q522p360
1013b7409o495J4038J5757M3286m1323J9864l0080j2266J7725k0586K1659m0331
1001d6161K8935J3961K0597n292j8763M2107l4226o241K6457N1774k6288m1063
989E797j5366O300m6997M8090L0247n9083j5800J5094L0845j1478r063j838J5271
976g981j6299P1041j5254p0827L3433Q392k5609K1068J670j4282K4959R326j7998
963A639l6927L2616K366O485K7239N305L0608n8378l1654j1346k5994L2831P079
950a8131m869k2243l696M3772J3892l455j790n628J9368k4991k6231O593j4239
$$ y = [1213, -30150, -51369, -15720, 27308, 60944, 33562, -8362, -24838, -16321, -11118, -58389, -50811, -25576, -1592, 11161, -38273, -33761, -66272, -50181, -48836, -25789, -24172, -30814, -28571, -20049, -27409, -33904, -19866, -4109, 39177, -2146, 17718, -12362, -24628, -6903, -27489, -5830, -46161, -17226, -3265, 17332, 12040, -6723, 35384, 1158, -5083, 21374, 73148, 46860, 5797, -9569, -3269, -50266, -2176, 28071, -31012, -46812, -31718, -873, -12351, -21414, -23252, -7981, -24280, 46761, 31507, -39320, -5887, 2505, -23104, -2036, -366, -14648, 10311, 19637, 1639, -35288, -2672, -306, 6179, 33418, 38723, 69331, 10953, -20701, -32047, -58041, -25210, -18131, -23000, -45243, -48939, -5167, 8725, 5270, 3480, -2148, 17220, -7771, -34002, -27409, -41648]
937d1648P0792k2256p3329M4724j0186J6207K4703q51n8704O3152N5574p3051
925d873M9559n277q1185k0712L4931K5613l8370q156j453M7766q037K0481n3438
912d3151m5006J0243J5533l021N3548R803j1572J7511m3666J0313J504j7296Q793
899c6464L0664q779J6109J5703O492n320q360l5088n4458L192R308J2952j3452
886f7501P518R787m0806Q122J2828J1877K6749O643J01K755J0816J6232J757l3748
872b6870k3197j0921m042N021J2974K5693N84p696J242m647m1889M6259p969J1091
858b4367N771l382L604L6767p881J015l8909Q803L4941k1898n6216K668J8400
845d0684P756O5562J1256m3720p61K5559k8609j0239j0743L1363k6758k2509j469
$$ y = [-41648, 29144, 6888, -66441, -21717, -31903, -15696, 9007, 8156, -50548, 12604, 68178, -4873, 44686, 39409, -41776, -62488, -27557, -1944, -40314, -48470, -49923, -2157, -10194, 10287, -43151, -88157, -77914, -62381, -65402, -11854, -2051, -13623, 3888, -39778, -29465, -27961, -45257, -36464, -5800, -14579, 1530, 17233, 23725, 18405, 10045, -25043, -79501, -76309, -67001, -54049, -67501, -59983, -50196, -91002, -82880, -70052, -58175, -31426, -24783, -24682, -21927, -11111, 5121, 6878, -26870, -50067, -60988, -65030, -60009, -47035, -21342, -20758, -28454, -27212, -31859, -73748, -27489, -35458, -24367, -18596, -21978, -18374, 18393, 10512, 11527, -27382, -18579, 16362, -5536, -61752, -59084, -40684, -32928, 32634, 43890, 170, -591, 24968, -3641, -13880, -24623, 6740, -20018, -42527, -43996]
832d3996O2779l63k3039l1314K9520O9387n4988J2402N432j0544n8406j8372N1203
819a0299L3217o0454p2485P4506N7431q572p3517M7763L3376r157N529m1345J1504
806a2503J1887k4385j4362M0176K1803m608k6430J3673n51K1428L196j0071j199
793A8054l2151k4562m2897K9716L8536Q456L719Q122K3622p2272l4136L9423L4308
780b062j0606l888p649J3353K4858Q047K3423P739o6494n1155M0577J1551m8793
767f1099j0798N0915l00k8050R230j126L629K7428j539k9758O346O955M987J5789
753g391k0769k6498J8841j4497O9719M1762n591l135K8930k2428n1174J2808J2189
740C2766j8291l1662l5222N3499L5675r1342O504M5331l2729l7840K8146k3332
$$ y = [-43996, 18783, 18420, -4619, -35933, -6413, 62974, 7986, 20388, 25820, 15276, -43130, -61502, -10299, 22918, -37536, -110021, -35515, 21916, 13344, -60173, -12410, 20966, 11809, 17338, -24007, -12503, -616, -25001, -39363, 813, 22616, 18008, -8422, 5251, 4700, 26128, 29324, 19253, 18054, -14097, -38659, -81556, -51840, -13304, -4848, -1129, 6993, 30615, -41657, -75793, -36370, -2062, -12668, -16556, -24205, -10852, 14006, 22053, 45476, 53215, -13279, -64434, -23857, -12306, -61099, -71897, -20982, -21282, -49332, -40102, -41228, -37599, -10171, -11710, -41468, -35122, -28167, -23180, -7391, -28160, -54658, -35817, -50314, 19405, 61167, 55576, 52441, 81371, 58943, 7769, 20577, 32766, 14475, -17187, -52409, 1090, 36765, -54577, -48073, -2742, -35471, -73311, -45165, -68497]
728f8497O3163L2715P168l4790j6750k2364k919l5801M2912M6778k2685Q072r79
715c977m337J0198R988l5187m6350M9829j0935k824N6876J7736m6654L7386l3839
702b090J3534J1758m2054k505k0676R463K8463j7325J1849k1076L5055l3622o1882
689i1108K1423K1967l078K6095j8689m4139O4044K3585j6869j5073R072l9150
677f1920J8043K2999l5501L3105J2212k9649J5842l7080N1764K7807k7013k9386
665c8777P652j1705J5701j0998N0697K4141q231j6370j6545j3513K5454K1396
653B8902J9831M784l0708N134j3741j1569L3822j9417q7380K6077O4112o7218
641d7371K3253K8336R44r522K8617m6015k5082J1311k9313P6043l7042n7806M1841
$$ y = [-68497, -5334, 27381, 34549, -241, -16991, -39355, -42274, -78075, -35163, 11615, -11070, -2998, -3977, -8314, 1884, 11872, -23315, -69665, -19836, -30771, -33595, 23281, 41017, -5637, 31749, -2090, 11444, 23202, -18852, -21357, -42033, -32570, -4107, -21432, -9583, -30659, 4396, -29226, -91108, -69685, -47718, -50796, -24701, -43390, -87529, -23485, 100, -16769, -31842, -22770, -61920, -43877, -20878, -56379, -23274, -11062, -40711, -24869, -61949, -10185, 17622, -9391, -38777, -31125, -42830, -27129, -38127, 12570, 36711, 28480, 12110, -4435, -17948, 7506, 28902, 48733, 53517, 22809, 27943, 14202, 2633, 36455, 17038, -70342, -44265, 19847, -47371, -24118, 4218, 5162, -4360, 24257, -21758, -46840, -35529, -64842, 11201, -25841, -83647, -41806]
628d1806m381M1923l5912q608O4475L1739K4582O789m9668L191m6406j2543N6222
615B9597J5130M812j7511m0177R316K1735l1917m0415J9693L8127L2810j5665
603B5535k8110K756Q784l5206j385J6440m9495N8427M0047m2725j7730K2304j5785
590a6143o510k325K8986J5313k2154j4651R433j6491M1948j3248k3663M660K6257
577A1412j513k8248j4830L554l118R498J2078J6943J7031n5731k8017N7429k1643
564b5155K8337K2133k2818q2989N2258M9423m7218L7670N5582n4113m1445J1688
552a6647N840j8135K8931M4555k4855J4246O620m1002l4923J1710K1072k8820
540c1408J205j341K437J0065P393N1844m7609j20r640K1347m9618L752M5327k911
$$ y = [-41806, -46187, -4264, -40176, -48784, 15691, 47430, 72012, 78801, 29133, 32324, -14082, -26625, 29597, 44727, 49539, 32028, -8149, 1167, 22902, -9015, -49430, -29737, 8390, 41200, 25535, -2575, 181, 8965, -26241, -27626, -11186, -60681, -2254, 37793, -4932, -22662, -358, -16143, -22653, -24978, 4008, 19321, -2833, -17484, -8051, -24542, 17406, 4158, -19505, -14845, 11412, 9899, -18349, -33179, -29625, -32743, -23245, -11167, 5776, 22807, -32924, -60941, -3512, -25155, 3182, 25315, 2497, -80492, -28234, 21189, -26029, 11641, 67223, 13110, -28335, -16647, -10807, -28942, -11, 44544, 19689, 33935, 40555, -447, -35370, -23660, -2588, -31408, -30203, -31544, -29107, -19042, -11649, 40195, -7414, -7534, -17174, 4173, -45445, -41693, 3634, 723]
526G23K7850k383k8000k0144L3340j9724q54J2563r698j4009K3043M7517j2818
513C7406M218k2526m752l1237m610m317k345M8730k7740k8022P7920L7481q6522
500f316M2148J3501m3801M6219k1983m6595L1830n699O002m2060M4221K6825r243
487C5049j316j527M618l4816L725K7143J1939l3447m0004O0419k8257J1700J7196
474C2422j6692K3393j3485K5028k4497q614M935m4533K6505J1757k1668j8121
462b3570J5984K4147J7824J9328j7646M034p5215L3529M0811m5399p0575O6212
450a0536K61p262N074O1149L4957j8517J6614n5462k2834R813m8373K6460k1700
437c0356K0336k7848L1643L063l5084K2545N5280J2069k5831K1615l1672j9751
$$ y = [723, 28573, 26190, -1810, -21954, 11386, -8338, -9192, 3371, -6327, -20336, 2707, 50224, 37406, 41624, 19098, 14346, -16891, -21501, -25818, -28163, 20567, -7173, -35195, 42725, 80206, -6316, 35832, 49333, 5532, 51751, 29768, -16827, 15003, 9304, 15306, -26754, 17467, 44292, 35049, 33733, 32206, 36824, 2008, 5733, 32876, 44815, 11368, -28636, 31783, 3526, 15226, 32422, 15730, 39123, 25638, 50666, 26169, 17555, 22490, -22043, 4462, 16219, -5449, -23570, -7586, 16561, 34385, 53713, 36067, 40101, -35114, -1585, 39226, -6173, -76748, -10536, -10275, -17537, -12463, 48686, 83643, 65126, 81740, 26278, 3444, 13257, -35116, -8656, -30356, -10020, -37868, -6225, -3162, -38246, -15701, 39579, 51648, 25817, 47432, 15760, -3991]
425c991l5652M7128l230J3052k209j4112L6126L6713o3037K397n267j5669Q508
412G57L133j6629N7327k3226j7256o453k8173L4699k4458O78O1819l2426j9902
399a0110k3331J9736M9080j1326N1926p0333M762O762j4856k5373N018M3027j3842
386A1140l5604J9812m254Q756m3658J3654K2047k959K2322j0270J9403J6052j2678
373B3763K019L2513k7739o5991K7460J7985m5489L3591k1826j926J9097O3601
361E7058k8918p1729M5062J3033J1214n8220j553L267K9885M5667j9392n1901
349b6527J5922j2608j027K4313m0895J3833J1168K5725q391j9324k3898O2257
337B0548N561j1119L6276k6346n0134n078K892J8950j4285L524J3491K105p743
$$ y = [-3991, -39643, 7485, 4255, 17307, 15098, 986, 37112, 73825, 10788, 13185, 7918, -7751, 757, 3890, -12739, 44588, 21362, 4106, -2347, -30520, 4179, -20279, -19601, 42218, 9792, -10110, -33441, -13705, 35375, 24049, 75975, 5642, 10404, 17166, 2310, -23063, -18045, 24982, 11140, -24464, -4652, -8906, -150, -43808, -30154, -8107, -11066, 11256, 986, 20389, 36441, 23763, 25782, 58295, 30556, -35435, -7975, 10010, -35479, -1888, -23714, -25640, -6543, 57058, 28140, -43589, 1473, 14506, 25720, -32500, -34053, -30786, -901, 44766, 25374, -26527, -10605, -23213, -24240, 73, -40822, -26989, -15821, 9904, 1513, -17811, -41709, 20548, 26109, 14990, 51266, 24920, -25214, -30292, -27400, -8450, -22735, -19211, -5720, -3615, -11358]
324a1358L0295N323q038j9981J4674L5852J2702k1249R120m5421j0331K305K0776
311A4669j8516k4536P5193k3499m842k0762K2953j7140j23J8801k3967J3917O5023
298G7171l3117l1846O870k6771O0572r899j2149j2946m2282L3122N9517Q885j4749
285F2378n766j2837k0166K3049l040l2649l1822K1964r610K7328k9714k3392O7170
272C2893M5321j3887p1565j6064L3740j6647k4036L7679p140m0618N855J708L4824
259B063M0005l5103j7520j9093q545L9958J6678M529m183k0727j0779r477L9523
246A7329J952Q852l15j6419j2052l374j6023j8665J4778L8464J2049j2854Q719
233B2441L9993l2288n4572k69K8761L2206n5152l0479O0967K7308j4952m8516
$$ y = [-11358, 18937, 24260, 16222, -3759, 10915, 46767, 59469, 38220, 47340, 1919, -8412, -6107, 14669, -3847, -28383, 46810, 23311, 18469, -2293, 20660, 3520, 3397, 22198, -1769, 12148, 77171, 44054, 12208, 19078, -7693, 52879, 42980, 30831, 17885, -24397, 8725, 68242, 77127, 62378, 56612, 43775, 23609, 46658, 43618, 10969, -20853, 1111, -8499, 18829, -10885, -34277, 32893, 78214, 64327, -7238, -23302, 10438, -6209, -30245, 7434, 294, -40324, -34469, -32761, 2063, 42068, 6965, -10555, -29648, -38193, 1765, 18443, 22972, 18789, -1938, -12717, -22194, 17329, 19281, 28133, 27818, 11399, -653, -4027, -20050, -38715, -23937, 14527, 26576, 13722, 22441, 62434, 30146, -24426, -24695, 4066, 36272, -18880, -49359, 11608, 38916, 23964, -24552]
221b4552M309P987K714K9751L7466j3322l127n7303L8246O251k7130k57q340J3054
207E747j9014L541L1921j0513J5797n0985M251J3921M4061K4855k5782N34K2484
194F0818l078k3264l4371k3149L6557J0417K2329k3290m0649K1937M2055o294
182D0018P512p0765m735M5914j5320j4987N8709J9837n603m3750Q944N099j9301
169A1572N687K1075M1539k5009m5657p221j2349J3753J4956r579l340j4051n8913
156f7537P3060N2506k4993k749k5825J3521j2339R616k3530K5293K4105Q712J8818
143F8658j9909n9163j3977J3981R671O274L6086m0482n9478L9032R549J7559J0405
130A8206K3958j0692j5554j8400K5894o463J964K7019O122o256n461k1674K5546
$$ y = [-24552, -20243, -12256, -9542, 20209, 57675, 44353, 41226, -16077, 22169, 28420, 1290, 1033, -7307, 5747, -13267, -9726, 22195, 11682, 27479, -23506, -19255, -5334, 38727, 63582, 37800, 38334, 60818, 57740, 34476, 105, -23044, 13513, 23930, 46259, 22969, -17680, 4257, 46312, 40018, 47530, -23235, -27970, 17944, 2624, -12363, 46346, 66183, 60580, 16830, 25774, 30873, 11572, 17259, 38334, 79873, 54864, 9207, 1986, -10363, 3390, 18346, 8767, 5427, -8624, -67537, 5523, 58029, 33036, 30287, 4462, 17983, 5644, 15260, -8270, 17023, 41128, 49840, 68658, 48749, -10414, -24391, -10410, -739, 5535, 41621, 1139, -58339, -19307, -9758, 7801, 18206, 42164, 31472, 15918, -2482, 23412, 16949, 18913, 45932, 52054, 45798, 40337, 18663, 44209]
117D4209J0966m4864l218L6304q324j7106J5810k4764P570o212j2292J7642J0829
104B6550K3707q015K1367l0738n6538K1611J9935k0211J3851j2875K8955L3655
92F1254l0578J4843K3702L541k2302k4521k844J8436O894l5191L3031L6045l5422
79D6888m4414j9914j6360L7854K8129j4103j1388J2020M411j2204K3895N326k8812
66A1328k6030L2950K5321k7544Q445k4048J3873j0587o711j8245L877N2811K0430
53E5870J1589l4107j1122l3308J1655L6016k5381m51J2284L7493R753m041j3598
40E2652l6824K9057j3000j3826J5585M55j092Q61K9580j7432m1046j5205K8796
27A8561J3554l9978p627n272M0203k0792K7041J5026M4368k9997j1370j0352o898
$$ y = [44209, 55175, 10311, 7093, 43397, 35073, 17967, 33777, 9013, 16583, 10371, -1921, 15721, 26550, 50257, 42242, 63609, 32871, -23667, -2056, 17879, -2332, 11519, -1356, 27599, 61254, 30676, 45519, 69221, 72762, 50460, 25939, 23095, 41531, 48425, 13234, 46265, 82310, 46888, 2474, -17440, -33800, 4054, 32183, 18080, 6692, 18712, 23123, 10919, 34814, 40140, 11328, -14702, 18248, 43569, 16025, 24470, 422, 14295, 3708, -3003, -21248, -17371, 35440, 55870, 67459, 33352, 22230, -11078, 577, 36593, 11212, 10761, 23045, 60538, 70291, 66250, 52652, 15828, 44885, 31885, 18059, 33644, 34099, 33007, 33868, 63448, 46016, 4970, -10235, 18561, 32115, -7863, -15490, -20762, 19441, -1351, 25690, 40716, 85084, 55087, 43717, 33365, 26467]
14B6467k6998R752O589j7439j093M2513J2414j1199k4178R160N059O605L2511
1G0163j2248
0E7915
$$ y = [26467, -531, 9221, 15810, -1629, -2722, 39791, 52205, 41006, 16828, 25988, 31047, 37652, 70163, 57915]
$$ Imaginary data points
##PAGE= N=2
##DATA TABLE= (X++(I..I)), XYDATA
16383a111207J4895L4016L4966o654L566P971L4422J6410L3848O566N3106J657
16371h76438j1180M4921K7181m4068K6838j0829L4713N7676r94J2584M1908R953
16359f87735J9250J2248L656K5499J3405O6522j6343j972k996L7629J2240L3557
16347d85040L5254N732P950j4181O5237J8711J9573R767K215j1845r913k213l458
16334c62211N0817L7023k869K8737L1403J0781K6084n374L169M8351K5191J0576
16322i8322J919L1448k3707j0723K9706L3161j1410K0114L8137K5574J7957K9297
16310H3151M1836k116p902N130L5870N488j3252J3562J7381j2839R304M1525J8758
16297B35896L7484M1732Q555q288J0649l4162M223L5941M0570O4666j6517q873
$$ y = [-1111207, -1096312, -1062296, -1027330, -1033984, -1030418, -1022447, -988025, -971615, -937767, -931201, -878095, -876438, -887618, -842697, -815516, -859584, -832746, -843575, -808862, -751186, -752180, -739596, -697688, -687735, -668485, -656237, -652581, -627082, -613677, -547155, -563498, -565470, -568466, -530837, -518597, -485040, -449786, -444054, -436104, -450285, -385048, -366337, -346764, -336997, -334782, -346627, -356540, -358753, -362211, -311394, -274371, -277240, -248503, -217100, -206319, -180235, -185609, -182440, -134089, -108898, -98322, -96403, -64955, -88662, -99385, -69679, -36518, -47928, -27814, 10323, 35897, 53854, 83151, 124987, 122871, 114969, 120099, 155969, 161457, 148205, 161767, 179148, 166309, 175613, 217138, 235896, 273380, 315112, 323667, 315379, 326028, 291866, 296089, 332030, 372600, 437266, 420749, 411876]
16285D11876J3279J5873K0224L230l7085N647M7948K3505K1485n661Q009K509
16273E30839J8448L5456L068j4270k2898j4832K1178M3415J2806J108J5958N7524
16261F87800J6798k6042L2262L7279K6085j4871p429N6069K8294l0472j7875N1306
16249H39204L9009p983k7844J290k4447j2495L9955N8676r133M3835P654r558
16237I38163q500J242N548l949L899K2770m391L715K1949L5165O806j4436J302
16224A009283K7342K1442K4138j5438m20l8070L7990k0669O1684j1420L9719N2537
16212A188118l0690j6785k1669K4588J499N4345K4845k2909j6784J860L755N260
16200A195433j5336r53L6002L681l0833P3168o721L4507r616k945k5446L6665
$$ y = [411876, 425155, 441028, 461252, 464482, 427397, 433044, 480992, 504497, 525982, 520321, 528330, 530839, 549287, 584743, 587811, 573541, 550643, 535811, 556989, 600404, 613210, 614318, 630276, 687800, 704598, 678556, 710818, 748097, 774182, 759311, 751882, 807951, 836245, 805773, 787898, 839204, 878213, 870230, 842386, 843676, 819229, 806734, 846689, 905365, 896232, 940067, 947721, 938163, 929663, 930905, 936453, 932504, 936403, 959173, 954782, 958497, 980446, 1015611, 1022417, 1007981, 1009283, 1036625, 1058067, 1082205, 1066767, 1066347, 1028277, 1066267, 1045598, 1107282, 1095862, 1135581, 1188118, 1157428, 1140643, 1118974, 1143562, 1145061, 1199406, 1224251, 1201342, 1184558, 1186418, 1190173, 1195433, 1180097, 1179144, 1215146, 1218827, 1187994, 1261162, 1254441, 1288948, 1279332, 1276387, 1250941, 1287606]
16188A287606j0367K6484J4405m5316m9K2710K0141r013j1402L0157p603J7433
16176A335186K5089K1789j2650k1506j1134R131M122l5879M4554j13k612J7040
16164A373017j8733j4138P9779l9565k0220N0058p502k4892J4905M1341M86M1656
16152A476192j7481J317J7768L0016n0992O178R008k4784o916k842k3278m3799
16140A370387N2880K1062k886N2537j7501l1488M156K3772r781J5527K9481K5389
16128A533535J9420l0270n5156K1417L694l2625N2618q486k1384j5298K2357j1288
16116A478534j1676K1487J374q321N3379n197n1834m7854N5559n301K4367J5824
16104A520341L603K600k3804N4927j0437j9815J1308l1967m3033j384K0225O6039
$$ y = [1287606, 1277239, 1303723, 1318128, 1272812, 1272763, 1295473, 1315614, 1306601, 1295199, 1325356, 1317753, 1335186, 1360275, 1382064, 1369414, 1347908, 1336774, 1345905, 1350027, 1314148, 1358702, 1358589, 1355977, 1373017, 1354284, 1340146, 1419925, 1380360, 1360140, 1410198, 1402696, 1377804, 1392709, 1434050, 1434536, 1476192, 1458711, 1460028, 1477796, 1507812, 1456820, 1462998, 1472006, 1447222, 1440306, 1437464, 1414186, 1370387, 1423267, 1444329, 1441443, 1493980, 1476479, 1444991, 1449147, 1472919, 1463138, 1478665, 1508146, 1533535, 1552955, 1522685, 1467529, 1488946, 1492640, 1460015, 1512633, 1504147, 1482763, 1467465, 1489822, 1478534, 1466858, 1488345, 1489719, 1481398, 1534777, 1529580, 1477746, 1429892, 1485451, 1480150, 1504517, 1520341, 1523944, 1526544, 1502740, 1557667, 1547230, 1527415, 1538723, 1506756, 1463723, 1462339, 1482564, 1548603]
16092A548603K4342k384m434j4023K5882n764l1108J8734Q547l188k3567J7022
16080A558662k5985J8176R608p07K607l3521M6622j2232M5016l1850k8790k1120
16068A526486R056O3709r534o650k1036L0303R293K286m0180j8240k045o994P2859
16055A609313K9645j7675J5356n3810o5136J3924M6944J593K9872K0283j2954
16044A617355k9216K7110J7217k908l2200o529j8499k4222J1096l756R856j052
16032A564252J5856j1900J0695J2130l8173k906N8500J55O15k6164K323o47r476
16019A575260Q656J0537k2506q808K829K5258r777l802J0560l3152r750N2175
16007A597480P762m3166J5464O3889k1671m6400J9507j9315K850K1429k3238l9091
$$ y = [1548603, 1572945, 1570561, 1566127, 1552104, 1577986, 1572222, 1541114, 1559848, 1568395, 1565207, 1541640, 1558662, 1532677, 1550853, 1560461, 1559754, 1562361, 1528840, 1575462, 1563230, 1608246, 1576396, 1547606, 1526486, 1535542, 1599251, 1589717, 1583067, 1562031, 1592334, 1601627, 1603913, 1563733, 1545493, 1543448, 1536454, 1609313, 1638958, 1621283, 1636639, 1582829, 1517693, 1531617, 1578561, 1580154, 1610026, 1630309, 1617355, 1588139, 1615249, 1632466, 1629558, 1597358, 1590829, 1572330, 1548108, 1559204, 1555448, 1565304, 1564252, 1580108, 1568208, 1578903, 1591033, 1552860, 1549954, 1608454, 1608609, 1609224, 1583060, 1585383, 1584736, 1575260, 1583916, 1594453, 1571947, 1563139, 1565968, 1591226, 1581449, 1577647, 1588207, 1555055, 1545305, 1597480, 1605242, 1562076, 1577540, 1641429, 1619758, 1573358, 1592865, 1573550, 1576400, 1597829, 1574591, 1535500]
15995A535500M3956j1286K0680L5695M7537O608r9671J7755L1485k8872k875L9036
15983A635548J3846l9783o5950K6086N8840k1014j1640K408j58L3387J5356n2339
15971A594587n159J0901O877n2149p459K0608Q973p810n7799N5658M4026J2539
15959A623793j6700r863l410j788o338n146J1494L6407j60j534q454L4846Q019
15946A661166k0020K4589k8843j1690k1382k9523K773k5297M1961J8704l0451
15935A581987K1737M2346N139l8140m3238R34L1089M7071J4404j8048k6724j5191
15923A603366M567r627k8907N731L451j0531L6638m337K4414L660K5315j9450
15911A634290m6743K145M0247k319n9253J0966M6656j4779M910O286N826L1747
$$ y = [1535500, 1579456, 1568170, 1588850, 1624545, 1672082, 1678690, 1579019, 1596774, 1628259, 1599387, 1596512, 1635548, 1649394, 1609611, 1543661, 1569747, 1628587, 1607573, 1595933, 1598341, 1598183, 1631570, 1646926, 1594587, 1589428, 1600329, 1607206, 1555057, 1547598, 1568206, 1577179, 1569369, 1511570, 1567228, 1611254, 1623793, 1607093, 1597230, 1593820, 1592032, 1585694, 1580548, 1592042, 1628449, 1628289, 1626755, 1618301, 1653147, 1661166, 1641146, 1665735, 1636892, 1625202, 1603820, 1574297, 1577070, 1551773, 1593734, 1612438, 1581987, 1603724, 1646070, 1651209, 1613069, 1569831, 1570765, 1601854, 1648925, 1663329, 1645281, 1618557, 1603366, 1607933, 1598306, 1569399, 1575130, 1578581, 1568050, 1604688, 1600351, 1624765, 1628425, 1653740, 1634290, 1587547, 1589692, 1629939, 1627620, 1568367, 1579333, 1625989, 1611210, 1616120, 1622406, 1628232, 1659979]
15899A659979n504k3768n606O0909Q277n9381l5203n839n292j0134j0257K9031
15887A597212N8591k8283p858k6684K606k0916j9717M9970j1923L6939j1295k9085
15875A589557j108k8639M515m814M7603j624m4448J2474O8838M0046k8634l2256
15863A621510p154k4837L0740L4424J5376J1120m969n601J4851m948j6575p80
15851A663157K8506k7011K0663R844r165j6601k2551K7699k4334k200J4069m7591
15839A614485l614L3755m5196O450L4084n785n4289j7081J5678L9164k0818j9441
15827A577392J9425N891L2955l5903k5841K8605l5208l3278L1987N5604j7531
15816A604098J5669K4096l1496m187j4309L4242k2711K2982O0452j2850j5068
$$ y = [1659979, 1654475, 1630707, 1625101, 1686010, 1694287, 1634906, 1599703, 1593864, 1588572, 1578438, 1568181, 1597212, 1655803, 1627520, 1619662, 1592978, 1595584, 1574668, 1554951, 1604921, 1592998, 1629937, 1618642, 1589557, 1588449, 1559810, 1564325, 1559511, 1607114, 1605490, 1561042, 1573516, 1642354, 1682400, 1653766, 1621510, 1614356, 1589519, 1620259, 1654683, 1670059, 1681179, 1676210, 1670609, 1685460, 1680512, 1663937, 1663157, 1691663, 1664652, 1685315, 1695159, 1685994, 1669393, 1646842, 1674541, 1650207, 1648007, 1662076, 1614485, 1610871, 1644626, 1599430, 1605880, 1639964, 1634179, 1579890, 1562809, 1578487, 1617651, 1596833, 1577392, 1596817, 1602708, 1635663, 1599760, 1573919, 1602524, 1567316, 1534038, 1566025, 1621629, 1604098, 1619767, 1643863, 1612367, 1608180, 1593871, 1628113, 1605402, 1628384, 1688836, 1675986, 1660918]
15805A660918k8653O721L2205q930n0257l8255J990m628R062K6557K3470n007
15793A625193j741N6114l5711m0398k1014j3079P9056M9117l8750k3371m241J6508
$$ y = [1660918, 1632265, 1638986, 1671191, 1662261, 1612004, 1573749, 1575739, 1571111, 1580173, 1606730, 1630200, 1625193, 1623452, 1679566, 1643855, 1603457, 1582443, 1569364, 1648420, 1697537, 1658787, 1635416, 1631175, 1647683]
$$ [...]
##END NTUPLES=NMR SPECTRUM
##END=
