##TITLE=1H_CA-9191-1
 CDCl3
 8 sc, 
 1.9.2023
##JCAMPDX= 6.0         $$ Bruker NMR JCAMP-DX V2.0
##DATA TYPE= NMR SPECTRUM
##DATA CLASS= NTUPLES
##ORIGIN= UXNMR, Bruker Analytische Messtechnik GmbH
##OWNER= root
$$ XWIN-NMR		Version 3.5
$$ Fri Sep  1 14:14:16 2023 Russian Standard Time (UT+4h)  she@DPX200
##.OBSERVE FREQUENCY= 200.13135
##.OBSERVE NUCLEUS= ^1H
##.ACQUISITION MODE= SIMULTANEOUS
##.ACQUISITION SCHEME= undefined
##.AVERAGES= 8
##.DIGITISER RES= 18
##SPECTROMETER/DATA SYSTEM= spect
##.PULSE SEQUENCE= zg30
##.SOLVENT NAME= CDCl3
##.SHIFT REFERENCE= (INTERNAL, CDCl3, 0, 15.7127)
##AUDIT TRAIL= $$ (NUMBER, WHEN, WHO, WHERE, WHAT)
$$ ##TITLE= Audit trail, XWIN-NMR		Version 3.5
$$ ##JCAMPDX= 5.01
$$ ##ORIGIN= Bruker BioSpin GmbH
$$ ##OWNER= she
$$ F:/spectra/data/she/nmr/H-F/1/pdata/1/auditp.txt
$$ ##AUDIT TRAIL=  $$ (NUMBER, WHEN, WHO, WHERE, WHAT)
(   1,<2023-09-01 14:12:52.17 +0400>,<she>,<DPX200>,
      <created by zg, POWCHK disabled, PULCHK disabled
       configuration hash MD5:
       00 E9 B6 7A A2 85 ED C7 34 08 36 98 17 FE 4E 26
       data hash MD5: 16K
       BE AB 1C BF 9C 13 07 A1 48 0D C5 71 6E 44 B1 46>)
(   2,<2023-09-01 14:12:54.25 +0400>,<she>,<DPX200>,
      <Start of raw data processing
       efp BC_mod = 2 LB = 0.24 FT_mod = 6 PKNL = 1 PHC0 = -21053.84 PHC1 = 13.05272 SI = 16K 
       data hash MD5: 16K
       31 81 2F 6F C7 A1 1C 88 09 A6 0F CE C1 91 80 03>)
(   3,<2023-09-01 14:13:09.54 +0400>,<she>,<DPX200>,
      <pk PHC0 = 12.09702 PHC1 = -15.4 
       data hash MD5: 16K
       F4 DB B5 04 01 D4 1A 53 11 E0 6A 5F 69 EF 8F EF>)
(   4,<2023-09-01 14:13:13.00 +0400>,<she>,<DPX200>,
      <abs ABSG = 5 
       data hash MD5: 16K
       02 F7 4C CA 9A 7F B1 04 BD 59 E3 70 19 12 C5 49>)
(   5,<2023-09-01 14:13:27.35 +0400>,<she>,<DPX200>,
      <pk PHC0 = -2.364227 PHC1 = 6.2 
       data hash MD5: 16K
       A9 D7 BB F5 6A E9 4C 8A A9 E3 98 C9 9F 48 26 77>)
(   6,<2023-09-01 14:13:31.25 +0400>,<she>,<DPX200>,
      <abs ABSG = 5 
       data hash MD5: 16K
       D0 1E FA 27 2E A8 1C 57 DC 6E E8 46 51 E8 D5 88>)
$$ ##END=
$$ 
$$ hash MD5
$$ 7F DE 97 FF 16 29 73 5E A6 F9 67 E4 C6 EA A2 C6
##$RELAX= 
##$RELAX= 
##$RELAX= 
##$RELAX= 
##$RELAX= 
##$RELAX= 
$$ Bruker specific parameters
$$ --------------------------
##$DU= <F:/spectra>
##$EXPNO= 1
##$NAME= <H-F>
##$PROCNO= 1
##$TYPE= <nmr>
##$USER= <she>
##$AMP= (0..31)
100 100 100 100 100 100 100 100 100 100 100 100 100 100 100 100 100 100 
100 100 100 100 100 100 100 100 100 100 100 100 100 100 
##$AQSEQ= 0
##$AQ_mod= 1
##$AUNM= <au_zg>
##$AUTOPOS= <>
##$BF1= 200.13
##$BF2= 200.13
##$BF3= 200.13
##$BF4= 200.13
##$BF5= 200.13
##$BF6= 200.13
##$BF7= 200.13
##$BF8= 200.13
##$BYTORDA= 1
##$CFDGTYP= 0
##$CFRGTYP= 5
##$CHEMSTR= <none>
##$CNST= (0..31)
1 1 145 1 1 1 1 1 1 1 1 1 1 1 1 1 1 1 1 1 1 1 1 1 1 1 1 1 1 1 1 1 
##$CPDPRG= <>
##$CPDPRG1= <>
##$CPDPRG2= <>
##$CPDPRG3= <>
##$CPDPRG4= <mlev>
##$CPDPRG5= <mlev>
##$CPDPRG6= <mlev>
##$CPDPRG7= <mlev>
##$CPDPRG8= <mlev>
$$ [...]
##$SUBNAM3= <"">
##$SUBNAM4= <"">
##$SUBNAM5= <"">
##$SUBNAM6= <"">
##$SUBNAM7= <"">
##$SUBNAM8= <"">
##$SUBNAM9= <"">
##$SW= 18.05172834244
##$SWIBOX= (0..15)
0 0 2 0 0 0 0 0 0 0 0 0 0 0 0 0 
##$SW_h= 3612.71676300578
##$TD= 16384
##$TD0= 1
##$TE= 0
##$TE2= 300
##$TE3= 300
##$TEG= 300
##$TL= (0..7)
0 120 120 120 120 120 120 120 
##$TP= (0..7)
150 150 150 150 150 150 150 150 
##$TP07= 0
##$TPNAME0= <>
##$TPNAME1= <>
##$TPNAME2= <>
##$TPNAME3= <>
##$TPNAME4= <>
##$TPNAME5= <>
##$TPNAME6= <>
##$TPNAME7= <>
##$TPOAL= (0..7)
0.5 0.5 0.5 0.5 0.5 0.5 0.5 0.5 
##$TPOFFS= (0..7)
0 0 0 0 0 0 0 0 
##$TUNHIN= 0
##$TUNHOUT= 0
##$TUNXOUT= 0
##$USERA1= <user>
##$USERA2= <user>
##$USERA3= <user>
##$USERA4= <user>
##$USERA5= <user>
##$V9= 5
##$VALIST= <valist>
##$VCLIST= <CCCCCCCCCCCCCCC>
##$VD= 0
##$VDLIST= <DDDDDDDDDDDDDDD>
##$VPLIST= <PPPPPPPPPPPPPPP>
##$VTLIST= <TTTTTTTTTTTTTTT>
##$WBST= 1024
##$WBSW= 4
##$XGAIN= (0..3)
0 0 0 0 
##$XL= 0
##$YL= 0
##$YMAX_a= 109241
##$YMIN_a= -141312
##$ZGOPTNS= <>
##$ZL1= 120
##$ZL2= 120
##$ZL3= 120
##$ZL4= 120
##$ABSF1= 15.72485
##$ABSF2= -2.327
##$ABSG= 5
##$ABSL= 3
##$ALPHA= 0
##$AQORDER= 0
##$ASSFAC= 0
##$ASSFACI= 0
##$ASSFACX= 0
##$ASSWID= 0
##$AUNMP= <proc_1d>
##$AZFE= 0.1
##$AZFW= 0.1
##$BCFW= 0
##$BC_mod= 2
##$BYTORDP= 0
##$COROFFS= 0
##$CY= -3
##$DATMOD= 1
##$DC= 0
##$DFILT= <>
##$DTYPP= 0
##$F1P= 0
##$F2P= 0
##$FCOR= 1
##$FTSIZE= 16384
##$FT_mod= 6
##$GAMMA= 0
##$GB= 0
##$INTBC= 1
##$INTSCL= 3.70164e-10
##$ISEN= 128
##$LB= 0.24
##$LEV0= 0
##$LPBIN= 0
##$MAXI= 10000
##$MC2= 0
##$MEAN= 0
##$ME_mod= 0
##$MI= 1.114404
##$NCOEF= 0
##$NC_proc= -8
##$NLEV= 6
##$NOISF1= 3.799351
##$NOISF2= 2.8
##$NSP= 0
##$NTH_PI= 0
##$NZP= 0
##$OFFSET= 15.71273
##$PC= 1
##$PHC0= -21044.1
##$PHC1= 3.85272
##$PH_mod= 1
##$PKNL= yes
##$PPARMOD= 0
##$PSCAL= 0
##$PSIGN= 0
##$REVERSE= no
##$SF= 200.130011768305
##$SI= 16384
##$SIGF1= 3
##$SIGF2= 2
##$SINO= 5.538805
##$SIOLD= 16384
##$SREGLST= <1H.CDCl3>
##$SSB= 0
##$STSI= 16384
##$STSR= 0
##$SW_p= 3612.71676300578
##$SYMM= 0
##$S_DEV= 0
##$TDeff= 16384
##$TDoff= 0
##$TI= <>
##$TILT= no
##$TM1= 0
##$TM2= 0
##$TOPLEV= 0
##$USERP1= <user>
##$USERP2= <user>
##$USERP3= <user>
##$USERP4= <user>
##$USERP5= <user>
##$WDW= 1
##$XDIM= 16384
##$YMAX_p= 411188579
##$YMIN_p= -1438336
$$ End of Bruker specific parameters
$$ ---------------------------------
##NTUPLES= NMR SPECTRUM
##VAR_NAME=  FREQUENCY,     SPECTRUM/REAL,   SPECTRUM/IMAG
##SYMBOL=    X,             R,               I
##VAR_TYPE=  INDEPENDENT,   DEPENDENT,       DEPENDENT
##VAR_FORM=  AFFN,          ASDF,            ASDF
##VAR_DIM=   16384,         16384,           16384
##UNITS=     HZ,            ARBITRARY UNITS, ARBITRARY UNITS
##FACTOR=    0.220516191357247, 1,           1
##FIRST=     3144.58892140818, 0,            0
##LAST=      -468.127841597605, 0,           0
##MIN=       -468.127841597605, -1438336,    0
##MAX=       3144.58892140818, 411188579,    0
$$ Real data points
##PAGE= N=1
##DATA TABLE= (X++(R..R)), XYDATA
$$ [...]
7204a41398L80866K09621K78239o02242J91958J64471j67187j30781r7672k93476
$$ -141398 239468 449089 727328 125086 317044 481515 314328 183547 85875 -207601
7194b07601L5812m4290O1006J11154r1711m7550J58415K70159n3642j62485j22270
$$ -207601 -171789 -216079 -155073 -43919 -135630 -183180 -24765 245394 191752 29267 -93003
7183i3003K36515k02038o0859j0285K4517m7111J40081P9301M0865j33304j73885
$$ -93003 143512 -58526 -119385 -129670 -105153 -152264 -12183 67118 107983 -25321 -199206
7172a99206r9279L44227R3216n2891m42869J53728L781l86019K46142J752M9613
$$ -199206 -298485 45742 138958 86067 -356802 -203074 -199293 -585312 -339170 -337418 -287805
7161b87805R5039j56136R375k7945J22129K76201j01649K42399K28421l95980
$$ -287805 -192766 -348902 -339527 -367472 -245343 30858 -70791 171608 400029 4049
7151D049k44181L60515P2859j08352J2660j19714j91502k23360L6263n2849Q9764
$$ 4049 -240132 120383 193242 84890 97550 -22164 -213666 -437026 -400763 -453612 -363848
7140c63848K06853M0852j03867Q8103J60757j66547k40674L43525j42806j05749
$$ -363848 -156995 -116143 -220010 -131907 28850 -137697 -378371 -34846 -177652 -283401
7130b83401j55783r8522L16382Q1236j31607q7604k85164J32215L34979p0878
$$ -283401 -439184 -537706 -221324 -140088 -271695 -359299 -644463 -512248 -177269 -248147
7120b48147J99546m82862m4736m750J81216q0965L57827K44898j99218l27446
$$ -248147 -48601 -531463 -576199 -580949 -399733 -480698 -122871 122027 -77191 -404637
7110d04637K7296p2541o6779m48834L63715K22645k42046K17597K11422L09773
$$ -404637 -377341 -449882 -516661 -965495 -601780 -379135 -621181 -403584 -192162 117611
7100A17611l74035k2100J74832N23755j84288O4111q2126l66309n1776r8088O8824
$$ 117611 -256424 -278524 -103692 420063 235775 299886 217760 -148549 -200325 -298413 -229589
7089b29589J42498p0864j90179K52293O6157L34554Q7645j13707k05056l45572
$$ -229589 -87091 -157955 -348134 -95841 -29684 304870 392515 278808 73752 -271820
7079b71820K79800Q9968j14443j94846k44281J93322N7247L02801l8571J96184
$$ -271820 7980 97948 -16495 -211341 -455622 -262300 -205053 97748 59177 255361
7069B55361o5500k49705K38329L8430m2001k89070J48037L5875k15766m3116K17337
$$ 255361 189861 -59844 178485 216915 174914 -114156 33881 69756 -146010 -189126 28211
7058B8211Q8358j43885q6298Q1503L8856j95826L05102r0327j63624l03680K33249
$$ 28211 116569 -27316 -113614 -32111 6745 -189081 116021 25694 -137930 -441610 -208361
7047b08361L64282n43423P8488R8855J02309j09885m888L55575j30749J62267
$$ -208361 155921 -387502 -309014 -210159 -107850 -217735 -222623 132952 2203 164470
7037A64470q6921k06164k08621j06216Q9236j42329M05791O8382k12520P8176
$$ 164470 77549 -128615 -337236 -443452 -354216 -496545 -90754 -22372 -234892 -156716
7027a56716K65924k12313o6743J1629J20840M9750N6389m2645k35301j26211k09620
$$ -156716 109208 -103105 -169848 -158219 -37379 12371 68760 26115 -209186 -335397 -545017
7016e45017L05066l30454k6166M05388K05363l75719j93336K52324l7194k4342
$$ -545017 -239951 -570405 -596571 -191183 14180 -361539 -554875 -302551 -339745 -364087
7006c64087K45507O2363k92775j88784l0311J33848K09384m15737M15367J44403
$$ -364087 -118580 -56217 -348992 -537776 -568087 -434239 -224855 -640592 -225225 -80822
6996h0822l2661J27067p9221k92993j23141L32768k73080k01954L88456Q372p0166
$$ -80822 -113483 13584 -65637 -358630 -481771 -149003 -422083 -624037 -235581 -227209 -297375
6985b97375k12521l7158M13502j29381j5971k18375P8960N2139n9852j80044M99890
$$ -297375 -509896 -547054 -133552 -262933 -278904 -497279 -418319 -366180 -426032 -606076 -106186
6974a06186K30527k5523L35579j15620m06975l02127p8478k9326L83449J36526
$$ -106186 124341 98818 434397 318777 -88198 -390325 -468803 -498129 -114680 21846
6964B1846k83303J70729J40800L415k17253J58308k02543K04896L88999j73923
$$ 21846 -261457 -90728 50072 53487 -163766 -5458 -208001 -3105 385894 211971
6954B11971k01806j01077J20747l7612m56044l61890K77146O03402L0239j04056
$$ 211971 10165 -90912 29835 -7777 -463821 -825711 -548565 54837 85076 -18980
6944a8980m6178K23200j16102j73931K23532j42987k28428J81019J22043r1330
$$ -18980 -65158 158042 41940 -131991 91541 -51446 -279874 -98855 23188 -68142
6934f8142o9856J94127K52731l71097O8361l22194j40719L46312L6275j91988
$$ -68142 -137998 56129 308860 -62237 6124 -316070 -456789 -110477 -74202 -266190
6924b66190n71523N29081Q0647K56747q9182l59678M41347j73400l7596K57637
$$ -266190 -837713 -308632 -227985 28762 -60420 -420098 21249 -152151 -189747 67890
6914F7890M7831j51471Q2102L46719K2444k53684J84212l33340n3911J65425j13447
$$ 67890 115721 -35750 46352 393071 415515 161831 346043 12703 -41208 124217 10770
6903A0770M15484J06098K0513k16035l35892l63356j352M76455j67987Q8274K07881
$$ 10770 426254 532352 552865 336830 938 -362418 -363770 112685 -55302 32972 240853
6892B40853k12335j1903J68404l09107n521M66034K40754J34802M9513l14690
$$ 240853 28518 16615 185019 -124088 -129609 336425 577179 711981 761494 446804
6882D46804k23850j36418j93987J78817m3500q111l9711O7654J7854P6782o3335
$$ 446804 222954 86536 -107451 71366 27866 19755 -19956 47698 65552 142334 78999
6871G8999L75537l56570l37171N59660n0140J68085N5372l69446m11368K40842
$$ 78999 454536 97966 -239205 320455 270315 438400 493772 124326 -287042 -46200
6861d6200k13606k09859r2477K93537L94044J61082j59230k52746J82962M13137
$$ -46200 -259806 -469665 -562142 -268605 125439 286521 127291 -125455 57507 470644
6851D70644k63920l61273k82738K67721L77236k64955j33359K36925L60518Q6707
$$ 470644 206724 -154549 -437287 -169566 207670 -57285 -190644 46281 406799 493506
6841D93506j54606n3246k52050m8968K27132L4436k14607K2717p240J73827k56745
$$ 493506 338900 285654 33604 -15364 211768 246204 31597 54314 47074 220901 -35844
6830c5844j27299J55444k6176L02124J3350J72742J2648k80579J30125M2506J4839
$$ -35844 -163143 -7699 -33875 268249 281599 454341 466989 186410 316535 359041 373880
6819C73880K54504k53481K6640P7515q1169o0867k49591L39410k25279k65827
$$ 373880 628384 374903 401543 479058 397889 337022 87431 426841 201562 -64265
6809f4265P0811l32463j91995L16796M45330p8597j82022j45630j68906R810L47429
$$ -64265 6546 -325917 -517912 -201116 244214 165617 -16405 -162035 -330941 -321131 26298
6798B6298p7757j63497M7177m8873K88251J32343k3445l47512P6139L47903K56562
$$ 26298 -51459 -214956 -167779 -216652 71599 203942 180497 -167015 -90876 257027 513589
6787E13589l4894j88395N258j88441l19818j87364M69158k4263l13032j09367
$$ 513589 478695 290300 295558 107117 -212701 -400065 69093 44830 -268202 -377569
6777c77569N65793L19043l83251Q645l08379m9187M14943k58939r7702L40544
$$ -377569 188224 507267 124016 132661 -175718 -224905 190038 -68901 -166603 173941
6767A73941k32635K92722q1666j38308j45175l34807O01457p3881k69952L06509
$$ 173941 -58694 234028 152362 14054 -131121 -465928 135529 61648 -208304 98205
6757I8205j53707k51976N65348j21244J92822K26250k62090O7860r4504j55683
$$ 98205 -55502 -307478 257870 136626 329448 555698 293608 361468 266964 111281
6747A11281k55401j45995M24268q7089k5275J52034L6101m32786j59260n2197
$$ 111281 -144120 -290115 134153 47064 21789 173823 209924 -222862 -382122 -434319
6737d34319K68598L6689J86151O7432l00060k22655j50242J86103K71248k38066
$$ -434319 -165721 -129032 57119 124551 -175509 -398164 -548406 -362303 -91055 -329121
6727c29121K81888j68926L46313P3945o6487k78822q0493K4126o8417o4521j66155
$$ -329121 -47233 -216159 130154 204099 137612 -141210 -221703 -197577 -265994 -330515 -496670
6716d96670j51863j82445N12481J69044R7726L75908m95016k01732K3580l68270
$$ -496670 -648533 -830978 -318497 -149453 -51727 324181 -170835 -372567 -348987 -717257
6706g17257M30415R2032K98580L12p0290j04492M96694m39821j06719j80522l1317
$$ -717257 -286842 -194810 103770 104082 33792 -70700 425994 -13827 -120546 -301068 -332385
6695c32385J20113j46699J54754j27536j70441o4101L950K37860p7546J23841
$$ -332385 -212272 -358971 -204217 -331753 -502194 -566295 -562345 -324485 -402031 -278190
6685b78190J70501q2703P5281K95803m46745K56054J84091l26819j68423L69663
$$ -278190 -107689 -190392 -115111 180692 -266053 -9999 174092 -152727 -321150 48513
6675D8513K51001j72087j95074j08624o1797o4145K41521k44933p866O1099j89880
$$ 48513 299514 127427 -67647 -176271 -238068 -302213 -60692 -305625 -313491 -252392 -442272
6664d42272K2859m67768N33118J75948j92253L9059J0760J01824q3096r5821j27538
$$ -442272 -419413 -887181 -354063 -178115 -370368 -331309 -320549 -218725 -301821 -397642 -525180
6653e25180L96927j92372k56065j18500K25941N0649P751L4656L2416J7464K63631
$$ -525180 -128253 -320625 -576690 -695190 -469249 -418600 -410849 -376193 -343777 -326313 -62682
6642f2682k8736J09081k50010P9809L03402j9894n678o8451M0993j77057R5403
$$ -62682 -91418 17663 -232347 -152538 150864 130970 125292 56841 97834 -79223 16180
6631A6180j78045k20341O1096p9721O7676J15936L49027J00724k29508L48224
$$ 16180 -161865 -382206 -321110 -400831 -333155 -217219 131808 232532 3024 351248
6621C51248n5304j63717K76545m98863k75478K50034J55394J847q4984K61731
$$ 351248 295944 132227 408772 -90091 -365569 -115535 39859 41706 -43278 218453
6611B18453O7410Q5810K76692k14942n52096J57288K31295r8650j16778j99285
$$ 218453 285863 371673 648365 433423 -118673 38615 269910 171260 54482 -144803
6601a44803l14892J40720M20052p7350j37751j93438J79133K81573l50191M9428
$$ -144803 -459695 -318975 101077 23727 -114024 -307462 -128329 153244 -196947 -147519
6591a47519j98726J77620J21417j59786K1509o0121R1041O8797j10925m02238
$$ -147519 -346245 -168625 -47208 -206994 -185485 -245606 -154565 -85768 -196693 -598931
6581e98931L51338r4367k93503L35211j05355M21210Q6199k8162K97535k14853
$$ -598931 -247593 -341960 -635463 -300252 -405607 15603 101802 73640 371175 156322
6571A56322j8486k53307J35522q5966j66815K11226j49834o3175Q6513K57257
$$ 156322 137836 -115471 20051 -65915 -232730 -21504 -171338 -234513 -148000 109257
6561A09257o0568j48884J7868Q5098j13174j08376J85280j19072j3853J62492
$$ 109257 48689 -100195 -82327 2771 -110403 -218779 -33499 -152571 -166424 -3932
6551c932J73210Q9428q9503J10031k30131m17000L29425J37391m0544k19197J45493
$$ -3932 169278 258706 169203 279234 49103 -367897 -38472 98919 58375 -160822 -15329
6540a5329P4527N51726l16738O949j20463k84625O8472l8229N72567k2649N0345
$$ -15329 59198 610924 294186 301135 180672 -103953 -35481 -73710 498857 476208 526553
6529E26553j16112m10804M9278k66589j27669k88206L01368N51941j50738J43778
$$ 526553 410441 -363 48915 -217674 -345343 -633549 -332181 219760 69022 212800
6519B12800r2187l49748M403N1020K70360K61813L3004J3600k83647m72298K76592
$$ 212800 120613 -229135 -224732 -173712 96648 358461 391465 405065 121418 -350880 -74288
6508g4288J35868k85411Q5571m18930K72253P1835P8175r7066j21009L27452K40427
$$ -74288 61580 -223831 -138260 -557190 -284937 -213102 -134927 -231993 -353002 -25550 214877
6497B14877j27168m4303J40111j80151L69561J23667m62282r4015M11162L05240
$$ 214877 87709 43406 183517 3366 372927 496594 34312 -59703 351459 656699
6487F56699k97809m51233l14553K13033J99610J25303l22235k614L22460k53530
$$ 656699 358890 -92343 -406896 -193863 5747 131050 -191185 -193799 128661 -124869
6477a24869j10434j23285J85079K80716k10756J90766m4775P7421J29721l83873
$$ -124869 -235303 -358588 -173509 107207 -103549 87217 42442 119863 249584 -134289
6467a34289k3360K14616J85108K1374k40835k59693l28851K2917J77449N61135
$$ -134289 -157649 56967 242075 263449 22614 -237079 -565930 -543013 -365564 195571
6457A95571O4981n59229j68693K92797j0345K11646m54798K2696J96562M5509
$$ 195571 260552 -298677 -467370 -174573 -184918 26728 -428070 -405374 -208812 -163303
6447a63303M82869j53354l08437p0796Q9035L27009J286j52457j66815o8262K03159
$$ -163303 319566 166212 -142225 -213021 -123986 203023 204309 51852 -114963 -183225 19934
6436A9934q3903K97060N2733n07768J37382M08123l87140j56494K45871o2845
$$ 19934 -63969 233091 285824 -221944 -84562 323561 -63579 -220073 25798 -37047
6426c7047l7226k3046l7477n6165l7897L4993J74564J85199l35399N6805j33133
$$ -37047 -74273 -97319 -134796 -190961 -228858 -193865 -19301 165898 -169501 -112696 -245829
6415b45829K03393M16435l42401n02059M81886K02542j99733q5889K70938n5834
$$ -245829 -42436 373999 31598 -470461 11425 213967 14234 -71655 199283 143449
6405A43449j08434p015K96819O8907p52400j33260K02818O5449J78132R9837J00640
$$ 143449 35015 28000 324819 393726 -358674 -491934 -289116 -223667 -45535 54302 154942
6394A54942M18568l4902k15910L31535r8374k79322K5621j06915j2890L6521l4626
$$ 154942 573510 538608 322698 654233 555859 276537 302158 195243 182353 218874 184248
6383A84248L8846j88460k06661L22493J6778n3813R4718k58851k0823L40185l07780
$$ 184248 223094 34634 -172027 150466 167244 113431 208149 -50702 -71525 268660 -39120
6372c9120k30016K17757k79889Q341K47118n45k54915Q5753N62913l92716l67442
$$ -39120 -269136 -51379 -331268 -322927 -75809 -76354 -331269 -245516 317397 -75319 -442761
6361d42761K65846p3347L31726o1063l5995J31883k07909j0558N19698n3623n23261
$$ -442761 -176915 -250262 81464 20401 -15594 116289 -91620 -102178 417520 363897 -159364
6350a59364M8604k29138k5611L40384J72159j24231j28386o3252j70220J89251
$$ -159364 -110760 -339898 -365509 -25125 147034 22803 -105583 -168835 -339055 -149804
6340a49804K42418M02649j94524l35454P5572K15246m59124k58135K91598k3764
$$ -149804 92614 495263 300739 -34715 40857 256103 -203021 -461156 -169558 -193322
6330a93322J73275r6469J97853j50382j48839Q5833J11724j87797j6065L38791
$$ -193322 -20047 -116516 81337 -69045 -217884 -132051 -20327 -208124 -224189 114602
6320A14602K01523j10969k6127K4713l25241O6905J52603J20147j47869k17705
$$ 114602 316125 205156 179029 203742 -121499 -54594 98009 218156 70287 -147418
6310a47418R3673J26344K25100J22823q0553m08791k19486N2200K23284M5177
$$ -147418 -53745 72599 297699 420522 339969 -68822 -288308 -236108 -12824 32353
6300C2353l58510K6019J99898P8454K46880n42092K02034J47662j63969K88121
$$ 32353 -326157 -300138 -100240 -21786 225094 -316998 -114964 32698 -131271 156850
6290A56850R106N9068n5281j29816j98876O7278L48634L27994p8293o7656k21251
$$ 156850 165956 225024 169743 39927 -158949 -91671 256963 584957 506664 439008 217757
6279B17757j10890K38443k6109K27186n3032l84474l28078K43167J35351P3323
$$ 217757 106867 345310 319201 546387 493355 108881 -219197 23970 159321 232644
6269B32644k54704k73898L17321K61518K88403j6871k96821j78284K22858k95580
$$ 232644 -22060 -295958 21363 282881 571284 554413 257592 79308 302166 6586
6259F586J59091M45017l18282k17855K33381k50960l24656r5295J78666j6215
$$ 6586 165677 610694 292412 74557 307938 56978 -267678 -362973 -184307 -200522
6249b00522j9154m4190L35326J04980q0573J51753K02571K27326k74383l97325
$$ -200522 -219676 -263866 71460 176440 95867 247620 450191 677517 403134 5809
6239E809L87134J71633k03067L2725k39837j56358k17804K31025J8949K95251
$$ 5809 392943 564576 361509 394234 154397 -1961 -219765 11260 30209 325460
6229C25460k82718K03253L30077j15909J00238j48329J10670J64323o33536l36436
$$ 325460 42742 245995 576072 460163 560401 412072 522742 687065 53529 -282907
6219b82907J72201L97021J08416J23308m11888O4970K85870j93380q1500K3001
$$ -282907 -110706 286315 394731 518039 106151 171121 456991 263611 182111 205112
6209B05112m22387K62721N21471J05727M2567k55525K10992m54301j13909L22456
$$ 205112 -217275 45446 566917 672644 715211 459686 670678 216377 102468 424924
6199D24924k25541j20430L75547k65549J52537p3839j77094n6123q0878K6718
$$ 424924 199383 78953 454500 188951 341488 267649 90555 34432 -46446 -19728
6189a9728K94345l7955k20189Q4916J76039p5898j63184q1429J36938J81517J13109
$$ -19728 274617 236662 16473 101389 277428 201530 38346 -43083 93855 275372 388481
6178C88481l20796O3360M2801k02955K67281J95854O3184k33628O8017K08817
$$ 388481 67685 131045 173846 -29109 238172 434026 497210 263582 331599 540416
6168E40416j90474J66483m4873K51390j54269k3512k78463l41656R3549N70815
$$ 540416 349942 516425 471552 722942 568673 545161 266698 -74958 18591 589406
6158E89406p6459k96418r3064J74168J90469L74372k06382n14253K17000J92177
$$ 589406 512947 216529 123465 297633 488102 862474 656092 141839 358839 551016
6148E51016r9714k51717l1230O02732J48296m40331Q9621l76097J31594k62218
$$ 551016 451302 199585 168355 771087 919383 479052 568673 192576 324170 61952
6138F1952J06750L65361L9596N2506k46879k07778q016K0427J59611J74323M3595
$$ 61952 168702 534063 573659 626165 379286 171508 163492 183919 343530 517853 561448
6127E61448j18254j50289l25868P07711r1570n12934j26893L32656K07583o4057
$$ 561448 443194 292905 -32963 674748 583178 70244 -56649 276007 483590 419533
6117D19533K04653j6287l61773P8718N0554K3419O3497J30231j60940J90974k96451
$$ 419533 624186 607899 246126 324844 375398 398817 462314 592545 431605 622579 326128
6106C26128j04693K81615l36222o1238L42287J1230j07597L40162j64305j45923
$$ 326128 221435 503050 166828 105590 447877 459107 351510 691672 527367 381444
6096C81444l22421J30896J37594K18743j28254J81292J07514P6925J64826j02775
$$ 381444 59023 189919 327513 546256 418002 599294 706808 783733 948559 845784
6086H45784r06j22639K09821r6886K78935p4914n11710p6935L7388O9111j24828
$$ 845784 844878 722239 932060 835174 1114109 1039195 527485 450550 487938 557049 432221
6075D32221n7831j80089j73434J47920j27743k89962L21473J65765K89676J64247
$$ 432221 374390 194301 20867 168787 41044 -248918 72555 238320 527996 692243
6065F92243l83196k66071m323K39257j63863Q2391K05161K90268p2019l20876
$$ 692243 309047 42976 38653 277910 114047 196438 401599 691867 619848 298972
6055B98972j05329L37070k10001j1858J14995l774m49835l6839K60888k1744J75930
$$ 298972 193643 530713 320712 308854 423849 420075 -29760 -66599 194289 172545 348475
6044C48475q9289r9222K84866j40591j63422L1456j98779K63100K18774J43261
$$ 348475 259186 159964 444830 304239 140817 172273 -26506 236594 455368 598629
6034E98629j83321m308Q7381J29914K02777n85527m7557K83179L5108j08808l9836
$$ 598629 415308 411000 498381 628295 831072 245545 197988 481167 516275 407467 367631
6023C67631k09428k2167j67679j84336L47990j76559M81742j03199M8134J42256
$$ 367631 158203 136036 -31643 -215979 132011 -44548 437194 333995 382129 524385
6013E24385J86459L44510m8902j56152j91860m01371K90463k14552L18834K50971
$$ 524385 710844 1055354 1006452 850300 658440 257069 547532 332980 651814 902785
6003I02785k39571j48234o610K9213K28781n8788k87595O3530K58743M2108j38760
$$ 902785 663214 514980 508370 537583 766364 707576 419981 483511 742254 784362 645602
5992F45602K76833J56847k59137k63215j28684J70800K4427m53168n09713M46067
$$ 645602 922435 1079282 820145 556930 428246 599046 623473 170305 -339408 106659
5982A06659J16092O2121M0421k53761j50640J78235j82548J51088N83699M19213
$$ 106659 222751 284872 325293 71532 -79108 99127 -83421 67667 651366 1070579
5972A070579l94074J16991M96396j20469N706k89833j32351L7746K16277j52868
$$ 1070579 676505 793496 1289892 1169423 1175129 885296 752945 790691 1006968 854100
5962H54100j65949j03415K04608k7595K00006k30081K07474l65056O9497J25133
$$ 854100 688151 584736 789344 761749 961755 731674 939148 574092 643589 768722
5952G68722Q4981p2539k08960k2305k45085p1771K62752n82726j08021M11046
$$ 768722 853703 781164 572204 549899 304814 233043 495795 -86931 -194952 216094
5942B16094K28407k89893J24783N93758K49965k80422n85685N74533j40552J28729
$$ 216094 444501 154608 279391 873149 1123114 842692 257007 831540 690988 819717
5932H19717N7801p2882k90077j25387j53918K33671J64968j36182M90048j19510
$$ 819717 877518 804636 514559 389172 235254 468925 633893 497711 987759 868249
5922H68249l65036M36804j58742j15304r0386j38119O7732j78019K52466k75887
$$ 868249 503213 940017 781275 665971 575585 437466 505198 327179 579645 303758
5912C03758K28648K29821L13146m81317k04663K75660l2270k62957J50347P5254
$$ 303758 532406 762227 1075373 594056 389393 665053 632783 369826 520173 595427
5902E95427J93709N2869j09325J75889j92081k1106K24205k95120n74K17229n35203
$$ 595427 789136 842005 732680 908569 716488 695382 919587 624467 623893 841122 305919
5891C05919P00K83349J35055L63978j91616j20333j61359o2134R0812l35606j30183
$$ 305919 306619 589968 725023 1089001 897385 777052 615693 553559 644371 308765 178582
5880A78582N9711L9029K75769K14146n7744m580j095m33932J26014N93225j50771
$$ 178582 238293 277322 553091 767237 709493 704913 703818 269886 395900 989125 838354
5869H38354r4573J55748K2643j60037J73106m51761J94032K06205M99854k23908
$$ 838354 743781 899529 922172 762135 935241 483480 677512 883717 1383571 1159663
5859A159663l33665p8351J39421K3481J0812o617Q6119l07260l00369K41699K8533
$$ 1159663 825998 747647 887068 910549 921361 914744 1000863 693603 393234 634933 663466
5848F63466J49353M8688P06431j32377l81835k81061K67962r2501L9535R3126
$$ 663466 812819 861507 1567938 1435561 1053726 772665 1040627 948126 987661 1080787
5838A080787O3652N7747j34726J24333j06083j10747J19644Q368o4305K7934M18903
$$ 1080787 1144439 1202186 1067460 1191793 1085710 974963 1094607 1102975 1038670 1066604 1485507
5827A485507l0328m39483J01906P1611J46664J81049J9973j01268K34130o18646
$$ 1485507 1455179 1015696 1117602 1189213 1335877 1516926 1536899 1435631 1669761 1051115
5817A051115j03710K93686L45108J03857k61478q8302L22046M46803l19825j23748
$$ 1051115 947405 1241091 1586199 1690056 1428578 1340276 1662322 2109125 1789300 1665552
5807A665552L7900J33663j89193l57790J11016L70850k52551k23586p7824J26616
$$ 1665552 1703452 1837115 1647922 1290132 1401148 1771998 1519447 1295861 1218037 1344653
5797A344653L74171m2272J25494L98107J76095K00527o55912n50407J47695M74852
$$ 1344653 1718824 1676552 1802046 2200153 2376248 2576775 1920863 1370456 1518151 1993003
5787A993003m431r2905J09323K77297J2111k48462R9211k24477K24656N09171
$$ 1993003 1988572 1895667 2004990 2282287 2294398 2045936 2145147 1920670 2145326 2654497
5777B654497m9095M2060j3383j81581r1446J53261J61111k54708O9518Q8750K33835
$$ 2654497 2605402 2647462 2634079 2452498 2361052 2514313 2675424 2420716 2490234 2578984 2812819
5766B812819l94478J05193K04005L3550j78328j55826j74468M4592j6722J35416
$$ 2812819 2418341 2523534 2727539 2761089 2582761 2426935 2252467 2297059 2280337 2415753
5756B415753j2854j0458J70884J27827L4963J01152j2084l94817k6200J4257n36238
$$ 2415753 2402899 2392441 2563325 2691152 2726115 2827267 2815183 2420366 2394166 2408423 1872185
5745A872185l921Q9418m0739K94780q8117k27934K4897K25614N69221o3587k56913
$$ 1872185 1868264 1957682 1916943 2211723 2123606 1895672 1920569 2146183 2715404 2651817 2394904
5734B394904Q818K45574K6072j12363l24952l47725K57745Q4451N381j54273K51007
$$ 2394904 2403722 2649296 2675368 2563005 2238053 1890328 2148073 2232524 2237905 2083632 2334639
5723B334639P1227j46655l99537R6478J83879l0787m035K0746K71182r2696R1901
$$ 2334639 2405866 2259211 1859674 1956152 2140031 2109244 2105209 2125955 2397137 2304441 2396342
5712B396342J95986J94664n46208l59977K75018N9721J72584M1809j09473j09197
$$ 2396342 2592328 2786992 2240784 1880807 2155825 2215546 2388130 2429939 2320466 2211269
5702B211269j2654k5822p5326k38255N8172K76541L59950j24208J27094N0068
$$ 2211269 2198615 2172793 2097467 1859212 1917384 2193925 2553875 2429667 2556761 2606829
5692B606829K6113K31275j65038n38852K11470L22056L9396m55508J26292M76080
$$ 2606829 2632942 2864217 2699179 2160327 2371797 2693853 2733249 2277741 2404033 2880113
5682B880113J31465k23194J4511J03347N548J79738M44722n2000l63618J4837
$$ 2880113 3011578 2788384 2802895 2906242 2911790 3091528 3536250 3484250 3120632 3135469
5672C135469J63630l95829k83144L39868L57509m39243J55949k22990J14274K53425
$$ 3135469 3299099 2903270 2620126 2959994 3317503 2878260 3034209 2811219 2925493 3178918
5662C178918J33218k21139J45407K96906k63647J77277j65662J96628K86427j43882
$$ 3178918 3312136 3090997 3236404 3533310 3269663 3446940 3281278 3477906 3764333 3620451
5652C620451m4370K04491l6570R5263j2580J96415p3089l5657m16633j08773M7306
$$ 3620451 3576081 3780572 3744002 3839265 3826685 4023100 3950011 3914354 3497721 3388948 3436254
5641C436254j21359r4294j8936K86214J31511J64872M98164j24900l59895m6454
$$ 3436254 3314895 3220601 3201665 3487879 3619390 3784262 4282426 4157526 3797631 3751177
5631C751177K63392K34515l61449K15775j9986l16176j7104M08639k2475O2219
$$ 3751177 4014569 4249084 3887635 4103410 4083424 3767248 3750144 4158783 4136308 4198527
5621D198527O41894j73279N8491L86610J8775j1545l4756m48840P49878j25568
$$ 4198527 4840421 4667142 4725633 5112243 5131018 5119473 5084717 4635877 5385755 5260187
5611E260187N0860K62749n17207k2723Q0719K44631J74701L7333K86902J97654
$$ 5260187 5311047 5573796 5056589 5033866 5114585 5359216 5533917 5571250 5858152 6055806
5601F055806k3804Q2524M10211k58307j43780P06222K20202l85678K26863J47453
$$ 6055806 6032002 6114526 6524737 6266430 6122650 6828872 7049074 6663396 6890259 7037712
5591G037712J74170k94678j02468M70273R4208R0512J49882n265o585K71125L37881
$$ 7037712 7211882 6917204 6814736 7285009 7379217 7469729 7619611 7614346 7607761 7878886 8216767
5580H216767K00111J46284k8834M11387J60464j33831k97418j42879P53673N19401
$$ 8216767 8416878 8563162 8534328 8945715 9106179 8972348 8674930 8532051 9285724 9805125
5570I805125o9467J30398J75710o7290K90068M04030J75928Q799K0553L78768
$$ 9805125 9735658 9866056 10041766 9974476 10264544 10668574 10844502 10853301 10873854 11252622
5560A1252622q4427L60072L93321Q3074J81959J67649J92066L57528O7963N54744
$$ 11252622 11168195 11528267 11921588 12004662 12186621 12354270 12546336 12903864 12971827 13526571
5550A3526571J43963M41305N46972J09123J69221l66466L73830N59533K53317
$$ 13526571 13670534 14111839 14658811 14767934 14937155 14570689 14944519 15504052 15757369
5541A5757369M05713L42925L98553J21793K91003N64427p9811K92218L55708L92488
$$ 15757369 16163082 16506007 16904560 17026353 17317356 17881783 17801972 18094190 18449898 18842386
5531A8842386O93848J38164J49128Q08097J07624N15902L55052M45713P16214
$$ 18842386 19536234 19674398 19823526 20631623 20739247 21255149 21610201 22055914 22772128
5522B2772128Q35624L56463L75088Q16590L32553O18036N69467Q76156J242948
$$ 22772128 23607752 23964215 24339303 25155893 25488446 26106482 26675949 27552105 28795053
5513B8795053R78246R81530P59867J453299R16154Q99082Q22311J417879J231425
$$ 28795053 29773299 30754829 31514696 32967995 33884149 34783231 35605542 37023421 38254846
5504C8254846J113304J190009J678017J213392Q08972J614180J589200J267958
$$ 38254846 39368150 40558159 42236176 43449568 44258540 45872720 47461920 48729878
5496D8729878J604822J126498K226341K288534K051680K259287K291811K630036
$$ 48729878 50334700 51461198 53687539 55976073 58027753 60287040 62578851 65208887
5488F5208887K419439L146926L633266L627457L798272M454186M574747M974548
$$ 65208887 67628326 70775252 74408518 78035975 81834247 86288433 90863180 95837728
5480I5837728N431622O006349O496115P369977P926674Q108717Q671737Q790408
$$ 95837728 101269350 107275699 113771814 121141791 129068465 137177182 145848919 154639327
5472A54639327Q922010R353317R226860Q847537P747247O926002O085723M673914
$$ 154639327 163561337 172914654 182141514 190989051 198736298 205662300 211748023 216421937
5464B16421937K649031L46347j763193l421828m879704p040836q500683r082499
$$ 216421937 219070968 219417315 217654122 214232294 209352590 202311754 193811071 184728572
5456A84728572j0006656j0768496j0442597j0569096j0549404r664483r086696
$$ 184728572 174721916 163953420 153510823 142941727 132392323 122727840 113641144
5449A13641144q278081p444864o997130o240311o031162n228828m745753m237639
$$ 113641144 105363063 97918199 90921069 84680758 78649596 73420768 68675015 64437376
5441F4437376l522874l574259k953418k809813k741138k551577k557222k217604
$$ 64437376 60914502 57340243 54386825 51577012 48835874 46284297 43727075 41509471
5433D1509471j885583k320724j748224j764181j258998j090165j530270j360138
$$ 41509471 39623888 37303164 35554940 33790759 32531761 31441596 29911326 28551188
5425B8551188j467213p49075n20759j080302r34353l79980q94661j142647p98084
$$ 28551188 27083975 26334900 25814141 24733839 23799486 23419506 22524845 21382198 20584114
5416B0584114r20143n62436p67336m64790K9772p7588o07351l19893n71154m72188
$$ 20584114 19663971 19101535 18334199 17869409 17899181 17821593 17214242 16894349 16323195 15851007
5406A5851007k07896k86956p53325l09201o43252n83695l19519r2542Q7998k06133
$$ 15851007 15643111 15356155 14602830 14293629 13650377 13066682 12747163 12654621 12742619 12536486
5396A2536486n13418m12696n18483p75305M3348L53077j11836l18945l42178k33197
$$ 12536486 12023068 11610372 11091889 10316584 10359932 10713009 10601173 10282228 9940050 9706853
5386I706853m44237l79559k40526N81694j54748j63363k11541k76000k53938k0110
$$ 9706853 9262616 8883057 8642531 9224225 9069477 8906114 8694573 8418573 8164635 8144525
5376H144525r5585O9061l58755j35322l8367k26836J40158j13492k84192J2229
$$ 8144525 8048940 8118001 7759246 7623924 7585557 7358721 7498879 7385387 7101195 7113424
5366G113424j44105k96972k08898k19304K27353k90028j74501j32993L95510l56609
$$ 7113424 6969319 6672347 6463449 6244145 6471498 6181470 6006969 5873976 6269486 5912877
5356E912877L0951j69559j00616j38456R0503p7572l2955j57772k32330k03551
$$ 5912877 5943828 5774269 5673653 5535197 5625700 5548128 5515173 5357401 5125071 4921520
5346D921520J12467M36260J24722m37951l40354K05389k10725O3535o0755l48303
$$ 4921520 5033987 5470247 5594969 5157018 4816664 5022053 4811328 4874863 4814108 4465805
5336D465805K41454J0760P7768j71702K19552k19332J44043j11189m56855j94738
$$ 4465805 4707259 4718019 4795787 4624085 4843637 4624305 4768348 4657159 4200304 4005566
5326D005566J88132K06880K53752J59776n09421M6839Q3209k34088n205L295k9511
$$ 4005566 4193698 4400578 4654330 4814106 4304685 4351524 4434733 4200645 4195440 4198735 4169224
5315D169224P1470J65048R74j68829j98145J19845M82205J7621l77580J81051
$$ 4169224 4240694 4405742 4406716 4237887 4039742 4159587 4641792 4659413 4281833 4462884
5305D462884J83431j28317j54278L50114j38145m2110J49321k72781k7240k62053
$$ 4462884 4646315 4517998 4363720 4713834 4575689 4533579 4682900 4410119 4382879 4120826
5295D120826n6080k02593O06965J14294j104754K14097L51109L40065m291n2499
$$ 4120826 4064746 3862153 4469118 4583412 3478658 3692755 4043864 4383929 4379638 4327139
5285D327139J42217k76059N6796n5016J33889k51866m49542J97716O0310n81711
$$ 4327139 4469356 4193297 4250093 4195077 4328966 4077100 3627558 3825274 3885584 3303873
5275C303873K46347J20320p6931j45171j3661O8457k52757J52247M03258J12706
$$ 3303873 3550220 3670540 3593609 3448438 3434777 3503234 3250477 3402724 3805982 3918688
5265C918688l25984m7178l12132p1355N27380m6500j95761j504L2241l4530n7493
$$ 3918688 3592704 3545526 3233394 3162039 3689419 3642919 3447158 3445654 3477895 3443365 3385872
5254C385872n3342k48118k21653M30887j83455k67019L43882J58116L88104J58648
$$ 3385872 3332530 3084412 2862759 3293646 3110191 2843172 3187054 3345170 3733274 3891922
5244C891922j48186l88242j72268L09851r5699J87282k48365n70850P464K15617
$$ 3891922 3743736 3355494 3183226 3493077 3397378 3584660 3336295 2765445 2772909 2988526
5234B988526Q0697N17987o318k41362P9788J52090p7j8201J05370m85674l50443
$$ 2988526 3069223 3587210 3580892 3339530 3419318 3571408 3571331 3553130 3658500 3172826 2822383
5223B822383L65202r9242K53137K2916j73133r1322p4738k2037k10650M92215
$$ 2822383 3187585 3088343 3341480 3364396 3191263 3099941 3025203 3003166 2792516 3284731
5213C284731J45508K16851j1368l89972M04881J12695l88936o5252p4281j29988
$$ 3284731 3430239 3647090 3635722 3245750 3650631 3763326 3374390 3309138 3234857 3104869
5203C104869J51912j2894l21821J81910p6095J25916J17059q3836K88802K120
$$ 3104869 3256781 3243887 2922066 3103976 3027881 3153797 3270856 3187020 3475822 3477942
5193C477942K1724l3025j28190k16491R5729j39637J92879p457j3808M6011L39827
$$ 3477942 3499666 3466641 3338451 3121960 3217689 3078052 3270931 3263474 3249666 3295677 3635504
5182C635504k97926j2605N27593J26676j94835j8452j69984m51972K54887J02266
$$ 3635504 3337578 3324973 3852566 3979242 3784407 3765955 3595971 3143999 3398886 3501152
5172C501152l91622p0702K45227L13959J55338j2722J69321k57428J69485l53
$$ 3501152 3109530 3038828 3284055 3598014 3753352 3740630 3909951 3652523 3822008 3821655
5162C821655K24117J33398J50149k78162L0660J24073j12131l35550L80365M57785
$$ 3821655 4045772 4179170 4329319 4051157 4081817 4205890 4093759 3758209 4138574 4596359
5152D596359l7819o04975n31856M36449L22196k59194k60746J35993l9234J69224
$$ 4596359 4558540 3953565 3421709 3858158 4180354 3921160 3660414 3796407 3757173 3926397
5142C926397j08490P7827k94330m56007K02193L96926J05681l27231p6630k51948
$$ 3926397 3817907 3895734 3601404 3145397 3347590 3744516 3850197 3522966 3446336 3194388
5132C194388J18248m36435J69256P0621k88374N55792r5520K83185j03256k6280
$$ 3194388 3312636 2876201 3045457 3116078 2827704 3383496 3287976 3571161 3467905 3441625
5122C441625J70897k06821j7375m82845Q9347K42189j21119k26938K00086K12446
$$ 3441625 3612522 3405701 3388326 2905481 2994828 3237017 3115898 2888960 3089046 3301492
5112C301492l71943J38884J52529K86734P3817k02605j39572l34133l61212J09947
$$ 3301492 2929549 3068433 3220962 3507696 3581513 3378908 3239336 2905203 2543991 2653938
5102B653938k34788L77161Q8462j07676J49004L706L42721O1444J63705m43407
$$ 2653938 2419150 2796311 2884773 2777097 2926101 2929807 3272528 3333972 3497677 3054270
5092C054270k92092k75220M92449J57507K6855J10001J55920J85623m6628L05518
$$ 3054270 2762178 2486958 2979407 3136914 3163769 3273770 3429690 3615313 3568685 3874203
5082C874203j4454n02468J27139k88406J98768Q8646N135j0406Q7840j83097J21793
$$ 3874203 3859749 3357281 3484420 3196014 3394782 3483428 3488563 3478157 3565997 3382900 3504693
5071C504693J95103K77196m02839k4902M23609j55758k65636N4011j60786k01500
$$ 3504693 3699796 3976992 3574153 3549251 3972860 3817102 3551466 3605477 3444691 3243191
5061C243191j0705K47868N89765o90898k70646N3552N91276l13077J45347m2714
$$ 3243191 3232486 3480354 4070119 3379221 3108575 3162127 3753403 3440326 3585673 3542959
5051C542959J98715Q4816J85934K82046k14681P712j05554j40653j76794n660
$$ 3542959 3741674 3826490 4012424 4294470 4079789 4087501 3981947 3841294 3664500 3658840
5041C658840M16967l50671L98554r8924J24854L9952J79942K67198k2871n0435
$$ 3658840 4075807 3725136 4123690 4024766 4149620 4189572 4369514 4636712 4613841 4563406
5031D563406p0156n8690r2199k16791N0631N33972n43892l94539K79890J70297
$$ 4563406 4493250 4434560 4342361 4125570 4176201 4710173 4166281 3771742 4051632 4221929
5021D221929r5471K50179M71440l63743J92439o0768J24793J29404m7001j19675
$$ 4221929 4126458 4376637 4848077 4484334 4676773 4616005 4740798 4870202 4823201 4703526
5011D703526l82200m2438O1032L63195j9756k53002R1040K96798k51774n2811
$$ 4703526 4321326 4278888 4339920 4703115 4683359 4430357 4521397 4818195 4566421 4513610
5001D513610M63949N1322P4707K88666n41149j46679L00500O5085n32594k6577
$$ 4513610 4977559 5028881 5103588 5392254 4851105 4704426 5004926 5070011 4537417 4510840
4991D510840L33736J62029l6298l12803L56707J16312k17514K8352J65892k5764
$$ 4510840 4844576 5006605 4970307 4657504 5014211 5130523 4913009 4941361 5107253 5081489
4981E081489j02701J59524j13970J76603m86868J25446J64756j90643M60692L1689
$$ 5081489 4978788 5138312 5024342 5200945 4714077 4839523 5004279 4813636 5274328 5306017
4971E306017m70887O7869J8779J95811J65904k68991K30445J81151P1355J6986
$$ 5306017 4835130 4902999 4921778 5117589 5283493 5014502 5244947 5426098 5497453 5514439
4961E514439k04378k66286j88342M43517J85050Q9540K71702j9906Q1331L4844
$$ 5514439 5310061 5043775 4855433 5298950 5484000 5573540 5845242 5825336 5906667 5941511
4951E941511k58953n143j06830l850J21895M67058O9918r4287q3639k89016n3718
$$ 5941511 5682558 5677415 5570585 5566735 5688630 6155688 6225606 6131319 6047680 5758664 5704946
4940E704946J65793L47628N8361p7885M46552N5702k00002n5484L28358k7154
$$ 5704946 5870739 6218367 6276728 6198843 6645395 6701097 6501095 6445611 6773969 6746815
4930F746815J04970J18213M13426P4361o95204J8755o9622J43437J46366n318
$$ 6746815 6851785 6969998 7383424 7457785 6762581 6781336 6711714 6855151 7001517 6996199
4920F996199Q9964L92035k81492k07405J58646J93814M44053L9758m13262L401
$$ 6996199 7086163 7478198 7196706 6989301 7147947 7341761 7785814 7825572 7412310 7415711
4910G415711j6258J66274j20899J87673L8184n0486Q2466K95566O0408n48906
$$ 7415711 7399453 7565727 7444828 7632501 7670685 7620199 7702665 7998231 8058639 7509733
4900G509733M79063j55754j73408K30360J73356M24385j81929o6787J39120k57848
$$ 7509733 7988796 7833042 7659634 7889994 8063350 8487735 8305806 8239019 8378139 8120291
4890H120291j26575K66841K62304L00837L3320k56195l6289J41226j3106k4361
$$ 8120291 7993716 8260557 8522861 8823698 8857018 8600823 8564534 8705760 8692654 8668293
4880H668293l85516j81305O32336n912J58809K09705J27137O0989k41756j2791
$$ 8668293 8282777 8101472 8733808 8727896 8886705 9096410 9223547 9284536 9042780 9029989
4870I029989J1429Q5050K90036N8255j10181k95661q0684K15074L82057N88234
$$ 9029989 9041418 9126468 9416504 9474759 9364578 9068917 8988233 9203307 9585364 10173598
4860A0173598k0278p0263m5376L87160l49139k3883O22679J86337k86010M20405
$$ 10173598 10153320 10083057 10037681 10424841 10075702 10051819 10674498 10860835 10574825 10995230
4850A0995230j42447j52767J60531q7538j41908o9069N81278J97012K84239j9374
$$ 10995230 10852783 10700016 10860547 10773009 10631101 10562032 11143310 11340322 11624561 11605187
4840A1605187J84310M1620M14235K27712j5898j48806j7457J68441O78638J30656
$$ 11605187 11789497 11831117 12245352 12473064 12457166 12308360 12290903 12459344 13137982 13268638
4830A3268638p0981J81234L24475k6667j09157N98507J74309l8613P706K81430
$$ 13268638 13197657 13378891 13703366 13676699 13567542 14166049 14340358 14301745 14309451 14590881
4820A4590881j20150M31690j41382K51594L29019N83844O66244j25639K28500
$$ 14590881 14470731 14902421 14761039 15012633 15341652 15925496 16591740 16466101 16694601
4811A6694601n7312r966j53737J77303M78785R9825K88478J51259M97938o918
$$ 16694601 16637289 16627323 16473586 16650889 17129674 17229499 17517977 17669236 18167174 18160256
4801A8160256O4363M95375K72877K15500L40371O60664K77223j98442Q18970M41444
$$ 18160256 18224619 18719994 18992871 19208371 19548742 20209406 20486629 20288187 21107157 21548601
4791B1548601j67339N04447N43158O2658J49951N23052M63961L09892o3271O44235
$$ 21548601 21381262 21885709 22428867 22491525 22641476 23164528 23628489 23938381 23875110 24519345
4781B4519345N51387P46956M14140N15952O02250k92036K04915M93075O95371
$$ 24519345 25070732 25817688 26231828 26747780 27350030 27057994 27262909 27755984 28451355
4772B8451355J075979N43974Q11237M45829L05056N48531O37032P29716J91316
$$ 28451355 29527334 30071308 30882545 31328374 31633430 32181961 32818993 33548709 33740025
4763C3740025P34478J041415R31015J182986M27492M06178J097559J045859P88903
$$ 33740025 34474503 35515918 36446933 37629919 38057411 38463589 39561148 40607007 41395910
4754D1395910J007949J227466J211835J072058J126581J642148J531655J220382
$$ 41395910 42403859 43631325 44843160 45915218 47041799 48683947 50215602 51435984
4746E1435984J521546J619570J863895J859606J771008J879925K024994J944334
$$ 51435984 52957530 54577100 56440995 58300601 60071609 61951534 63976528 65920862
4738F5920862K240946J999303K047496K127656K422788K059039J900703K334455
$$ 65920862 68161808 70161111 72208607 74336263 76759051 78818090 80718793 83053248
4730H3053248J668423K097489K028224K200495K135921K051504J747226K135281
$$ 83053248 84721671 86819160 88847384 91047879 93183800 95235304 96982530 99117811
4722I9117811K032983K054325J736849K182536K462518K419617L139878K783985
$$ 99117811 101150794 103205119 104941968 107124504 109587022 112006639 115146517 117930502
4714A17930502K880529L207274L302108L157923L401785L931349L859764M100434
$$ 117930502 120811031 124018305 127320413 130478336 133880121 137811470 141671234 145771668
4706A45771668L865106M226431L771161K916829K814366J594468J288770P47073
$$ 145771668 149636774 153863205 157634366 160551195 163365561 164960029 166248799 166995872
4698A66995872P6335m26563j51302m17312m37477J08220N25493P06174J161168
$$ 166995872 167072207 166645644 166494342 166077030 165639553 165747773 166273266 166979440 168140608
4689A68140608J173132J099724J619164J209864R79334J392720J103423O50997
$$ 168140608 169313740 170413464 172032628 173242492 174221826 175614546 176717969 177368966
4681A77368966k05147n8059j599925k006486j843951k128582k014919k136122
$$ 177368966 177163819 177105760 175505835 173499349 171655398 169526816 167511897 165375775
4673A65375775k205611j365217j518692j245245o53060n06714l06450n4284K75171
$$ 165375775 163170164 161804947 160286255 159041010 158387950 157881236 157574786 157520502 157795673
4664A57795673K33380J094810R06189P85977J475490J436374O80551N55051J010401
$$ 157795673 158029053 159123863 160030052 160816029 162291519 163727893 164408444 164963495 165973896
4655A65973896M68477R7168M20978J59456k49348n22595k21743n01041l59057
$$ 165973896 166442373 166539541 166960519 167119975 166870627 166348032 166126289 165625248 165266191
4646A65266191j181166p93989j027057p17643m73767o44424m32144k26881l73222
$$ 165266191 164085025 163291036 162263979 161546336 161072569 160428145 159996001 159769120 159395898
4637A59395898o71040j024129o43251K65584L6720l74002k26092n30444m26079
$$ 159395898 158724858 157700729 157057478 157323062 157359782 156985780 156759688 156229244 155803165
4628A55803165n55906p44159p17765l45616o09735j75196m15757j339894j712948
$$ 155803165 155247259 154503100 153785335 153439719 152829984 152654788 152239031 150899137 149186189
4619A49186189j403095k179332k149151k244574k915384k328950k494910k124897
$$ 149186189 147783094 145603762 143454611 141210037 138294653 135965703 133470793 131345896
4611A31345896k097935k001887j338383r54710j387363r18670o98693m90378K20091
$$ 131345896 129247961 127246074 125907691 124952981 123565618 122646948 121948255 121457877 121677968
4602A21677968N74378J10827O50971J396845J533252K101039J990144K298796
$$ 121677968 122252346 122363173 123014144 124410989 125944241 128045280 130035424 132334220
4594A32334220L756230L319539K997198L371279K653164K377286J388158J18125
$$ 132334220 136090450 139409989 142407187 145778466 148431630 150808916 152197074 152315199
4586A52315199j367922k940958l648288m823245n031590n507148n320546n089833
$$ 152315199 150947277 148006319 144358031 139534786 134503196 128996048 123675502 118585669
4578A18585669m953402l836207l194720k750019k259352j808409j439388p37480
$$ 118585669 113632267 109796060 106601340 103851321 101591969 99783560 98344172 97606692
4570I7606692m06202K50382M85572J136726J806591J660951K478498L065999L350360
$$ 97606692 97200490 97450872 97936444 99073170 100879761 102540712 105019210 108085209 111435569
4561A11435569L409548L575227L747579L811395L215981K070474P56500m65522
$$ 111435569 114845117 118420344 122167923 125979318 129195299 131265773 132022273 131556751
4553A31556751k075429l490538m553908n713403o394400o197035o043421n136107
$$ 131556751 129481322 125990784 121436876 115723473 109329073 103132038 97088617 91952510
4545I1952510m771958m273157m339324l104680k541552k843744j952270j782459
$$ 91952510 87180552 82907395 78568071 75463391 72921839 70078095 68125825 66343366
4537F6343366j670124j441018q37048o18380o43321j92791O4237p1830r0009M14410
$$ 66343366 64673242 63232224 62395176 61776796 61133475 60940684 61004921 60933091 60843082 61257492
4527F1257492J219412K80752P516L32115k1502k83481q21405j973039j997311
$$ 61257492 62476904 62757656 62765172 63097287 63075785 62792304 61970899 59997860 58000549
4518E8000549k178452k293419k620308k509918k295548j945735j987235j753450
$$ 58000549 55822097 53528678 50908370 48398452 46102904 44157169 42169934 40416484
4510D0416484j326593j708861k082480j341035o30871j095045j112302p46455
$$ 40416484 39089891 37381030 35298550 33957515 33326644 32231599 31119297 30372842
4502C0372842r48828p35446n18910n55204q94112o02347o24951l29080j53896
$$ 30372842 29424014 28688568 28169658 27614454 26720342 26117995 25493044 25163964 25010068
4493B5010068n37866l78139l96543k79038m45565m83526m71712l20677n27418
$$ 25010068 24472202 24094063 23697520 23418482 22972917 22489391 22017679 21697002 21169584
4484B1169584o6464O56644j83727k11160m3082o98124J32861M40204j03717m03847
$$ 21169584 21103120 21759764 21576037 21364877 21321795 20623671 20756532 21196736 21093019 20689172
4474B0689172k97797j21051J66082k52311m2354j76383L79565R9078j79105m43425
$$ 20689172 20391375 20270324 20436406 20184095 20141741 19965358 20344923 20444001 20264896 19821471
4464A9821471N6044K26824L42171n0212q645J58249L67097o2400j97718J62552
$$ 19821471 19877515 20104339 20446510 20396298 20387653 20545902 20912999 20850599 20652881 20815433
4454B0815433L4264n2462M8543K76152J94184L86687n27007R0251P9249J8874
$$ 20815433 20849697 20797235 20845778 21121930 21316114 21702801 21175794 21266045 21345294 21364168
4444B1364168M79491K30814j26054M03175M30167k00920k46059K91611L46909
$$ 21364168 21843659 22074473 21948419 22351594 22781761 22580841 22334782 22626393 22973302
4435B2973302Q2502J06465N48300q1029m8201O0401J36491O82837L46703N20211
$$ 22973302 23055804 23162269 23710569 23629540 23581339 23641740 23778231 24461068 24807771 25327982
4425B5327982j00719o2135M93275M7752J13645N28799K30698L95459M16158J50488
$$ 25327982 25227263 25165128 25658403 25706155 25819800 26348599 26579297 26974756 27390914 27541402
4415B7541402M75769M55286k61438j59535R84855K70689J15982O91379L06571
$$ 27541402 28017171 28472457 28211019 28051484 29036339 29307028 29423010 30114389 30420960
4406C0420960J51570M24773M17695Q6776M55730L92881K94674O01817K93994M52412
$$ 30420960 30572530 30997303 31414998 31501774 31957504 32350385 32645059 33246876 33540870 33993282
4396C3993282O56334N32483K80809O11258M59909L12673K70296N35763M61045
$$ 33993282 34649616 35182099 35462908 36074166 36534075 36846748 37117044 37652807 38113852
4387C8113852Q81434N74673L82961N76051K72828K75709J015800P93972Q58745
$$ 38113852 38995286 39569959 39952920 40528971 40801799 41077508 42093308 42887280 43746025
4378D3746025N72477N32819R66214J426920J184659J306885J421172J467847J222578
$$ 43746025 44318502 44851321 45817535 47244455 48429114 49735999 51157171 52625018 53847596
4369E3847596J700625J531943J369411J721380J483079J731960J634736K040851
$$ 53847596 55548221 57080164 58449575 60170955 61654034 63385994 65020730 67061581
4361F7061581J896976J542521J995177K003242K156053K157495J883124K172604
$$ 67061581 68958557 70501078 72496255 74499497 76655550 78813045 80696169 82868773
4353H2868773K078550K762473K853997K812945L232628L544370L747650M203610
$$ 82868773 84947323 87709796 90563793 93376738 96609366 100153736 103901386 108104996
4345A08104996M275673N039041N082544N947178O271661P015992P712656Q526292
$$ 108104996 112380669 117419710 122502254 128449432 134721093 141737085 149449741 157976033
4337A57976033R573648J0491920J1225998J3177883J5113868J5833196J7756449
$$ 157976033 167549681 178041601 189267599 202445482 217559350 233392546 251148995
4330B51148995J9909001K0718182K1564610K2588694K2054974K0269804J6932046
$$ 251148995 271057996 291776178 313340788 335929482 357984456 378254260 395186306
4323C95186306J1408329M593944k308223r485277j6213583k1084545k5197046
$$ 395186306 406594635 411188579 408880356 399395079 383181496 362096951 336899905
4316C36899905k6574828k6857580k5439593k3113460k0468454j8645255j6679050
$$ 336899905 310325077 283467497 258027904 234914444 214445990 195800735 179121685
4309A79121685j4222442j2320035j1431299r932753q880442q106828o485182o266227
$$ 179121685 164899243 152579208 141147909 131215156 122334714 114227886 107742704 101476477
4301A01476477n719025m862756m637348m290935m282038l824234l253132l009409
$$ 101476477 95757452 90894696 86257348 81966413 77684375 73860141 70607009 67597600
4293F7597600l012593k529552k011495k479013k569070k124799j264861j725398
$$ 67597600 64585007 62055455 60043960 57564947 54995877 52871078 51606217 49880819
4285D9880819j840831j343348j678898j571767o37925j249141j090366q75212
$$ 49880819 48039988 46696640 45017742 43445975 42808050 41558909 40468543 39593331
4277C9593331r66044q87712n19731p06134r84501q37934o98627k53789o10907
$$ 39593331 38627287 37739575 37219844 36513710 35529209 34691275 33992648 33738859 33127952
4268C3127952o86394q03308m33177n1112p04772m41758k32679k92508q07026l41239
$$ 33127952 32441558 31638250 31205073 31153961 30449189 30007431 29774752 29482244 28675218 28333979
4258B8333979k49402l80224m98161o44085k50340p00483q49169o69655k22727
$$ 28333979 28084577 27704353 27206192 26562107 26311767 25611284 24762115 24092460 23869733
4249B3869733j94540n05249l61492j08644n55104o70897K13075l88081m56005
$$ 23869733 23675193 23169944 22808452 22699808 22144704 21473807 21686882 21298801 20842796
4240B0842796M3077k23215k51520J41161m85472n57786M2851o9157m56892R2631
$$ 20842796 20885873 20662658 20411138 20552299 20066827 19509041 19551892 19482735 19025843 19118474
4230A9118474J28962j11435J17157L1742k7115n22889k59645j14524n00577l5646
$$ 19118474 19247436 19136001 19253158 19284900 19257785 18734896 18475251 18360727 17860150 17824504
4220A7824504J37887O4564l24928l41042m13967k49511k87047l20797J13656k9519
$$ 17824504 17962391 18026955 17702027 17360985 16947018 16697507 16410460 16089663 16203319 16173800
4210A6173800k27510Q4834Q4196J71716j63570L10644K19933n90650j0914J93043
$$ 16173800 15946290 16031124 16115320 16287036 16123466 16434110 16654043 16063393 16052479 16245522
4200A6245522r0427K00209K31926k55784K06988j66328L98674K16326L5685K41912
$$ 16245522 16155095 16355304 16587230 16331446 16538434 16372106 16770780 16987106 17022791 17264703
4190A7264703O7205k8407J86365j42852k97221L25546R8187L0193l05566k27446
$$ 17264703 17331908 17303501 17489866 17347014 17049793 17375339 17473526 17503719 17198153 16970707
4180A6970707K27019J30366j91701K3617j01131k45068J19096K01838k5164l39455
$$ 16970707 17197726 17328092 17136391 17160008 17058877 16813809 16932905 17134743 17109579 16770124
4170A6770124j24532J80848k59163J75945j65613k4886J50730j2117m3855j58060
$$ 16770124 16645592 16826440 16567277 16743222 16577609 16552723 16703453 16691336 16647481 16489421
4160A6489421K91950m31155q6649K11543j75519L5139j68581k86337K91522j12728
$$ 16489421 16781371 16350216 16263567 16475110 16299591 16334730 16166149 15879812 16171334 16058606
4150A6058606n9039K53077n06437l48728K47111L4207m46416j29375J52751m7963
$$ 16058606 15999567 16252644 15746207 15397479 15644590 15678797 15232381 15103006 15255757 15207794
4140A5207794k49811L24826L60210o05855n2957R807l29898j30238r5395p061
$$ 15207794 14957983 15282809 15643019 15037164 14984207 14994014 14664116 14533878 14438483 14431422
4130A4431422K92872J0904l7393k64996J71780K40861k07487k81922K22971J79943
$$ 14431422 14724294 14735198 14697805 14432809 14604589 14845450 14637963 14356041 14579012 14758955
4120A4758955O2645o28745M52K38440j21787l22702K09875J75728m9857J30299
$$ 14758955 14821600 14192855 14193307 14431747 14309960 13987258 14197133 14372861 14323004 14453303
4110A4453303J63551J51824j05638j63816m39662Q5741r8050m3536k243j81853
$$ 14453303 14616854 14768678 14663040 14499224 14059562 14145303 14047253 14003717 14001474 13819621
4100A3819621K25188N08589m8012m74420j67094q83P9247J26966J36579k89207
$$ 13819621 14044809 14553398 14505386 14030966 13863872 13862989 13942236 14069202 14205781 13916574
4090A3916574K35229L7743o3217L97056l92062k68227N1582L28408m59179m08184
$$ 13916574 14151803 14189546 14126329 14523385 14131323 13863096 13914678 14243086 13783907 13375723
4080A3375723O5435J50169j07194K66486n32179k09584J73301m66614L09297L4538
$$ 13375723 13441158 13591327 13484133 13750619 13218440 13008856 13182157 12715543 13024840 13059378
4070A3059378J20578k82590J09768K42003j25516k42741K51710L12501l20507
$$ 13059378 13179956 12897366 13007134 13249137 13123621 12880880 13132590 13445091 13124584
4061A3124584k36768n82629P6361o4048K37758m1630N6497j084o5342K26131N4214
$$ 13124584 12887816 12305187 12381548 12317500 12555258 12513628 12570125 12569041 12503699 12729830 12784044
4050A2784044j03386j09864j01909Q6217M89948L94309j05421k27103J60767J14387
$$ 12784044 12680658 12570794 12468885 12555102 13045050 13439359 13333938 13106835 13267602 13381989
4040A3381989K98916R0838j0979m0509j99388J4772Q0355j57906r50189n9620
$$ 13381989 13680905 13771743 13760764 13720255 13520867 13535639 13615994 13458088 12507899 12448279
4030A2448279O1017J19047n12222l92563n9879L03075l63748n15032L87211n05902
$$ 12448279 12509296 12628343 12116121 11723558 11663679 11966754 11603006 11087974 11475185 10969283
4020A0969283P6741J07268j5213K29671m8486m53375m40123N5990J05618J23201
$$ 10969283 11046024 11153292 11138079 11367750 11319264 10865889 10425766 10481756 10587374 10710575
4010A0710575l63590o8656j36375K1903K66366q0629r8210j99507j66957Q409
$$ 10710575 10346985 10278329 10141954 10163857 10430223 10349594 10251384 10051877 9884920 9893329
4000I893329K40868l79726j05123j11613J03927k3319m98003J07045k67515k24372
$$ 9893329 10134197 9754471 9649348 9537735 9641662 9618343 9120340 9227385 8959870 8735498
3990H735498J28788r415K44806k95009q9558p1821k31312m95647K13652j79301
$$ 8735498 8864286 8854871 9099677 8804668 8715110 8643289 8411977 7916330 8129982 7950681
3980G950681K32464j22593J57393J64081l18489K62377j42703o5239K6518j02873
$$ 7950681 8183145 8060552 8217945 8382026 8063537 8325914 8183211 8117972 8144490 8041617
3970H041617l32335L04906l15378m68637M92138j80957j37584j63744Q4884O0661
$$ 8041617 7709282 8014188 7698810 7230173 7722311 7541354 7403770 7240026 7324910 7385571
3960G385571l0524k11577j53025m03640N8626L55269j20591j12361k8757l80161
$$ 7385571 7355047 7143470 6990445 6586805 6645431 7000700 6880109 6767748 6738991 6358830
3950F358830L37938m6756j69973j15156j55070j7726L44669K68983l95923Q7279
$$ 6358830 6696768 6650012 6480039 6364883 6209813 6192087 6536756 6805739 6409816 6497095
3940F497095n84517J23271r2410m13608K2463M350K18131P4138k92829o5873l7463
$$ 6497095 5912578 6035849 5943439 5529831 5552294 5556644 5774775 5848913 5556084 5490211 5452748
3929E452748j68023q3291K99120l4905M68009R3060k38964j67113L85716n60983
$$ 5452748 5284725 5201434 5500554 5465649 5933658 6026718 5787754 5620641 6006357 5445374
3919E445374K6261N1425K7451k49502J70420N29193k97380m49311j21042J04026
$$ 5445374 5471635 5523060 5550511 5301009 5471429 6000622 5703242 5253931 5132889 5236915
3909E236915r7434K0166j56642K0570J52582k43295l41089q1595q7497L67835
$$ 5236915 5139481 5159647 5003005 5023575 5176157 4932862 4591773 4510178 4422681 4790516
3899D790516j2845J0400n9235K94676K38491q40337j54787L55436j79224j88981
$$ 4790516 4777671 4788071 4728836 5023512 5262003 4421666 4266879 4622315 4443091 4254110
3889D254110l78047K61070K23251m5272j33655K72992q5502k58072K28023m56957
$$ 4254110 3876063 4137133 4360384 4315112 4181457 4454449 4368947 4110875 4338898 3881941
3879C881941J0135j34616P0168K08675L2519P1277L1753j08451j60235n6891j24226
$$ 3881941 3892076 3757460 3827628 4036303 4068822 4140099 4171852 4063401 3903166 3846275 3722049
3868C722049N21118k96406k64904K7524o9214j91870J81683l62080L86691M91481
$$ 3722049 4243167 3946761 3681857 3709381 3640167 3448297 3629980 3267900 3654591 4146072
3858D146072q3663p25686j78756J52537L25947J12732j80918R6223O2430J4408
$$ 4146072 4062409 3336723 3157967 3310504 3636451 3749183 3568265 3664488 3726918 3741326
3848C741326k09370m6366k09396L10914K08396k67665J80510J22505m87016k14577
$$ 3741326 3531956 3485590 3276194 3587108 3795504 3527839 3708349 3830854 3343838 3129261
3838C129261j17878L19441K62252m08924l83013l8433M45722J93973m2598r5499
$$ 3129261 3011383 3330824 3593076 3184152 2801139 2762706 3208428 3402401 3359803 3264304
3828C264304k09517O782k75551j60477o1448J77707k94206L55637l73242p219
$$ 3264304 3054787 3061569 2786018 2625541 2564093 2741800 2447594 2803231 2429989 2422770
3818B422770O73758J30866p2883P8127l3863o74332L71541J87767j24119l76618
$$ 2422770 3096528 3227394 3154511 3232638 3198775 2524443 2895984 3083751 2959632 2583014
3808B583014R3885K41396K04443L20588n47317j62250J08006j9095l89871K52190
$$ 2583014 2676899 2918295 3122738 3443326 2896009 2733759 2841765 2822670 2432799 2684989
3798B684989P381j13252r4175L514j20721N0140L16073m5772k80863j79274J80163
$$ 2684989 2692370 2579118 2484943 2488457 2367736 2417876 2733949 2688177 2407314 2228040 2408203
3787B408203L54891j40857J22351k32226K78429K44913l99054j04648j78568J86172
$$ 2408203 2763094 2622237 2744588 2512362 2790791 3035704 2636650 2532002 2353434 2539606
3777B539606J46276K36495l65938o8570O4436K85979J975k54754p9632L45331
$$ 2539606 2685882 2922377 2556439 2487869 2552305 2838284 2840259 2585505 2505873 2851204
3767B851204K06130k92612l77393J2920J06548Q0082k17351L05291K19484l98967
$$ 2851204 3057334 2764722 2387329 2400249 2506797 2586879 2369528 2674819 2894303 2495336
3757B495336l54105k62578k3091K84503J62696k0213J0002k43139R3320J41457
$$ 2495336 2141231 1878653 1855562 2140065 2302761 2282548 2292550 2049411 2142731 2284188
3747B284188j26059k4679p7377k90215R0721J31500j2207M3413J87385k96626
$$ 2284188 2158129 2133450 2056073 1765858 1856579 1988079 1975872 2019285 2206670 1910044
3737A910044p8649M3125j55345J52234L24786k68081P9192L4227k84932J68784
$$ 1910044 1831395 1874520 1719175 1871409 2196195 1928114 2007306 2041533 1756601 1925385
3727A925385J22300J09453J15973j96874l34475L66722m7700m80469N80521R3314
$$ 1925385 2047685 2157138 2273111 2076237 1741762 2108484 2060784 1580315 2160836 2254150
3717B254150k00902J04944J16672n2109k8156J3758p8671l6865k16876l0595K43777
$$ 2254150 2053248 2158192 2274864 2222755 2194599 2208357 2129686 2092821 1875945 1845350 2089127
3706B089127M7092l60889J64648J8722k1508L26415J24622k48882J78934J27232
$$ 2089127 2136219 1775330 1939978 1958700 1937192 2263607 2388229 2139347 2318281 2445513
3696B445513j61138J8426k2399m07820L41858J66522q8698j41712J24069k01247
$$ 2445513 2284375 2302801 2280402 1872582 2214440 2380962 2292264 2150552 2274621 2073374
3686B073374o4943L66631J15250l85261m74206L35740O63723J9273R5466j08966
$$ 2073374 2008431 2375062 2490312 2105051 1630845 1966585 2630308 2649581 2745047 2636081
3676B636081m18164k72094L18970l15190o2169J3728k42545p6165N59542L25601
$$ 2636081 2217917 1945823 2264793 1949603 1887434 1901162 1658617 1582452 2141994 2467595
3666B467595j58090k12409j18986l644j97391M60179J21857j26014l10527P1316
$$ 2467595 2309505 2097096 1978110 1974466 1777075 2237254 2359111 2233097 1922570 1993886
3656A993886J86725L66592k62917j22257j46235M11205M12875l42404q1749j3903
$$ 1993886 2180611 2547203 2284286 2162029 2015794 2426999 2839874 2497470 2415721 2401818
3646B401818k06372J04571K24766k36362o9020j51308K78529L48122l01975K4
$$ 2401818 2195446 2300017 2524783 2288421 2219401 2068093 2346622 2694744 2392769 2392793
3636B392793j35599n8676J59515R0727j08931k04919Q1166l9608n3940K96080
$$ 2392793 2257194 2198518 2358033 2448760 2339829 2134910 2216076 2176468 2122528 2418608
3626B418608P5506J17595n07046j01469r1675K16001L80334j47529J44430K44257
$$ 2418608 2494114 2611709 2104663 2003194 1911519 2127520 2507854 2360325 2504755 2749012
3616B749012k27804J35218J38552r7774k57604K5890K49956J55264K42767K2536
$$ 2749012 2521208 2656426 2794978 2697204 2439600 2465490 2715446 2870710 3113477 3136013
3606C136013r5587k97267M1012K47688o3690m00164m5028L36330k13355J05825
$$ 3136013 3040426 2743159 2784171 3031859 2968169 2568005 2522977 2859307 2645952 2751777
3596B751777L15745Q388m45124N30401K14820m20985l97205K95184K01594J22478
$$ 2751777 3067522 3075910 2630786 3161187 3376007 2955022 2557817 2853001 3054595 3177073
3586C177073J5733q0086k61178P2569L82026l42437K70338k00313k24034L70123
$$ 3177073 3192806 3112720 2851542 2924111 3306137 2963700 3234038 3033725 2809691 3179814
3576C179814J24583l05007j95116L22727O5525k63645j07863L39102k65588J87600
$$ 3179814 3304397 2999390 2804274 3127001 3192526 2928881 2821018 3160120 2894532 3082132
3566C082132M08636k12035J379L39702K16926m70157J49358J19338J01423L7667
$$ 3082132 3490768 3278733 3280112 3619814 3836740 3366583 3515941 3635279 3736702 3774369
3556C774369J83032l00297J88525p6119K36880k55141M5636J32683j54543k0377
$$ 3774369 3957401 3657104 3845629 3769510 4006390 3751249 3796885 3929568 3775025 3754648
3546C754648K71150j16240P3626l8889n6831J86625M8289j69392R1754p0042l77559
$$ 3754648 4025798 3909558 3983184 3944295 3887464 4074089 4122378 3952986 4044740 3974698 3597139
3535C597139N81403L32834R8918k37831J73959K58354k62051J34655m58867O30343
$$ 3597139 4178542 4511376 4610294 4372463 4546422 4804776 4542725 4677380 4218513 4848856
3525D848856O7820l36358K36991j03621j40440N14065j03236q4344K81593k05575
$$ 4848856 4916676 4580318 4817309 4713688 4573248 5087313 4984077 4899733 5181326 4975751
3515D975751K71916j1199M12868k74662J45199r2361l05877l44538l8092K1823
$$ 4975751 5247667 5236468 5649336 5374674 5519873 5427512 5121635 4777097 4739005 4760828
3505D760828m86390P0519N2254N2325J8357K176J89823J40898M62452n00592r5967
$$ 4760828 4274438 4344957 4397211 4449536 4467893 4470069 4659892 4800790 5263242 4762650 4666683
3494D666683J92299l5551O58087j57387m72338k38611J93758k83919J37054Q6828
$$ 4666683 4858982 4823431 5481518 5324131 4851793 4613182 4806940 4523021 4660075 4746903
3484D746903J93479p8469n75692J94110k5147J82810o6459j16489J82967j08190
$$ 4746903 4940382 4861913 4286221 4480331 4455184 4637994 4571535 4455046 4638013 4529823
3474D529823K49588K3593J16229K72373l13380n1079j91617J7264J31894J27947
$$ 4529823 4779411 4803004 4919233 5191606 4878226 4827147 4635530 4652794 4784688 4912635
3464D912635p299O42449r1180m85378l88429j4030L18425M44336J27038m66612
$$ 4912635 4905336 5547785 5456605 4971227 4582798 4568768 4887193 5331529 5458567 4991955
3454D991955o1375j0600L3301J5243n3123K53342J92483k46570K23652j5636p3905
$$ 4991955 4930580 4919980 4953281 4968524 4915401 5168743 5361226 5114656 5338308 5322672 5248767
3443E248767K00561P5558j15813L47948K717j07364K3570j98721L27482J18424
$$ 5248767 5449328 5524886 5409073 5757021 5759738 5652374 5675944 5477223 5804705 5923129
3433E923129N1975K6849P8041j32835J96621K08365J15994j75542l6453k63801
$$ 5923129 5975104 6001953 6079994 5947159 6143780 6352145 6468139 6292597 6256144 5992343
3423E992343M75513J18046m24870K31454J37857k50111J40165K20607k02787L44988
$$ 5992343 6467856 6585902 6161032 6392486 6530343 6280232 6420397 6641004 6438217 6783205
3413F783205K1492l40036p4603J98321K30221q0398J27490O07536m64785n06165
$$ 6783205 6804697 6464661 6390058 6588379 6818600 6738202 6865692 7473228 7008443 6502278
3403F502278M08806L42742O84267l5445J46496K18544m78287r1646L06782K54703
$$ 6502278 6911084 7253826 7938093 7902648 8049144 8267688 7789401 7697755 8004537 8259240
3393H259240k96677n0510M1683L76125M28335L53085N1559k32824J83556L84131
$$ 8259240 7962563 7912053 7953736 8329861 8758196 9111281 9162840 8930016 9113572 9497703
3383I497703l4239r2586K34172j7684M42116J58429j62575K7874J0027J60070
$$ 9497703 9463464 9370878 9605050 9587366 10029482 10187911 10025336 10053210 10063237 10223307
3373A0223307J29739M389M70653J05098j77407M73554P5478J19294K77877K20179
$$ 10223307 10353046 10357435 10828088 10933186 10755779 11229333 11304811 11424105 11701982 11922161
3363A1922161p1685O32097J94601j50509K05687k20150L34954J24780L57437N92053
$$ 11922161 11850476 12482573 12677174 12526665 12732352 12512202 12847156 12971936 13329373 13921426
3353A3921426N2076K97397M13043M09655o5839K20453L5717P07844j71006K24755
$$ 13921426 13973502 14270899 14683942 15093597 15027758 15248211 15283928 15991772 15820766 16045521
3343A6045521N55348K00888M44368J64196L54015K1688m4480Q21385J65879J08536
$$ 16045521 16600869 16801757 17246125 17410321 17764336 17786024 17741544 18562929 18728808 18837344
3333A8837344O60556m0180M52947N05318K31410K34792N27934O01188M93679N27001
$$ 18837344 19497900 19457720 19910667 20415985 20647395 20882187 21410121 22011309 22504988 23031989
3323B3031989J7712P13840P80763J61197M99655J015804M31077M86759O65668
$$ 23031989 23049701 23763541 24544304 24705501 25205156 26220960 26652037 27138796 27804464
3314B7804464L39435N63326Q42228J093377Q12477M24421N16273R70281P42031
$$ 27804464 28143899 28707225 29549453 30642830 31455307 31879728 32396001 33366282 34108313
3305C4108313Q34687J409470R63470K03506J048937J098338Q30916R80820J371550
$$ 34108313 34943000 36352470 37315940 37519446 38568383 39666721 40497637 41478457 42850007
3296D2850007Q86279J161913J345352J394317J691878J504805J299646K163443
$$ 42850007 43736286 44898199 46243551 47637868 49329746 50834551 52134197 54297640
3288E4297640K550194K302652K239668K302716L141480L563262L457414L716332
$$ 54297640 56847834 59150486 61390154 63692870 66834350 70397612 73855026 77571358
3280G7571358L814244M238391M607673N168535N649479N960843O142607O155330
$$ 77571358 81385602 85623993 90231666 95400201 101049680 107010523 113153130 119308460
3272A19308460O554255N953307N468762N024822L417620J639540Q7612j856113
$$ 119308460 125862715 131816022 137284784 142309606 145727226 147366766 147454378 145598265
3264A45598265k996798l652140m134978m125157l749110l340424k277321j784270
$$ 145598265 142601467 138949327 134814349 130689192 126940082 123599658 121322337 119538067
3256A19538067j406820m85721K90615J307116J492576K101010L240831L850009
$$ 119538067 118131247 117645526 117936141 119243257 120735833 122836843 126077674 129927683
3248A29927683L741651M952273N992768O723009P679402Q763409Q919846R304823
$$ 129927683 133669334 138621607 144614375 151337384 159016786 167780195 176700041 186004864
3240A86004864R671755J0357775R261163O890461N133266J855319j916470n423826
$$ 186004864 195676619 206034394 215295557 222186018 227319284 229174603 227258133 221834307
3232B21834307q522493j0691924j1654557j2116451j1733769j0465991r673759
$$ 221834307 213311814 202619890 190965333 178848882 167115113 156649122 146975363
3225A46975363q599777o972297n904969n073792m409403l240020k483683k277774
$$ 146975363 138375586 131403289 125498320 120424528 116015125 112775105 110291422 108013648
3217A08013648j367328p20744k58687J13422J66986J182379J599882J871308K130488
$$ 108013648 106646320 105925576 105666889 105780311 105947297 107129676 108729558 110600866 112731354
3208A12731354K585513K363290K467021J574493J289558j10624j301955k993029
$$ 112731354 115316867 117680157 120147178 121721671 123011229 122900605 121598650 118605621
3200A18605621m460084m931479o126492o808047o644601n821480n651480n582856
$$ 118605621 114145537 109214058 103087566 96279519 89634918 83813438 78161958 72579102
3192G2579102m902310m133628l552227l234264l007961k580840k453300k251657
$$ 72579102 67676792 63543164 59990937 56756673 53748712 51167872 48714572 46462915
3184D6462915k349132k239941j614316j452322j655134j661216k005732j189670
$$ 46462915 44113783 41873842 40259526 38807204 37152070 35490854 33485122 32295452
3176C2295452j438898j260208j299888r55065o84933r86629p42502r00827p08099
$$ 32295452 30856554 29596346 28296458 27341393 26656460 25669831 24927329 24026502 23318403
3167B3318403n77517q65713m44044l75669m09382q17442r16470L1520m4285o49160
$$ 23318403 22740886 21875173 21431129 21055460 20646078 19828636 18912166 18943686 18899401 18250241
3157A8250241q53615k62462o35237J09380j44016p44644j76241o01657n98601
$$ 18250241 17396626 17134164 16498927 16608307 16464291 15719647 15543406 14941749 14343148
3148A4343148O4232K93683m72969l92927l38180j06870n00594O235r6444k58858
$$ 14343148 14407380 14701063 14228094 13835167 13496987 13390117 12889523 12895758 12799314 12540456
3138A2540456m52694l71529J3427J3219l84177J5228k96625m43999j10302l87433
$$ 12540456 12087762 11716233 11729660 11742879 11358702 11373930 11077305 10633306 10523004 10135571
3128A0135571m8234N080j24722n7443k56742j10846k38603l95710J91122l0194
$$ 10135571 10087337 10092417 9967695 9910252 9653510 9542664 9304061 8908351 9099473 9069279
3118I069279J91964j30876j28664j91435r9243l24448k7495J9348P8477m04779
$$ 9069279 9261243 9130367 9001703 8810268 8711025 8386577 8359082 8378430 8456907 8052128
3108H052128j41154K41917N4973k34261l51273k28031j82534r985L86996l84897
$$ 8052128 7910974 8152891 8207864 7973603 7622330 7394299 7211765 7201780 7588776 7203879
3098G203879l75461l5811J45463l45290j89205K24N1625q3009o154J83774l93162
$$ 7203879 6828418 6792607 6938070 6592780 6403575 6403799 6455424 6372415 6366261 6550035 6156873
3087F156873L5792J69597l16523j39314k3463j50182j2311M3993J22649J60434
$$ 6156873 6192665 6362262 6045739 5906425 5882962 5732780 5720469 5764462 5887111 6047545
3077F047545L5844L2839l06989k90760L96798j2259k15909l50890J05537j25135
$$ 6047545 6083389 6116228 5809239 5518479 5915277 5903018 5687109 5336219 5441756 5316621
3067E316621l30946P9512L58589m51471k80294J82669j53746K64587J65530o32971
$$ 5316621 4985675 5065187 5423776 4972305 4692011 4874680 4720934 4985521 5151051 4518080
3057D518080k87618J88758p7176K867j03504o9951L1360J31580j5308r3814j04623
$$ 4518080 4230462 4419220 4342044 4344911 4241407 4171456 4202816 4334396 4319088 4225274 4120651
3046D120651R6037k1080j59990J97703J85255n52002j92896p1327j47534J86011
$$ 4120651 4216688 4195608 4035618 4233321 4418576 3866574 3673678 3602351 3454817 3640828
3036C640828j2590j9205m4760K18670O2559j92287m17682P7469L4624k5315l58612
$$ 3640828 3628238 3609033 3564273 3782943 3845502 3653215 3235533 3313002 3347626 3322311 2963699
3025B963699K83513l93752J641L90551l7530q6830k1759j21097r6591l20933k39114
$$ 2963699 3247212 2853460 2855101 3245652 3208122 3121292 3099533 2978436 2881845 2560912 2321798
3014B321798P0250j18401K76571j28956M35779K52135o6645o06429J4970p5799
$$ 2321798 2392048 2273647 2550218 2421262 2857041 3109176 3042531 2436102 2451072 2375273
3004B375273j54124K80672P1168k28129R8520J85100j35350j86522J68331J86228
$$ 2375273 2221149 2501821 2572989 2344860 2443380 2628480 2493130 2306608 2474939 2661167
2994B661167k20845k33925L2000L06955j37972K13239O8344o9098j66055J73035
$$ 2661167 2440322 2206397 2238397 2545352 2407380 2620619 2688963 2619865 2453810 2626845
2984B626845l3768K9916m41187J09894K96084K80810l01580k88810J26755l43838
$$ 2626845 2593077 2622993 2181806 2291700 2587784 2868594 2567014 2278204 2404959 2061121
2974B061121J21044K69214L51175p59858j13544J03269j12966J4894K17518p2744
$$ 2061121 2182165 2451379 2802554 2042696 1929152 2032421 1919455 1934349 2151867 2079123
2964B079123O4410J24828j85849L88629O7301j14226J48714k31515J13437m5695
$$ 2079123 2143533 2268361 2082512 2471141 2538442 2424216 2572930 2341415 2454852 2409157
2954B409157J23829K31107J76060q8689O7163K14901n99740L13294m999j67850
$$ 2409157 2532986 2764093 2940153 2851464 2918627 3133528 2533788 2847082 2842083 2674233
2944B674233n03566l6301L58111K4128l62047j46113j83069p7645J33358n466
$$ 2674233 2170667 2134366 2492477 2516605 2154558 2008445 1825376 1747731 1881089 1875623
2934A875623l1139J28146J79039k59826J02462j36571N1062p3158P4214m1369
$$ 1875623 1844484 1972630 2151669 1891843 1994305 1857734 1908796 1835638 1909852 1868483
2924A868483r3446j03828O9872L6650M23609j86781k89747K29992J83477k05103
$$ 1868483 1775037 1671209 1741081 1777731 2201340 2014559 1724812 1954804 2138281 1933178
2914A933178j82442J19191N4003q624k57716J55714Q7426k194o9971l665R8445
$$ 1933178 1750736 1869927 1923930 1915306 1657590 1813304 1900730 1898536 1828565 1824900 1923345
2903A923345l66413l57735k14663m26754K50313K53492K52875r782K65769k03803
$$ 1923345 1556932 1199197 984534 557780 808093 1061585 1314460 1304678 1570447 1366644
2893A366644k74385K94511o1600J77999J1239r1314m2881K8774q9216L2044l58677
$$ 1366644 1092259 1386770 1325170 1503169 1514408 1423094 1380213 1408987 1319771 1351815 993138
2882I93138r2011j09851J52468r6418K06734N09407l85441r0412l9636R1398j5541
$$ 993138 901127 791276 943744 847326 1054060 1563467 1178026 1087614 1047978 1139376 1123835
2871A123835k05653j09507k70370L52961J46512j73326o9517J75222l28469L00085
$$ 1123835 918182 808675 538305 891266 1037778 864452 794935 970157 641688 941773
2861I41773j77949L11677J53195n78323j26962K11545L02003r2624k44165k02534
$$ 941773 763824 1075501 1228696 650373 523411 734956 1036959 944335 700170 497636
2851D97636O6306m68207J78054L61023j8178j03942j2590j62084L96401L158J52374
$$ 497636 563942 95735 273789 634812 616634 512692 500102 338018 734419 737577 889951
2840H89951m63052p7444O3929j7259M3887m34384J88189N07252k51653n73405
$$ 889951 426899 349455 413384 396125 440012 5628 193817 701069 449416 -123989
2830a23989m2846M65821q7298j1535L2717K61510l9985k33849N5108J73995K74935
$$ -123989 -166835 298986 211688 200153 232870 494380 454395 220546 275654 449649 724584
2819G24584k63052P0224k47904j83132L04340n5562p304R6494k70139j45653L6647
$$ 724584 461532 531756 283852 100720 405060 349498 342194 438688 168549 22896 59543
2808E9543J90225K38498j70357l23344M08466j63741l89296N27961M80330p5417
$$ 59543 249768 488266 317909 -5435 403031 239290 -150006 377955 858285 782868
2798G82868q36948j79918K07214L61057k9609m8340P9218K75484n06585m21302
$$ 782868 -54080 -233998 -26784 334273 304664 256324 335542 611026 104441 -316861
2788c16861P49320j91349M6413k0391k29820K4446k94234j24599K80616J70373
$$ -316861 432459 241110 287523 267132 37312 61758 -232476 -357075 -76459 93914
2778I3914K9689Q7457J54480l40208q2148K46696N08209k56790o74294J87284
$$ 93914 123603 211060 365540 25332 -56816 189880 698089 441299 -232995 -45711
2768d5711K3451l6398J54456J34088j78067M39382K9661j79083j32066J864P2967
$$ -45711 -22260 -58658 95798 229886 51819 491201 520862 341779 209713 211577 284544
2757B84544l97475J84750p9986K82413k30299k36629J93175o436k66314N18571
$$ 284544 -112931 71819 -8167 274246 43947 -192682 493 -5943 -272257 246314
2747B46314o3230l04696n3883j9136j57256J19154K46716K37672j33056o4887
$$ 246314 183084 -121612 -175495 -194631 -351887 -232733 13983 251655 118599 53712
2737E3712k09399l20848K21334L75400j5722l55105J79634j77854J45089J18998
$$ 53712 -155687 -476535 -255201 120199 104477 -250628 -70994 -248848 -103759 15239
2727A5239k09921J22557K4699l38034K67719P2177K80500l8756K36092l70701
$$ 15239 -194682 -72125 -47426 -385460 -117741 -45564 234936 196180 432272 61571
2717F1571J01802J27686j64001L72486r5243j57771J08949K11484j94690j70599
$$ 61571 163373 291059 127058 499544 404301 246530 355479 566963 372273 201674
2707B01674o6450m2718n15187k38677J93311M32184M4477K07153m19350j29945
$$ 201674 135224 92506 -422681 -661358 -468047 -35863 8614 215767 -203583 -333528
2697c33528L1428l0119P45806Q7811j15667k48415J68758j46861j09748Q208m39258
$$ -333528 -302100 -332219 413587 501398 385731 137316 306074 159213 49465 57673 -381585
2686c81585M417l05868L84765M01678k92485j14583L1644l28768K94201L90040
$$ -381585 -377168 -683036 -298271 103407 -189078 -303661 -272017 -600785 -306584 83456
2676H3456j31813R5193k79141k91776P4659K71687Q0159K4791p9880M19597k74019
$$ 83456 -48357 46836 -232305 -524081 -449422 -177735 -97576 -72785 -152665 266932 -7087
2665g087l0343l70489R4737K42936j9734l695j73994k06139r7359L49488j07882
$$ -7087 -37430 -407919 -313182 -70246 -89980 -93675 -267669 -473808 -571167 -221679 -329561
2654c29561k46960J66221j88582L53224K48390L58828j25393n44819K58587j44555
$$ -329561 -576521 -410300 -598882 -245658 2732 361560 236167 -308652 -50065 -194620
2644a94620j80689L41003J50461n25724J32599O1773n3068L9160J19274R3072
$$ -194620 -375309 -34306 116155 -409569 -276970 -215197 -268265 -229105 -109831 -16759
2634a6759J47771n7703K17126k46204K1638n9713k01695l42695M3805K64268m92709
$$ -16759 131012 73309 290435 44231 65869 6156 -195539 -538234 -494429 -230161 -722870
2623g22870R3384K81263J72484J91729M43750j47558l08066N2395r762J01135
$$ -722870 -629486 -348223 -175739 15990 459740 312182 4116 56511 46749 147884
2613A47884p9319J07487M7037k62514o6483r040J10843M07146J98171m98879k85764
$$ 147884 68565 176052 223089 -39425 -105908 -114948 -4105 403041 601212 102333 -183431
2602a83431J29659Q0709n5559N9825L13289m30006J44311K46731O6476n58184
$$ -183431 -53772 26937 -28622 31203 344492 -85514 58797 305528 372004 -186180
2592a86180j44843M13478J831r5603J29961m0791j16422M77919P6605k24349j81468
$$ -186180 -331023 82455 84286 -11317 118644 77853 -38569 439350 515955 291606 110138
2581A10138K95440J49380k09297k5409j86612L01435J35418j62761o01532J8206
$$ 110138 405578 554958 345661 320252 133640 435075 570493 407732 -193800 -175594
2571a75594J52869K93161k4265J38574L5588J58375l43690l23557M19336P5445
$$ -175594 -22725 270436 246171 384745 420333 578708 235018 -88539 330797 406242
2561D06242m2881m61872L45198O5706j01941j3838K75495l7974k59183n3124k50743
$$ 406242 363361 -98511 246687 312393 210452 196614 472109 434135 174952 121828 -128915
2550a28915J37812K2685J5726j38742j06999K56027n3007J33519J67600o2776
$$ -128915 8897 31582 47308 -91434 -198433 57594 4587 138106 305706 242930
2540B42930K00453k8532m68765M74650l39616R3814J47482K07829l52088l2570
$$ 242930 443383 414851 -53914 420736 81120 174934 322416 530245 178157 145587
2530A45587l71906J72779J77574j34744j63283J27711J91277J75668J45362m9276
$$ 145587 -226319 -53540 124034 -10710 -173993 -46282 144995 320663 466025 416749
2520D16749k36029m94993L3721q7465K75055J79895m2871j55072P6721j24474
$$ 416749 180720 -314273 -280552 -368017 -92962 86933 44062 -111010 -34289 -158763
2510a58763L84405K74614k53677m29284J04036k85478p8934M85780R390k15130
$$ -158763 225642 500256 246579 -182705 -78669 -364147 -443081 42699 52089 -163041
2500a63041k21307J10621N46868J58565l23810k57603Q6042J471K2765N07122
$$ -163041 -384348 -273727 273141 431706 107896 -149707 -63665 -62194 -39429 467693
2490D67693k83459k96857q5500K93761K63965k31140K3679J58130J47287k22142
$$ 467693 184234 -112623 -198123 95638 359603 128463 152142 310272 457559 235417
2480B35417n09178k30040L18710J88545j60975K25690p8878J25357K35502k16425
$$ 235417 -273761 -503801 -185091 3454 -157521 68169 -10709 114648 350150 133725
2470A33725l99929k39857J30658J43667N24143m22423L7389o5415K09925K59577
$$ 133725 -266204 -506061 -375403 -231736 292407 -130016 -92627 -158042 51883 311460
2460C11460K89006k94537j72079J22611k04614J05591J0813j55063k04943L79861
$$ 311460 600466 305929 133850 256461 51847 157438 168251 13188 -191755 188106
2450A88106j21706K36327k19314m92785K13846M67736m2434J43813m24389l82743
$$ 188106 66400 302727 83413 -409372 -195526 272210 229776 373589 -50800 -433543
2440d33543M04831J30169K37373j06414p2362m5685k29303M0434K56990K53514
$$ -433543 -28712 101457 338830 232416 160054 114369 -114934 -74500 182490 436004
2430D36004K39254j74211m40772j66133O352J0454j22137J45852O6956K04483
$$ 436004 675258 501047 60275 -105858 -99506 -89052 -211189 -65337 1619 206102
2420B06102R7438j13939j04534k07650N12959o2596k80652j6443P2958J07409
$$ 206102 303540 189601 85067 -122583 390376 327780 47128 30685 103643 211052
2410B11052K88008k45892J86802k87240p2504M14889L59791k74475l4248l4052
$$ 211052 499060 253168 439970 152730 80226 495115 854906 580431 546183 512131
2400E12131J74219k16548l49287J88649M86156j20217n13382J61128M3295L8017
$$ 512131 686350 469802 120515 309164 795320 675103 161721 322849 366144 404161
2390D04161Q5109k97192O2222L85864R7150k08897R6131k6513o59565L16896k17473
$$ 404161 489270 192078 254300 640164 737314 528417 624548 598035 -61530 255366 37893
2379C7893J34938k98074J83753j43396K9797j3854L1780K90124K91009n4401k50114
$$ 37893 172831 -125243 58510 -84886 -55089 -68943 -37163 252961 543970 489569 239455
2368B39455N29724o1875l95032l54545k4116L43543J07980J60671J86549j49413
$$ 239455 769179 707304 312272 -42273 -66389 277154 385134 545805 732354 582941
2358E82941j91458r4295J85052k20485p9092P7966M90606J28194k61343L71511
$$ 582941 391483 297188 482240 261755 182663 260629 751235 879429 618086 989597
2348I89597m01308l433P9463n5736J4392k49857O9667n3638J24904j30483J64357
$$ 989597 588289 584856 664319 608583 622975 373118 442785 389147 514051 383568 547925
2337E47925K65555k48971J10316L8225k13138M1952K73216o67662o1872L23561
$$ 547925 813480 564509 674825 713050 499912 541864 815080 147418 85546 409107
2327D09107J89275O6633J45692m06540K6484k0291o04154M18556K31260j65439
$$ 409107 598382 665015 810707 404167 430651 410360 -193794 224762 456022 290583
2317B90583M82384K13865k08675J7322L33587k91345M8497J96120l15099L0719
$$ 290583 772967 986832 778157 795479 1129066 837721 886218 1082338 767239 797958
2307G97958m03088L93221j63867l48542J90113J95308K17658j19072k89414k36457
$$ 797958 394870 788091 624224 275682 465795 661103 878761 759689 470275 233818
2297B33818J93413p8442K41461n2880n4982K62657k88640k77886L29811N92275
$$ 233818 427231 348789 590250 537370 482388 745045 456405 178519 508330 1100605
2287A100605j83508K15845m6013J26027r1302k48678k65825j99837K02222m8262
$$ 1100605 917097 1132942 1086929 1212956 1121654 872976 607151 407314 609536 561274
2277E61274L36201n0492k0314L74877j56878k46647J57599K2967q2153P2007l41079
$$ 561274 897475 846983 826669 1201546 1044668 798021 955620 978587 896434 968441 627362
2266F27362L97177K62418k76100j8520M03193n2353O9140M7983n75749L13499
$$ 627362 1024539 1286957 1010857 992337 1395530 1343177 1412317 1460300 884551 1198050
2256A198050J07810L1968q364L23373k15915J42554K34570l66495l87155K56639
$$ 1198050 1305860 1337828 1329464 1652837 1436922 1579476 1814046 1447551 1060396 1317035
2246A317035J94595k96109m8006K06675P9930R3336n6389L29111l793j28942K41224
$$ 1317035 1511630 1215521 1167515 1374190 1454120 1547456 1491067 1820178 1816385 1687443 1928667
2235A928667k20180M54116q420k85076M15202M50474l58466k30534L83366K75562
$$ 1928667 1708487 2162603 2154183 1869107 2284309 2734783 2376317 2145783 2529149 2804711
2225B804711l48176j41784M02255K75884o09635K74418j37517L44199J34138K80413
$$ 2804711 2456535 2314751 2717006 2992890 2383255 2657673 2520156 2864355 2998493 3278906
2215C278906K02298k13331j13160o37582L79409M87909k62293J43629Q4704n6550
$$ 3278906 3481204 3267873 3154713 2517131 2896540 3384449 3122156 3265785 3350489 3293939
2205C293939Q2462N13208r5977m5854O7309j72061N8202K0638R2848Q066j15017
$$ 3293939 3376401 3889609 3793632 3747778 3815087 3643026 3701228 3721866 3814714 3822780 3707763
2194C707763N34948J28857j120M1411j00771K40569k36580N693J68521J21824
$$ 3707763 4242711 4371568 4370448 4411859 4311088 4551657 4315077 4320770 4489291 4611115
2184D611115M12416M35373K34862M8498p2551k20951j02534m4830L07583L61359
$$ 4611115 5023531 5458904 5693766 5742264 5669713 5448762 5346228 5301398 5608981 5970340
2174E970340J36082M09641O05342j14888L6004M14958K90340O14392j62634M98836
$$ 5970340 6106422 6516063 7121405 7006517 7042521 7457479 7747819 8362211 8199577 8698413
2164H698413J59241K67363M2577O76205N46063Q3663n873L40537M35648N95469
$$ 8698413 8857654 9125017 9167594 9843799 10389862 10473525 10467652 10808189 11243837 11839306
2154A1839306L29420J90852M65763P25377N07421M31393P80495J077419M43564
$$ 11839306 12168726 12359578 12825341 13550718 14058139 14489532 15270027 16347446 16791010
2145A6791010L80057P46611J169545P22073J159221J825442J653412J044545J571803
$$ 16791010 17171067 17917678 19087223 19809296 20968517 22793959 24447371 25491916 27063719
2136B7063719K099575K115834K234312K166901K476558L253864M001258M640241
$$ 27063719 29163294 31279128 33513440 35680341 38156899 41410763 45412021 50052262
2128E0052262M710427N187322N810906N430424M807989L214731P53733j757802
$$ 50052262 54762689 59950011 65760917 71191341 75999330 79214061 79967794 78209992
2120G8209992m427053o623052p397554o906253o363707n285352m946358l609811
$$ 78209992 73782939 67159887 59762333 52856080 46492373 41207021 36260663 32650852
2112C2650852l195352k973218j967523j898096j774731j900440j356991j399578
$$ 32650852 29455500 26482282 24514759 22616663 20841932 18941492 17584501 16184923
2104A6184923p28157j391548j285318q12500n35696o69274o04074l50775m02919
$$ 16184923 15456766 14065218 12779900 11967400 11431704 10762430 10158356 9807581 9404662
2095I404662j059152o03464k13744j53201q62169k95720m54831k49440l2066j22653
$$ 9404662 8345510 7742046 7528302 7375101 6512932 6217212 5762381 5512941 5480875 5358222
2085E358222n65394k29039k91334K8727Q9560k79418l20111L3922k27043K66762
$$ 5358222 4792828 4563789 4272455 4301182 4390742 4111324 3791213 3825135 3598092 3864854
2075C864854l62618l33239r7502K21734o08527m63905q8465K19881J10569j73104
$$ 3864854 3502236 3168997 3071495 3293229 2684702 2220797 2132332 2352213 2462782 2289678
2065B289678K71858o00487J92867n3495J08070m06285K56428M2147l84017p9859
$$ 2289678 2561536 1961049 2153916 2100421 2208491 1802206 2058634 2100781 1716764 1636905
2055A636905l28924J69164J47255m98864J7904j91245K02182P2707N4891l58456
$$ 1636905 1307981 1477145 1624400 1125536 1143440 952195 1154377 1227084 1281975 923519
2045I23519J72762Q0494K10075K23899k95108k8237J13706Q9932K44437m36898
$$ 923519 1096281 1176775 1386850 1610749 1315641 1287404 1401110 1491042 1735479 1298581
2035A298581L0934k37572j96114N38298m49998J13942Q3201k09558J33689J18696
$$ 1298581 1329515 1091943 895829 1434127 984129 1098071 1181272 971714 1105403 1224099
2025A224099n5533k89422j96359j05412q2523Q7726L62221k09835j43773q1561
$$ 1224099 1168566 879144 682785 577373 494850 582576 944797 734962 591189 509628
2015E09628j58178J18308L31226J40288l76968j94420J45258K36642n99859R9977
$$ 509628 351450 469758 800984 941272 564304 369884 515142 751784 151925 251902
2005B51902L60796k4482J72081m69714r9142J67728R3287j80465k29050Q7050
$$ 251902 612698 588216 760297 290583 191441 359169 452456 271991 42941 129991
1995A29991L6569q0618J07446J02215R8628J98802k7349l45912j80249K97219
$$ 129991 166560 85942 193388 295603 394231 593033 565684 219772 39523 336742
1985C36742J78166j91789J33695R0423O0716m6681k22854L23735j96604n31821
$$ 336742 514908 323119 456814 547237 607953 561272 338418 662153 465549 -66272
1975f6272j25240K58237N75713j24439k00758L44340k25836q551M46169m25687
$$ -66272 -191512 66725 642438 517999 317241 661581 435745 427194 873363 447676
1965D47676m01383L88051j26141l6953j10996K70123K8727j81392L79820Q7866
$$ 447676 46293 434344 308203 271250 160254 430377 459104 277712 657532 745398
1955G45398k77165K8252m16860J88837j9261l33254K00389Q9746J76319j32229
$$ 745398 468233 496485 79625 268462 249201 -84053 116336 206082 382401 250172
1945B50172q534R9630K6487r2926j13226M35830k55211j33813J03817j58452l364
$$ 250172 241638 341268 367755 274829 161603 597433 342222 208409 312226 153774 150410
1934A50410K0457o2294l13615m9165Q4500M17344K01002j76985J78391j62321
$$ 150410 170867 108573 -205042 -254207 -169707 247637 448639 271654 450045 287724
1924B87724k05843J42421J45947k22869j02865J80903k84974L91842l55109j27992
$$ 287724 81881 224302 370249 147380 44515 225418 -59556 332286 -22823 -150815
1914a50815P1283j01505R5161K94612M07758m06962j49622M6471j23271K41182
$$ -150815 -79532 -181037 -85876 208736 616494 209532 59910 106381 -16890 224292
1904B24292q2866p919l59839k19166M12695K87347j09210J23424N0712j77127
$$ 224292 141426 133507 -226332 -445498 -32803 254544 145334 268758 319470 142343
1894A42343J74581j47042K40395j48487j46493o420L18121K09865l0481j67327
$$ 142343 316924 169882 410277 261790 115297 108877 426998 636863 606382 439055
1884D39055o88005l4871J02630m388L51906k30388k93841K10375O06372R496R802
$$ 439055 -248950 -283821 -181191 -185579 166327 -64061 -357902 -147527 458845 468341 478143
1873D78143l58971k47570l8724o7573M16392L53873l83289J13349j9000j43192
$$ 478143 119172 -128398 -167122 -234695 181697 535570 152281 265630 246630 103438
1863A03438L21103K14874q2749r5624P3890R4373k2515m92373K18403l27867k1313
$$ 103438 424541 639415 556666 461042 534932 629305 606790 114417 332820 4953 -16360
1852a6360J44068J41551o2809K71409j75729j375j9899m38375J19251Q195j12463
$$ -16360 127708 269259 206450 477859 302130 300755 280856 -157519 -38268 -30073 -142536
1841a42536K70235j3468j53650J58558Q1241J88988j05477k8081n8763l3996O8391
$$ -142536 127699 114231 -39419 119139 200380 389368 283891 255810 197047 163051 231442
1830B31442J21252K69925m1683J25190l27395Q4738r1299O6107n52370l63520
$$ 231442 352694 622619 580936 706126 378731 463469 372170 438277 -114093 -477613
1820d77613N70434m7359J15749l7156n2271j92722J44837J31319J30280L32515
$$ -477613 92821 45462 161211 124055 71784 -120938 23899 155218 285498 618013
1810F18013r5717q4160m02593Q4369J51941k01238L4778J80319N1458J81576j36733
$$ 618013 522296 438136 35543 119912 271853 70615 105393 285712 337170 518746 382013
1799C82013p1725J33008j20707m32206k77434L624R8722M2001M88287Q8515N5071
$$ 382013 310288 443296 322589 -109617 -387051 -383427 -284705 -242704 245583 334098 389169
1788C89169k83215k27459K35536l6004j08559j05699j97568j00624P05304j7007
$$ 389169 105954 -121505 114031 78027 -30532 -136231 -333799 -434423 270881 253874
1778B53874J00585l04033J85024r9916k77226p8825O092M5548K96529r0548J96742
$$ 253874 354459 50426 235450 135534 -141692 -220517 -214425 -168877 127652 37104 233846
1767B33846k08370p0177m12868j43239K63279Q0148o1172k44095M42429r7798
$$ 233846 25476 -44701 -457569 -600808 -337529 -257381 -318553 -562648 -120219 -218017
1757b18017J13532J17279n09165L46691K51000K05638l47031q7907K29633l75207
$$ -218017 -104485 12794 -496371 -149680 101320 306958 -40073 -127980 101653 -273554
1747b73554k03720L94136J91666M407k66395o1812K09003k52414K49777j60744
$$ -273554 -477274 -83138 108528 112935 -153460 -215272 -6269 -258683 -8906 -169650
1737a69650p6148L55566M7375j15203K2644j68172j87091l01504N34782J92603
$$ -169650 -245798 109768 157143 41940 64584 -103588 -290679 -592183 -57401 135202
1727A35202m869J95959K39060N5255m69060j40716J57252r9723M7255j4811l61881
$$ 135202 130333 326292 565352 620607 151547 10831 168083 68360 115615 100804 -261077
1716b61077J53935J54378K12447r6457p655M10244r0899j35937k55516q6711k6235
$$ -261077 -107142 47236 259683 163226 155571 565815 474916 338979 83463 -3248 -29483
1705b9483J56560j75885k71790J71639M11404N9736k57519N5966l59538L34975
$$ -29483 127077 -48808 -320598 -148959 262445 322181 64662 120628 -238910 96065
1695I6065M7194m34608j55203M98980M34715k74571j60941l3001m7264j10274
$$ 96065 143259 -291349 -446552 52428 487143 212572 51631 18630 -28634 -138908
1685a38908j72619j12677L29217k05179O0569L50019J18522K88767l64878n38034
$$ -138908 -311527 -424204 -94987 -300166 -239597 110422 228944 517711 152833 -385201
1675c85201J22197k12389M96129j53415k36427P9453k0586K7971q716K48699L65795
$$ -385201 -263004 -475393 20736 -132679 -369106 -289653 -310239 -282268 -290984 -42285 323510
1664C23510O0405l30648J17836j78215m02239n0320Q7869K34156p8057j28846
$$ 323510 383915 53267 171103 -7112 -409351 -459671 -371802 -137646 -215703 -344549
1654c44549k5378K96087k48875k43447K87889L22437j13365L6930L17126q7135
$$ -344549 -369927 -73840 -322715 -566162 -278273 44164 -69201 -32271 284855 197720
1644A97720q2849j89066J59603K61171L7390o4413k91956r0474k47846l11389
$$ 197720 114871 -74195 85408 346579 383969 319556 27600 -62874 -310720 -622109
1634f22109Q8320J15140J38772K3441L01218o73636J68337L96626m8681J56566
$$ -622109 -533789 -418649 -279877 -256436 44782 -628854 -460517 -63891 -112572 43994
1624D3994j01055Q8154o6053m44387K21821K10643j17162O2951N0175j87547j55229
$$ 43994 -57061 31093 -34960 -479347 -257526 -46883 -164045 -101094 -50919 -238466 -393695
1613c93695L67655n7438j13478L58657P3846l87416k70718k4871L81616L23860
$$ -393695 -26040 -83478 -196956 161701 235547 -151869 -422587 -447458 -65842 258018
1603B58018l29427j82962J12152Q299L85684j72147K65748j6864P64J53358j32186
$$ 258018 -71409 -254371 -142219 -133920 251764 79617 345365 328501 329265 482623 350437
1592C50437j07968n8319K2227J07482M28233j79773l93537J75911k86474P5353
$$ 350437 242469 184150 206377 313859 742092 562319 168782 344693 58219 133572
1582A33572o6044K33409j69051j78164K41406J09996J92636r448j35331m2587
$$ 133572 67528 300937 131886 -46278 195128 305124 497760 488312 352981 310394
1572C10394j60031j68084P9437j79164n3532J26341l5309l52806J99957J71675
$$ 310394 150363 -17721 61716 -117448 -170980 -44639 -79948 -432754 -232797 -61122
1562f1122O2158k5372K23147l11266Q8196L41934j82092m06312L28716J75657
$$ -61122 1036 -24336 198811 -112455 -24259 317675 135583 -270729 57987 233644
1552B33644j05302j72037r8230l04474K30446M8124j08582k94501L54348J87884
$$ 233644 128342 -43695 -141925 -446399 -215953 -167829 -276411 -570912 -216564 -28680
1542b8680M0872n40604K21058L35154j78385K00190m00251k0819R2806L09884
$$ -28680 12192 -528412 -307354 27800 -150585 49605 -350646 -371465 -278659 31225
1532C1225k71609n2864L63985L20408j10555m59143L4892k19454L14754J73487
$$ 31225 -240384 -293248 70737 391145 280590 -178553 -143661 -363115 -48361 125126
1522A25126J77109m4135l19454J98253J41381P0057O8302k11424l32005M514q2337
$$ 125126 302235 258100 -61354 136899 278280 348337 416639 205215 -126790 -122276 -204613
1511b04613K46079j01341m8632j08519k6732P8958K9266K08489N17635M876l68001
$$ -204613 41466 -59875 -108507 -217026 -243758 -164800 -135534 72955 590590 595466 227465
1500B27465m80316J65935J50189O6975J28515j63098J06946j57854J28678K72137
$$ 227465 -252851 -86916 63273 130248 258763 95665 202611 44757 173435 445572
1490D45572m24373j44509J43442L6443K05300o2653m36151M44416m79593j69674
$$ 445572 21199 -123310 20132 56575 261875 199222 -236929 207487 -272106 -441780
1480d41780O49560k13895l29544J37998L02837k06558j4733j29755J14358J62721
$$ -441780 207780 -6115 -335659 -197661 105176 -101382 -116115 -245870 -131512 31209
1470C1209P5761m850q6652R7096n38310j3030J67731N0887K29801J8624j34537
$$ 31209 106970 102120 15468 112564 -425746 -438776 -271045 -220158 9643 28267 -106270
1459a06270J79571n6973p3612Q6709k7196k40815J33633M54959k26294m9098n78609
$$ -106270 73301 16328 -57284 29425 2229 -238586 -104953 350006 123712 74614 -503995
1448e03995Q5676K27334L0327J18868J27578k05715j61331K03304J27452p5569
$$ -503995 -418319 -190985 -160658 -41790 85788 -119927 -281258 -77954 49498 -26071
1438b6071o7602n3351j13497K81453P7802l52989R0213J84832j06639O8046J41506
$$ -26071 -93673 -147024 -260521 20932 98734 -254255 -164042 20790 -85849 -17803 123703
1427A23703L09083n26277K07714k51941K45501j96812j40761J90787P6981O7161
$$ 123703 432786 -93491 114223 -137718 107783 -89029 -229790 -39003 37978 105139
1417A05139N673M9117k53614l56798K50595j05880l04600K69836Q1668l0750N3369
$$ 105139 110812 159929 -93685 -450483 -199888 -305768 -610368 -340532 -258864 -289614 -236245
1406b36245k30444J70573L70886J75198l10915l00369k05884M32965L45805l50612
$$ -236245 -466689 -296116 74770 249968 -60947 -361316 -567200 -134235 211570 -139042
$$ [...]
##END NTUPLES=NMR SPECTRUM
##END=
