##TITLE=1H_CA-9183
 CDCl3
 8 sc, 
 11.8.2023
##JCAMPDX= 6.0         $$ Bruker NMR JCAMP-DX V2.0
##DATA TYPE= NMR SPECTRUM
##DATA CLASS= NTUPLES
##ORIGIN= UXNMR, Bruker Analytische Messtechnik GmbH
##OWNER= root
$$ XWIN-NMR		Version 3.5
$$ Fri Aug 11 14:15:53 2023 Russian Standard Time (UT+4h)  she@DPX200
##.OBSERVE FREQUENCY= 200.13135
##.OBSERVE NUCLEUS= ^1H
##.ACQUISITION MODE= SIMULTANEOUS
##.ACQUISITION SCHEME= undefined
##.AVERAGES= 8
##.DIGITISER RES= 18
##SPECTROMETER/DATA SYSTEM= spect
##.PULSE SEQUENCE= zg30
##.SOLVENT NAME= CDCl3
##.SHIFT REFERENCE= (INTERNAL, CDCl3, 0, 15.7392)
##AUDIT TRAIL= $$ (NUMBER, WHEN, WHO, WHERE, WHAT)
$$ ##TITLE= Audit trail, XWIN-NMR		Version 3.5
$$ ##JCAMPDX= 5.01
$$ ##ORIGIN= Bruker BioSpin GmbH
$$ ##OWNER= she
$$ F:/spectra/data/she/nmr/H-F/1/pdata/1/auditp.txt
$$ ##AUDIT TRAIL=  $$ (NUMBER, WHEN, WHO, WHERE, WHAT)
(   1,<2023-08-11 14:14:19.96 +0400>,<she>,<DPX200>,
      <created by zg, POWCHK disabled, PULCHK disabled
       configuration hash MD5:
       00 E9 B6 7A A2 85 ED C7 34 08 36 98 17 FE 4E 26
       data hash MD5: 16K
       58 70 CB 3E BA 7D 41 B9 C8 53 00 A0 DF 04 FC C9>)
(   2,<2023-08-11 14:14:27.92 +0400>,<she>,<DPX200>,
      <Start of raw data processing
       efp BC_mod = 2 LB = 0.24 FT_mod = 6 PKNL = 1 PHC0 = -21039.66 PHC1 = 10.45272 SI = 16K 
       data hash MD5: 16K
       70 3D 03 21 8D 61 B4 D7 57 5C FE DD 1B 4D 5B 07>)
(   3,<2023-08-11 14:14:44.84 +0400>,<she>,<DPX200>,
      <pk PHC0 = -5.752072 PHC1 = 8 
       data hash MD5: 16K
       FF 68 98 6F D9 D4 79 F2 DE 79 96 6D ED 1E CF 26>)
(   4,<2023-08-11 14:14:48.29 +0400>,<she>,<DPX200>,
      <abs ABSG = 5 
       data hash MD5: 16K
       DC 02 F5 E3 57 52 8D 85 08 CA 48 47 25 75 6F 96>)
$$ ##END=
$$ 
$$ hash MD5
$$ 48 A8 1E 44 AE 39 80 0A 2C 84 8A B2 62 25 34 3B
##$RELAX= 
##$RELAX= 
##$RELAX= 
##$RELAX= 
##$RELAX= 
##$RELAX= 
$$ Bruker specific parameters
$$ --------------------------
##$DU= <F:/spectra>
##$EXPNO= 1
##$NAME= <H-F>
##$PROCNO= 1
##$TYPE= <nmr>
##$USER= <she>
##$AMP= (0..31)
100 100 100 100 100 100 100 100 100 100 100 100 100 100 100 100 100 100 
100 100 100 100 100 100 100 100 100 100 100 100 100 100 
##$AQSEQ= 0
##$AQ_mod= 1
##$AUNM= <au_zg>
##$AUTOPOS= <>
##$BF1= 200.13
##$BF2= 200.13
##$BF3= 200.13
##$BF4= 200.13
##$BF5= 200.13
##$BF6= 200.13
##$BF7= 200.13
##$BF8= 200.13
##$BYTORDA= 1
##$CFDGTYP= 0
##$CFRGTYP= 5
##$CHEMSTR= <none>
##$CNST= (0..31)
1 1 145 1 1 1 1 1 1 1 1 1 1 1 1 1 1 1 1 1 1 1 1 1 1 1 1 1 1 1 1 1 
##$CPDPRG= <>
##$CPDPRG1= <>
##$CPDPRG2= <>
##$CPDPRG3= <>
##$CPDPRG4= <mlev>
##$CPDPRG5= <mlev>
##$CPDPRG6= <mlev>
##$CPDPRG7= <mlev>
##$CPDPRG8= <mlev>
##$CPDPRGB= <>
##$CPDPRGT= <>
##$D= (0..31)
0 1.2 0 0 0 0 0 0 0 0.06 0 0.03 0 0 0 0 0.0002 0 0 0 0 0 0 0 0 0 0 0 0 
0 0 0 
##$DATE= 1691748859
##$DBL= (0..7)
120 120 120 120 120 120 120 120 
##$DBP= (0..7)
150 150 150 150 150 150 150 150 
##$DBP07= 0
##$DBPNAM0= <>
##$DBPNAM1= <>
##$DBPNAM2= <>
##$DBPNAM3= <>
##$DBPNAM4= <>
##$DBPNAM5= <>
$$ [...]
##$SUBNAM3= <"">
##$SUBNAM4= <"">
##$SUBNAM5= <"">
##$SUBNAM6= <"">
##$SUBNAM7= <"">
##$SUBNAM8= <"">
##$SUBNAM9= <"">
##$SW= 18.05172834244
##$SWIBOX= (0..15)
0 0 2 0 0 0 0 0 0 0 0 0 0 0 0 0 
##$SW_h= 3612.71676300578
##$TD= 16384
##$TD0= 1
##$TE= 0
##$TE2= 300
##$TE3= 300
##$TEG= 300
##$TL= (0..7)
0 120 120 120 120 120 120 120 
##$TP= (0..7)
150 150 150 150 150 150 150 150 
##$TP07= 0
##$TPNAME0= <>
##$TPNAME1= <>
##$TPNAME2= <>
##$TPNAME3= <>
##$TPNAME4= <>
##$TPNAME5= <>
##$TPNAME6= <>
##$TPNAME7= <>
##$TPOAL= (0..7)
0.5 0.5 0.5 0.5 0.5 0.5 0.5 0.5 
##$TPOFFS= (0..7)
0 0 0 0 0 0 0 0 
##$TUNHIN= 0
##$TUNHOUT= 0
##$TUNXOUT= 0
##$USERA1= <user>
##$USERA2= <user>
##$USERA3= <user>
##$USERA4= <user>
##$USERA5= <user>
##$V9= 5
##$VALIST= <valist>
##$VCLIST= <CCCCCCCCCCCCCCC>
##$VD= 0
##$VDLIST= <DDDDDDDDDDDDDDD>
##$VPLIST= <PPPPPPPPPPPPPPP>
##$VTLIST= <TTTTTTTTTTTTTTT>
##$WBST= 1024
##$WBSW= 4
##$XGAIN= (0..3)
0 0 0 0 
##$XL= 0
##$YL= 0
##$YMAX_a= 210760
##$YMIN_a= -222801
##$ZGOPTNS= <>
##$ZL1= 120
##$ZL2= 120
##$ZL3= 120
##$ZL4= 120
##$ABSF1= 15.76342
##$ABSF2= -2.288429
##$ABSG= 5
##$ABSL= 3
##$ALPHA= 0
##$AQORDER= 0
##$ASSFAC= 0
##$ASSFACI= 0
##$ASSFACX= 0
##$ASSWID= 0
##$AUNMP= <proc_1d>
##$AZFE= 0.1
##$AZFW= 0.1
##$BCFW= 0
##$BC_mod= 2
##$BYTORDP= 0
##$COROFFS= 0
##$CY= -3
##$DATMOD= 1
##$DC= 0
##$DFILT= <>
##$DTYPP= 0
##$F1P= 0
##$F2P= 0
##$FCOR= 1
##$FTSIZE= 16384
##$FT_mod= 6
##$GAMMA= 0
##$GB= 0
##$INTBC= 1
##$INTSCL= 3.70164e-10
##$ISEN= 128
##$LB= 0.24
##$LEV0= 0
##$LPBIN= 0
##$MAXI= 10000
##$MC2= 0
##$MEAN= 0
##$ME_mod= 0
##$MI= 1.114404
##$NCOEF= 0
##$NC_proc= -7
##$NLEV= 6
##$NOISF1= 3.799351
##$NOISF2= 2.8
##$NSP= 0
##$NTH_PI= 0
##$NZP= 0
##$OFFSET= 15.73918
##$PC= 1
##$PHC0= -21045.41
##$PHC1= 18.45272
##$PH_mod= 1
##$PKNL= yes
##$PPARMOD= 0
##$PSCAL= 0
##$PSIGN= 0
##$REVERSE= no
##$SF= 200.130006476952
##$SI= 16384
##$SIGF1= 3
##$SIGF2= 2
##$SINO= 5.538805
##$SIOLD= 16384
##$SREGLST= <1H.CDCl3>
##$SSB= 0
##$STSI= 16384
##$STSR= 0
##$SW_p= 3612.71676300578
##$SYMM= 0
##$S_DEV= 0
##$TDeff= 16384
##$TDoff= 0
##$TI= <>
##$TILT= no
##$TM1= 0
##$TM2= 0
##$TOPLEV= 0
##$USERP1= <user>
##$USERP2= <user>
##$USERP3= <user>
##$USERP4= <user>
##$USERP5= <user>
##$WDW= 1
##$XDIM= 16384
##$YMAX_p= 392425058
##$YMIN_p= -647615
$$ End of Bruker specific parameters
$$ ---------------------------------
##NTUPLES= NMR SPECTRUM
##VAR_NAME=  FREQUENCY,     SPECTRUM/REAL,   SPECTRUM/IMAG
##SYMBOL=    X,             R,               I
##VAR_TYPE=  INDEPENDENT,   DEPENDENT,       DEPENDENT
##VAR_FORM=  AFFN,          ASDF,            ASDF
##VAR_DIM=   16384,         16384,           16384
##UNITS=     HZ,            ARBITRARY UNITS, ARBITRARY UNITS
##FACTOR=    0.220516191357247, 1,           1
##FIRST=     3149.88211753258, 0,            0
##LAST=      -462.834645473202, 0,           0
##MIN=       -462.834645473202, -647615,     0
##MAX=       3149.88211753258, 392425058,    0
$$ Real data points
##PAGE= N=1
##DATA TABLE= (X++(R..R)), XYDATA
$$ [...]
6916G5121j8292J967k02112n3610J8953j2354K6273O7808o3174J74568p1591r269
6904f5712J3858r4824o7145O7478k56724m7856Q7324J38727k4242q290J84738
6893g2668J62965j18179m8726l28665O2373J15249M9839J75497m2405Q4328j6391
6882B3217p6250j74546J02865q0166J08859k1175j17615q288K5336L5483j52894
6871c35174K9437J6494J14966k2289J12535M7443r0290L5859o4799J41426p0478
6860h4870o1146K0818r2104L4194l6866r7271K05125O4249m2048k01794P9821
6849b11892K51755j9719j00242P2191Q6591J7052k32719L7963o740k6146j36011
6838b67917l3288j64730L38409K7298k7021J34499n439q5046m5385P2635j64051
$$ plain form
6916 75121 56829 58796 -143316 -196926 -177973 -190327 -164054 -96246 -159420 15148 -56443 -65712
6904 -65712 -51854 -146678 -213823 -146345 -403069 -450925 -363601 -224874 -249116 -257406 -72668
6893 -72668 90297 -27882 -76608 -405273 -342900 -227651 -177812 -2315 -44720 39608 23217
6882 23217 -53033 -227579 -124714 -204880 -96021 -117196 -234811 -243099 -217763 -182280 -335174
6871 -335174 -305737 -289243 -174277 -196566 -84031 -36588 -126878 -91019 -155818 -14392 -84870
6860 -84870 -146016 -125198 -217302 -183108 -219974 -317245 -112120 -47871 -89919 -291713 -211892
6849 -211892 39863 20144 -80098 -7907 78684 95736 -136983 -99020 -105760 -131906 -267917
6838 -267917 -301205 -465935 -127526 -100228 -127249 7250 1811 -83235 -128620 -55985 -220036
6827b20036l4577J7403j54735J77013J10840j20850R9581R7621q1319k30651j17223
6816d56933J45094J99771m1183Q0282j8253k02718Q0542L39486j14518k50524
6806b38954P471J05342j06481j94945K012J99987Q3042q4630q1815P6113j6073
6795b48931m1579K8331R7374J64502j12366j59763J09510J3499j17406j30357
6785c97186J23150K52412J7086j53450J4370L5495m8376o2540J37857M9715j94290
6774b25757M4792J32652n4229r6349M1433P220k931L4830O053J27276J6184j44725
6762a13551o3592N3592j29020N2764J12363m748r3811R1322J0076o4643m505n8954
6750b12707J2466K48239j66323p9537K4574r067P7198J4606p6258O351P8838n8166
$$ plain form
6827 -220036 -254613 -237210 -391945 -214932 -104092 -224942 -125361 -27740 -109059 -339710 -456933
6816 -456933 -311839 -112068 -153251 -72969 -91222 -293940 -213398 126088 11570 -238954
6806 -238954 -231483 -126141 -232622 -427567 -425555 -225568 -142526 -227156 -308971 -232858 -248931
6795 -248931 -290510 -262179 -164805 -303 -112669 -272432 -162922 -149423 -266829 -397186
6785 -397186 -274036 -21624 -4538 -157988 -143618 -108123 -156499 -219039 -81182 -31467 -225757
6774 -225757 -180965 -48313 -102542 -198891 -157458 -150238 -153169 -118339 -112286 14990 31174 -113551
6762 -113551 -177143 -123551 -252571 -199807 -87444 -92192 -186003 -94681 -84605 -149248 -153753 -212707
6750 -212707 -200241 47998 -118325 -197862 -173288 -182355 -105157 -90551 -166809 -160458 -81620 -139786
6738a39786o9039p6862N4533J48183Q9149K9580j18483j36167J61848n0232q0134
6727a87410L4336J33798R5729J69365j16197k7915o7956l05410J05334N9542j05874
6716b12658m092N5324j05822K05999j2366k40125j358K42876J61169k046j26462
6705c9561l5639O6568j48374j37933R0335K9186k0862J01635n2828k16675L7382
6694c26766R2545q569q4935O9474K64591Q927p8123j07500k9171J40210M977k10228
6682b64568J22362M953O3534l7302P5338j0174J3227p9365j8913K3276J78045
6671G0413p1614l85208L6433J83487K68075k18989l0569o492N4724l356L707J1125
6659h8264r962j07425J91226J25447j24025J63867k65348j6917j03845K2282n3762
$$ plain form
6738 -139786 -208825 -285687 -231154 -82971 6178 35758 -82725 -218892 -57044 -107276 -187410
6727 -187410 -153074 -19276 76453 245818 129621 101706 33750 -271660 -166326 -106784 -212658
6716 -212658 -216750 -161426 -267248 -61249 -73615 -313740 -315098 -72222 88947 86901 -39561
6705 -39561 -75200 -8632 -157006 -294939 -204604 -175418 -196280 -94645 -147473 -364148 -326766
6694 -326766 -234221 -242790 -327725 -258251 6340 15267 -62856 -170356 -199527 -59317 -54340 -264568
6682 -264568 -142206 -137253 -73719 -111021 -35683 -45857 -32630 -111995 -130908 -107632 70413
6671 70413 -1201 -386409 -349976 -166489 101586 -117403 -147972 -154464 -99740 -103096 -99389 -88264
6659 -88264 -98226 -205651 -14425 111022 -13003 150864 -114484 -131401 -235246 -212964 -266726
6648b66726K4860l6435L8571l5072L88Q1969J585J50792N3422k46295M6383N7080
6636a29478m5467J13346O6870m6954J2584j54892L0759p6075j20700K05204R129
6625a35674j18048o9643K53179M5837q432j57410l7967p6818J52065n261o0593
6614b18765J24623j2322r4828p5416O365J63210J26681r2940Q764j32237J61294
6603c5571K10278j45252r4466k9173J53443l15280k3048J23745m9448m9538M5069
6592b09241j45468L8448J32457m1038R6666k59381K54363J97066j60621o5155
6582a61904J67114j18442j55945L3692J50581M1625p1121k6035j65988O5128k36173
6571d77468n1186K08944J73298R1854j82358O8771J25256j79772M4308l2464N233
$$ plain form
6648 -266726 -241866 -278301 -239730 -274802 -274414 -192445 -190860 -40068 13354 -232941 -186558 -129478
6636 -129478 -174945 -61599 5271 -41683 -29099 -183991 -153232 -229307 -350007 -144803 -135674
6625 -135674 -253722 -323365 -70186 -24349 -32781 -190191 -228158 -304976 -152911 -158172 -218765
6614 -218765 -94142 -106464 -201292 -276708 -270343 -107133 19548 -73392 -64628 -196865 -35571
6603 -35571 174707 29455 -65011 -94184 59259 -256021 -279069 -155324 -204772 -254310 -209241
6592 -209241 -354709 -316261 -183804 -224842 -128176 -387557 -133194 63872 -96749 -161904
6582 -161904 5210 -113232 -269177 -235485 -84904 -43279 -114400 -140435 -306423 -241295 -477468
6571 -477468 -528654 -319710 -146412 -54558 -236916 -168145 -42889 -222661 -178353 -210817 -205584
6560b05584J54915j30802r7043J39432j105j11256M2404J41760P647q226j03046
6549a70904j9269L27849M3359J1161j13578j49193j72337N7555N3359M72o1271
6538a92797J76782p1738j76194O6492N239l0588j9461K4516J2610J23029o5349
6527a47459R73m3210K8505n4611K12095J5739J27780l38689k16460J01942J23514
6516a89881L34240J68861j92104n7112p7619M0266j53026q5850J94512J66737
6506A49024Q0327j56354P286n3401m9832M0724M1419j51288p3450p8686J61267
6495h2964n9088N4601J8449j74784J35438P9214o9289k9750N0134J2121r8491
6484a64409l1511k7083J35274j24418j5970N7197O5905O4619o0079l5062O3475
$$ plain form
6560 -205584 -50669 -181471 -278514 -139082 -140187 -251443 -209039 -67279 -59632 -67858 -170904
6549 -170904 -190173 137676 181035 192196 78618 -70575 -242912 -185357 -131998 -131526 -192797
6538 -192797 -16015 -87753 -263947 -197455 -192216 -222804 -242265 -217749 -205139 -82110 -147459
6527 -147459 -146486 -189696 -161191 -215802 -3707 12032 139812 -198877 -415337 -313395 -189881
6516 -189881 144359 313220 121116 64004 -13615 26651 -126375 -212225 -17713 149024
6506 149024 229351 72997 80283 26882 -22950 17774 59193 -92095 -165545 -244231 -82964
6495 -82964 -142052 -87451 -69002 -243786 -108348 -29134 -98423 -128173 -78039 -65918 -164409
6484 -164409 -195920 -223003 -87729 -212147 -228117 -170920 -105015 -40396 -100475 -135537 -72062
6473g2062R6454J1318R2426k56132N76K8693K2039k42879l2518K98034o1331J41916
6461B6534n4504k06323n5110J54532N3366O1733l1343j02520q7234O8007J7217
6450a55645R1784J13931o0179k15727R6152K01858j27021p817N6148l6949J08530
6439F5065n3133L9587J5803k62426R6380j5564j02421M9871K3500K1248n0522
6428a72612J4303N7299j1063N8811J70667L4617j34198r6314N7731J2573r6764
6417a04950K43824j60926r7270J34842j31442K7624j66513n0747n8705P7294O3623
6406b23346J60594m881l5189R0402j26348j11778N1852J40295L0229J10117k22439
6395a40492P3787N4494j49620J01678M9439M3262o8977k3699O4708q7400j12343
$$ plain form
6473 -72062 24392 35710 128136 -127996 -127420 -98727 -76688 -319567 -352085 -54051 -115382 26534
6461 26534 -27970 -234293 -289403 -134871 -81505 -19772 -51115 -153635 -240869 -172862 -155645
6450 -155645 -63861 50070 -10109 -225836 -129684 72174 -54847 -62664 -6516 -43465 65065
6439 65065 11932 51519 67322 -195104 -98724 -114288 -216709 -166838 -143338 -122090 -172612
6428 -172612 -158309 -101010 -112073 -53262 117405 152022 17824 -78490 -20759 -8186 -104950
6417 -104950 138874 -22052 -119322 15520 -115922 -88298 -254811 -305558 -364263 -286969 -223346
6406 -223346 -62752 -67633 -102822 -12420 -138768 -250546 -198694 -58399 -28170 81947 -140492
6395 -140492 -66705 -12211 -161831 -60153 -10714 32548 -36429 -60128 4580 -82820 -195163
6384a95163Q9069j135n1344j0699n8426p3052J21632J47521J28875n0271j098
6373D5909J30364l12991N7400O5613j80526r478L3333j6077n0841K45721l8575
6362c0148j57135j9559Q584N2992r7860j1540R0814J73108L7650K20535m7309
6351B20132k27585L0503k4988j25670J19665Q26P7798j38854l2196J12201O2605
6340G4437j91253m5681R6063Q3691L3955k1829m0939P4512q6384j16369K7533
6329a12264K7008n0477j4624J75394p6105j04868R8164L4J9869o295m4798R5657
6317F695L9599J1171j4602r7692R8689J57387k64485N509o3510L0733J19156L819
6305C2469r2752J08699J46138j48505r3656m3942N1771K78405j02755m1419j3055
$$ plain form
6384 -195163 -106094 -107229 -158573 -169272 -227698 -300750 -179118 -31597 97278 47007 45909
6373 45909 176273 -136718 -79318 -13705 -194231 -203709 -170376 -186453 -237294 8427 -30148
6362 -30148 -187283 -206842 -198258 -145266 -243126 -254666 -163852 9256 46906 267441 220132
6351 220132 -7453 23050 -1938 -127608 -7943 -7117 70681 -68173 -100369 11832 74437
6340 74437 -116816 -162497 -66434 17257 51212 29383 -11556 62956 -23428 -139797 -112264
6329 -112264 -85256 -135733 -150357 25037 -51068 -155936 -57772 -57738 -37869 -44164 -88962 6695
6317 6695 46294 57465 42863 -54829 43860 201247 -63238 -57729 -121239 -90506 28650 32469
6305 32469 -60283 48416 194554 46049 -47607 -91549 -39778 238627 135872 94453 81398
6294H1398j57579k73670K17563J23889J66103P0195K6004o6480j58559L888K0735
6283E3487J0279p4057R6985Q4272M54p0980J2930J02007j14645j9049j80052J14369
6271A6000L3794k02259J96052j40655r7229J39609K7368K7605O5883M5326l1672
6260G9822j50935N6242n6035k0021P8540j18863N4288P3699m517J44169k5226
6249A11163k30504P251j79907o6332L33178o2293p9218O5671J25976J00650j32138
6238f503m9689l3222n0012j80704J94595J78967j36580J05502k7955J30275J0106
6227A34780O6900j15695j1972j91900j83512J87765K02229j60818O6582r9186
6217a04827J2192j13438Q1830l3147K02812J49823J1188j07684k29072O0717q0860
$$ plain form
6294 81398 -76181 -349851 -132288 -8399 157704 227899 253903 187423 28864 32752 53487
6283 53487 63766 -10291 86694 170966 171420 100440 113370 215377 100732 81683 -98369 16000
6271 16000 49794 -152465 43587 -97068 -194297 -54688 -27320 285 66168 111494 79822
6260 79822 -71113 -14871 -70906 -90927 -12387 -131250 -76962 -3263 -7780 136389 111163
6249 111163 -119341 -112090 -291997 -358329 -25151 -87444 -166662 -100991 24985 125635 -6503
6238 -6503 -56192 -89414 -139426 -320130 -125535 53432 -83148 22354 -5601 124674 134780
6227 134780 201680 85985 74013 -117887 -301399 -113634 88595 -72223 -5641 -104827
6217 -104827 -92635 -206073 -124243 -157390 45422 195245 206433 98749 -130323 -69606 -150466
6206a50466M3217O4354j4868J9881p7500J02290N942m2802j2523J8603J37155
6195I3283k26382M4466J29618L650j15026K4348J52508m0333R0264o9300J7978
6184A05074J14094r3642K845J8022N6914n4029r7388n6656Q2437j27787j50410
6173b00526p5904K14697M7276O2483M0014K9302J08151K26277l22898m7581J03563
6162A84854M5723O7292o0514p8040R4562k35954p1282K36208Q3105O8900n5800
6151B79054j29455M2070n7414k2479L6137O1960k44184R1949K55277N853n9880
6140B58888O5892L3161J26987n7707j48512J8288l0163J39249L1259p9999J51269
6129E08612M5449j401O3911q6667l6126K12950m1411j48450j52385q8001J7617
$$ plain form
6206 -150466 -107249 -42895 -57763 -37882 -115382 -13092 -7150 -49952 -62475 -43872 93283
6195 93283 -133099 -88633 40985 44635 -70391 -46043 106465 66132 156396 87096 105074
6184 105074 219168 125526 128371 146393 203307 149278 51890 -4766 77671 -50116 -200526
6173 -200526 -276430 -61733 -14457 48026 88040 117342 225493 451770 128872 81291 184854
6162 184854 230577 297869 237355 159315 253877 17923 -53359 182849 265954 334854 279054
6151 279054 149599 191669 134255 111776 147913 209873 -34311 57638 312915 318768 258888
6140 258888 324780 357941 484928 427221 278709 296997 266834 406083 437342 357343 508612
6129 508612 554061 552660 616571 529904 493778 706728 665317 516867 364482 276481 294098
6118B94098o147J3447N1239J15634j39030J06784Q2295m749j12410j08077n6558
6107B36526J60229N9685k6414o5538K63032Q921j20911j46098O3973r0037P8155
6096D21523K0095j1906r9527L1173p7231Q1652J6721k5629l5916o6661P3570K04179
6084E32043r0634j34675o98J0771p3182P279K37675r6895k2342R2037m9652J33960
6072E45687J4592j94179p8064r6360J67164M9126k60015p3479J30901R8890M2668
6061C46931l4192J46303J09611j76896j26386n1708k9374J03829l1621R2401R9480
6050D48378k1585K2354M8877r4176J00515l3747j65950O3360j47684j1997J10284
6039C18629j16482J69421q485q4288K55534J06972m0309j70084m1032Q6346j14897
$$ plain form
6118 294098 287951 301398 352637 468271 329241 436025 518320 513571 401161 293084 236526
6107 236526 396755 456440 430026 364488 627520 636441 515530 369432 433405 343368 421523
6096 421523 441618 429712 330185 361358 284127 365779 382500 356871 320955 254294 327864 532043
6084 532043 441409 306734 306036 316807 243625 250904 488579 391684 369342 461379 411727 545687
6072 545687 560279 366100 288036 191676 358840 407966 147951 74472 205373 304263 346931
6061 346931 312739 459042 568653 391757 265371 213663 184289 288118 256497 348898 448378
6050 448378 426793 449147 498024 403848 504363 470616 304666 368026 220342 208345 318629
6039 318629 202147 371568 363083 278795 534329 641301 600992 430908 389876 476222 361325
6028C61325j55470K85833r5624q9157J00194J97691J28478M2142Q610p8889J30676
6017H35809q7756j4834j39298j1425m9556J67159R9284j44359M4097j4848J4577
6006F98850l6182n0172k8200J4959K94996N2866l19029j44326P2790O628L2619
5995E95799N8365J70004L5630Q0428J27815j23500k96952J68367o5812k3815q5003
5984F41326J29123l048O5370J08470j8281j49481m339O1859o8012K44472m8302
5973I59157j0423m3206N0822M4159m1288J29292N3398k19636L0744R6913j00536
5962I49396L0517K22351K8183J38627j09857j53745j1164R9803j91644r8357J92130
5951A096240N1909p5711q6303M4495J80327J75635o6799n2863M7126m0461n0982
$$ plain form
6028 361325 205855 491688 396064 306907 407101 604792 733270 775412 784022 705133 835809
6017 835809 748053 733219 593921 582496 532940 700099 799383 655024 699121 684273 698850
6006 698850 662668 612496 584296 599255 894251 947117 628088 483762 556552 563180 595799
5995 595799 654164 824168 859798 940226 1068041 944541 647589 815956 750144 726329 641326
5984 641326 770449 767401 832771 941241 922960 773479 769140 830999 762987 1007459 959157
5973 959157 948734 905528 956350 1000509 959221 1088513 1141911 922275 953019 1049932 949396
5962 949396 979913 1202264 1230447 1369074 1259217 1105472 1094308 1194111 1002467 904110 1096240
5951 1096240 1148149 1072438 986135 1030630 1210957 1386592 1319793 1266930 1314056 1273595 1222613
5940A222613K3549O479J27648r7954K9659O9661M3748L7378p2588O981P5144r6399
5928A375919J36030K3612j6608j67909K69544K39905m3105k19606l6735K26784
5918A787831j29723J77219j88648m4149K18062L60278Q0671k9343m8390k18112
5908A965696j35K08676O1459p6495Q2900J03077l4483J94931K44326Q7802m0789
5897B796965j36289Q2880j5960R7599Q8233P7823J79998Q8349J8295R3882j66107
5886C205668J04069L97997n6633L8093N5238J22253n1641J78448N8482j7003O3043
5875D098014M4588K36252K70875K18189P6983L2883m8837L8266K23635K46874
5865E437722L17142J68133J70333M5809J96359M4507J60409K89298J18800J33785
$$ plain form
5940 1222613 1246162 1252641 1380289 1282335 1311994 1381655 1425403 1462781 1390193 1397174 1472318 1375919
5928 1375919 1511949 1535561 1518953 1351044 1620588 1860493 1817388 1597782 1561047 1787831
5918 1787831 1658108 1835327 1646679 1602530 1820592 2180870 2261541 2232198 2183808 1965696
5908 1965696 1965561 2174237 2235696 2159201 2242101 2345178 2310695 2505626 2749952 2837754 2796965
5897 2796965 2660676 2743556 2727596 2825195 2913428 2991251 3171249 3259598 3277893 3371775 3205668
5886 3205668 3309737 3707734 3651101 3689194 3744432 3866685 3815044 3993492 4051974 4034971 4098014
5875 4098014 4142602 4378854 4649729 4867918 4944901 4977784 4928947 4967213 5190848 5437722
5865 5437722 5754864 5922997 6093330 6139139 6335498 6380005 6540414 6829712 6948512 7082297
5855G082297K51827K42633K35042L38121J83940J73935L61666K03737L17597M70804
5845I861599N34162L62789M27630M01842O16150P33962Q38115O55146P08113R89323
5835A6128831J060220J420197J356383J830940J792431J714577J661708J789356
5827B8754643J884131J333311J215415J094522P41749Q20873J045528J242220
5819C8132392J248280J553506J744021J764962J822582J723186J339112O04507
5811D9932548Q1630k12602o59150j298244j418122j411164j105164r09611n57497
5802D2442624m7022k18125n9786K91541L38641j44190K8519L6830J33609j72410
5792D2630231l23835k27541k38239m12431o65762j78167l80214N0527L58732M74655
$$ plain form
5855 7082297 7334124 7576757 7811799 8149920 8333860 8507795 8869461 9073198 9390795 9861599
5845 9861599 10395761 10758550 11186180 11588022 12204172 12938134 13776249 14431395 15139508 16128831
5835 16128831 17189051 18609248 19965631 21796571 23589002 25303579 26965287 28754643
5827 28754643 30638774 31972085 33187500 34282022 35023771 35844644 36890172 38132392
5819 38132392 39380672 40934178 42678199 44443161 46265743 47988929 49328041 49932548
5811 49932548 50014178 49801576 49142426 47844182 46426060 45014896 43909732 43000121 42442624
5802 42442624 42395602 42177477 42117691 42409232 42747873 42603683 42632202 42669032 42802641 42630231
5792 42630231 42306396 42078855 41840616 41428185 40762423 40584256 40204042 40254569 40613301 41087956
5782D1087956J111853Q89300J062461J082151Q52085M83678l6803n71897j076218
5773D4884566j472898j595084j917325j691098j874001j431900j135126r30149
5765C2836985p81165j017117j085081j214697j280731j603361j901930j605895
5757B2347008j811647j635453j639438j746065j455827j246756j189360q86878
5749A0735584o08671q71736n27988o38390m97993l22081n97157k83905j45010
5740F242653k86799l20973l71886l38448j92205o7806k26151j30418j20593j36547
5730D050827l43388j62115m385j39662k73797R5035k0116j59416j78873j7077
5720B847033r3628j02130K0944q8555j07480l6927j85070j99211r8164k7695J5011
$$ plain form
5782 41087956 42199809 43089109 44151570 45233721 46085806 46569484 46532681 45960784 44884566
5773 44884566 43411668 41816584 39899259 38208161 36334160 34902260 33767134 32836985
5765 32836985 32055820 31038703 29953622 28738925 27458194 25854833 23952903 22347008
5757 22347008 20535361 18899908 17260470 15514405 14058578 12811822 11622462 10735584
5749 10735584 10126913 9255177 8727189 8088799 7590806 7268725 6671568 6387663 6242653
5740 6242653 5955854 5634881 5262995 4924547 4732342 4664536 4438385 4307967 4187374 4050827
5730 4050827 3707439 3545324 3540939 3401277 3127480 3222515 3202399 3042983 2864110 2847033
5720 2847033 2753405 2651275 2672219 2583664 2476184 2439257 2254187 2054976 1956812 1929117 1944128
5709A944128P8591m4445k09882M5993m9561q4178j03197K2428p7487p4454K55431
5698A703367q0789l6756m2577k16308J00944o3895q9615n5970j47562J14626n3244
5687A132221q2042J74472m8324k31185j19561o9210o098K09201J05416J5247l4657
5676A045480k89962N0785k4954j48853j88498K99450J06244k9536Q4918M594j47667
5665G62001k6130j07168o4684l5383O5841n6227J27229J14171o3733j12917j59363
5654D43637P921o8638J24435k7203M4152j10901K1309P5706Q824j94209K7847
5643C52880j3721M8491J92156l26204q9106j47713J46942K39909L324j77148k2054
5632B07756J06300j24832P0822M5240J96265k12472l21080k8075K10489O2095
$$ plain form
5709 1944128 2022719 1978274 1768392 1814385 1764824 1680646 1577449 1599877 1522390 1447936 1703367
5698 1703367 1622578 1585822 1543245 1326937 1427881 1363986 1274371 1218401 1070839 1185465 1132221
5687 1132221 1050179 1224651 1176327 945142 825581 756371 750273 959474 1064890 1080137 1045480
5676 1045480 755518 806303 781349 632496 443998 743448 849692 820156 905074 909668 762001
5665 762001 735871 628703 564019 528636 594477 538250 665479 779650 715917 603000 443637
5654 443637 451558 382920 507355 480152 524304 413403 434712 510418 519242 325033 352880
5643 352880 339159 387650 579806 253602 164496 16783 163725 403634 406958 229810 207756
5632 207756 314056 189224 260046 305286 501551 289079 -32001 -60076 150413 212508
5622B12508K2873q6129J15823j82979o0129J11536O4813l3268N1329l9065j44048
5611C3264j16537j9275P3621K2343n604J17728J31563k07863K9903J93557k04698
5600D8002M3804R7209k43825R4789Q2147N7227o3956j85240L2587O0631K59934
5589B83309J00146n3927k10061k03533K29744J11206M8092o2207n4872j57360
5579C0537O152J59972j3596n5179q6056L73492j65272l03915K09243j12318m5000
5568a940r2005L9563Q5470R7434J098o1398K051J25426n2708J09457k67417J05774
5556I0805m2045k0113n8458K6020j18315k6541R4227k3881J49674Q8625l5189
5545A24809r1358K81337k1457p1249k16543R2290L5581J87998j18540J76726k30092
$$ plain form
5622 212508 235381 149252 265075 82096 21967 133503 198316 165048 216377 177312 33264
5611 33264 -83273 -102548 -28927 -6584 -12188 105540 237103 29240 59143 252700 48002
5600 48002 91806 189015 -54810 39979 122126 179353 115397 -69843 -37256 23375 283309
5589 283309 383455 329528 119467 -84066 145678 256884 304976 242769 187897 30537
5579 30537 36689 196661 183065 127886 41830 415322 250050 -53865 155378 43060 -1940
5568 -1940 -93945 -54382 31088 128522 129620 68222 70273 195699 142991 252448 -14969 90805
5556 90805 48760 28647 -29811 -3791 -122106 -148647 -54420 -78301 71373 159998 124809
5545 124809 33451 314788 293331 222082 5539 97829 133410 321408 202868 379594 149502
5534A49502j88798l3548P2688J36335l9095L7589r7472P321Q0274K4731N902m9820
5522A05609K3052O7325J76573p1893r5276L0983r6209m1612l1343O822J55601
5511B29632J37777k49603j31537L3128r0687J91644J96667o1377L9013O5541j79705
5500A80493K3393l0443q3179R2898J13249K22775j51529l2862q6302N0451J97270
5489D96214K0468K3979k28579j05197K524k2679N0071j98645R78r414J95094J60884
5477C85698j17906l5051J36486p4464M1067P684m5035o960N8407J17008j16669
5466C50265O4196N0k8943J13931k15334q852J07980l9012J09272k7224p9026l0213
5454C17090M3445k1196k22722J69967K05390k1995r6869o8039K23884j93385o6627
$$ plain form
5534 149502 -39296 -72844 -156 136179 97084 134673 37201 44522 124796 149527 155429 105609
5522 105609 128661 195986 372559 300666 205390 236373 140164 98552 67209 74031 229632
5511 229632 367409 117806 -13731 19397 -71290 120354 317021 255644 294657 360198 180493
5500 180493 203886 173443 90264 183162 296411 519186 367657 334795 248493 298944 496214
5489 496214 516682 540661 312082 206885 209409 186730 236801 38156 39134 29720 224814 385698
5477 385698 267792 232741 369227 294763 335830 343514 298479 291519 349926 466934 350265
5466 350265 414461 414511 385568 499499 284165 275313 383293 344281 453553 426329 347303 317090
5454 317090 360535 339339 116617 286584 491974 469979 373110 305071 528955 335570 268943
5443B68943n5451j03076R8791R3012J73235q7772N6578j65299Q0151J13056Q1009
5432E53177k62366j15575J211J40352m7921o8899J12013k45748K7910o7827M4442
5421G0769M0002P1058J3603k37980j19423J87549O0703q8401P3981Q5380K05495
5410C62736o2133j18196K7360r438J20995q6938p0943j56836N8762J83235j94711
5399E3893J89036R1534J2672O9364k62975J6386k70349M1935J66992R0849Q568
5388B07905o2995m0635j07212J39514Q3849m4088j57769O4380J57865j47826j9043
5377G3945m8420J12590r8998J54845P9883j32879j9097n7309r2582M998J50285
5366A27261n6568P7941j43559j09420O8513J41016n1648O9324K55344j03304p0980
$$ plain form
5443 268943 213492 110416 209207 302219 475454 387682 444260 278961 359112 472168 553177
5432 553177 290811 175236 176447 316799 268878 199979 311992 66244 94154 26327 70769
5421 70769 110771 181829 195432 -42548 -161971 25578 86281 -2120 71861 157241 362736
5410 362736 300603 182407 209767 200329 321324 234386 163443 6607 65369 248604 53893
5399 53893 242929 334463 347135 416499 153524 169910 -100439 -58504 108488 199337 207905
5388 207905 144910 104275 -2937 136577 220426 176338 18569 82949 240814 92988 73945
5377 73945 25525 138115 39117 193962 273845 140966 121869 64560 -28022 -23024 127261
5366 127261 70693 148634 5075 -104345 -35832 105184 53536 122860 378204 274900 203920
5355B03920j60584k3998J15632n436k3768J12395j285r215L0886o0364M454q1691
5343A00946J0681j08931M452O0930k0525J36304J8057q457K3093N5391M0969K7290
5331C40200j24909j3072P6614l1530J2047K2988O8300l8927J79872m2189k88630
5320A60764j98965K91878P6109o0689J23473j56697J80205o3124k80988K08078
5310B80044K5219j68260J0019J0852j01031L3833p6392J78127K22273n3979P8990
5299D39695r7663M7014k30746J66162M3597j49326j86133R4950K37118o541m5076
5288C13051j82766m6974O2735O7490j07409J16054j6745J32509J67756j46121
5278C59580m9709L8394j42896j0804K38435j62401K0545O2779j38065K9786r3570
$$ plain form
5355 203920 43336 19338 134970 129534 105766 218161 216876 207661 238547 178183 182637 100946
5343 100946 111627 2696 7148 68078 47553 183857 201914 193457 216550 271941 312910 340200
5331 340200 215291 202219 278833 247303 259350 282338 350638 311711 491583 449394 160764
5320 160764 -38201 253677 329786 269097 392570 235873 416078 352954 71966 280044
5310 280044 305263 137003 147022 157874 56843 90676 14284 192411 414684 360705 439695
5299 439695 342032 389046 158300 324462 368059 218733 32600 127550 364668 358127 313051
5288 313051 130285 83311 146046 213536 106127 222181 205436 337945 505701 359580
5278 359580 309871 348265 205369 194565 433000 270599 291144 353923 215858 245644 152074
5267A52074j3446P2912Q8559k8979J02279j64585j06966J10060L9626m8238M9104
5256B52400n5950K087k256m0555Q7413o4539n4344M571j31644N0722J87138J6074
5244B51117l3760p7500N1045p3017k8987J8990L1670J94681o3808l420K5731j01207
5232A91535o0789j62369R705L847J25464J55391q6019K66974m446j07483Q4480
5221D16290N7859r1611q0593N1165j11227k13277j8465J86166J28783j14476J208
5210B11822J67301k04439m0055K11224j25263l5318J1969m9708R7767j549J6597
5199B60348k15245K09760J08273l17752M0042J08138L2602n0539q9278M8121j4425
5188A20045J18377q8657J98581N2963q9356j02468O5772k0905k07456J32247j41163
$$ plain form
5267 152074 138628 211540 300099 271120 373399 208814 101848 211908 251534 203296 252400
5256 252400 196450 198537 196281 155726 243139 178600 124256 128827 -2817 47905 235043 251117
5244 251117 217357 139857 190902 117885 88898 107888 139558 334239 270431 267011 292742 191535
5232 191535 130746 -31623 -21918 -18071 107393 262784 176765 443739 439293 331810 416290
5221 416290 474149 382538 301945 353110 241883 28606 10141 196307 325090 210614 211822
5210 211822 379123 174684 134629 345853 220590 185272 197241 147533 245300 243751 260348
5199 260348 45103 254863 363136 45384 85426 193564 226166 175627 86349 134470 120045
5188 120045 238422 149765 348346 401309 311953 209485 275257 254352 46896 179143 37980
5177C7980Q3100L320j43075L53006l3845j01650O4541j53064k1227J19715K38968
5166D47769q2594K5689r2880Q0965j38870o084J7653j68617k2211n8133q9075
5155h6388K6265J36188n419J20902J41376j52287k41256m4258J73276N1519k78425
5144a58507K6678J03279J6199o7847M728J98537K7008j18546n4191J75232L5568
5133A88138l4491R0675r94j98676n1543j743J47095m0546o3331R5171J12885P1992
5121C14632o8211L5915M3387o0948j42410J44568l6888M04l6390j12657j24040
5110d2638Q5827J29227r8982o7984J88309Q8137k12920j02472Q3282o5361Q7061
5099G1486m6869J10114J89583p1656j11650p279J20941N855J40494j06594j75876
$$ plain form
5177 37980 121080 124400 -18675 334331 300486 198836 263377 110313 89086 208801 447769
5166 447769 365175 390864 297984 378949 240079 233995 251648 83031 60820 2687 -86388
5155 -86388 -60123 76065 70646 191548 332924 180637 -60619 -104877 68399 119918 -158507
5144 -158507 -131829 -28550 -12351 -80198 -75470 123067 150075 31529 -22662 152570 188138
5133 188138 153647 244322 243328 44652 -6891 -8634 138461 97915 34584 129755 242640 314632
5121 314632 246421 282336 325723 264775 122365 266933 230045 230449 194059 81402 -42638
5110 -42638 43189 172416 73434 5450 193759 281896 68976 -33496 49786 -15575 71486
5099 71486 24617 134731 324314 252658 141008 133729 254670 260525 401019 294425 118549
5088A18549R0194N487J02404p1989j46898J19028N7696m6852j33001j54461J88329
5077A28486J6558m4044j08189N7748J17296L3336J05745Q8092j25027n1865J75783
5066C93919j67418r2764q2947k4829R8791J00632n262Q7251o5930j79036j1202
5055E1205J16347j44415K48445J74579p5823N888k38439n0732j025Q5173o5205
5044A05998o7575K15461p0085O6895M5492j05907l8925K2400R0030L9345j25765
5033A77364O6413k66013j13968J84086Q8294J03324j195m3538J35677Q3703q6043
5022C28104j42062j12909J47750j33007J37577N669N7588j66705j20059J87589
5012A89535J37579l116r8166p1844L9471n4643J8083J29167k1083j69038m4447
$$ plain form
5088 118549 208743 214230 316634 244645 97747 216775 274471 227619 94618 -59843 128486
5077 128486 145044 101000 -7189 50559 167855 201191 306936 395028 270001 218136 393919
5066 393919 226501 133737 50790 25961 124752 225384 220122 307373 241443 62407 51205
5055 51205 167552 23137 271582 446161 370338 376226 137787 87055 86030 171203 105998
5044 105998 38423 253884 183799 250694 296186 190279 151354 173754 263784 303129 177364
5033 177364 243777 -22236 -136204 47882 136176 239500 238305 194767 330444 414147 328104
5022 328104 186042 73133 220883 87876 225453 231122 288710 122005 1946 189535
5012 189535 327114 323998 225832 153988 193459 138816 156899 286066 264983 95945 51498
5001E1498o0864J19057J44109m1082l3473m39n715j20296J79170K0410J94100
4990D46475j49459o5298l9477j55123M9885J22393P9166j17529K1354j44519j16041
4979f8173J88897j74622R4115L8595M1019J42472j26550J52848L6828j97644j36570
4968h785J18063P1229m4312l1664J46193J14431j27935J09397j32727j61993J11961
4957A63858j63188J38314J98505p4739j1051l27505k3797K84278J05222o7398
4947B22499M6666p2320n4669J01471M3927j76526R3617J8358l43637J13608Q1513
4936G4507r7009m6482l7749o2351J74969K66713K29672k2291l2893P2924q7862
4925D32148j12978m6725o5815L3748K63774k44843m2281p4344k1753J8690j08303
$$ plain form
5001 51498 -9366 109691 253800 212718 179245 178806 173091 52795 231965 252375 446475
4990 446475 297016 231718 192241 37118 87003 209396 288562 171033 192387 47868 -68173
4979 -68173 120724 -53898 40217 78812 119831 262303 135753 288601 325429 127785 -8785
4968 -8785 109278 180507 136195 104531 250724 365155 237220 346617 213890 51897 163858
4957 163858 670 138984 337489 262750 251699 -75806 -99603 184675 289897 222499
4947 222499 269165 196845 142176 243647 287574 111048 204665 223023 -120614 -7006 74507
4936 74507 -22502 -68984 -106733 -169084 5885 272598 502270 479979 447086 520010 432148
4925 432148 319170 272445 206630 240378 504152 259309 217028 142684 120931 139621 31318
4914C1318J65336J12012K39609k37985j20622p984O7520K753L3770J24013j13863
4903B95877Q0790L3682j79450J28213j55492p85q9480p7103K35521P666J32712
4892D12151L9571l26976O2756O3484j75773R2499K0410J6384J12494Q867l1580
4881B94287j35981k3372q095n3228N4040r1280N7503J54128j0701m531p1183J02888
4869B64475q1956Q1641q9845k715l1546P8549j63422J49784J43379l10155M8583
4858H6772p5537M1447J97225k36091j36950J99752J26246O2389j14963J9882m7377
4847A22795l19040L5998M01638k6326l201j01412J14494J30271o0707j85706M0089
4836A48893j7675J996j19650J03377J33408P3971j13602R9832q2084j51092J09347
$$ plain form
4914 31318 196654 308666 548275 310290 189668 181684 249204 251957 285727 409740 295877
4903 295877 376667 410349 230899 359112 203620 202835 113355 36252 271773 279439 412151
4892 412151 451722 124746 187502 250986 75213 167712 188122 204506 317000 325867 294287
4881 294287 158306 134934 126839 73611 127651 36371 93874 248002 237301 232770 161587 264475
4869 264475 182519 264160 174315 171600 140054 218603 55181 204965 348344 38189 86772
4858 86772 11235 52682 249907 13816 -123134 76618 202864 265253 150290 170172 122795
4847 122795 -196245 -160247 241391 215065 211864 110452 224946 355217 294510 108804 148893
4836 148893 131218 133214 13564 116941 250349 324320 210718 310550 228466 77374 186721
4825A86721J69310l7659Q0991N5556l12447L9726M5609j66872O9796J21586r5154
4814A57163j14921m3528J21696K8691M964N2966Q530n5289N1323k07364L8446
4803D2677K49207q822q0313n2375M1709l8405n6002j21310J8189O6831J17395
4792A78781p4770n7694M0173R2109r523j52767J61523k19867J78959P6329j96051
4781A7202j4Q7179o5441k2856J90680J40335o8935m8403K1580j63574J16566k98971
4769i4652o0314O0018M2836q2628j8551K24568O1103J47590r7534j91333O7796
4758E8899j6911Q0481P5706p3366J80197J29026o988N2027j08876j48906J19449
4747C40738j05345k905m6844P7366N1659m1168J7719m8142J89190j45687j57679
$$ plain form
4825 186721 356031 318372 399363 454919 142472 182198 227807 60935 130731 252317 157163
4814 157163 42242 -1286 120410 149101 154065 207031 215561 160272 211595 4231 42677
4803 42677 291884 283062 202749 150374 192083 153678 97676 -23634 -5445 61386 178781
4792 178781 104011 46317 86490 178599 169076 16309 177832 -42035 136924 213253 17202
4781 17202 17188 104367 38926 16070 206750 347085 278150 229747 251327 87753 204319 -94652
4769 -94652 -154966 -94948 -52112 -134740 -153291 71277 132380 279970 182436 -8897 58899
4758 58899 41988 122469 198175 124809 305006 434032 427044 479071 370195 221289 340738
4747 340738 235393 232488 185644 263010 314669 273501 291220 243078 432268 286581 128902
4736A28902k1983j9349l6307q3007Q7867K88348l924r3037l8806J14659N6049
4725C79412j21649Q5247K02914j13276k27239J47458r4144j5504l8966M4848O3102
4714C12203j11816O1166K39248k03995j49863J35850M7620m8692j6636p9925j11550
4703G3610O2878Q6574j46754j8493J76370N679O160Q5068o1118n9176J08255R456
4691C28509r5142J10710k7253J1556j29580l6665J65848Q4116M413M6473J1858
4680D74843j77504n6967j77642L2014J81846n6666p2065Q1107l3248P7675o9443
4669B03950k3054j0553l2253N7392o4716R168o0251Q8106Q7890J88956m1452j6387
4657C86796M972j5493k05429j74007J93622O2156q6476r1006O6759j3080J05731
$$ plain form
4736 128902 106919 87570 51263 -31744 56123 344471 340547 247510 208704 323363 379412
4725 379412 257763 343010 545924 432648 205409 352867 258723 243219 204253 249101 312203
4714 312203 200387 261553 500801 296806 146943 282793 330413 281721 265085 185160 73610
4703 73610 136488 223062 76308 57815 234185 239864 246024 331092 269974 210798 319053 328509
4691 328509 233367 344077 316824 328380 198800 162135 327983 412099 416512 462985 474843
4680 474843 297339 240372 62730 94744 276590 219924 147859 228966 195718 273393 203950
4669 203950 180896 170343 138090 195482 130766 139934 79683 167789 255679 444635 403183 386796
4657 386796 391768 376275 170846 -3161 190461 252617 166141 75135 141894 128814 234545
4646B34545q0970J52874J97248m8012j70705m6082O7877K68785k34199j3755j223
4635C26383j53032J34360K34165p3258j66281M8702o8330L083N0000O2835n6832
4624C41795q1879K4030K03378j44079k6101J42330O5806q2666L4297k1474j65002
4613B90435n7645k4828n6958J19270J59584k09513N5677Q7625Q904O8477p7142
4602C63886j32258j88589K02500O9919r9348j75344j23108J04419J71958P6981
4592B71016P7554J11130o4843j5366k1919M4630n7682o6811m3850J45486J96188
4581E75533j84468Q4575J05730k53983l8394o3367Q5569J28622r6662J22906j14010
4570C52051j46055K2658O1957K95706k7046m8302l0938k35187R3878k8277k7864
$$ plain form
4646 234545 153575 306449 503697 455685 284980 238898 306775 575560 341361 327606 326383
4635 326383 173351 307711 541876 468618 302337 351039 282709 285792 335792 398627 341795
4624 341795 259916 283946 487324 343245 317144 459474 525280 442614 476911 455437 290435
4613 290435 232790 207962 151004 270274 429858 220345 276022 363647 372551 441028 363886
4602 363886 231628 43039 245539 315458 216110 40766 -82342 22077 194035 271016
4592 271016 348570 459700 394857 379491 357572 402202 344520 277709 233859 379345 575533
4581 575533 391065 475640 581370 327387 288993 225626 311195 439817 343155 466061 352051
4570 352051 205996 228654 290611 586317 559271 510969 480031 244844 338722 310445 282581
4559B82581J14223J03439r0040j84960K46400P2863r0933O266r6268P4241P4598
4548E12410p2509j30217K06801j26145j56786O3562P4920R4450N8414q0082j18738
4537C26080k2074q0375J19104J37381Q0536k9684j77322L6537R8384R8053J81828
4526G68448j87783l6652k92746R9287O0227l4859P3384J19587o3859n9271J10014
4515E55777j44227q5147o1989j22316L3902J12313j54420J51461Q6324J78372
4505E50050l849k20250J4069O9085p0603l8882J58022k9428j50762J62234J01011
4494E40697k5145R3249n0719k4203j30917K3356K5139p9674N4115O7055J86014
4483F78967M9870j65008j75291n0415L5298M4680P282l1736M3219j44347r2841
$$ plain form
4559 282581 396804 500243 410203 225243 471643 544506 453573 459839 363571 437812 512410
4548 512410 439901 309684 516485 390340 233554 297116 372036 466486 524900 444818 326080
4537 326080 304006 223631 342735 480116 560652 530968 353646 390183 488567 586620 768448
4526 768448 580665 544013 251267 350554 410781 375922 449306 568893 505034 445763 555777
4515 555777 411550 326403 264414 142098 176000 288313 133893 285354 371678 550050
4505 550050 546201 325951 340020 409105 338502 299620 457642 428214 277452 439686 540697
4494 540697 515552 608801 558082 533879 402962 426318 451457 371783 425898 492953 678967
4483 678967 728837 563829 388538 338123 373421 418101 425383 393647 436866 292519 199678
4472A99678Q170J97075j0088J89481j67228n5225K03399j31361o6995P3473R947
4461D50326j8020J71064j19430k4819n4644N1490l0381N68M5005j62620J49998
4450D58537L8689O2265l8276k09184P5526k1726J69304K19519k40629r8491J92123
4439F07657k08633N2314O6970J8782K2558r2006k48277K73754N502k3313J7862
4428D93170J36735J44219P9881P811j36470J7310O652j15013o5633N167l6061
4417E37768n3276Q5728k55892P7133j2983j3016K20078M4404r666l0824J5179
4406F04633k55212P6065J2289J00507m5797j5807P1486J20579k8992j35899J43822
4395F47674O9269p3146r2888R5067M3572p1671L5178N3002J23386j54397j76893
$$ plain form
4472 199678 207848 404923 394835 584316 417088 361863 565262 433901 366906 440379 450326
4461 450326 432306 603370 483940 459121 404477 455967 425586 426154 471159 308539 458537
4450 458537 497226 559491 521215 312031 387557 365831 535135 754654 514025 415534 607657
4439 607657 399024 451338 518308 537090 559648 467642 219365 493119 498621 475308 493170
4428 493170 629905 774124 854005 861816 725346 742656 749308 634295 568662 573829 537768
4417 537768 484492 570220 314328 391461 378478 365462 585540 629944 620278 589454 604633
4406 604633 349421 425486 437775 538282 492485 476678 548164 668743 639751 503852 647674
4395 647674 716943 643797 550909 645976 689548 617877 653055 706057 829443 675046 498153
4384D98153m54L34211j2651l4952j0333r2361j77625J00590r7639l5610J59473
4373F30802j9919k7969J02715Q4194o4180j84119J14340R0658q7463J58224p4613
4362G22670j63594J29494J2281l7234J38237j19399J6035J2356L3927J15427m9381
4351H10819n2284j0170j4468Q9378N5829k4281K3735j3590p0637k35924K70827
4340H29234J91090k13374j55467J61711o7746J18170K30371M865k43701k7266
4330H27887o1463j73911j992J58K98620n6232L5664j14075J7040L3105j04692
4319G00109J09191o0970M5374j14001J5294M5715Q6420J55427N0226p1990m3707
4308I17088J01842L4875j00228L1848Q0544L8225n1294k89712Q2064N3149J34507
$$ plain form
4384 498153 497699 831910 819259 784307 773974 681613 503988 604578 506939 471329 630802
4373 630802 610883 582914 685629 769823 705643 521524 635864 726522 639059 797283 722670
4362 722670 559076 688570 700851 663617 801854 682455 698490 710846 744773 860200 810819
4351 810819 758535 748365 733897 823275 879104 854823 878558 864968 794331 558407 829234
4340 829234 1020324 806950 651483 813194 745448 863618 1093989 1098854 855153 827887
4330 827887 766424 592513 590521 590679 889299 833067 868731 754656 771696 804801 700109
4319 700109 809300 748330 793704 679703 694997 740712 827132 982559 1032785 960795 917088
4308 917088 1018930 1053805 953577 985425 1065969 1104194 1052900 763188 845252 898401 1032908
4297A032908L2135n0206l2542J31646j86803J45720j29157J02176r0376l1600
4287I23901l5445M8601J50443j54661J82601M6190j87443J41381J92648j21530
4277A186686j41312J28397j5104Q3446j004l4802j7791K0766r5972J2165J75663
4266A301138l0249J99543n5747O3017N6687K01449M466k00287P7011J27849J71983
4255A916860q9260l3339R6472q8056J08985K5045j19866J809l925m4244J49335
4244A919816K47558J20181j45805l0166P6857k69236l6720L0463l9941K05289
4234B078296P6639K1716K3354L932j03194m6571j03647K14259p265m4911p190
4223B105418K426q0154K6909l855J10154j53062N5838J86988L2801k56015K9107
$$ plain form
4297 1032908 1065043 1014837 982295 1113941 927138 1072858 943701 1045877 955501 923901
4287 923901 888456 937057 1087500 932839 1115440 1161630 974187 1115568 1308216 1186686
4277 1186686 1045374 1173771 1158667 1242113 1241109 1206307 1188516 1209282 1113310 1125475 1301138
4266 1301138 1270889 1470432 1414685 1477702 1534389 1735838 1740304 1540017 1617028 1744877 1916860
4255 1916860 1827600 1794261 1890733 1802677 1911662 1936707 1816841 1818650 1814725 1770481 1919816
4244 1919816 2167374 2287555 2141750 2111584 2188441 1919205 1882485 1912948 1873007 2078296
4234 2078296 2154935 2176651 2200005 2203937 2100743 2054172 1950525 2164784 2157519 2112608 2105418
4223 2105418 2107844 2027690 2054599 2050744 2160898 2007836 2063674 2250662 2283463 2027448 2056555
4212B056555O5322L6713k54432j28070K13913j83896P787J49934j3934N130N1881
4201B006903n9862j55226J3679K7989Q8954R7922p616K53532l2574n7382k57227
4190A919092J1715J45496Q9556M8316o8243j14797j89308R5890J65634O4391L4652
4179B202394j27932J34459J05012k5731p7762j03364O5952L32930P736j59847
4169B353847J21447J48140K16710J7275l04232j03429o7508R2305J25458P2994
4159B673007L23770L9787j15892j4832Q7044J65310O332q656Q2035j06826N0007
4148C181086m861J02467R5109M5427J22207o8591K248J21593K39589j41418J41071
4137C835927P2124M952n4905J80420O4708m2385j31375j1444J89949Q3842M855
$$ plain form
4212 2056555 2121877 2158590 1904158 1776088 1990001 1806105 1813892 1963826 1949892 1955022 2006903
4201 2006903 1947041 1791815 1805494 1833483 1922437 2020359 2012743 2266275 2233701 2176319 1919092
4190 1919092 1930807 2076303 2165859 2214175 2145932 2031135 1841827 1937717 2103351 2167742 2202394
4179 2202394 2074462 2208921 2313933 2288202 2210440 2107076 2173028 2505958 2513694 2353847
4169 2353847 2475294 2623434 2840144 2857419 2553187 2449758 2382250 2474555 2600013 2673007
4159 2673007 2996777 3036564 2920672 2905840 2992884 3158194 3164526 3155870 3237905 3131079 3181086
4148 3181086 3176225 3278692 3373801 3419228 3541435 3472844 3475092 3596685 3836274 3694856 3835927
4137 3835927 3908051 3913003 3858098 4038518 4103226 4060841 3929466 3918022 4107971 4191813 4196668
4126D196668K6650q2331K26121N0499j62572J05860p22L9121K03266r2020M901
4115D515441K95237O5117L4686j975n0948J05220J58236j0875O0724Q6853J64427
4104E422143j53036k32108K99652K65000l1047L6562N6637J19920n9829K37646
4094E961540J7687J1125M0867J7045R7545K15288L24578N9866k12326l8896j17924
4083F376395J28552K07811q6882k3457P2548K178p6059N8638q146Q4082j6903
4072F718757k01541J91034J16992l6913J00078J08828r6303R8003j08510r7261
4062F793164q1537q468L2014K48445O8553N6080M1418L1385N323r9531K13788
4051G300634N4382K59252j18212P2067J43297N1618J41654K80104R9143K00282
$$ plain form
4126 4196668 4223318 4140987 4367108 4417607 4255035 4360895 4360173 4399294 4602560 4510540 4515441
4115 4515441 4810678 4875795 4910481 4908506 4857558 4962778 5121014 5110139 5170863 5257716 5422143
4104 5422143 5269107 5036999 5336651 5601651 5570604 5607166 5663803 5783723 5723894 5961540
4094 5961540 5979227 5990352 6031219 6048264 6145809 6361097 6685675 6745541 6533215 6494319 6376395
4083 6376395 6504947 6712758 6625876 6602419 6674967 6677145 6601086 6659724 6651578 6735660 6718757
4072 6718757 6517216 6708250 6825242 6788329 6888407 6997235 6900932 6998935 6890425 6793164
4062 6793164 6711627 6703159 6735173 6983618 7052171 7108251 7149669 7181054 7186377 7086846 7300634
4051 7300634 7355016 7614268 7496056 7568123 7711420 7763038 7904692 8184796 8283939 8484221
4041H484221J50112L28037n5115j50562K70678M6438J83927K37184L43539K61892
4031A0100351Q3886M9024L26436L5048M6082K51336O24951L44987k24489J91426
4021A1829038K72632K67568L75939K39422J1092K34866L44525M02593K97041M73608
4011A4748324K46993O8794M22019J83261L14164L72757L45402L26692L59366M23529
4001A7811301K56796M36702K35680M56792N65014M89921L98748K30516N71935
3992B1453405L73869O74451O12868O54768P40658N88151N30666O10982Q46594
3983B7086412O40574P55201R27253J025949R84753J083311J079576J353511J416504
3974C6353044J547398J442297J729179J873074J981857J842736J857301K187861
$$ plain form
4041 8484221 8634333 8962370 8907255 8756693 9027371 9073809 9257736 9494920 9838459 10100351
4031 10100351 10184237 10233261 10559697 10594745 10640827 10892163 11517114 11862101 11637612 11829038
4021 11829038 12101670 12369238 12745177 12984599 12995691 13230557 13575082 13977675 14274716 14748324
4011 14748324 14995317 15064111 15486130 15669391 15983555 16356312 16701714 17028406 17387772 17811301
4001 17811301 18068097 18504799 18740479 19197271 19762285 20252206 20650954 20881470 21453405
3992 21453405 21827274 22501725 23114593 23769361 24510019 25098170 25628836 26239818 27086412
3983 27086412 27726986 28482187 29409440 30435389 31420142 32503453 33583029 34936540 36353044
3974 36353044 37900442 39342739 41071918 42944992 44926849 46769585 48626886 50814747
3966E0814747K365047K341702K537175K788624L038378L012146L099790L423042
3958G3420651L285345L252243L251375L342451L288445L279240L283339L392158
3950I9795247L247102L174743L260012L297099L449327L258612L038951K750715
3942A25271808K491582K533435J936446J627941J080869Q56818Q39078M71354
3934A37109331M61128N52993n3168j15695l68881o03170q19473j531763k073506
3925A32557796k236418k529783k737250k879412k705199k829089l059666l172899
3917A10408080l022718k935806l140221l178032k941355l255161l384173l083613
3909H5467001l094374l136572k893227k663924k578575k561611k285043j932116
$$ plain form
3966 50814747 53179794 55521496 58058671 60847295 63885673 66897819 69997609 73420651
3958 73420651 76705996 79958239 83209614 86552065 89840510 93119750 96403089 99795247
3950 99795247 103042349 106217092 109477104 112774203 116223530 119482142 122521093 125271808
3942 125271808 127763390 130296825 132233271 133861212 134942081 135798899 136637977 137109331
3934 137109331 137570459 138123452 138070284 137954589 137585708 136982538 136163065 134631302 132557796
3925 132557796 130321378 127791595 125054345 122174933 119469734 116640645 113580979 110408080
3917 110408080 107385362 104449556 101309335 98131303 95189948 91934787 88550614 85467001
3909 85467001 82372627 79236055 76342828 73678904 71100329 68538718 66253675 64321559
3901F4321559j948913j986476j733945j375787j247623j341405j011252q35060
3893E2841098j078662p35646m22390n01999j70273J53260j47632R7866J9656K93425
3883E0348703L82534P31066P77354O55651Q54327J095619J006024J271422J224076
3874E8346776J532118J572402J619516J572905J861889K296153K011787J859559
3866G2673105K022810K270531K067219J922883J940014J938646K107901J961517
3858H8904626K064621K194849K514805K676682K699775K819811L051286L178036
3850A10104491L040835L094785K876336L056984L136750L215819L399576L763094
3842A35688670L823342L905289L879487L873782M131886M229555M006445L921785
$$ plain form
3901 64321559 62372646 60386170 58652225 57276438 56028815 54687410 53676158 52841098
3893 52841098 51762436 51026790 50604400 50102401 49932128 50085388 49937756 50035622 50055278 50348703
3883 50348703 50731237 51462303 52239657 52895308 53749635 54845254 55851278 57122700 58346776
3874 58346776 59878894 61451296 63070812 64643717 66505606 68801759 70813546 72673105
3866 72673105 74695915 76966446 79033665 80956548 82896562 84835208 86943109 88904626
3858 88904626 90969247 93164096 95678901 98355583 101055358 103875169 106926455 110104491
3850 110104491 113145326 116240111 119116447 122173431 125310181 128526000 131925576 135688670
3842 135688670 139512012 143417301 147296788 151170570 155302456 159532011 163538456 167460241
3834A67460241L738188L826982M239767M165667M465177N150162N539036N830311
3826B04415531O591797O773170P115922P700849Q106842Q598391R513430J0164185
3818B68980117J1009093J2085202J2339121J2377629J2308617J1591973J0777053
3811C51468805R910283Q693490P957646O911686N040705K302174J40269k535001
3803C89890057m415125o057030o837410o922454p097259p266858p233158p061248
3795C36999515p354228p286479q048045q617101r541449j0684372j1736472j2626089
3787B61105280j2718281j2561069j1555824j0832000j0029418r472189q695152
3780A85241347p611966o867454o737510o452918o032486n736101n759337n410669
$$ plain form
3834 167460241 171198429 175025411 179265178 183430845 187896022 193046184 198585220 204415531
3826 204415531 211007328 217780498 224896420 232597269 240704111 249302502 258815932 268980117
3818 268980117 279989210 292074412 304413533 316791162 329099779 340691752 351468805
3811 351468805 361379088 370072578 378030224 384941910 389982615 392284789 392425058 389890057
3803 389890057 385474932 379417902 372580492 365658038 358560779 351293921 344060763 336999515
3795 336999515 329645287 322358808 314310763 305693662 296152213 285467841 273731369 261105280
3787 261105280 248386999 235825930 224270106 213438106 203408688 193936499 185241347
3780 185241347 177629381 170761927 164024417 157571499 151539013 145802912 140043575 134632906
3772A34632906n200580m959324m693132l893038l494708l344943k664233k290841
3764A04092107k243277j491085j340535j259830p63440q43033m86919m67949p5101
3755I5120938j7946Q4989M46037O27543P96572Q26084P87827Q44145P82112Q01962
3745A01100263N98690O13085N15068O23917N26105R12173J150847J242595J483790
3736A08766533J911722K379876K598997L103086L351089L566409M355777M798990
3728A34832479N283793N786045N996012O701306P040775O988673O660974O454298
3720A85744355O143848N595318N330201N009745M752603M842412N134104N980158
3712B28532744O536431O619872O748895O786767O302331N417226M377178L112180
$$ plain form
3772 134632906 129432326 124473002 119779870 115886832 112392124 109047181 106382948 104092107
3764 104092107 101848830 100357745 99017210 97757380 96993940 96150907 95663988 95196039 95120938
3755 95120938 95102992 95187981 95634018 96261561 97058133 97884217 98672044 99516189 100298301 101100263
3745 101100263 101698953 102312038 102827106 103451023 103977128 104889301 106040148 107282743 108766533
3736 108766533 110678255 113058131 115657128 118760214 122111303 125677712 130033489 134832479
3728 134832479 140116272 145902317 151898329 158599635 165640410 172629083 179290057 185744355
3720 185744355 191888203 197483521 202813722 207823467 212576070 217418482 222552586 228532744
3712 228532744 235069175 241689047 248437942 255224709 261527040 266944266 271321444 274433624
3704B74433624K473654J803244J415771J028477J548232J645701K379325K892880
3696B89620908L395480L644294L844105M002889M186501M094156L743997L222454
3688C19754784K407933J826837R17223k30550j400871k379676k765159l086135
3680C15044386l819668l349947l204429l031566k892075l161030l443157m181991
3672B87960523n639459o684464p896645r086896j0124498j0994994j1388600j1037806
3664B15107161j0655637j0271013r377461q737489q477885p991920p536630p491363
3656A44567763p348095p351642p464146p318567p197978p053557o332196n977496
3648H8524086n401422m759407m317574l526824l237786l025124k677569k256132
$$ plain form
3704 274433624 276907278 278710522 280126293 281154770 282703002 284348703 286728028 289620908
3696 289620908 293016388 296660682 300504787 304507676 308694177 312788333 316532330 319754784
3688 319754784 322162717 323989554 324906777 324676227 323275356 320895680 318130521 315044386
3680 315044386 311224718 307874771 304670342 301638776 298746701 295585671 292142514 287960523
3672 287960523 282321064 275636600 267739955 258653059 248528561 237533567 226144967 215107161
3664 215107161 204451524 194180511 184803050 176065561 167587676 159595756 152059126 144567763
3656 144567763 137219668 129868026 122403880 115085313 107887335 100833778 94501582 88524086
3648 88524086 83122664 78363257 74045683 70518859 67281073 64255949 61578380 59322248
3640E9322248j960794j912467j661077j324587j199650j219332j114545p39251
3632D8190545o59402l65080n19798l68718O809j02886J41814N31180L61663J04032
3622D7320159L14165L64225M32592P22886Q54107J444494J322938J595869J771434
3613E6142869J847520J762428J208802Q22085j96574j331014k310281k671651
3605E5274184l025042l244870l068784k861263k513556k242862k028869j747262
3597C4541676j542391j659583j581218j441119j394825j226681j245771j203246
3589B3246842j056711j071205q16825p25936q68733q69480l77820o23828p75781
3580A6060523o00359n54548k14312k70313o15854o52996k60945j42226l18777
$$ plain form
3640 59322248 57361454 55448987 53787910 52463323 51263673 50044341 48929796 48190545
3632 48190545 47531143 47166063 46646265 46277547 46284356 46181470 46323284 46854464 47216127 47320159
3622 47320159 47634324 47998549 48431141 49154027 50008134 51452628 52775566 54371435 56142869
3613 56142869 57990389 59752817 60961619 61783704 61587130 60256116 57945835 55274184
3605 55274184 52249142 49004272 45935488 43074225 40560669 38317807 36288938 34541676
3597 34541676 32999285 31339702 29758484 28317365 26922540 25695859 24450088 23246842
3589 23246842 22190131 21118926 20302101 19576165 18707432 17837952 17460132 16836304 16060523
3580 16060523 15460164 14905616 14691304 14420991 13805137 13152141 12891196 12748970 12430193
3571A2430193l64424j0243l47621l70491j75231j97807j23756k74018k13395j72638
3561A0180569k37847j65624o8591l05407l34777n1078o4236j86883j41179p8664
3551H546283q0710n8674l03426j75682j33699l9330j47202m7824o4995j35047
3541G359694j36489l30932J8274Q865N820k36988j09366j6439k29624j7092n6135
3530F259588o1365o7284N2607j6899l970j99755n0013K6534o620L4551k60597
3519E706777l6495P6267j81744o3409J86364k35614j90215j3060l927k8801j25932
3508E090211J16418k7003k20968M1402K1059k34553j7231j74705n6594n2351k64031
3497D221654n7704l5876j19509J4339q1219j62719m7905j74377r4168n3384k60213
$$ plain form
3571 12430193 12065769 12055526 11707905 11337414 11162183 10964376 10840620 10566602 10353207 10180569
3561 10180569 9942722 9777098 9708507 9403100 9068323 9017245 8953009 8766126 8624947 8546283
3551 8546283 8465573 8406899 8103473 7927791 7794092 7754762 7607560 7559736 7494741 7359694
3541 7359694 7223205 6892273 6910547 6919412 6925232 6688244 6578878 6562439 6332815 6315723 6259588
3530 6259588 6198223 6130939 6183546 6166647 6162677 5962922 5912909 5939443 5932823 5967374 5706777
3519 5706777 5670282 5746549 5564805 5501396 5687760 5452146 5261931 5248871 5244944 5216143 5090211
3508 5090211 5206629 5179626 4958658 5000060 5021119 4786566 4769335 4594630 4538036 4485685 4221654
3497 4221654 4163950 4128074 4008565 4022904 3941685 3778966 3731061 3556684 3462516 3409132 3148919
3486C148919l0660j41464j15310Q6382n400K7392j08436k06835j55161l3809O683
3475B472301k5950j75819O0146R3793q4442k3934J17493j16815m4828O5537r4908
3464B242574o5441j37341K20834j73352p3514R8732m05J27503J65656n7343M9129
3453B397032K9941j06161k21842J34376N0969O5756j49824L7259K6436j40442
3443B123500J18430L6502n3051j29398J13245j22569J77782K9995K43800k2908
3433B515328J86999q3294l27791J46823k94353j7273J16608P0115J06048m1345
3423B377865R6141m7298K92990J24822j51276k64330J67988J47687p8239k211
3413B664139r0852N1149K5311O576n854j24233l5485O1195O5935Q4889l3557j72932
$$ plain form
3486 3148919 3118259 2976795 2861485 2947867 2942467 2969859 2861423 2654588 2499427 2465618 2472301
3475 2472301 2446351 2270532 2330678 2424471 2340029 2316095 2433588 2316773 2271945 2337482 2242574
3464 2242574 2177133 2039792 2260626 2087274 2013760 2112492 2112087 2239590 2405246 2347903 2397032
3453 2397032 2426973 2320812 2098970 2233346 2284315 2350071 2200247 2237506 2263942 2123500
3443 2123500 2241930 2278432 2225381 2095983 2209228 2086659 2264441 2294436 2538236 2515328
3433 2515328 2702327 2619033 2291242 2438065 2143712 2126439 2243047 2313162 2419210 2377865
3423 2377865 2474006 2426708 2719698 2844520 2693244 2428914 2596902 2744589 2666350 2664139
3413 2664139 2573287 2624436 2649747 2656323 2650469 2526236 2490751 2551946 2617881 2702770 2669213 2496281
3401B496281K5940n0061M2379J11980K0593K177p0035j85919p2922J4164J16190
3390B450767N2362j29744q2580Q8064o5316k15651J18756j1125j31900m2582j03088
3379A927963K2980j6986j4796n14k2313p4222J7758p2415l12080Q2625J5134j48135
3367A404999J19175J01713O653K8787j44133p3700j10485l4737K162n9202Q3562
3356A324794j84889j35454k0263L8098J33090k07530q4117J71812J11304k2339
3346A124506J6394j67115n4589j019J02903L5868q8319O1827m7601n0732J34273
3335A066396Q9769j70281j21576j10361o8322K1425K8816P3388J06246J15272
3325A030772l6150l1218j77672J02907p2486N9378J80604j61281r7519J70847
$$ plain form
3401 2496281 2522221 2472160 2514539 2626519 2647112 2649289 2579254 2393335 2320413 2334577 2450767
3390 2450767 2503129 2373385 2290805 2378869 2313553 2097902 2216658 2205533 2073633 2031051 1927963
3379 1927963 1950943 1933957 1919161 1918647 1896334 1822112 1839870 1767455 1455375 1538000 1553134 1404999
3367 1404999 1524174 1625887 1632540 1661327 1517194 1443494 1333009 1298272 1300434 1241232 1324794
3356 1324794 1139905 1004451 984188 1022286 1155376 947846 863729 1035541 1146845 1124506
3346 1124506 1140900 973785 919196 918177 1021080 1056948 968629 1030456 982855 932123 1066396
3335 1066396 1156165 985884 864308 753947 685625 707050 735866 809254 915500 1030772
3325 1030772 994622 963404 785732 888639 816153 875531 1056135 894854 797335 968182
3315I68182J84700j94896q3539j72302q3395j421K77020M1740k02847L4768L01825
3304A069835l6626P2336m8060j93104J63658k01178r506n3530J35955m6643Q453
3293H61590j9960J20799J08023j02341o895j85938o9964J03754K39357J47560
3283A195985R12n4723r7541N4438J01121j9628J85599O8572k81844m59P8476J06589
3271A337497J9238J12630o4408J88191k8293l11136K44911K21557N3376j09837
3261A663726K39254R337q9021J96272M11943K5444N4799K46856o1970J86140o187
3250B876593M9485N6468k30674K1130R6973l7351o4115l79101k09994M1527j65147
3239B055794j54827J79826j7063n1371j27322j09570j58843j89244P8719j34007
$$ plain form
3315 968182 1152882 957986 874447 702145 618750 617329 894349 936089 733242 768010 1069835
3304 1069835 1033209 1105545 1057485 864381 1028039 826861 817355 763825 899780 853137 861590
3293 861590 841630 962429 1070452 968111 961216 775278 705314 809068 1048425 1195985
3283 1195985 1196897 1142174 1044633 1099071 1200192 1180564 1366163 1434735 1152891 1152432 1230908 1337497
3271 1337497 1356735 1469365 1404957 1593148 1564855 1253719 1498630 1720187 1773563 1663726
3261 1663726 1902980 1912317 1823296 2019568 2431511 2456955 2511754 2758610 2696640 2882780 2876593
3250 2876593 2926078 2982546 2751872 2773002 2869975 2832624 2768509 2389408 2179414 2220941 2055794
3239 2055794 1900967 2080793 2063730 2012359 1885037 1775467 1616624 1427380 1506099 1372092
3229A372092O592o1817r9959j28559K83095k55220j63817j08914j88470Q9146
3219G44169j70016Q7606O7754r8834j0062k0379J27555J02650k34119j6903M1597
3208F21018o3586n996p4478Q1404J07341p9769N2353k30580k34113j49064R8970
3197A23500K93465j44781n7031K1533q9425j08874Q8891J7631j9551j04209L3822
3186E4971K38443K7232j33751J46143j43126q2949l3053k16072J17483J08323
3176H3644Q8274j30283j5521m0375M7950p2586R650M5936k4076N0242J31709Q2821
3164B57385m09892l5931K39135R9168q7715m8536j8559j15533J46835J29202k02906
3153d7347o2632K9788J39387J8215k9849P2114j79984O181L5444p4618L4794k1956
$$ plain form
3229 1372092 1378684 1316867 1216908 1088349 1371444 1116224 952407 843493 655023 744169
3219 744169 574153 661759 729513 630679 620617 600238 727793 830443 596324 579421 621018
3208 621018 557432 551436 476958 558362 665703 585934 638287 407707 173594 24530 123500
3197 123500 416965 272184 215153 236686 147261 38387 127278 144909 125358 21149 54971
3186 54971 293414 320646 186895 333038 189912 106963 73910 -142162 -24679 83644
3176 83644 171918 41635 26114 -14261 33689 -38897 -29247 16689 -7387 42855 174564 257385
3164 257385 -152507 -188438 50697 149865 62150 13614 -4945 -120478 26357 155559 -47347
3153 -47347 -109979 -80191 59196 77411 47562 119676 -60308 -54127 -18683 -93301 -58507 -80463
3141h0463j3209J4998m4425R7176J39864O766j59961L3640j0909k00348O4804
3130a52067M0181j0045j63372n828L34039n3845L530L1087j59311P272M0152j1694
3118i9901N8453j07609J28026r9646q4392J50898n9698J8008K7149j36413k77672
3107d82797R8148J46440J49666Q904q8106q1015K5748O1522P4908k7413k42848
3096c56843n745J88220K9327k18520Q6401j1401J04227J40399J3872M4636j61710
3085a47137J18941O4454l1418l9530j14474J50568j7397j66449n0622M1950O0617
3074a30497j8647q4387k23662O6461l4243M0128J84752n1694M8273o7238k13077
3063d83831P72K40151K109k1495L26699j75607k27849J8572N2354K24225p8568
$$ plain form
3141 -80463 -93672 -78674 -123099 -25923 113941 120707 -39254 -5614 -16523 -216871 -152067
3130 -152067 -111886 -121931 -285303 -291131 42908 -10937 -7407 23680 -135631 -128359 -88207 -99901
3118 -99901 -41448 -149057 -21031 -120677 -205069 -54171 -113869 -95861 -68712 -205125 -482797
3107 -482797 -384649 -238209 -88543 -79639 -167745 -248760 -223012 -161490 -86582 -113995 -356843
3096 -356843 -362588 -174368 -145041 -363561 -277160 -288561 -184334 -43935 -30063 14573 -147137
3085 -147137 -28196 36258 4840 -34690 -149164 1404 -15993 -182442 -233064 -191114 -130497
3074 -130497 -149144 -233531 -457193 -390732 -424975 -384847 -200095 -251789 -203516 -270754 -483831
3063 -483831 -483059 -242908 -240799 -262294 64405 -111202 -339051 -320479 -268125 -43900 -122468
3052a22468r2738n8526l5401P0601m7372r4957J09295J6753J28530j0018j38230
3041b74531j0832o2883l2958K00985J15425j61868J794O3108J10895k57937o3444
3030c72246L10363o1244j4499j5657R2366j98716j01434J8889K14616K1270j5866
3019a22158j5760k8585k1644M6958J42696R925p2618m7476l8520m8023J13569
3008h1636N7597p7557M891O7579j37931O0226J59787j6643j71583P1586p057L4651
2996c6090K7106L231q2852J12518r159N2443N5749p2391l5492P8252q9063J44292
2984A48544Q8052k07819q4752j09904Q6112J19888P2311l4668n0489k07441M0912
2973a39254J93392L3862K11950q147j98152j45808j6274M7009P8773j3309j36373
$$ plain form
3052 -122468 -215206 -273732 -309133 -238532 -285904 -380861 -271566 -254813 -126283 -136301 -274531
3041 -274531 -285363 -348246 -381204 -180219 -64794 -226662 -224868 -161760 -50865 -308802 -372246
3030 -372246 -61883 -123127 -137626 -153283 -60917 -259633 -361067 -342178 -127562 -106292 -122158
3019 -122158 -137918 -166503 -188147 -141189 1507 11432 -61186 -108662 -147182 -195205 -81636
3008 -81636 -24039 -101596 -96705 -29126 -167057 -106831 52956 36313 -135270 -63684 -70741 -36090
2996 -36090 -8984 -5753 -88605 23913 14754 67197 122946 50555 15063 93315 4252 148544
2984 148544 236596 28777 -55975 -165879 -79767 40121 112432 77764 27275 -180166 -139254
2973 -139254 54138 88000 299950 291803 93651 -52157 -68431 -21422 57351 44042 -92331
2962i2331J15192P8053p5892p705k8343J44756J48492j5584j0584j72423k31855
2951a48224J96702J49458k65066J53649K24155j47187J81351j30225L5386M2144
2941B92143J13135K14586q4343M7558j17183n0995N6864M5957J09665K92166k1533
2930H98020R1692j23527l9154J02361J98532K01508m3396k15808l5593j33823
2920I00812j25125N1241Q4617Q6623m4659N4471n2687M9281K08580N5475j82982
2909A085647j8091J99749J42K6206K92852J06556J73427J34581J36472l2846k09746
2898A894949l05046k57464j12886P7287k80434j63633K8710M2433j73837p2509
2888F77570J9985J58379R1625j04804k48591L7715j8950n9938J42468j80167J80305
$$ plain form
2962 -92331 22861 100914 25022 17317 -11026 133730 282222 266638 256054 83631 -148224
2951 -148224 48478 197936 -67130 86519 310674 163487 344838 214613 249999 292143
2941 292143 405278 619864 535521 583079 465896 414901 471765 517722 627387 919553 898020
2930 898020 989712 866185 827031 929392 1127924 1329432 1286036 1070228 1034635 900812
2920 900812 775687 826928 911545 998168 953509 1007980 955293 1004574 1213154 1268629 1085647
2909 1085647 1067556 1267305 1267447 1293653 1586505 1693061 1866488 2001069 2137541 2104695 1894949
2898 1894949 1589903 1332439 1219553 1296840 1016406 852773 881483 923916 750079 677570
2888 677570 697555 855934 947559 842755 594164 631879 612929 552991 695459 515292 695597
2877F95597N0841j0988J75122J66903j47070j08044N7009J3097j51502r2798J28842
2866G77009q1928k17965j15110j40912p0404L7524J00268K9560m9504r6636J19427
2855B91329j64704J27538r1278j9561j03014J6135j36400n8933K62908k3837r4279
2844E904M8426j12778N5139o0149j35640R5108O0209J42158k76026L0329q9008
2833b36328k39453K59153K39641j55395J76250p9649m9749R7056J8590k27183
2823a97067k9003J69389p719M2411j76545O0508j3406l66298n0736L72974N6198
2812a39294q8855J12688p8195N3785J47055K8609j51426j20846N0230j07795j18740
2801d12784r885O3778J0072L9349q4298K53920M1907J8668r4949o0179J26309
$$ plain form
2877 695597 746438 735450 910572 1077475 930405 822361 879370 892467 740965 648167 777009
2866 777009 695081 477116 362006 221094 150690 188214 288482 318042 268538 171902 291329
2855 291329 126625 254163 162885 143324 40310 56445 -79955 -138888 124020 100183 5904
2844 5904 54330 -58448 -3309 -63458 -199098 -103990 -43781 98377 -177649 -147320 -236328
2833 -236328 -475781 -216628 23013 -132382 43868 -35781 -85530 11526 30116 -197067
2823 -197067 -226070 -56681 -64400 -21989 -198534 -138026 -151432 -517730 -568466 -195492 -139294
2812 -139294 -228149 -115461 -193656 -139871 7184 35793 -115633 -236479 -186249 -294044 -412784
2801 -412784 -422669 -358891 -348819 -309470 -393768 -139848 -97941 -79273 -174222 -234401 -108092
2790a08092J01099N6208l06438L2155n7775p9859O4795n3158k8214K0606K51931
2779a06742j02732n6997J28359j40831k912R1851p8473J03234N1768j20921R9347
2768a35049J22175k3660j4697R399j84520j29868m4146L50433J5090l00326j37019
2757d72188L42749r9069M2060L9961j55337j00584l2251Q2402M1218J1801p2873
2746c72111K1787M8389j35504R3194J45514J05139R6775n3405O5785r4221r506
2735h8164N8056j8873O3393p7872j65295r2316J53468K10711J5079q2094k1979
2724d5886J3420J20502j3684q5525M3679k30606q0615J28830l2103k6789L1338
2713a77439l9127J32697J6067L4691j90404l3984J60882j56835M6585K06298o2526
$$ plain form
2790 -108092 -6993 49215 -257223 -225068 -282843 -362702 -297907 -351065 -379279 -358673 -106742
2779 -106742 -209474 -266471 -138112 -278943 -281855 -190004 -268477 -165243 -113475 -234396 -135049
2768 -135049 -12874 -36534 -51231 -41832 -226352 -356220 -400366 -49933 -34843 -335169 -472188
2757 -472188 -129439 -228508 -186448 -146487 -301824 -402408 -434659 -352257 -311039 -299238 -372111
2746 -372111 -350324 -301935 -437439 -344245 -198731 -93592 3183 -50222 15563 -78658 -88164
2735 -88164 -30108 -48981 14412 -63460 -228755 -321071 -167603 43108 58187 -23907 -45886
2724 -45886 -32466 88036 74352 -11173 32506 -198100 -278715 -149885 -181988 -208777 -177439
2713 -177439 -216566 -83869 -67802 -33111 -223515 -257499 -96617 -253452 -206867 -569 -63095
2702f3095j67224m6825K06741q0428o3540o0448J28365N5686n7586J23500j22432
2691a47286p2379n9245N3422Q3606J30590j70421m9374J2348Q0726N7332j1987
2680i2668p8925l2821K42664q1089j76367K48752m182k34819o5590j10652J01454
2669b84243j4787o2870j3694P0949n5077R6898j00119R2160J35576m6449j26294
2658c07950R6236P991K9972L7265q6848J5866j19719J53811R9311j49776J52736
2647g1105j81944k8909N0094J3618R0842m7507j39059j6378L5282R9625P3172
2636a22269j01026q0893j36175J10596P6103M2720n7138o2604J90109L9114r9493
2625b00956O5610j95870R5390J85729J66094j31413j34700M9905l8517n3789r3835
$$ plain form
2702 -63095 -230319 -277144 -70403 -150831 -214371 -274819 -146454 -90768 -148354 -24854 -147286
2691 -147286 -219665 -278910 -225488 -141882 -11292 -181713 -231087 -218739 -138013 -80681 -92668
2680 -92668 -171593 -204414 38250 -42839 -219206 29546 25364 -209455 -275045 -385697 -284243
2669 -284243 -299030 -361900 -375594 -304645 -359722 -262824 -362943 -270783 -135207 -181656 -307950
2658 -307950 -211714 -203723 -173751 -136486 -223334 -207468 -327187 -173376 -74065 -223841 -71105
2647 -71105 -253049 -281958 -231864 -218246 -127404 -174911 -313970 -330348 -295066 -195441 -122269
2636 -122269 -223295 -304188 -440363 -329767 -253664 -210944 -268082 -330686 -140577 -101463 -200956
2625 -200956 -135346 -331216 -235826 -50097 115997 -15416 -150116 -100211 -138728 -192517 -286352
2614b86352K9875N0688r3167L0735k389K7686R5205J09912q4082J00082q2868
2603a04675m287K09431P8773K2618k60162j13231l789L2764J3594k51901K22023
2592a58842M1507J76317J6460k01000l4312p9679k6015r3251O2460O4266j8069
2581b50158J13549R5472J04339j28144r4867k9098L4902j09715k03533j7007J80141
2570c04119J98540J5649L2660j91799j15114n5410L5829n1947r8960J04303K86113
2559a44255m1354J3303q8010J20533l8929j32048k2173J12294O4950N1197j72779
2548b77271K16824m3613j69287J46406K5074J22622l4895j78082j82718J551J42277
2537b31112M2743J23301j08025o3223j53238J41057K62331O1766q1505j26209
$$ plain form
2614 -286352 -256477 -205789 -298956 -268221 -270610 -242924 -147719 -37807 -121889 -21807 -104675
2603 -104675 -108962 100469 179242 201860 -58302 -171533 -175322 -142558 -128964 -380865 -158842
2592 -158842 -117335 58982 75442 -125558 -159870 -239549 -265564 -358815 -296355 -232089 -250158
2581 -250158 -136609 -41137 63202 -64942 -159809 -188907 -154005 -263720 -467253 -484260 -304119
2570 -304119 -105579 -89930 -57270 -249069 -364183 -419593 -383764 -435711 -534671 -430368 -144255
2559 -144255 -185609 -172306 -260316 -139783 -178712 -310760 -332933 -220639 -155689 -104492 -277271
2548 -277271 -60447 -104060 -273347 -126941 -101867 20755 -14140 -192222 -374940 -373389 -231112
2537 -231112 -188369 -65068 -173093 -236316 -389554 -248497 13834 75600 -5905 -132114
2527a32114l2946N1660Q4641j8422r131j43257p2612J27877J27727P8297r7443
2516c5723N6524J6741j44776R3302j33144j59776J46906q323j24622J08442M284
2505a80165M6803n5456J63813P2457o1377j39620R6380J2605R0982J08704l01451
2494a46325k51349K27574p9949J07406K4838o7421P4122J16927k23818R0785o4558
2483a91768L026P8246j21447R4808N2828j7880k05746q449R0558k3358O124J3819
2471b29239J89489j1871j50017J27623p5876n7664J78780k46118l72722J95738
2461d51877K53359j3941j73228J43183P3718j32469r2411K36505M8324L3451k532
2450g7918k2059j27189K1544o5014o9362R5580J312P2898O4232j12649R6195j08033
$$ plain form
2527 -132114 -165060 -113400 -28759 -47181 -56312 -199569 -272181 -144304 -16577 61720 -35723
2516 -35723 20801 37542 -107234 -13932 -147076 -306852 -159946 -168269 -292891 -184449 -180165
2505 -180165 -133362 -188818 -25005 47452 -13925 -153545 -57165 -44560 46422 155126 -146325
2494 -146325 -397674 -170100 -250049 -142643 -117805 -185226 -111104 5823 -217995 -127210 -191768
2483 -191768 -188742 -110496 -231943 -137135 -84307 -102187 -307933 -316382 -225824 -249182 -243058 -229239
2471 -229239 -39750 -51621 -201638 -74015 -149891 -207555 -28775 -274893 -647615 -451877
2461 -451877 -198518 -212459 -385687 -242504 -168786 -301255 -393666 -157161 -108837 -75386 -77918
2450 -77918 -99977 -227166 -205622 -270636 -339998 -244418 -243106 -170208 -105976 -218625 -122430 -230463
2438b30463j13869J04078j38166J22184J85877J35700r3946j04672k54949L00845
2428h7381K66120k3061j02262p6996J33911j31801P3040n0163Q8029j30163j1398
2417e2125n3998K2096P2561p8166j15052j0309K3483M6283j14700J78055j78998
2406b60870l9648J33534m423J9674J1666K3864K4403J234n3918J09036j37429
2395a72877O9752L8357l6914o446J80962k51962R5322K93823p5171j22481M0248
2384E2613j75475l1929o236J31479J88811j1515j34584K3424j5032q4600J5339
2373d7705O9832R6849P5921j7093o9673L96778j32739j46644Q2730k39581q8904
2362b0229q955L6740J10201J43006j15613k71341L00356K4130J01811K5537j38310
$$ plain form
2438 -230463 -344332 -240254 -378420 -256236 -70359 65341 -28605 -133277 -388226 -87381
2428 -87381 178739 155678 53416 -23580 110331 -21470 51570 1407 89436 -40727 -52125
2417 -52125 -106123 -84027 -11466 -89632 -204684 -214993 -191510 -145227 -259927 -81872 -260870
2406 -260870 -300518 -166984 -171407 -151733 -140067 -116203 -91800 -90566 -144484 -35448 -172877
2395 -172877 -103125 -64768 -101682 -108128 72834 -179128 -83806 210017 134846 12365 52613
2384 52613 -122862 -154791 -161027 -29548 159263 147748 13164 36588 21556 -63044 -47705
2373 -47705 22127 118976 194897 177804 108131 504909 372170 225526 308256 68675 -20229
2362 -20229 -29184 7556 117757 260763 145150 -126191 174165 198295 300106 325643 187333
2351A87333J0926j35387j73593J50294J30568J043j07383L0857l1013j2613K15012
2340B66044k45368k09438j04808M674J21845J26360j7715K54784R2053j88396
2330A00035k18218N077J07425j60579P3886P522L510N2464M0156R2741m6917R2568
2318A49670k21769p373J65681Q4052k26586J58019Q1028k02910j1916J25336j32674
2307c9442j167J14398n3769j86015J257L85673J24362j97655q6762J80179J4639
2296B55698J7932J65486j36986k39375j25429J3026Q0347L263r301K1251J68822
2285B14734j89438J74662O752o9479j10887J48265k5326J5223O9206j27207N6770
2274A63275K1629m8070R5947L6545J18424l36296K537R3361r5037m9454k017J88939
$$ plain form
2351 187333 198259 62872 -110721 39573 170141 171184 63801 94658 63645 51032 266044
2340 266044 20676 -188762 -293570 -288896 -167051 -40691 -58406 196378 288431 100035
2330 100035 -118183 -113106 -5681 -166260 -92374 -84852 -81342 -28878 11278 104019 57102 149670
2318 149670 -72099 -79472 86209 170261 -56325 101694 182722 -20188 -32104 93232 -39442
2307 -39442 -40609 73789 20020 -165995 -164738 220935 345297 147642 60880 241059 255698
2296 255698 273630 439116 302130 62755 -62674 -49648 30699 33962 24661 45912 214734
2285 214734 25296 199958 206710 137231 26344 174609 149283 164506 233712 106505 163275
2274 163275 184904 136834 232781 269326 387750 51454 53991 147352 52315 2861 844 189783
2262A89783J12178r0489j71109j7056N7060P5354n541q5154n3459J21248j21372
2251A1443m3069L9164Q0683j14106J82641j36464l7516n5410N806Q3715N5602
2240G2489J39507j01668J39597M7937p8577K7030R8689k14885J1311n0050P2949
2229A64329J74749l6855j74059l4254l0341o5117K30167J11048N7595K8778p4448
2218C51592r3997J39050n7349J32689N3341n8625l2012Q9032m2889O8833Q7266
2207F36931K3661k30287j23601q392K57974K08581Q8494L0867j58802l3906j76655
2196E14865J77534P7477K6454J4321J3188j06752N6830M3817N5803k3375K15788
2185A065950p7145p3391J81095J23259n0506j87775K73839n6053m166K18679o056
$$ plain form
2262 189783 301961 211472 40363 23307 80367 155721 150180 65026 11567 132815 11443
2251 11443 -31626 7538 88221 -25885 156756 20292 -17224 -72634 -66828 16887 72489
2240 72489 211996 110328 249925 297862 219285 246315 345004 130119 141430 91380 164329
2229 164329 339078 302223 128164 93910 63569 -1548 228619 339667 397262 426040 351592
2218 351592 257595 396645 339296 471985 525326 466701 434689 523721 480832 549665 636931
2207 636931 660592 430305 306704 298312 556286 764867 853361 884228 725426 691520 514865
2196 514865 692399 769876 796330 810651 823839 717087 773917 817734 873537 850162 1065950
2185 1065950 988805 915414 1096509 1219768 1169262 981487 1255326 1199273 1195107 1413786 1407730
2174A407730n4626J60935Q506j0331l01368O7791N8441O9674R0416K03469j9612
2163A681025q9825O6734m036P0906J10459N6665J79943n8227K4641P0573o9398
2152B039460m4265r9189K98684M7302k3012J03585L30914N5220J84673m9698J4941
2141B858615K92825k05007O5965K41915J19397J60020n1311J34963J14372L53910
2131D085664L21845K39158K41812K87634J48821K17877J93827J84115L23345L79488
2121F623586K98134L17744M18911N27656M14887P10437R18791R23226M74422O22659
2111A2250453P72262Q79199J411719J971533K471712L035841L645368M554508
2103C0992595N862944Q110316J1175190J2276865M765029o685613j1944416j1958543
$$ plain form
2174 1407730 1353104 1514039 1522545 1512214 1210846 1278637 1337078 1406752 1497168 1700637 1681025
2163 1681025 1591200 1657934 1653898 1724804 1835263 1891928 2071871 2013644 2038285 2108858 2039460
2152 2039460 1995195 1896006 2194690 2241992 2218980 2322565 2653479 2708699 2893372 2843674 2858615
2141 2858615 3151440 2946433 3012398 3254313 3373710 3533730 3482419 3617382 3731754 4085664
2131 4085664 4407509 4646667 4888479 5176113 5324934 5542811 5736638 5920753 6244098 6623586
2121 6623586 6921720 7239464 7658375 8186031 8600918 9311355 10230146 11153372 11627794 12250453
2111 12250453 13022715 13901914 15313633 17285166 19756878 22792719 26438087 30992595
2103 30992595 36855539 44965855 56141045 68417910 73182939 66497326 54552910 42594367
2095D2594367q817182o128343m424657l132921k434893j931603j423993j284891
2087A3015884j082500p58443l63972m99210j001518q50058m23031o27170n45565
2078F864417m84738l25820l69181o66610m33839j52219j35804l6435j36547k05896
2068C917328k53357j71912k38237l6979k01321n0947J30886k38079l84815j27420
2058B345147n4686m1352j46117j74595J00247r4204l3678j72039q7489Q2465K9538
2047A753237K8013j7562r2879k48873R5003P5434k3562r2476j09054P9182k20205
2036A226258l5559O9997j07478p6697R5024j89874j1793O1039k9329n0990p8996
2025H71602j42449j44394j4667O5359K51559p8853j05471J4637P6651j23311J08882
$$ plain form
2095 42594367 33777185 27648842 23224185 20091264 17656371 15724768 14300775 13015884
2087 13015884 11933384 11174941 10810969 10311759 9310241 8460183 8037152 7409982 6864417
2078 6864417 6379679 6053859 5684678 5018068 4584229 4432010 4296206 4259771 4123224 3917328
2068 3917328 3663971 3492059 3253822 3216843 3015522 2964575 3095461 2857382 2472567 2345147
2058 2345147 2290461 2249109 2102992 1928397 2028644 1934440 1900762 1728723 1641234 1723699 1753237
2047 1753237 1781250 1763688 1670809 1421936 1516939 1592373 1568811 1476335 1367281 1446463 1226258
2036 1226258 1190699 1260696 1153218 1076521 1171545 981671 969878 1030917 1001588 950598 871602
2025 871602 729153 584759 570092 635451 887010 808157 702686 717323 793974 670663 779545
2014G79545Q4231k58246j21978J3702j34370K07600K2024k65628R5996r8829Q9848
2003D13895j64312J90553J21186r9016J41888j9482J14610j1109m27796q7975
1993A72442L20221Q8211l9836q0815O7009l10234J36962J9029J00878J01624j61701
1982D13790p117J41301j22743J9462j89225j65893J38270L6428j07994j24449
1972C1830O9794J58537J19554j29867K74992N9784q8329j80650j123p056P0464
1961C77930p4679j77938K1692n5269J83402m8259n2144l3884Q0099O072k64367
1950c7345K34903J9242o4412J41285J04815j96794j71995j2865J24288M7144n929
1939A82337r3129J13936j78539o1610Q2818p3685L21n7565J32271J83356j01111
$$ plain form
2014 779545 863776 605530 483552 497254 362884 570484 592508 326880 422876 324047 413895
2003 413895 249583 440136 561322 462306 604194 584712 699322 688213 260417 172442
1993 172442 492663 580874 541038 460223 527232 216998 353960 372989 473867 575491 413790
1982 413790 406673 547974 425231 444693 255468 89575 227845 264273 156279 31830
1972 31830 101624 260161 379715 249848 524840 584624 496295 315645 314522 307466 377930
1961 377930 303251 125313 147005 91736 275138 226879 174735 140851 220950 227022 -37345
1950 -37345 197558 216800 152388 293673 398488 201694 29699 16834 141122 188266 182337
1939 182337 89208 203144 24605 -37005 45813 -27872 -27551 -85116 47155 230511 129400
1928A29400L5881L7968O4238k9825k8971k09000p44O8211o9707j1848J36183k3971
1916I7815p7433k55774L2362K48163m8716R9838j08219q7569o9550K59629K14340
1905C04886j64179j30196j06358O8900J51242K951Q5238j32332j31525n0560J1196
1894i0737Q9795p344p3966L1059K37443k5975m8675j04089q362M9394j77158O2202
1882f6413J6155Q621j27507L0645k68974O2398k7178J12364J31306J69784q970
1871C2231j32556j56554J76168M4933M7832K52294J11228k74816q4378q0149k69129
1860c32896L575K02575J54611j3949j12013O8307O4495k1124P9743L3615j4232
1849A12707O2051Q0643m47169P562J50799m6331M9352r2509J19334J41816q0540
$$ plain form
1928 129400 165281 203249 267487 237662 208691 -309 -1053 67158 -2549 -14397 121786 97815
1916 97815 20382 -235392 -203030 45133 -3583 96255 -11964 -99533 -169083 90546 304886
1905 304886 140707 10511 -95847 -26947 124295 127246 212484 80152 -51373 -101933 -90737
1894 -90737 -942 -8286 -82252 -51193 186250 160275 111600 7511 -851 48543 -128615 -66413
1882 -66413 -50258 -41637 -169144 -138499 -407473 -345075 -372253 -259889 -128583 41201 32231
1871 32231 -100325 -256879 -80711 -35778 12054 264348 375576 100760 16382 -63767 -332896
1860 -332896 -329321 -126746 27865 13916 -98097 -29790 34705 13581 93324 126939 112707
1849 112707 174758 255401 -191768 -184206 -33407 -79738 -30386 -122895 -3561 138255 57715
1838E7715m0280M7475L5341O3617N5448O872O6794o0437R3551j81408j2851M8356
1826A80193K61400j61555j16477j93640j29924J9103J69159j5011p0031J0745
1816d6038m904o2842k2078J36296J2619p9611J00895Q7643J15778j59629k53234
1805a75105K0269M5486o5350M8023J24539k3700K775o2078j58655n6435n26J60476
1793a40281K28185k09360J15484N9564J37862m1975j45592l6017k0563J14410
1783F1717J23836P083j82522J65673n5816p6725k2800k26596M4332J464J31079
1772b9275k1732o3388J13363M5331j68331J68029P2942q3622l3001o3574j42385
1761b05643K48772q6963l7784J48422o640j00033r6819k7955J23168J22468k36027
$$ plain form
1838 57715 17435 64910 100251 163868 219316 226188 292982 232545 326096 144688 131837 180193
1826 180193 441593 280038 163561 -30079 -160003 -140900 28259 13248 -56783 -46038
1816 -46038 -50942 -113784 -135862 434 13053 -66558 34337 121980 237758 78129 -175105
1805 -175105 -154836 -109350 -174700 -126677 -2138 -25838 -23063 -85141 -243796 -300231 -300757 -140281
1793 -140281 87904 -121456 -5972 53592 191454 149479 3887 -32130 -52693 61717
1783 61717 185553 192636 10114 175787 119971 43246 20446 -206150 -161818 -160354 -29275
1772 -29275 -51007 -114395 -1032 44299 -124032 43997 116939 33317 316 -63258 -205643
1761 -205643 43129 -43834 -81618 66804 60164 -39869 -136688 -164643 -41475 80993 -155034
1750a55034L9990L1246P2829q6363n6756L2435J95341j29182p1584N7176l8226
1739a08128o7385m1400J17024k795p5308P8207J68851l7502p8908J1535J62609
1728A26800j04942P257j8975j5911K1804j78356N6332J24490q3167O5701R6141
1717I7174R6792k3228m158j33966n1294Q082k3435N1589q8841p3835J61541j28931
1705a12510L3738K23765q8286l6403j56816J23089r6466j9056m577K13745N3423
1694A33646k20451j29255j42376K71998O3795k02312K42714J12870P2108j49108
1684E3629J21969K5211j34025r4782P2113K9096j1105j17798j27423K24854j27247
1673h5508N6835J56233j20967o1964l2886j79003J08002K36236O3731o2057j22815
$$ plain form
1750 -155034 -115044 -83798 -10969 -97332 -154088 -121653 73688 -55494 -127078 -69902 -108128
1739 -108128 -175513 -216913 -99889 -102684 -177992 -99785 69066 31564 -47344 -35809 126800
1728 126800 21858 29115 10140 -5771 16033 -162323 -105991 18499 -64668 1033 97174
1717 97174 193966 170738 166580 32614 -18680 -10598 -34033 17556 -71285 -145120 16421 -112510
1705 -112510 -78772 144993 56707 20304 -136512 -13423 -109889 -128945 -133522 80223 133646
1694 133646 -86805 -216060 -358436 -86438 -22643 -224955 17759 130629 202737 53629
1684 53629 175598 200809 66784 -27998 44115 73211 62106 -55692 -183115 41739 -85508
1673 -85508 -28673 127560 6593 -55371 -88257 -267260 -159258 76978 140709 78652 -44163
1662d4163j7308Q2870N6833K49361j54993n6871Q5365l57882j09363K64320j10010
1651a11841J14611J27996o5969M2558o9915j39779N1254q8944K10743J48003l6527
1640A82190j86054L9762k7734J2677J79390j64223J42852q8787j00917j08874
1630a19718k744p9806K3242K04523Q7100k2010j49841j84378K45507K48405K485
1619B52765j29453j95689j43984l1058K25080L0832J30727R39n0212J50414r8658
1608A41703q8127j64229J6J1805O9791K0809J4384j38816K20733n7998K4596J8689
1596G3356r1517K3182j35788r8690P1947J47309n1961M876j75057j11222J38957
1585b04608J99619j52802L022L5817o7620N843R502R7186k21208J55631J23905
$$ plain form
1662 -44163 -61471 21399 78232 327593 172600 115729 201094 -156788 -266151 -1831 -111841
1651 -111841 2770 130766 64797 107355 37440 -102339 -51085 -140029 70714 218717 182190
1640 182190 -3864 35898 8164 20841 200231 36008 178860 90073 -10844 -119718
1630 -119718 -122462 -202268 -179026 25497 112597 90587 -59254 -243632 1875 250280 252765
1619 252765 123312 -72377 -216361 -247419 -22339 8493 139220 140159 89947 240361 141703
1608 141703 53576 -110653 -110637 -98832 -29041 -8232 6152 -132664 88069 30071 54667 73356
1596 73356 -18161 5021 -130767 -229457 -157510 -10201 -62162 -57286 -232343 -343565 -204608
1585 -204608 -4989 -157791 -154769 -118952 -186572 -180729 -171227 -74041 -295249 -139618 -15713
1574a5713p7500m6377j526K20352J33623q4170j35833p6394m591J1156J06899
1563B9926K0329j4921J38659k46170j24099J13447J15608Q7011j02105p3668K20261
1552A64278o2023j21323O7507o393K911m6176k9255J4247j92407m3166J70819
1541h0981J65652J71758P6386k81382n5369j26507L50126k69575j58846L0394
1531a78344L2908r6638K29794P4734j51065K3427j14516j445R3626J15694j2172
1520A6003L0313j53304R6691J5144q5232k3244R6659K2351o8847P2867J00701
1509A20102j2967K843J71092o7796j34217j23064N1784j6863k52955K36313K1784
1498c944j22891q0965O341k8827n1807r4949p564R6036J39966K4060M8927Q3901
$$ plain form
1574 -15713 -93213 -139590 -141116 79236 212859 128689 -7144 -83538 -88129 -76973 29926
1563 29926 50255 35334 173993 -72177 -196276 -82829 32779 119790 17685 -55983 164278
1552 164278 102255 -19068 48439 42046 44957 -1219 -30474 -16227 -208634 -251800 -80981
1541 -80981 84671 256429 332815 51433 -3936 -130443 219683 -49892 -208738 -178344
1531 -178344 -145436 -242074 -12280 62454 -88611 -65184 -179700 -181145 -87519 28175 16003
1520 16003 46316 -106988 -10297 4847 -80385 -103629 -6970 15381 -53466 19401 120102
1509 120102 107135 109978 281070 213274 79057 -44007 7777 -9086 -262041 -25728 -3944
1498 -3944 -126835 -207800 -201459 -230286 -282093 -377042 -384606 -288570 -148604 -124544 -75617 8284
1486H284J15998j39032k29553o9992K28453R8837j62802K4551P6760m8009j9078
1475a15583K13688q4545J05888J72315k05705L2471j54026j5313L9060M9630k6154
1464A1726j28677K29168k044j57822M6332J11007n5174k45311Q6607L3755o8761
1453a39194P2069j38963Q0530K09984j53676j96498k0391K17684O7378Q5893j64852
1442h0036Q537N5249K8499M7520k90289j03719J24130p1749J70225r3990m6576
1431b52199L8703O4999J00046R66O8450p1256r7163M9483O2534O9890k30198Q7440
1419a08305J78564N7193k8293p1300J48025q132r8702j32047J01941j79324l3588
1408a73968J68319l629J62157j2480j43123R9200k33248P9692J20381p510o893
$$ plain form
1486 8284 124282 -14750 -244303 -314295 -85842 12995 -149807 -125256 -48496 -96505 -115583
1475 -115583 98105 13560 119448 291763 86058 118529 -35497 -50810 -11750 37880 11726
1464 11726 -116951 112217 110173 -47649 -1317 109690 54516 -190795 -104188 -70433 -139194
1453 -139194 -67125 -206088 -125558 84426 -69250 -265748 -286139 -68455 -1077 84816 -80036
1442 -80036 -71499 -16250 12249 59769 -230520 -334239 -210109 -281858 -111633 -205623 -252199
1431 -252199 -213496 -148497 -48451 -47485 20965 -50291 -147454 -97971 -35437 34453 -195745 -108305
1419 -108305 70259 127452 99159 27859 175884 167752 69050 -62997 38944 -140380 -173968
1408 -173968 -5649 -9278 152879 140399 -2724 96476 -136772 -57080 63301 55791 48898
1397D8898n5606k01373o0905K724Q5981J61971k9390n0061J5842K07720j03848
1386B1953m3397P139q0176N8838j06723k4311Q1481P4002J63892l4636k12928
1375i4866O9441j19632l833Q061r5370J06869K34750m5086q5347j59789R9681
1364h5121L5324P570n5286J32803j61064K05013q9267j62932K63957o4663K47089
1353B73423j14920P3592k19318j44116K12400j90803j4161J040r479j2941J62780
1342A7497J30597n9452o9971r4086P9980N0721j71447p5044J64348J01028k7639
1331D6532j99719K4433P4250p0913j1428J6264N7579R0612n1237n361P8754M6652
1319I6418L3796O639j43634P3717M5183j01759K20111O2028q2840j08510M5237
$$ plain form
1397 48898 -6708 -208081 -268986 -266262 -180281 -18310 -47700 -97761 -81919 125801 21953
1386 21953 -21444 -14305 -94481 -35643 -142366 -166677 -85196 -11194 152698 118062 -94866
1375 -94866 -25425 -145057 -148890 -140829 -236199 -129330 105420 60334 -25013 -184802 -85121
1364 -85121 -49797 -42227 -97513 35290 -125774 79239 -10028 -172960 90997 26334 273423
1353 273423 158503 232095 12777 -131339 81061 -109742 -123903 -122863 -132342 -145283 17497
1342 17497 148094 88642 18671 -75415 4565 55286 -116161 -191205 -26857 74171 46532
1331 46532 -153187 -128754 -54504 -125417 -136845 -120581 -63002 27610 -23627 -28988 49766 96418
1319 96418 130214 136853 -6781 66936 112119 10360 230471 292499 209659 101149 146386
1308A46386o1603k21216P6429J56910p8465O9966j00791j98022J26055J57454
1298G3103o2456m7250J89125p4913K61279j71663l21742N3015O4968L6501O2314
1287F2281n5626j85036k0346J29402R6736k8507j30652r5827j67905P3083K40984
1276h1413L47q3069N7265j48172R9237J39091l9072Q4551J90429Q1213j48413
1265A51994p4765r8627l1979K94701n2986j36500k13880M7572J27873k7657O4370
1254E0116J6617p6976N633m3584k57391J56311p0040j11864J46636Q7163q3476
1243a80855R7383L8644j1953J4518j0285j71193K0145R9639l9014L109J40736
1232H74L9485o8453J6793j29713P8114j3018N9731N3510r8486j05140J26420L0954
$$ plain form
1308 146386 84783 -136433 -60004 96906 18441 88407 -12384 -210406 -84351 73103
1298 73103 10647 -36603 152522 77609 338888 167225 -154517 -101502 -36534 -33 62281
1287 62281 6655 -178381 -198727 -69325 27411 -1096 -131748 -227575 -395480 -322397 -81413
1276 -81413 -81066 -164135 -106870 -255042 -155805 -16714 -55786 28765 219194 300407 151994
1265 151994 77229 -21398 -53377 241324 188338 51838 -162042 -114470 13403 -14254 50116
1254 50116 66733 -10243 -4610 -48194 -305585 -149274 -219314 -331178 -184542 -97379 -180855
1243 -180855 -83472 -44828 -56781 -42263 -52548 -223741 -203596 -103957 -142971 -139862 874
1232 874 40359 -28094 -11301 -141014 -62900 -75918 -16187 37323 -61163 -166303 -39883 -8929
1220h929j66730l3928M6227L5276J40505N5641J016m5386l2180o6868k93660j2124
1208c81140Q7519J9692q7027R8124K18898Q7286j3622Q2179q569M583k38536L2167
1196i8446J23302j09043J46078l7894o8221K01322j5202m07j05192j70774l1215
1185a65692j28016J12020n7061L944N6474j17952K24071J21883o8189q6110Q1456
1174b3172L5381P544J20901K8421k15438m0117J8978J09462K5469k7349P6903
1163A16983R1472J57188l13627m0811q8367k14893J91608K68360J0279j51115
1153B7077J36696J8308l4134j04261j76663J16296n2629n8119j09852N6676J14694
1142f5911o4306j2542J69584k26323p2835J22317J17746O4787n4422q0918r0709
$$ plain form
1220 -8929 -175659 -209587 -163360 -128084 12421 68062 69078 23692 -8488 -75356 -369016 -381140
1208 -381140 -293621 -273929 -360956 -262832 -43934 43352 29730 111909 103340 107923 -130613 -98446
1196 -98446 24856 -84187 61891 23997 -44224 157098 141896 141489 36297 -134477 -165692
1185 -165692 -293708 -181688 -238749 -234805 -178331 -296283 -72212 49671 -18518 -104628 -23172
1174 -23172 12209 19753 140654 169075 -46363 -86480 -67502 41960 67429 40080 116983
1163 116983 208455 365643 52016 11205 -77162 -292055 -100447 167913 178192 27077
1153 27077 163773 182081 147947 43686 -132977 -16681 -69310 -127429 -237281 -180605 -65911
1142 -65911 -130217 -142759 26825 -199498 -272333 -150016 -32270 32517 -21905 -102823 -193532
1131a93532K1926L2957O4730J91972M924q6090Q6830J5245M259k6671n6536j05996
1119d5982J42690J25853l59351k88883L79908M6706o2942J33819o8593k8181o5086
1108i0042N0195J4715j24822o0784J67395P4098k00662J99832o1184o8357J62091
1097F2475J8406N3070n5425p9455r9836n4269j06889k7137L11182J02866j3995
1086A10993j24781o6128O524n9594K3116N5827j03686O5036l0289Q8194J4540
1075b0248J9306N7522L9884J11789J13651j65811j62674j22697M1127J16011J75564
1064B03424l171K891j23433n5505Q5295p5775j9999R4109n8036J17531r9151j87761
1052a19581J28608j24960q7974J9028L64206k47393J0464J06353o6433l7841k555
$$ plain form
1131 -193532 -171606 -138649 -73919 118053 122977 36887 123717 138962 143221 116550 60014 -45982
1119 -45982 96708 222561 -136790 -425673 -45765 941 -62001 71818 3225 -24956 -90042
1108 -90042 -39847 -25132 -149954 -210738 -43343 30755 -169907 29925 -31259 -99616 62475
1097 62475 80881 133951 78526 -929 -100765 -155034 -261923 -289060 22122 124988 110993
1086 110993 -13788 -79916 -73392 -132986 -109870 -54043 -157729 -92693 -122982 -34788 -20248
1075 -20248 -942 56580 96464 208253 321904 156093 -6581 -129278 -88151 27860 203424
1064 203424 200253 203144 79711 24206 109501 33726 13727 107836 49800 167331 68180 -119581
1052 -119581 9027 -115933 -203907 -184879 179327 -68066 -57602 48751 -17682 -55523 -58078
1041e8078J9847K27656k41864J62064J39481l7452k11585j52369R0381J83272
1031A21353n6023j58196J08101n1286J7328J8202j2473J19263J35989m0691r8669
1020A02898Q4185j52020k6554k2158n7206J59524j33006O6169N7454L5451q8628
1009B6109r2460J69760P4721q7194j15779J16601j34449n105r1936O5448N8847
998a5437n293K49406o6636j86225J05895n3680j55541Q4266Q4267P7179K05669
987C23870j11727m4980j67701O2029Q0489j24198L8618j25211o7582q0683J78813
976c8263Q3080N89j37257q0308Q5661J74831l6160J69845j48445j69278j75256
965b70961K8039J01456K68532k5956k72569O8093J46957j20189K6519r1749n1253
$$ plain form
1041 -58078 -38231 189425 -52439 109625 249106 211654 69 -152300 -61919 121353
1031 121353 65330 -92866 15235 -36051 -18723 -521 -12994 106269 242258 201567 102898
1020 102898 187083 35063 8509 -13649 -70855 88669 -44337 21832 79286 114737 26109
1009 26109 -66351 103409 178130 90936 -24843 91758 -42691 -47796 -139732 -74284 -15437
998 -15437 -20730 228676 162040 -24185 81710 28030 -127511 -43245 41022 118201 323870
987 323870 212143 167163 -538 61491 141980 17782 56400 -68811 -136393 -217076 -38263
976 -38263 44817 45406 -91851 -172159 -86498 88333 52173 222018 73573 -95705 -270961
965 -270961 -242922 -141466 127066 101110 -171459 -103366 43591 -76598 -50079 -141828 -193081
954a93081K29059R5780j86330k5322m3834J4138L9090J98679N3707j46638K02852
943B38100k9110k1188k62994j31056K11629J19843j108j50563J21073J3865m4847
932F3644K3572J8853j9631R0844J81253k51164R3889R853N3776j07141j07371
921E0377N6650q0854O0367Q4406k7874q898R7299r3415o4844J42445l06258L6420
909e4179J52780J36429j49630k28068J22152k68374J59620K384Q9049J53644m2361
898G3446m2624j16421L3917J4734K20654R9743j25647J20898j6686m0422k1759
887A99833r8571k6411K53679L4064l0978m18253K9987N0712r8838k4913K07750
876G8061l8511m897j03655K4286J56501J39874P3029j50154j11833O4264P545
$$ plain form
954 -193081 35978 131758 -54572 -79894 -123728 -109590 -70500 128179 181886 35248 238100
943 238100 208990 187802 -75192 -206248 5381 125224 124116 -26447 94626 108491 63644
932 63644 87216 106069 86438 177282 358535 107371 201260 211113 264889 157748 50377
921 50377 107027 26173 86540 170946 143072 134174 231473 138058 73214 215659 -90599 -54179
909 -54179 98601 235030 85400 -142668 -20516 -288890 -129270 -126886 -37837 115807 73446
898 73446 30822 -85599 -51682 -36948 183706 283449 157802 278700 262014 221592 199833
887 199833 101262 74851 328530 362594 331616 -86637 -56650 -5938 -104776 -129689 78061
876 78061 39550 34653 -69002 -44716 111785 251659 324688 174534 62701 126965 134510
865A34510j86368R0860K3937N3279k46601M2096q7608J79080J54575J4114J78220
854C50094n853k67576O9925N1652q2441j37962K78054j69673j57495n9579Q9819
843d1035J16655M4193N8994k04817J69957R5789j78851P1249r1624K18382o3800
832A95092J19998k08660j98919K59806j11442k59390Q8557J35249q8222K8025
822c9906J83615n0145o6036p0122N0112R6626q7387m0405J58142P1875J24734
811C31103q3897k04025l1386j05920q1852K35495r0489p6506R6327O0511J24235
800A73596l1660k2689K9586j40561q2595R1941K2866J31934o9662q2751o6323
789d6318M649M429J25519o4728R7308j79064N6620j73562r422R993L6909n401
$$ plain form
865 134510 -51858 39002 62939 116218 -130383 -88287 -175895 3185 157760 171874 350094
854 350094 344241 76665 146590 198242 115801 -22161 255893 86220 -71275 -130854 -41035
843 -41035 75620 119813 178807 -26010 143947 239736 60885 132134 40510 258892 195092
832 195092 315090 106430 -92489 167317 55875 -203515 -114958 20291 -67931 -39906
822 -39906 143709 93564 27528 -42594 7518 104144 16757 -23648 134494 206369 331103
811 331103 247206 43181 11795 -94125 -175977 59518 -30971 -107477 -11150 49361 173596
800 173596 141936 119247 148833 8272 -74323 17618 40484 172418 102756 20005 -46318
789 -46318 -41669 -37240 88279 23551 120859 -58205 -1585 -175147 -184569 -174576 -137667 -143068
777a43068K23083j22492Q3051m7759R7635n1298L5559J0608n0339K5335l5508
766B4807M2806J55254j49577J49719J23059n5550J5290l1974j83257Q934M1649
755A41160Q3894l2843q6338j11404k13856J23904J21095R2657p2702r7852j32979
744a85264J23447N871J09146K6774J91086j52107M3178j03909J0427r6794P8766
733E0621j44768j17165L0859J26106O8368j14758J02495k9990Q1995N6076J0611
722A20450K9227j36982j21744J38327J98661j8659l1507J1118j63995r7833J74649
711A01712j0856R7606o2713j57669q790n1031J30576J71929M1713k2672j12895
700A16910m4665L7484m6404o3263p328K69911n2676j64710J0296M5392O8830r8096
$$ plain form
777 -143068 80015 -42477 40574 -7185 90450 39152 74711 85319 34980 60315 24807
766 24807 67613 222867 73290 223009 346068 290518 305808 273834 90577 99511 141160
755 141160 225054 192211 105873 -5531 -219387 -95483 25612 118269 45567 -52285 -185264
744 -185264 -61817 -55946 53200 79974 271060 118953 162131 58222 68649 -28145 50621
733 50621 -94147 -211312 -180453 -54347 14021 -100737 1758 -28232 53763 109839 120450
722 120450 149677 12695 -109049 29278 227939 209280 177773 188891 24896 -72937 101712
711 101712 90856 188462 125749 -31920 -40710 -91741 38835 210764 252477 229805 116910
700 116910 72245 109729 63325 62 -7266 262645 209969 45259 55555 100947 169777 71681
688G1681j795J6839K0005j70726l0963J07926N1714J0140m6659j65052J20410
$$ plain form
688 71681 69886 86725 106730 -63996 -94959 12967 64681 74821 28162 -136890 -16480
$$ [...]
##END NTUPLES=NMR SPECTRUM
##END=
