##TITLE=1H_CA-9183-2
 CDCl3
 8 sc, 
 31.8.2023
##JCAMPDX= 6.0         $$ Bruker NMR JCAMP-DX V2.0
##DATA TYPE= NMR SPECTRUM
##DATA CLASS= NTUPLES
##ORIGIN= UXNMR, Bruker Analytische Messtechnik GmbH
##OWNER= root
$$ XWIN-NMR		Version 3.5
$$ Thu Aug 31 14:15:30 2023 Russian Standard Time (UT+4h)  she@DPX200
##.OBSERVE FREQUENCY= 200.13135
##.OBSERVE NUCLEUS= ^1H
##.ACQUISITION MODE= SIMULTANEOUS
##.ACQUISITION SCHEME= undefined
##.AVERAGES= 8
##.DIGITISER RES= 18
##SPECTROMETER/DATA SYSTEM= spect
##.PULSE SEQUENCE= zg30
##.SOLVENT NAME= CDCl3
##.SHIFT REFERENCE= (INTERNAL, CDCl3, 0, 15.7403)
##AUDIT TRAIL= $$ (NUMBER, WHEN, WHO, WHERE, WHAT)
$$ ##TITLE= Audit trail, XWIN-NMR		Version 3.5
$$ ##JCAMPDX= 5.01
$$ ##ORIGIN= Bruker BioSpin GmbH
$$ ##OWNER= she
$$ F:/spectra/data/she/nmr/H-F/1/pdata/1/auditp.txt
$$ ##AUDIT TRAIL=  $$ (NUMBER, WHEN, WHO, WHERE, WHAT)
(   1,<2023-08-31 14:14:14.42 +0400>,<she>,<DPX200>,
      <created by zg, POWCHK disabled, PULCHK disabled
       configuration hash MD5:
       00 E9 B6 7A A2 85 ED C7 34 08 36 98 17 FE 4E 26
       data hash MD5: 16K
       7E 84 DE FE 79 13 93 87 E4 AF 5D DB 06 BF D9 5F>)
(   2,<2023-08-31 14:14:16.84 +0400>,<she>,<DPX200>,
      <Start of raw data processing
       efp BC_mod = 2 LB = 0.24 FT_mod = 6 PKNL = 1 PHC0 = -21046.57 PHC1 = 9.85272 SI = 16K 
       data hash MD5: 16K
       E2 9C 76 81 41 5C 9A B8 D3 4D 59 C2 19 A7 BE 93>)
(   3,<2023-08-31 14:14:35.71 +0400>,<she>,<DPX200>,
      <pk PHC0 = -4.033418 PHC1 = 4.4 
       data hash MD5: 16K
       43 69 94 D0 5D D8 32 BD 4F 38 D9 B1 34 00 B3 D4>)
(   4,<2023-08-31 14:14:40.12 +0400>,<she>,<DPX200>,
      <abs ABSG = 5 
       data hash MD5: 16K
       96 75 5F 07 E1 6D 84 83 18 0D 2A A7 42 A1 A0 2D>)
$$ ##END=
$$ 
$$ hash MD5
$$ 9A 02 FE 53 2F AA 48 66 D2 B3 F9 44 77 EA 73 2F
##$RELAX= 
##$RELAX= 
##$RELAX= 
##$RELAX= 
##$RELAX= 
##$RELAX= 
$$ Bruker specific parameters
$$ --------------------------
##$DU= <F:/spectra>
##$EXPNO= 1
##$NAME= <H-F>
##$PROCNO= 1
##$TYPE= <nmr>
##$USER= <she>
##$AMP= (0..31)
100 100 100 100 100 100 100 100 100 100 100 100 100 100 100 100 100 100 
100 100 100 100 100 100 100 100 100 100 100 100 100 100 
##$AQSEQ= 0
##$AQ_mod= 1
##$AUNM= <au_zg>
##$AUTOPOS= <>
##$BF1= 200.13
##$BF2= 200.13
##$BF3= 200.13
##$BF4= 200.13
##$BF5= 200.13
##$BF6= 200.13
##$BF7= 200.13
##$BF8= 200.13
##$BYTORDA= 1
##$CFDGTYP= 0
##$CFRGTYP= 5
##$CHEMSTR= <none>
##$CNST= (0..31)
1 1 145 1 1 1 1 1 1 1 1 1 1 1 1 1 1 1 1 1 1 1 1 1 1 1 1 1 1 1 1 1 
##$CPDPRG= <>
##$CPDPRG1= <>
##$CPDPRG2= <>
##$CPDPRG3= <>
##$CPDPRG4= <mlev>
##$CPDPRG5= <mlev>
##$CPDPRG6= <mlev>
##$CPDPRG7= <mlev>
##$CPDPRG8= <mlev>
##$CPDPRGB= <>
##$CPDPRGT= <>
##$D= (0..31)
0 1.2 0 0 0 0 0 0 0 0.06 0 0.03 0 0 0 0 0.0002 0 0 0 0 0 0 0 0 0 0 0 0 
0 0 0 
##$DATE= 1693476853
##$DBL= (0..7)
120 120 120 120 120 120 120 120 
##$DBP= (0..7)
150 150 150 150 150 150 150 150 
##$DBP07= 0
##$DBPNAM0= <>
##$DBPNAM1= <>
##$DBPNAM2= <>
##$DBPNAM3= <>
##$DBPNAM4= <>
$$ [...]
##$SUBNAM3= <"">
##$SUBNAM4= <"">
##$SUBNAM5= <"">
##$SUBNAM6= <"">
##$SUBNAM7= <"">
##$SUBNAM8= <"">
##$SUBNAM9= <"">
##$SW= 18.05172834244
##$SWIBOX= (0..15)
0 0 2 0 0 0 0 0 0 0 0 0 0 0 0 0 
##$SW_h= 3612.71676300578
##$TD= 16384
##$TD0= 1
##$TE= 0
##$TE2= 300
##$TE3= 300
##$TEG= 300
##$TL= (0..7)
0 120 120 120 120 120 120 120 
##$TP= (0..7)
150 150 150 150 150 150 150 150 
##$TP07= 0
##$TPNAME0= <>
##$TPNAME1= <>
##$TPNAME2= <>
##$TPNAME3= <>
##$TPNAME4= <>
##$TPNAME5= <>
##$TPNAME6= <>
##$TPNAME7= <>
##$TPOAL= (0..7)
0.5 0.5 0.5 0.5 0.5 0.5 0.5 0.5 
##$TPOFFS= (0..7)
0 0 0 0 0 0 0 0 
##$TUNHIN= 0
##$TUNHOUT= 0
##$TUNXOUT= 0
##$USERA1= <user>
##$USERA2= <user>
##$USERA3= <user>
##$USERA4= <user>
##$USERA5= <user>
##$V9= 5
##$VALIST= <valist>
##$VCLIST= <CCCCCCCCCCCCCCC>
##$VD= 0
##$VDLIST= <DDDDDDDDDDDDDDD>
##$VPLIST= <PPPPPPPPPPPPPPP>
##$VTLIST= <TTTTTTTTTTTTTTT>
##$WBST= 1024
##$WBSW= 4
##$XGAIN= (0..3)
0 0 0 0 
##$XL= 0
##$YL= 0
##$YMAX_a= 315429
##$YMIN_a= -316139
##$ZGOPTNS= <>
##$ZL1= 120
##$ZL2= 120
##$ZL3= 120
##$ZL4= 120
##$ABSF1= 15.74799
##$ABSF2= -2.30386
##$ABSG= 5
##$ABSL= 3
##$ALPHA= 0
##$AQORDER= 0
##$ASSFAC= 0
##$ASSFACI= 0
##$ASSFACX= 0
##$ASSWID= 0
##$AUNMP= <proc_1d>
##$AZFE= 0.1
##$AZFW= 0.1
##$BCFW= 0
##$BC_mod= 2
##$BYTORDP= 0
##$COROFFS= 0
##$CY= -3
##$DATMOD= 1
##$DC= 0
##$DFILT= <>
##$DTYPP= 0
##$F1P= 0
##$F2P= 0
##$FCOR= 1
##$FTSIZE= 16384
##$FT_mod= 6
##$GAMMA= 0
##$GB= 0
##$INTBC= 1
##$INTSCL= 3.70164e-10
##$ISEN= 128
##$LB= 0.24
##$LEV0= 0
##$LPBIN= 0
##$MAXI= 10000
##$MC2= 0
##$MEAN= 0
##$ME_mod= 0
##$MI= 1.114404
##$NCOEF= 0
##$NC_proc= -6
##$NLEV= 6
##$NOISF1= 3.799351
##$NOISF2= 2.8
##$NSP= 0
##$NTH_PI= 0
##$NZP= 0
##$OFFSET= 15.74028
##$PC= 1
##$PHC0= -21050.6
##$PHC1= 14.25272
##$PH_mod= 1
##$PKNL= yes
##$PPARMOD= 0
##$PSCAL= 0
##$PSIGN= 0
##$REVERSE= no
##$SF= 200.130006256275
##$SI= 16384
##$SIGF1= 3
##$SIGF2= 2
##$SINO= 5.538805
##$SIOLD= 16384
##$SREGLST= <1H.CDCl3>
##$SSB= 0
##$STSI= 16384
##$STSR= 0
##$SW_p= 3612.71676300578
##$SYMM= 0
##$S_DEV= 0
##$TDeff= 16384
##$TDoff= 0
##$TI= <>
##$TILT= no
##$TM1= 0
##$TM2= 0
##$TOPLEV= 0
##$USERP1= <user>
##$USERP2= <user>
##$USERP3= <user>
##$USERP4= <user>
##$USERP5= <user>
##$WDW= 1
##$XDIM= 16384
##$YMAX_p= 273460367
##$YMIN_p= -370665
$$ End of Bruker specific parameters
$$ ---------------------------------
##NTUPLES= NMR SPECTRUM
##VAR_NAME=  FREQUENCY,     SPECTRUM/REAL,   SPECTRUM/IMAG
##SYMBOL=    X,             R,               I
##VAR_TYPE=  INDEPENDENT,   DEPENDENT,       DEPENDENT
##VAR_FORM=  AFFN,          ASDF,            ASDF
##VAR_DIM=   16384,         16384,           16384
##UNITS=     HZ,            ARBITRARY UNITS, ARBITRARY UNITS
##FACTOR=    0.220516191357247, 1,           1
##FIRST=     3150.10236516864, 0,            0
##LAST=      -462.614397837144, 0,           0
##MIN=       -462.614397837144, -370665,     0
##MAX=       3150.10236516864, 273460367,    0
$$ Real data points
##PAGE= N=1
##DATA TABLE= (X++(R..R)), XYDATA
$$ [...]
$$ plain form
7047 -67488 -61155 -61871 -100233 -73981 -82749 22968 -198576 -206838 -181823 -147425 -155238 -97241 -46348
7034 -46348 -65882 -9224 29081 29789 68502 -14939 -175063 -133225 -114690 -166942 -121826 -132031
7022 -132031 -116307 -121956 -23256 57330 44117 -30742 -133956 -141345 -187838 -181662 -283028 -226183
7010 -226183 -202858 -198848 -101814 -34132 -238657 -216597 -155257 -169051 33870 -15398 22012
6999 22012 85436 -3033 -156270 -59343 -37092 -205029 -246325 -244478 -370665 -242979 -128202
6988 -128202 -150779 -156649 -28034 -31931 -104456 -41398 -84603 -90126 -128675 -109894 -155390 -113196
6976 -113196 -3506 4809 -43632 -50422 -137537 -97461 -25901 -72538 -77934 -47010 12939 -147020
6964 -147020 -90118 -9865 60123 21109 -86171 -187704 -66406 -108451 -139694 -148620 -190431
$$ packed form
7047f7488O333p16l8362K6252q768J05717k21544q262K5015L4398p813N7997N0893
7034d6348j9534N6658L8305P08L8713q3441j60124M1838J8535n2252M5116j0205
7022a32031J5724n649R8700Q0586j3213p4859j03214p389m6493O176j01366N6845
7010b26183K3325M010R7034O7682k04525K2060O1340j3794K02921m9268L7410
6999B2012O3424q8469j53237R6927K2251j67937m1296J847j26187J27686J14777
6988a28202k2577n870J28615l897p2525O3058m3205n523l8549J8781m5496M2194
6976a13196J09690Q315m8441o790q7115M0076P1560m6637n396L0924N9949j59959
6964a47020N6902Q0253O9988l9014j07280j01533J21298m2045l1243q926m1811
$$ plain form
6953 -190431 -73429 -63602 -160081 -137967 -104060 -151384 -139641 -81190 -94894 -83893 -66093 -130717
6941 -130717 -41728 -5384 53134 -3361 -108535 -62071 -122116 -87161 52853 -40720 -115899
6930 -115899 -122768 -128490 -185350 -84800 -1716 21683 -143434 -179546 -141239 -70022 -111886 -133694
6918 -133694 -144855 -75759 -59428 -72657 -111880 -92564 -76604 -40507 -70475 15251 2168 -71112
6906 -71112 97320 61349 36 -103640 -276741 -238586 -183373 -192336 -161130 -85357 -114335
6895 -114335 -917 -53046 -127634 -173702 -121470 -42 61919 49747 -66218 -74112 -100551
6884 -100551 -81787 -58789 -142327 -150052 -116498 -24201 -29576 -194550 -141475 -93169 -17512 -64252
6872 -64252 -96312 -141519 -189340 -212466 -217855 -191707 -210626 -236901 -175891 -153166 2712 877
$$ packed form
6953a90431J17002R827r6479K2114L3907m7324J1743N8451j3704J1001J7800o4624
6941a30717Q8989L6344N8518n6495j05174M6464o0045L4955J40014r3573p5179
6930a15899o869n722n6860J00550Q3084K3399j65117l6112L8307P1217m1864k1808
6918a33694j1161O9096J6331j3229l9223J9316J5960L6097k9968Q5726j3083p3280
6906g1112J68432l5971o1313j03676j73101L8155N5213q963L1206P5773k8978
6895a14335J13418n2129p4588m6068N2232J21428O1961j2172j15965p894k6439
6884a00551J8764K2998q3538p725L3554R2297n375j64974N3075M8306P5657m6740
6872f4252l2060m5207m7821k3126n389K6148j8919k6275O1010K2725J55878j835
$$ plain form
6860 877 -31348 -33638 -22353 8542 -27546 72301 35099 -20304 -10943 -65086 -68366 21685 -90756
6847 -90756 -113573 -38937 -767 -111011 -175399 -172824 -60255 1854 -49817 -52611 -146259 -96088
6835 -96088 -88004 -89912 -125041 -92146 -89845 23073 -42827 -90536 -36288 -110313 -112172 -202750
6823 -202750 -195005 -180654 -216689 -164665 -172540 -157915 -93079 -80647 -136816 -248815 -221365 -170746
6811 -170746 -182997 -155645 -164813 -109458 -103665 -23582 -40178 -35786 -144108 -85476 -75697 -234441
6799 -234441 -51981 -23606 -105803 -86112 -69816 -111460 -92736 53355 -38327 -195961 -85863
6788 -85863 -140225 -154612 -115874 -102553 -148558 -95664 -44630 -117437 -143942 -219498 -126474 -98420
6776 -98420 -2804 37451 47495 27203 96722 -6199 -83478 -38353 -197928 -205924 -106809 -48772
$$ packed form
6860H77l2225k290J1285L0895l6088R9847l7202n5403R361n4143l280R0051j12441
6847i0756k2817P4636L8170j10244o4388K575J12569O2109n1671k794r3648N0171
6835i6088Q084j908l5129L2895K301J12918o5900m7709N4248p4025j859r0578
6823b02750P745J4351l6035N2024p875J4625O4836J2432n6169j11999K7450N0619
6811a70746j2251K7352r168N5355N793Q0083j6596M392j08322N8632R779j58744
6799b34441J82460K8375q2197J9691J6296m1644J8724J46091r1682j57634J10098
6788h5863n4362j4387L8738J3321m6005N2894N1034p2807k6505p5556R3024K8054
6776i8420R5616M0255J0044k0292O9519j02921p7279M5125j59575p996R9115N8037
$$ plain form
6764 -48772 44576 73465 -144213 -108624 -203386 -175316 -22715 22350 8081 -33952 7267
6753 7267 -32345 -57780 -88965 -34943 -1576 -87126 -127142 -52829 -189331 -170019 -147764 -111385
6741 -111385 -107790 -53443 61762 42868 86036 37118 -51717 -27812 -63494 -10213 23353 29821
6729 29821 -104185 -131905 -73745 24267 -7606 -62216 -107846 -185143 -126612 -77463 -65915 -111633
6717 -111633 -128401 -114674 -131235 -50854 -91605 -164903 -12271 -97832 -100308 -238715 -196011
6706 -196011 -159597 -159419 -103394 -83109 -198829 -108964 -144746 -102144 -186384 -190034 -101557 -237931
6694 -237931 -159767 -72644 -57884 -138176 -343690 -292794 35098 107077 -73821 -111516 -59338
6683 -59338 -78685 -77023 -92380 -100065 -221708 -254195 -128099 -101210 -212719 -292004 -135173
$$ packed form
6764d8772R3348K8889k17678L5589r4762K8070J52601M5065j4269m2033M1219
6753G267l9612k5435l1185N4022L3367q5550m0016P4313j36502J9312K2255L6379
6741a11385L595N4347J15205j8894M3168m8918q8835K3905l5682N3281L3566O468
6729B9821j34006k7720N8160R8012l1873n4610m5630p7297N8531M9149J1548m5718
6717a11633j6768J3727j6561Q0381m0751p3298J52632q5561k476j38407M2704
6706a96011L6414J78N6025K0285j15720Q9865l5782M2602q4240l650Q8477j36374
6694b37931P8164Q7123J4760q0292k05514N0896L27892P1979j80898l7695N2178
6683e9338j9347J662j5357p685j21643l2487J26096K6889j11509p9285J56831
$$ plain form
6672 -135173 -51647 34908 -115253 -55465 53763 -33988 34064 50653 -49463 -84777 -78281
6661 -78281 -165105 -111008 -106732 -134120 -69542 -131595 -28294 -66408 -151885 -179588 -48802 17389
6649 17389 -61996 -99227 -128868 -125005 -199157 -133219 -30261 48400 1781 22976 -103980 -26700
6637 -26700 -29629 -102783 1928 -6829 -15783 -65117 -157238 -165586 -136038 -19640 -44322 -23928
6625 -23928 -111464 -212117 -93488 -83018 -207988 -233600 -202866 -211139 -111047 -80545 -16815
6614 -16815 -58952 -114264 -22964 -43743 -12505 -127930 -132349 -95999 -195852 -142412 -103317 -136088
6602 -136088 -85921 -19287 -179151 -317795 -114236 -77590 -107838 -135217 28082 66283 -13803
6591 -13803 12530 -145750 -148142 -101476 -109768 -94529 -70866 -27156 -53885 -190588 -215158 -95861
$$ packed form
6672a35173Q3526Q6555j50161N9788J09228q7751O8052J6589j00116l5314O496
6661g8281q6824N4097M276k7388O4578o2053J03301l8114q5477k7703J30786O6191
6649A7389p9385l7231k9641L863p4152O5938J02958P8661m6619K1195j26956P7280
6637b6700k929p3154J04711q757q954m9334r2121q348K9548J16398k4682K0394
6625b3928q7536j00653J18629J0470j24970k5612L0734q273J00092L0502O3730
6614a6815m2137n5312R1300k0779L1238j15425m419L6350r9853N3440L9095l2771
6602a36088N0167O6634j59864j38644K03559L6646l0248k7379J63299L8201q0086
6591a3803K6333j58280k392M6666q292J5239K3663M3710k6729j36703k4570J19297
$$ plain form
6579 -95861 -242496 -236668 -160480 -101065 -72177 -47234 -68563 -207034 -144688 -52700 21316 -69155
6567 -69155 -24909 -153118 -205835 -179509 -179095 -143412 -120659 -125850 -11853 -83556 -122827 -94907
6555 -94907 -144349 -186195 -159946 -63260 -126616 -81894 -79639 -44948 -137909 -99422 -77661 -135147
6543 -135147 -259440 -261704 -131564 -27414 -80075 -32258 -96444 -123730 55389 28499 -11719
6532 -11719 -36564 6695 53503 101536 44156 -1159 -18831 66782 74715 -107718 -147820 -207324
6520 -207324 -85287 -128145 -165119 -112718 9008 89160 98283 -6322 -18301 -68757 -226609
6509 -226609 -192492 55372 169999 6235 -130560 -140163 -33956 -131044 -150747 -173018 -111047
6498 -111047 -90984 -173456 -111117 -82616 -104015 -123675 -107638 -10991 31881 41130 54616 -88962
$$ packed form
6579i5861j46635N828P6188N9415K8888K4943k1329j38471O2346R1988P4016r0471
6567f9155M4246j28209n2717K6326M14L5683K2753n191J13997p1703l9271K7920
6555i4907m9442m1846K6249R6686o3356M4722K255L4691r2961L8487K1761n7486
6543a35147j24293k264J30140J04150n2661M7817o4186k7286J79119k6890m0218
6532a1719k4845M3259M6808M8033n7380m5315j7672Q5613P933j82433m0102n9504
6520b07324J22037m2858l6974N2401J21726Q0152R123j04605j1979n0456j57852
6509b26609L4117K47864J14627j63764j36795r603J06207r7088j9703k2271O1971
6498a11047K0063q2472O2339K8501k1399j9660J6037R6647M2872R249J3486j43578
$$ plain form
6486 -88962 -198190 -81905 -129376 -202701 -177160 -99851 -115843 -185690 -212059 -130364 -56434
6475 -56434 4349 -22947 11161 68009 13576 7081 20003 107923 152188 92031 -21248 -87707
6463 -87707 -57467 -79001 -29845 -44167 25039 55996 113243 93096 41470 -85281 -95704 -24657
6451 -24657 -37819 168921 131559 -30315 -59511 -45685 -29861 55419 -65167 -172029 -119895
6440 -119895 -155873 11855 -152232 -169245 -236449 -152147 -14637 -67587 -114620 65075 -11038
6429 -11038 -62819 -104877 -130034 -143237 -115501 -6134 54198 98942 29394 -42395 -125494 -115147
6417 -115147 -122092 -125137 -132660 -74354 -67368 -67373 -129662 -135156 -18142 -84847 -222922 -202654 -169260
6404 -169260 -112447 -188386 -126884 -135769 -93728 -101168 -167637 -192945 -214312 -153361 -175406 -228899
$$ packed form
6486h8962j09228J16285m7471p3325K5541P7309j5992o9847k6369Q1695P3930
6475e6434O0783k7296L4108N6848n4433o495J2922Q7920M4265o0157j13279o6459
6463h7707L0240k1534M9156j4322O9206L0957N7247k0147n1626j26751j0423P1047
6451b4657j3162K06740l7362j61874k9196J3826J5824Q5280j20586j06862N2134
6440a19895l5978J67728j64087j7013o7204Q4302J37510n2950m7033J79695p6113
6429a1038n1781m2058k5157j3203K7736J09367O0332M4744o9548p1789q3099J0347
6417a15147o945l045p523N8306O986no2289n494J17014o6705j38075K0268L3394
6404a69260N6813p5939O1502q885M2041p440o6469k5308k1367O0951k2045n3493
$$ plain form
6392 -228899 -159953 -139827 -91655 -71351 -96631 -190086 -193060 -200379 -154525 -115021 -97492 -224072
6380 -224072 -219829 -191694 -191653 -124527 -195804 -235038 -194622 -184378 -146746 -63725 10482 -55040
6368 -55040 -26012 79269 -23819 -153396 -99688 -130032 -201743 -190211 -129033 -176580 -145264
6357 -145264 -127730 -183914 -183084 -81666 -100451 -170431 -141570 -127914 -244055 -116949 -54386
6346 -54386 9333 19109 -55751 -27336 108252 -61889 -108638 -58204 -94863 -54479 -103061 -136162
6334 -136162 -46504 -137386 -239529 -288070 -208510 -148032 -81721 -22157 -17291 53220 -49216
6323 -49216 -145179 -118552 -104944 -92073 -152278 -209338 -161369 -202652 -154366 -147050 -111030 -196731
6311 -196731 -219456 -111060 -36992 -70453 -65331 -244757 -149164 33441 -66478 -139841 -78590
$$ packed form
6392b28899O8946K0126M8172K0304k5280r3455k974p319M5854L9504J7529j26580
6380b24072M243K8135M1O7126p1277l9234M0416J0244L7632Q3021P4207o5522
6368e5040K9028J05281j03088j29577N3708l0344p1711J1532O1178m7547L1316
6357a45264J7534n6184Q30J01418j8785o9980K8861J3656j16141J27106O2563
6346e4386O3719R776p4860K8415J35588j70141m6749N0434l6659M0384m8582l3101
6334a36162Q9658r0882j02143m8541P9560O0478O6311N9564M866P0511j02436
6323d9216r5963K6627J3608J2871o0205n7060M7969m1283M8286P316L6020q5701
6311a96731k2725J08396P4068l3461N122j79426R5593J82605r9919p3363O1251
$$ plain form
6300 -78590 -106430 -125907 -57411 -68464 -57264 -77402 -174250 12303 62037 -96206 -194355
6289 -194355 -153650 -135591 -5656 -32686 -140143 -208795 -110992 -146205 -107445 -50236 75124
6278 75124 -61653 -47122 -62513 -123520 -183051 -113168 -70061 -72243 -57824 9597 14507 74862
6266 74862 -76215 -19228 72285 18830 -60845 -46526 19517 -51731 25594 -60442 -31370 -70564
6254 -70564 -30285 -33387 -125449 -97854 69772 52641 64610 -54371 -126614 -12643 -3869 -122395
6242 -122395 -28443 6900 4427 -32906 80556 -47019 -190653 -219136 -178081 -21664 29779
6231 29779 -38056 -27559 -81267 16819 -25961 -5880 98995 -33872 7648 -46980 -37247 -14410
6219 -14410 -98242 -98012 -14909 -78342 -218710 -19082 -44100 -130134 -101426 -11876 172271 251364
$$ packed form
6300g8590k7840j9477O8496j1053J1200k0138r6848J86553M9734j58243r8149
6289a94355M0705J8059J29935k7030j07457o8652R7803l5213L8760N7209J25360
6278G5124j36777J4531j5391o1007n9531O9883M3107k182J4419O7421M910O0355
6266G4862j51077N6987R1513n3455p9675J4319O6043p1248P7325q6036K9072l9194
6254g0564M0279l102r2062K7595J67626j7131J1969j18981p2243J13971Q774j18526
6242a22395R3952L5343k473l7333J13462j27575j43634k8483M1055J56417N1443
6231B9779o7835J0497n3708R8086m2780K0081J04875j32867M1520n4628R733K2837
6219a4410q3832K30Q3103o3433j40368J99628k5018q6034K8708Q9550J84147P9093
$$ plain form
6207 251364 -71478 -155848 -162275 -119729 -67082 -16124 -34541 -113379 -63309 -77955 -37838 48251
6195 48251 30324 -12180 -52223 -159462 -101087 -105057 -134561 -81594 -47349 -38516 36341 4570
6183 4570 27306 -53984 -35173 -60092 -8868 -21091 -15507 -27302 -57375 -38121 140392 126441
6171 126441 101181 115867 40393 90583 -34989 -11464 151271 239991 122886 -21613 4402
6160 4402 23090 40248 41164 52561 14684 -14644 11570 68035 163983 184862 214643 164466
6148 164466 77883 70755 207902 180754 46102 12826 65946 101411 68536 148388 159103
6137 159103 114233 183073 338361 287609 194776 128431 256490 310055 267098 217868 176614
6126 176614 247305 153070 124712 159951 103107 82995 237381 309284 238065 291657 303674
$$ packed form
6207B51364l22842q4370o427M2546N2647N0958j8417p8838N0070j4646M0117Q6089
6195D8251j7927m2504m0043j07239N8375l970k9504N2967L4245Q833P4857l1771
6183D570K2736q1290J8811k4919N1224j2223N584j1795l0073J9254J78513j3951
6171A26441k5260J4686p5474N0190j25572K3525J62735Q8720j17105j44499K6015
6160D402J8688J7158R16J1397l7877k9328K6214N6465R5948K0879K9781n0177
6148A64466q6583p128J37147k7148j34652l3276N3120L5465l2875P9852J0715
6137A59103m4870O8840J55288n0752r2833o6345J28059N3565m2957m9230m1254
6126A76614P0691r4235k8358L5239n6844k0112J54386P1903p1219N3592J2017
$$ plain form
6115 303674 250555 316896 198878 192010 203446 244574 169363 91582 160990 156754 169603 139202
6103 139202 243162 233143 51632 66306 163463 278870 217785 179772 148891 188436 165571
6092 165571 263246 389319 331266 222420 197283 138734 163953 166841 115617 148249 44797
6081 44797 103456 191743 172785 245607 263149 147667 115451 73106 84490 196047 200108 133601
6069 133601 204556 276740 128993 129842 108703 55140 109963 215074 252976 285709 352733 331057
6057 331057 166290 86014 166984 241225 188637 162213 150376 274263 220633 220529 320888
6046 320888 154005 291039 142012 145735 271372 282129 180487 246094 242079 237575 267410
6035 267410 281192 315823 232434 224897 311986 331105 117419 110382 319405 257070 160923 208544
$$ packed form
6115C03674n3119O6341j18018o868J1436M1128p5211p7781O9408m236J2849l0401
6103A39202J03960j0019j81511J4674R7157J15407o1085l8013l0881L9545k2865
6092A65571R7675J26073n8053j08846k5137n8549K5219K888n1224L2632j03452
6081D4797N8659Q8287j8958P2822J7542j15482l2216m2345J1384J11557M061o6507
6069A33601P0955P2184j47747Q49k1139n3563N4823J05111L7902L2733O7024k1676
6057C31057j64767q0276Q0970P4241n2588k6424j1837J23887n3630j04J00359
6046C20888j66883J37034j49027L723J25637J0757j01642O5607m015m504K9835
6035B67410J3782L4631q3389p537Q7089J9119k13686p037K09023o2335r6147M7621
$$ plain form
6023 208544 330222 321268 254843 300330 280247 178737 142380 252541 432116 346759 242843
6012 242843 299488 339493 257897 319100 334448 408538 431797 354254 448602 389885 307674 262213
6000 262213 326350 414906 406656 356968 468600 579189 476238 434145 326664 265770 286932
5989 286932 450240 561879 432165 314056 395948 550644 668187 560920 549262 558120
5979 558120 501794 448890 380618 438633 474605 526180 491222 433707 437882 516705 452292 346535
5967 346535 336239 507031 553275 430528 570435 566028 611164 554428 495344 613931 520767
5956 520767 465178 600705 608534 547087 684579 698179 737619 727527 657039 685473 728393
5945 728393 722163 749187 748277 730288 677486 689479 754010 862623 810832 840581 860472 810256
$$ packed form
6023B08544J21678q954o6425M5487k0083j01510l6357J10161J79575q5357j03916
6012B42843N6645M0005q1596O1203J5348P4090K3259p7543R4348n8717q2211m5461
6000B62213O4137Q8556q250m9688J11632J10589j02951m2093j07481o0894K1162
5989B86932J63308J11639j29714j18109Q1892J54696J17543j07267j1658Q858
5979E58120n6326n2904o8272N8015L5972N1575l4958n7515M175P8823o4413j05757
5967C46535j0296J70792M6244j22747J39907m407M5136n6736n9084J18587r3164
5956E20767n5589J35527P829o1447J37492J3600L9440j0092p0488K8434M2920
5945G28393o230K7024r10j7989n2802J1993O4531J08613n1791K9749J9891n0216
$$ plain form
5933 810256 796965 824476 814849 819143 834689 911047 1044071 1133752 1148048 1261088 1322224 1194256
5921 1194256 1026143 1106803 1143650 1078169 1076615 1275362 1337658 1164312 1248595 1244982 1401330
5910 1401330 1343789 1261183 1319559 1380793 1359275 1395854 1635883 1563895 1587944 1498184 1619486
5899 1619486 1658854 1620595 1641440 1723430 1786864 1865538 1918041 1874537 1853413 1956524 2034553
5888 2034553 2111304 2140762 2205799 2266222 2301337 2483306 2642860 2618066 2614146 2578097 2618590
5877 2618590 2739564 2760209 2947451 2890134 2804918 2866839 2964658 3061885 3199266 3251590 3403309
5866 3403309 3531045 3606798 3581838 3710702 3853404 4044658 4049408 4239986 4274276 4286698 4491150
5855 4491150 4596557 4740602 4835922 5093725 5213694 5372657 5545813 5858581 5992712 6246047
$$ packed form
5933H10256j3291K7511r627M294J5546P6358J33024Q9681J4296J13040O1136j27968
5921A194256j68113Q0660L6847o5481j554J98747O2296j73346Q4283l613J56348
5910A401330n7541q2606N8376O1234k1518L6579K40029p1988K4049q9760J21302
5899A619486L9368l8259K0845Q1990O3434P8674N2503m3504k1124J03111P8029
5888B034553P6751K9458O5037O0423L5115J81969J59554k4794l920l6049M0493
5877B618590J20974K0645J87242n7317q5216O1921R7819R7227J37381N2324J51719
5866C403309J27736P5753k4960J28864J42702J91254M750J90578L4290J2422K04452
5855D491150J05407J44045R5320K57803J19969J58963J73156L12768J34131K53335
$$ plain form
5845 6246047 6388161 6586205 6981903 7269274 7503499 7871195 8306089 8613090 9136196 9641978
5835 9641978 10206743 10834960 11576484 12558644 13672495 14897601 16076937 17380606 18776581
5826 18776581 20027723 21175181 22013316 22881848 23586856 24118884 24575759 25178102 25977460
5817 25977460 26958950 27966382 29321695 30745705 32109089 33388493 34219381 34695463 34881391
5808 34881391 34622351 34005761 33169231 32031818 31123607 30353826 29711012 29354073 29162649
5799 29162649 29224830 29434151 29511154 29588478 29763028 29844479 29917322 29783789 29818433 29626054
5789 29626054 29229523 29036503 28867345 28481906 28209923 28015399 27987569 28175766 28607443 29174783
5779 29174783 29912340 30739528 31703348 32422445 32879560 32867535 32404405 31751782 30675458
$$ packed form
5845F246047J42114J98044L95698K87371K34225L67696M34894L07001N23106N05782
5835I641978N64765O28217P41524R82160J113851J225106J179336J303669J395975
5826A8776581J251142J147458Q38135Q68532P05008N32028M56875O02343P99358
5817B5977460R81490J007432J355313J424010J363384J279404Q30888M76082J85928
5808C4881391k59040o16590q36530j137413r08211p69781o42814l56939j91424
5799B9162649O2181K09321P7003P7324J74550Q1451P2843j33533L4644j92379
5789B9626054l96531j93020j69158l85439k71983j94524k7830J88197M31677N67340
5779B9174783P37557Q27188R63820P19097M57115j2025m63130o52623j076324
$$ plain form
5770 30675458 29402118 28001958 26720030 25587361 24668686 23907064 23113011 22386817 21868720
5761 21868720 21219346 20299900 19336878 18345938 17118631 15850355 14480715 13165699 12108365
5752 12108365 11017513 9920006 9067243 8409642 7671643 7054167 6644771 6152076 5752567
5743 5752567 5431422 5251382 5102579 4828536 4584849 4320082 3980544 3787986 3643137 3564991
5733 3564991 3371350 3291449 3158834 3101251 2984805 2915927 2731100 2712642 2608271 2517175
5723 2517175 2380376 2238466 2206632 2179535 2095548 1997773 1917107 1957119 1871803 1786311 1596533
5712 1596533 1515736 1604518 1462094 1382510 1372554 1319865 1375504 1364211 1269437 1193213 1257594
5701 1257594 1197460 1076534 1115869 993266 1035766 1057334 1087378 1086913 1001866 993333 923246 901428
$$ packed form
5770C0675458j273340j400160j281928j132669r18675p61622p94053p26194n18097
5761B1868720o49374r19446r63022r90940j227307j268276j369640j315016j057334
5752A2108365j090852j097507q52763o57601p37999o17476m09396m92695l99509
5743E752567l21145j80040j48803k74043k43687k64767l39538j92558j44849p8146
5733C564991j93641p9901j32615n7583j16446o8878j84827j8458j04371r1096
5723B517175j36799j41910l1834k7097q3987r7775q0666M0012q5316q5492j89778
5712A596533q0797Q8782j42424p9584r956n2689N5639j1293r4774p6224O4381
5701A257594o0134j20926L9335j22603M2500K1568L0044m65q5047q533p0087k1818
$$ plain form
5689 901428 894211 846391 824617 947556 1001654 892780 741669 819710 866592 805122 745474
5678 745474 691665 629370 635120 777632 719420 639499 599458 654038 582863 638182 601277 619127
5666 619127 618951 629384 495634 627652 634914 511561 512098 538380 492919 395953 433719 390142
5654 390142 331857 549190 547555 515472 567681 511632 547702 495297 523371 564662 560619 575048
5642 575048 465133 349834 377641 458906 496203 451404 376041 385902 494820 455959 370270
5631 370270 304249 412560 407193 374268 432833 432962 464682 404642 255361 235215 222230 267068
5619 267068 214690 189990 390402 353258 216469 350627 351436 354168 339528 304899 297494 181192
5607 181192 166701 156472 114093 78875 143617 236422 212988 156745 370128 220329 224538
$$ packed form
5689I01428p217m7820k1774J22939N4098j08874j51111P8041M6882o1470n9648
5678G45474n3809o2295N750J42512n8212p9921m0041N4580p1175N5319l6905J7850
5666F19127j76J0433j33750J32018P262j23353N37K6282m5461r6966L7766m3577
5654C90142n8285K17333j635l2083N2209n6049L6070n2405K8074M1291m043J4429
5642E75048j09915j15299K7807Q1265L7297m4799p5363R861J08918l8861q5689
5631C70270o6021J08311n367l2925N8565J29L1720o0040j49281k0146j2985M4838
5619B67068n2378k4700K00412l7144j36789J34158Q09K732j4640l4629p405j16302
5607A81192j4491j0229m2379l5218O4742R2805k3434n6243K13383j49799M209
$$ plain form
5596 224538 185036 165393 365195 268325 173518 95843 70486 74293 178137 197634 114184
5585 114184 170662 293271 276784 233749 232308 277885 192110 181589 172244 152085 233682 115037
5573 115037 160130 83731 90110 144932 182556 285922 134874 37587 62189 96980 76232
5562 76232 144967 101736 156463 107053 43255 167926 92398 53459 53795 114209 74590 174687
5550 174687 191635 247637 239091 254674 203870 85802 138840 218298 248964 220153 160461 170718
5538 170718 92836 -41951 48743 158775 203307 219471 201390 271582 212756 73487 91716
5527 91716 130654 115331 153390 297705 347537 254979 165761 270293 233659 278601 209916
5516 209916 199239 166518 55021 48300 222874 230865 137033 149987 163691 151320 128878 368507
$$ packed form
5596B24538l9502j9643J99802r6870r4807p7675k5357L807J03844J9497q3450
5585A14184N6478J22609j6487m3035j441M5577q5775j0521r345k0159Q1597j18645
5573A15037M5093p6399O379N4822L7624J03366j51048r7287K4602L4791k0748
5562G6232O8735m3231N4727m9410o3798J24671p5528l8939L36O0414l9619J00097
5550A74687J6948N6002q546J5583n0804j18068N3038P9458L0666k8811n9692J0257
5538A70718p7882j34787R0694J10032M4532J6164j8081P0192n8826j39269J8229
5527I1716L8938j5323L8059J44315M9832r2558q9218J04532l6634M4942o8685
5516B09916j0677l2721j11497o721J74574P991r3832J2954J3704j2371k2442K39629
$$ plain form
5504 368507 320798 177779 286634 301460 299563 363375 249254 98303 164424 274031 280237
5493 280237 227788 290530 209490 215675 225653 278080 367138 343093 366345 396683 279143 381171
5481 381171 330418 318661 271713 336478 205862 127009 185808 220966 184278 253782 289963
5470 289963 248434 316618 328299 299036 264546 313345 370079 302491 220566 152361 252969
5459 252969 177507 91907 141916 84508 76734 35603 173576 311070 262015 302493 390464
5448 390464 261393 237206 272041 239602 207170 149231 103862 245432 211177 149992 136170
5437 136170 229410 72325 76113 124926 227647 290831 227604 182903 66837 74085 191387
5426 191387 61475 40418 139818 33524 49234 84181 119381 105916 79768 220616 105024
$$ packed form
5504C68507m7709j43019J08855J4826j897O3812j14121j50951O6121J09607O206
5493B80237n2449O2742q1040O185R978N2427Q9058k4045K3252L0338j17540J02028
5481C81171n0753j1757m6948O4765j30616p8853N8799L5158l6688O9504L6181
5470B89963m1529O8184J1681k9263l4490M8799N6734o7588q1925o8205J00608
5459B52969p5462q5600N0009n7408p774m1131J37973J37494m9055M0478Q7971
5448C90464j29071k4187L4835l2439l2432n7939m5369J41570l4255o1185j3822
5437A36170R3240j57085L788M8813J02721O3184o3227m4701j16066P248J17302
5426A91387j29912k1057R9400j06294J5710L4947L5200j3465k6148J40848j15592
$$ plain form
5415 105024 53103 57960 62555 -76070 -72106 -26058 -11483 14383 170284 83510 109983 207734
5403 207734 210342 74867 12078 31285 53947 88498 77949 77959 7388 84151 75477 3268
5391 3268 15084 34728 42470 18846 49988 75924 45045 30905 3224 32983 19447 -6142
5379 -6142 -4940 47091 85021 39123 28808 79010 -27529 -58462 -44520 -71384 -90052 -62912
5367 -62912 -62746 -1584 42759 -57877 -51712 41994 118279 92099 120316 142551 113614 115000
5355 115000 13894 5012 -8534 -4157 -25569 -2877 58872 158826 139963 63825 -1682 173051
5343 173051 182724 257557 143034 88098 44880 108127 201145 167008 86764 43155 -34539 -65409
5331 -65409 -69661 -55897 -71764 -80289 -9769 71882 165277 143703 169563 148673 74787 -2727
$$ packed form
5415A05024n1921M857M595j38625L964M6048J4575K5866J55901q6774K6473R7751
5403B07734K608j35475o2789J9207K2662L4551j0549J0p0571P6763q674p2209
5391C268J1816J9644P742k3624L1142K5936l0879j4140k7681K9759j3536k5589
5379f142J202N2031L7930m5898j0315N0202j06539l0933J3942k6864j8668K7140
5367f2912J66O1162M4343j00636O165R3706P6285k6180K8217K2235k8937J386
5355A15000j01106q882j3546M377k1412K2692O1749R9954j8863p6138o5507J74733
5343A73051R673P4833j14523n4936m3218O3247R3018l4137q0244m3609p7694l0870
5331f5409m252J3764j5867q525P0520Q1651R3395k1574K5860k0890p3886p7514
$$ plain form
5319 -2727 96402 110437 38123 -69835 -13736 -119334 -67678 68423 158473 167879 115991 -17564
5307 -17564 -32205 -30868 -36940 91952 67530 37350 67944 48890 6113 -10423 -16430 -120674
5295 -120674 -105634 -174682 -219690 -110061 -112569 -61646 -80494 -17044 180860 284747 186415
5284 186415 152708 141597 167857 74962 38711 181942 214331 93277 125656 119589 74435
5273 74435 70393 120537 105317 8833 32125 183635 234156 191782 291870 155480 148958 256808
5261 256808 247435 140239 144913 182547 171010 115400 141581 208189 165119 210552 79235 94746
5249 94746 97689 89746 86826 117049 61900 -44126 150022 93926 135788 128497 111782 252274
5237 252274 318159 269156 282002 224038 270299 340355 220669 213733 299967 212735 231225 254058
$$ packed form
5319b727R9129J4035p2314j07958N6099j05598N1656J36101R0050R406n1888j33555
5307a7564j4641J337o072J28892k4422l0180L0594j9054m2777j6536o007j04244
5295a20674J5040o9048m5008J09629k508N0923j8848O3450J97904J03887r8332
5284A86415l3707j1111K6260r2895l6251J43231L2389j21054L2379o067m5154
5273G4435m042N0144j5220r6484K3292J51510N0521m2374J00088j36390o522J07850
5261B56808r373j07196M674L7634j1537n5610K6181O6608m3070M5433j31317J5511
5249I4746K943p943k920L0223n5149j06026J94148n6096M1862p291j6715J40492
5237B52274O5885m9003J2846n7964M6261P0056j19686o936Q6234q7232J8490K2833
$$ plain form
5225 254058 304668 242873 138791 201892 131173 218441 319107 329505 93411 135282 141631
5214 141631 102483 78478 145038 59191 -126095 58813 28352 -119904 -53426 -47351 57840
5203 57840 -18255 -94694 -4246 51321 135927 146836 56359 79951 49975 7202 -111167 -109440
5191 -109440 -76794 -108346 63137 115513 2239 -23327 60232 56022 56337 12498 34981 50018
5179 50018 40526 -114084 -110532 -27654 -5684 78197 49646 -38833 -65942 65015 -73880 -47694
5167 -47694 -2785 -69033 -119964 -301970 -209460 -185988 -122960 -110007 -22714 43139 90707 48539
5155 48539 24263 -33851 80744 92276 85463 -31623 -24054 -13122 19564 62799 -19395 39241
5143 39241 25478 -12263 -53077 -42187 -125689 -115078 35967 2377 -106695 -161835 -53136
$$ packed form
5225B54058N0610o1795j04082O3101p0719Q7268J00666J0398k36094M1871O349
5214A41631l9148k4005O6560q5847j85286J84908l0461j48256O6478O075J05191
5203E7840p6095p6439R0448N5567Q4606J0909r0477K3592k9976m2773j18369J727
5191a09440L2646l1552J71483N2376j13274k5566Q3559m210L15m3839K2483J5037
5179E0018r492j54610L552Q2878K1970Q3881k8551q8479k7109J30957j38895K6186
5167d7694M4909o6248n0931j82006R2510K3472O3028J2953Q7293O5853M7568m2168
5155D8539k4276n8114J14595J1532o813j17086P569J0932L2686M3235q2194N8636
5143C9241j3763l7741m0814J0890q3502J0611J51045l3590j09072n5140J08699
$$ plain form
5132 -53136 41766 112244 41282 -17018 9719 89922 8248 -93864 -76596 103913 119023
5121 119023 110728 92537 72928 93187 14329 1685 -42801 -124561 -61554 9957 -83554 -33752
5109 -33752 70958 127988 15074 -29063 -23577 3146 19565 117062 146655 105112 79616 272
5097 272 -116961 -203031 -137974 -63474 -70287 -31889 -26078 48068 172216 94576 -75965 -58236
5085 -58236 -48164 17960 -108712 -2312 -101985 -96534 -53136 -93149 39972 23015 -94747
5074 -94747 -102985 -163476 -26481 152804 158716 24108 13607 -86024 -75269 -18974 -36596 34156
5062 34156 -72112 -95615 -140281 -151880 -93700 -74857 40856 14064 -1323 -106965 -84930
5051 -84930 -87472 -53383 -104838 -92245 -117662 -35377 -11104 8609 41015 -67309 -35757 -46327
$$ packed form
5132e3136R4902P0478p0962n8300K6737Q0203q1674j02112J7268J80509J5110
5121A19023q295j8191j9609K0259p8858j2644m4486q1760O3007P1511r3511M9802
5109c3752J04710N7030j12914m4137N486K6723J6419R7497K9593m1543k5496p9344
5097B72j17233q6070O5057P4500o813L8398N811P4146J24148p7640j70541J7729
5085e8236J0072O6124j26672J06400r9673N451M3398m0013J33121j6957j17762
5074i4747q238o0491J36995J79285N912j34608j0501r9631J0755N6295j7622P0752
5062C4156j06268k3503m4666j1599N8180J8843J15713k6792j5387j05642K2035
5051h4930k542L4089n1455J2593k5417Q2285K4273J9713L2406j08324L1552j0570
$$ plain form
5039 -46327 -40273 -70120 37837 -27260 -38556 -26975 -14964 -37639 17873 -4404 -31918 28531
5027 28531 -12295 -36761 -55703 -20248 44351 -37909 -206135 -168946 -156896 -188869 -166922 -168099
5015 -168099 -109395 -181570 -24547 13734 -43157 -60109 -25653 5782 91824 93399 -7613
5004 -7613 -144649 -19272 -63281 -97726 -25629 -97867 -77604 -94658 -202919 -149934 -79698
4993 -79698 -4577 21789 -42877 -78366 4837 62896 83194 -58018 -70029 -92396 -119117 -27186
4981 -27186 -26173 -90063 -40298 -16489 69139 21376 -33628 4045 83316 -35683 -21762 7418
4969 7418 -141150 -92775 20086 -5595 -62972 -94626 -41748 12279 95073 31811 -18093 -40730
4957 -40730 -23142 67983 38151 138073 203415 123446 -2831 5745 105413 206439 52905
$$ packed form
5039d6327O054k9847J07957o5097j1296J1581J2011k2675N5512k2277k7514O0449
5027B8531m0826k4466j8942L5455O4599q2260j68226L7189J2050l1973K1947j177
5015a68099N8704p2175J57023L8281n6891j6952L4456L1435Q6042J575j01012
5004g613j37036J25377m4009l4445P2097p2238K0263j7054j08261N2985P0236
4993g9698P5121K6366o4666l5489Q3203N8059K0298j41212j2011k2367k6721R1931
4981b7186J013o3890M9765K3809Q5628m7763n5004L7673P9271j18999J3921K9180
4969G418j48568M8375J12861k5681n7377l1654N2878N4027Q2794o3262m9904k2637
4957d0730J7588R1125k9832R9922O5342p9969j26277Q576R9668J01026j53534
$$ plain form
4946 52905 -105374 8979 90473 13984 14061 -160776 -61476 20407 -70394 8243 43832 -47608
4934 -47608 84973 66183 -81136 -88725 49752 -56024 -98748 6925 111354 30730 44633
4923 44633 3217 100915 -22085 -109439 69246 71616 30290 -28756 -103724 -39588 -33121 10893
4911 10893 -17824 -24846 -70627 -17153 -73107 -66348 4458 -115979 -93491 -128659 -53708 29331
4899 29331 -6156 -599 122563 -6493 -13775 -46148 -23490 -6596 29622 -36460 51084 -6586
4887 -6586 42172 -23033 -140619 -194081 -125684 -1914 -26132 57773 35510 -147451 -166077
4876 -166077 -97540 -143232 -9157 -17972 -56756 -44201 -174584 -225457 -184038 -179803 -16576
4865 -16576 -33525 98003 88682 -3869 47060 61735 27238 -3572 -31214 -100897 -77329 4620
$$ packed form
4946E2905j58279J14353Q1494p6489P7j74837R9300Q1883r0801P8637L5589r1440
4934d7608J32581j8790j47319p589J38477j05776m2724J05673J04429q0624J3903
4923D4633m1416R7698j23000q7354J78685K370m1326n9046p4968O4136O467M4014
4911A0893k8717p022m5781N3474n5954O759P0806j20437K2488l5168P4951Q3039
4899B9331l5487N557J23162j29056p282l2373K2658J6894L6218o6082Q7544n7670
4887f586M8758o5205j17586n3462O8397J23770k4218Q3905k2263j82961j8626
4876a66077O8537m5692J34075q815l8784J2555j30383n0873M1419M235J63227
4865a6576j6949J31528r321r2551N0929J4675l4497l0810k7642o9683K3568Q1949
$$ plain form
4853 4620 -48911 59455 -47562 -40849 -5971 76260 144601 121421 159052 101207 93656 -91481
4841 -91481 -79716 -48466 -153734 -120411 -152537 -180030 24063 8908 -27135 23655 7449
4830 7449 13395 61535 46807 38274 -1667 156313 204024 15233 47362 165865 90156 -110889
4818 -110889 -105720 -95373 -173998 -33286 6352 218541 249988 165684 155257 212512 66099
4807 66099 36886 84675 21523 61516 54797 7043 10058 -98575 -62786 -76581 76741 41150
4795 41150 4780 86017 -27709 27699 38274 94300 81108 91662 98270 161492 96425 8436
4783 8436 72549 92427 156995 190131 91228 176424 163307 201631 190232 311939 160466 37308
4771 37308 193968 246618 91679 52164 87686 154268 161442 125291 155267 164893 173653 42156
$$ packed form
4853D620n3531J08366j07017O713L4878Q2231O8341k3180L7631n7845p551j85137
4841i1481J1765L1250j05268L3323l2126k7493K04093j5155l6043N0790j6206
4830G449N946M8140j4728q533l9941J57980M7711j88791L2129J18503p5709k01045
4818a10889N169J0347p8625J40712L9638K12189L1447q4304j0427N7255j46413
4807F6099k9213M7789o3152L9993o719m7754L015j08633L5789j3795J53322l5591
4795D1150l6370Q1237j13726N5408J0575N6026j3192J0554O608O3222o5067q7989
4783H436O4113J9878O4568L3136r8903Q5196j3117L8324j1399J21707j51473j23158
4771C7308J56660N2650j54939l9515L5522O6582P174l6151K9976R626Q760j31497
$$ plain form
4759 42156 47209 123916 179094 177964 161780 176015 69761 29340 72692 77741 93453 136047
4747 136047 216336 175783 229709 163420 51561 175678 173572 126523 94649 70182 901
4736 901 12413 110271 53404 52169 203167 239269 196068 285411 185087 51720 139552 65423
4724 65423 -10684 12559 -45416 27268 122079 110088 97310 34911 44546 29298 -212351 -201377
4712 -201377 52502 80669 152951 25199 -67263 14242 -1087 39504 2891 89839 73851
4701 73851 176849 87009 -84956 -47277 30778 41488 26176 -42002 -125185 -83037 19815
4690 19815 129674 34417 91718 208479 106469 205511 179300 144647 28175 -43219 69657
4679 69657 45499 14781 -27887 33647 103652 -9921 8418 68391 157203 167786 54348
$$ packed form
4759D2156N053P6707N5178j130j6184J4235j06254m0421M3352N049J5712M2594
4747A36047Q0289m0553N3926o6289j11859J24117k106m7049l1874k4467o9281
4736I01J1512R7858n6867j235J50998L6102m3201Q9343j00324j33367Q7832p4129
4724F5423p6107K3243n7975P2684R4811j1991j2778o2399R635j5248k41649J0974
4712b01377K53879K8167P2282j27752r2462Q1505j5329M0591l6613Q6948j5988
4701G3851J02998q9840j71965L7679P8055J0710j5312o8178q3183M2148J02852
4690A9815J09859r5257N7301J16761j02010R9042k6211l4653j16472p1394J12876
4679F9657k4158l0718m2668O1534P0005j13573J8339N9973Q8812J0583j13438
$$ plain form
4668 54348 96792 -4898 -79349 24463 116824 154936 115903 -40715 -50248 48271 94175
4657 94175 88971 79232 28327 17729 -41214 7103 52678 60369 130841 29196 -21898 -76807
4645 -76807 -57870 -44230 -22491 173979 197931 241342 218782 226678 248374 246880 99597 48688
4633 48688 116312 110742 96529 142332 81071 594 30870 85132 32566 97001 202664 167981
4621 167981 57696 -57998 -15932 -29927 93493 12647 40208 225363 247595 64780 -23191
4610 -23191 -8076 42378 118333 20904 -51971 32130 -7962 -1507 92247 21303 73043 15169
4598 15169 -83026 -98342 123761 261255 132610 68339 133016 115405 -5701 81746 197345
4587 197345 71590 91595 148610 123727 -5682 143825 168571 17257 -56967 -88003 1204
$$ packed form
4668E4348M2444j01690p4451J03812R2361L8112l9033j56618r533R8519M5904
4657I4175n204r739n0905j0598n8943M8317M5575P691P0472j01645n1094n4909
4645g6807J8937J3640K1739J96470K3952M3411k2560P896K1696j494j47283n0909
4633D8688O7624n570j4213M5803o1261q0477L0276N4262n2566O4435J05663l4683
4621A67981j10285j15694M2066j3995J23420q0846K7561J85155K2232j82815q7971
4610b3191J5115N0454P5955r7429p2875Q4101m0092O455R3754p0944N1740n7874
4598A5169r8195j5316K22103J37494j28645o4271O4677j7611j21106Q7447J15599
4587A97345j25755K0005N7015k4883j29409J49507K4746j51314p4224l1036Q9207
$$ plain form
4576 1204 -22582 -62319 125246 197444 120750 150145 132026 147771 73404 61391 123505 58627
4564 58627 34950 16844 43225 158566 76953 79582 -3541 -46755 -48953 -50900 -45186 46409
4552 46409 98260 178935 121349 131446 155126 -17920 -31684 80949 145764 177698 56905
4541 56905 76400 146073 -9326 -84804 -75016 -117355 -118092 -59612 90757 221880 30069 -8960
4529 -8960 1593 11269 75394 181418 151604 65017 56991 23825 68301 159412 123502 139274
4517 139274 170265 147581 115903 60617 62759 87264 122195 29707 -23378 48766 8372 62657
4505 62657 198099 121158 18520 82494 148133 85627 84570 64789 65622 16168 105876 110718
4493 110718 100485 151292 191899 227895 88428 4090 82502 112396 70035 123649 64534
$$ packed form
4576A204k3786l9737J87565P2198p6694K9395j8119J5745p4367j2013O2114o4878
4564E8627k3677j8106K6381J15341q1613K629q3123m3214k198j947N714R1595
4552D6409N1851Q0675n7586J0097K3680j73046j3764J12633O4815L1934j20793
4541E6905J9495O9673j55399p5478R788m2339p37N8480J50369J31123j91811l9029
4529h960J0553R676O4125J06024k9814q6587q026l3166M4476R1111l5910J5772
4517A39274L0991k2684l1678n5286K142K4505L4931r2488n3085P2144m0394N4285
4505F2657J35442p6941j02638O3974O5639o2506j057j9781Q33m9454Q9708M842
4493A10718j0233N0807M0607L5996j39467q4338P8412K9894m2361N3614n9115
$$ plain form
4482 64534 143375 228367 129207 119737 85108 170162 99932 121482 201848 159151 128058 58690
4470 58690 -21663 26113 -15491 63732 196784 196551 138366 259716 239250 157556 179839 59567
4458 59567 97719 169813 231818 261479 95685 11737 146123 109595 252004 269258 208720
4447 208720 166327 71489 194822 223017 179675 225466 138887 70275 35874 55740 155637
4436 155637 108815 95566 193779 211273 95958 30262 -323 27386 74439 44077 149151
4425 149151 211494 116795 58713 80805 118869 126900 127363 -12419 -25870 92222 121916 150280
4413 150280 102548 111868 -16618 107387 213413 139727 105689 194307 140795 186160 178630
4402 178630 110085 150949 206302 203762 174537 117306 65184 31598 99176 132988 105481 228237
$$ packed form
4482F4534P8841Q4992r9160r470l4629Q5054p0230K1550Q0366m2697l1093o9368
4470E8690q0353M7776m1604P9223J33052k33n8185J21350k0466q1694K2283j20272
4458E9567L8152P2094O2005K9661j65794q3948J34386l6528J42409J7254o0538
4447B08720m2393r4838J23333K8195m3342M5791q6579o8612l4401J9866R9897
4436A55637m6822j3249R8213J7494j15315o5696l0585K7709M7053l0362J05074
4425A49151O2343r4699n8082K2092L8064Q031M63j39782j3451J18092K9694K8364
4413A50280m7732R320j28486J24005J06026p3686l4038Q8618n3512M5365p530
4402A78630o8545M0864N5353k540k9225n7231n2122l3586O7578L3812k7507J22756
$$ plain form
4390 228237 295196 159202 213505 183545 113392 66227 210736 359922 195303 121642 202256
4379 202256 223211 219008 192783 195668 71405 105829 113538 211337 195567 147009 92999 79557
4367 79557 248628 343073 323699 234574 342168 333414 328804 290351 239974 167406 343187 352168
4355 352168 256732 198233 180510 199938 154567 323264 379790 217740 218712 137164 249602
4344 249602 266998 206148 274827 356728 259381 364082 273038 252533 196098 215735 284594
4333 284594 217292 245625 211016 135297 223308 249283 195116 267204 317817 287329 226205 213999
4321 213999 122457 177335 390281 346081 273928 361759 402330 357463 274658 303369 281161
4310 281161 397037 479629 560891 600901 625950 684774 643397 767421 755157 791082 781672
$$ packed form
4390B28237O6959j35994N4303k9960p0153m7165J44509J49186j64619p3661Q0614
4379B02256K0955m203k6225K885j24263L4424P709R7799j5770m8558n4010j3442
4367G9557J69071R4445j9374q9125J07594q754m610l8453n0377p2568J75781Q981
4355C52168r5436n8499j7723J9428m5371J68697N6526j62050R72q1548J12438
4344B49602J7396o0850O8679Q1901r7347J04701r1044k0505n6435J9637O8859
4333B84594o7302K8333l4609p5719Q8011K5975n4167P2088N0613l0488o1124j2206
4321B13999r1542N4878K12946m4200p2153Q7831M0571m4867q2805K8711k2208
4310B81161J15876Q2592Q1262M0010K5049N8824m1377J24024j2264L5925r410
$$ plain form
4299 781672 641387 575788 601067 463836 485344 408268 298172 378734 515888 549814 571803
4288 571803 552449 475580 473637 560014 527754 598619 579497 590857 605484 532130 494410 557392
4276 557392 477365 514693 676010 644845 612097 680069 796138 608728 586840 674491 644159
4265 644159 731576 689965 597785 660511 659751 742893 666981 813690 799352 776395 711016 789498
4253 789498 954783 933055 818150 909938 899352 903758 894821 970850 993575 911280 977725 990443
4241 990443 1115969 1054328 1079025 1148026 989429 959859 880879 908052 1060005 1219599 1155063
4230 1155063 1191946 1077684 1139390 1075626 1118882 1201174 1057094 1073018 952004 969122 1022834
4219 1022834 1161011 1157834 1082689 1003720 1061247 1156664 1044796 1058813 1071099 1039126 939913
$$ packed form
4299G81672j40285o5599K5279j37231K1508p7076j10096Q0562J37154L3926K1989
4288E71803j9354p6869j943Q6377l2260P0865j9122J1360J4627p3354l7720O2982
4276E57392q0027L7328J61317l1165l2748O7972J16069j87410k1888Q7651l0332
4265F44159Q7417m1611r2180O2726p60Q3142p5912J46709j4338k2957o5379P8482
4253G89498J65285k1728j14905R1788j0586M406q937P6029K2725q2295O6445J2718
4241I90443J25526o1641K4697O9001j58597k9570p8980K7173J51953J59594o4536
4230A155063L6883j14262O1706o3764M3256Q2292j44080J5924j21014J7118N3712
4219A022834J38177l177p5145p8969N7527R5417j11868J4017J2286l1973r9213
$$ plain form
4208 939913 982256 972952 944280 984047 1077254 1118348 1138532 1184075 1242036 1101963 1129624 1146014
4196 1146014 1147859 1164901 1236354 1263382 1168293 1273172 1231780 1205014 1145633 1053437 1084415
4185 1084415 1202563 1221820 1129217 1173122 1249070 1171781 1266805 1203674 1190077 1206378 1288237
4174 1288237 1289877 1207358 1266283 1309878 1415662 1301165 1331620 1358971 1389581 1514958 1550293
4163 1550293 1658373 1599716 1525491 1579741 1623625 1637808 1744838 1755909 1827562 1829634 1942562
4152 1942562 1777534 1671707 1656432 1823831 1853755 1893045 1989158 2024826 1977469 1922083 1950186
4141 1950186 2214397 2140292 2168226 2301595 2163321 2129911 2237285 2230391 2213270 2368333 2406555
4130 2406555 2420800 2445193 2588761 2553155 2519422 2417749 2461479 2529899 2621851 2760754 2743231
$$ packed form
4208I39913M2343r304k8672L9767R3207M1094K0184M5543N7961j40073K7661J6390
4196A146014J845J7042P1453K7028r5089J04879m1392k6766n9381r2196L0978
4185A084415J18148J9257r2603M3905P5948p7289R5024o3131j3597J6301Q1859
4174A288237J640q2519N8925M3595J05784j14497L0455K7351L0610J25377L5335
4163A550293J08080n8657p4225N4250M3884J4183J07030J1071P1653K072J12928
4152A942562j65028j05827j5275J67399K9924L9290R6113L5668m7357n5386K8103
4141A950186K64211p4105K7934J33369j38274l3410J07374o894j7121J55063L8222
4130B406555J4245K4393J43568l5606l3733j01673M3730O8420R1952J38903j7523
$$ plain form
4119 2743231 2842120 2881922 2823210 2856160 2926880 3032593 3196603 3252259 3394623 3415202 3497543
4108 3497543 3582124 3602758 3636599 3612462 3654900 3583007 3617415 3578462 3552612 3496630 3536450
4097 3536450 3507209 3592281 3511262 3729795 3812673 3763096 3903198 3977920 3959161 3999489 3976849
4086 3976849 3882115 3989143 4004080 4079668 4143920 4178665 4082013 4160932 4247791 4382864 4479573
4075 4479573 4479837 4408780 4434972 4433186 4444785 4323329 4352255 4489351 4516659 4542036 4515183 4471760
4063 4471760 4486437 4509370 4520503 4553059 4567274 4675022 4757161 4741060 4842100 4905629 5006826
4052 5006826 5029200 4979892 5066028 5148458 5245962 5233935 5280453 5362126 5400201 5433148 5567278
4041 5567278 5613276 5722980 5737451 5861649 5970084 6018210 6071655 6175266 6363171 6514715
$$ packed form
4119B743231R8889L9802n8712L2950P0720J05713J64010N5656J42364K0579Q2341
4108C497543Q4581K0634L3841k4137M2438p1893L4408l8953k5850n5982L9820
4097C536450k9241Q5072q1019K18533Q2878m9577J40102P4722j8759M0328k2640
4086C976849r4734J07028J4937P5588O4252L4745r6652P8919Q6859J35073R6709
4075D479573K64p1057K6192j786J1599j21456K8926J37096K7308K5377k6853m3423
4063D471760J4677K2933J1133L2556J4215J07748Q2139j6101J01040O3529J01197
4052E006826K2374m9308Q6136Q2430R7504j2027M6518Q1673L8075L2947J34130
4041E567278M5998J09704J4471J24198J08435M8126N3445J03611J87905J51544
$$ plain form
4031 6514715 6651668 6871849 6959444 7051527 7206784 7399661 7444320 7582636 7726818 7771082
4021 7771082 8002328 8025049 8132916 8508329 8568060 8694359 8960480 9081760 9301037 9449395
4011 9449395 9530981 9858633 10081109 10319035 10549538 10771681 10878128 11139089 11364866 11568889
4001 11568889 11784248 12165034 12426748 12642044 13006374 13148473 13539202 13797407 14191916
3992 14191916 14469116 14862858 15369094 15774864 16201523 16622624 16909675 17172533 17593112
3983 17593112 18138686 18565328 19024034 19580745 20214284 20906871 21617799 22467598 23348637
3974 23348637 24296917 25214099 26172260 27380158 28522849 29708970 31167232 32465527 33890332
3965 33890332 35387754 37087904 38846604 40676112 42714839 44885387 47116673 49388416
$$ packed form
4031F514715J36953K20181Q7595R2083J55257J92877M4659J38316J44182M4264
4021G771082K31246K2721J07867L75413N9731J26299K66121J21280K19277J48358
4011I449395Q1586L27652K22476K37926K30503K22143J06447K60961K25777K04023
4001A1568889K15359L80786K61714K15296L64330J42099L90729K58205L94509
3992A4191916K77200L93742N06236M05770M26659M21101K87051K62858M20579
3983A7593112N45574M26642M58706N56711O33539O92587P10928Q49799Q81039
3974B3348637R48280R17182R58161J207898J142691J186121J458262J298295J424805
3965C3890332J497422J700150J758700J829508K038727K170548K231286K271743
$$ plain form
3957 49388416 51575044 53775796 56228922 58710456 60988792 63128420 65441193 67697105
3949 67697105 70009616 72256504 74652785 76998702 79363399 81797414 84062582 86166554
3941 86166554 88085170 89844183 91299570 92527662 93518659 94305810 94785069 95241299 95515163
3932 95515163 95855334 96230999 96232979 96176751 95908624 95265691 94379813 93299047 91867764 90295925
3922 90295925 88460686 86481875 84428127 82324804 80259789 78201140 76144580 74076804
3914 74076804 72114379 70034116 67703662 65518442 63269812 61090141 58830616 56653922
3906 56653922 54517854 52629149 50757794 48966945 47368093 45802904 44427305 43144792
3898 43144792 41946251 40959260 40019364 38951062 38242520 37643948 36812559 36300752 35968692
$$ packed form
3957D9388416K186628K200752K453126K481534K278336K139628K312773K255912
3949F7697105K312511K246888K396281K345917K364697K434015K265168K103972
3941H6166554J918616J759013J455387J228092R90997P87151M79259M56230K73864
3932I5515163L40171L75665J980n6228k68127o42933q85878j080766j431283j571839
3922I0295925j835239j978811k053748k103323k065015k058649k056560k067776
3914G4076804j962425k080263k330454k185220k248630k179671k259525k176694
3906E6653922k136068j888705j871355j790849j598852j565189j375599j282513
3898D3144792j198541r86991r39896j068302p08542n98572q31389n11807l32060
$$ plain form
3889 35968692 35564199 35239808 35207632 35138615 35111019 35159968 35376061 35748606 36111751 36431377
3879 36431377 36791849 37454145 38130561 38887855 39658512 40510097 41489912 42496405 43636226
3870 43636226 44885956 46243907 47541045 48898411 50290417 51671494 53208071 54802160
3862 54802160 56160931 57534424 58923164 60176239 61490542 62820018 64459288 66136693
3854 66136693 68023879 69803925 71732957 73697218 75788469 77823673 79884052 82050729
3846 82050729 84173042 86214001 88274045 90460630 92786668 95356964 97973216 100756107
3838 100756107 103629501 106486209 109362877 112073264 114778550 117330449 119969836 122555043
3830 122555043 125327091 128303978 131501518 135139208 138994006 143252902 147719778 152553680
$$ packed form
3889C5968692m04493l24391l2176o9017k7596M8949K16093L72545L63145L19626
3879C6431377L60472O62296O76416P57294P70657Q51585R79815J006493J139821
3870D3636226J249730J357951J297138J357366J392006J381077J536577J594089
3862E4802160J358771J373493J388740J253075J314303J329476J639270J677405
3854F6136693J887186J780046J929032J964261K091251K035204K060379K166677
3846H2050729K122313K040959K060044K186585K326038K570296K616252K782891
3838A00756107K873394K856708K876668K710387K705286K551899K639387K585207
3830A22555043K772048K976887L197540L637690L854798M258896M466876M833902
$$ plain form
3822 152553680 157587047 162799171 168428920 174515368 180980561 187989875 195876182 204328479
3814 204328479 213209888 221950395 230424124 238295288 245601813 252522016 258713062 264261434
3806 264261434 268842798 271950864 273460367 272907739 270481531 266833559 262436254 257820064
3798 257820064 253024217 248211369 243416353 238522945 233608404 228782385 223840434 218541399
3790 218541399 212668155 206130910 198690453 190275718 181434211 172609767 164287721 156389168
3782 156389168 148969394 142074003 135793404 130299051 125190808 120458465 116187793 112029918
3774 112029918 107933298 103877007 100025795 96435363 92805548 89531618 86619422 84017952
3766 84017952 81620245 79618822 77708021 76223400 75007631 73796602 72790890 72031211
$$ packed form
3822A52553680N033367N212124N629749O086448O465193P009314P886307Q452297
3814B04328479Q881409Q740507Q473729P871164P306525O920203O191046N548372
3806B64261434M581364L108066J509503n52628k426208l647972m397305m616190
3798B57820064m795847m812848m795016m893408m914541m826019m941951n299035
3790B18541399n873244o537245p440457q414735q841507q824444q322046p898553
3782A56389168p419774o895391o280599n494353n108243m732343m270672m157875
3774A12029918m096620m056291l851212l590432l629815l273930k912196k601470
3766H4017952k397707k001423j910801j484621j215769j211029j005712p59679
$$ plain form
3758 72031211 71386527 70948899 70726680 70622155 70717701 70778340 70977239 71278823 71664079 72157522
3748 72157522 72593649 73171117 73704639 74230175 74611078 75053890 75460195 75788345 76121156
3739 76121156 76642991 77237879 77933282 78929465 79952053 81305787 83011134 84925175 87014146
3730 87014146 89562564 92198280 95264325 98689232 102522988 106730079 111329846 116216890
3722 116216890 121152548 126290872 131035982 135731891 139887062 143719315 147198429 150571389
3714 150571389 153986188 157568921 161371630 165696734 170699902 175762067 180926836 185986616
3706 185986616 190527399 194308510 197378875 199604245 201218943 202228232 202869398 203552283
3698 203552283 204322988 205466691 206885724 208841525 211126346 213775413 216577689 219343503
$$ packed form
3758G2031211o44684m37628k22219j04525R5546O0639J98899L01584L85256M93443
3748G2157522M36127N77468N33522N25536L80903M42812M06305L28150L32811
3739G6121156N21835N94888O95403R96183J022588J353734J705347J914041K088971
3730H7014146K548418K635716L066045L424907L833756M207091M599767M887044
3722A16216890M935658N138324M745110M695909M155171L832253L479114L372960
3714A50571389L414799L582733L802709M325104N003168N062165N164769N059780
3706A85986616M540783L781111L070365K225370J614698J009289O41166O82885
3698B03552283P70705J143703J419033J955801K284821K649067K802276K765814
$$ plain form
3690 219343503 222227774 225003465 227441789 229257544 230552137 231297308 231050683 229993933
3682 229993933 228293721 225909860 223192239 220275456 217522279 214936934 212796318 210950660
3674 210950660 208971355 206827124 204399262 201126633 196990605 191774922 185837241 178929349
3666 178929349 171600681 163815989 155925077 148355207 141072715 134202087 127820892 121944949
3658 121944949 116505356 111138036 105894883 100870616 95747939 90658181 85538319 80489039
3650 80489039 75306683 70408056 65848747 61699838 58124164 54914950 52079659 49666667
3642 49666667 47478515 45394525 43457189 41733302 40049664 38872863 37600361 36346800
3634 36346800 35315817 34359245 33663288 32847380 32156105 31544289 31128107 30728498 30237020
$$ packed form
3690B19343503K884271K775691K438324J815755J294593P45171k46625j056750
3682B29993933j700212k383861k717621k916783k753177k585345k140616j845658
3674B10950660j979305k144231k427862l272629m136028n215683n937681o907892
3666A78929349p328668p784692p890912p569870p282492o870628o381195n875943
3658A21944949n439593n367320n243153n024267n122677n089758n119862n049280
3650H0489039n182356m898627m559309m148909l575674l209214k835291k412992
3642D9666667k188152k083990j937336j723887j683638j176801j272502j253561
3634C6346800j030983r56572o95957q15908o91275o11816m16182l99609m91478
$$ plain form
3625 30237020 30009772 29709938 29286009 28860382 28401724 27978661 27592307 27204599 26809734
3616 26809734 26466680 26205721 25978458 25881143 25794252 25540521 25371181 25126213 24898938 24362574
3606 24362574 23826508 23207585 22427103 21576896 21014103 20291524 19560454 19117409 18607122
3597 18607122 18079045 17608126 17194181 16688673 16161486 15656971 15143018 14547866 14071277
3588 14071277 13584827 13124258 12697060 12195231 11740849 11398872 11071957 10722017 10485579
3579 10485579 10179447 9840567 9741106 9559131 9380663 9183751 8958227 8814521 8646763 8441769
3569 8441769 8317909 8228899 8043613 7932017 7858372 7731486 7686900 7549264 7457889 7266854
3559 7266854 7169029 7082004 6955883 6861944 6721194 6710887 6575320 6436290 6368069 6306318 6231890
$$ packed form
3625C0237020k27248k99834m23929m25627m58658m23063l86354l87708l94865
3616B6809734l43054k60959k27263r7315q6891k53731j69340k44968k27275n36364
3606B4362574n36066o18923p80482q50207n62793p22579p31070m43045n10287
3597A8607122n28077m70919m13945n05508n27187n04515n13953n95152m76589
3588A4071277m86450m60569m27198n01829m54382l41977l26915l49940k36438
3579A0485579l06132l38880r9461j81975j78468j96912k25524j43706j67758k04994
3569H441769j23860q9010j85286j11596p3645j26886m4586j37636r1375j91035
3559G266854r7825q7025j26121r3939j40750j0307j35567j39030o8221o1751p4428
$$ plain form
3548 6231890 6123062 6165568 6128506 6088098 6062210 5975951 5962073 5953217 5887205 5870183 5613839
3537 5613839 5619209 5512968 5534092 5567120 5559476 5405773 5350873 5411753 5516581 5483521 5419683
3526 5419683 5499593 5422319 5353297 5243561 5227472 5248862 5150673 5053248 5059582 5108977 5121981
3515 5121981 5072217 5032949 5062938 5031167 5093135 5098496 5082988 5083390 5023965 4908217 4751931 4571762
3503 4571762 4438039 4524790 4548614 4543368 4514830 4354064 4298718 4169904 3998295 4104536 3997440
3492 3997440 3856066 3690279 3610908 3451334 3387637 3309977 3234839 3264698 3360205 3285894 3261494
3481 3261494 3187165 3224552 3245396 3155839 2910775 2887522 2921540 2928285 2816598 2611721 2521332
3470 2521332 2663727 2621628 2594330 2629543 2574921 2458798 2513918 2639128 2543432 2503604 2521490
$$ packed form
3548F231890j08828M2506l7062m0408k5888q6259j3878q856o6012j7022k56344
3537E613839N370j06241K1124L3028p644j53703n4900O0880J04828l3060o3838
3526E419683P9910p7274o9022j09736j6089K1390r8189r7425O334M9395J3004
3515E121981m9764l9268K9989l1771O1968N361j5508M02n9425j15748j56286j80169
3503D571762j33723Q6751K3824n246k8538j60766n5346j28814j71609J06241j07096
3492C997440j41374j65787p9371j59574o3697p7660p5138K9859R5507p4311k4400
3481C261494p4329L7387K0844q9557k45064k3253L4018O745j11687k04877r0389
3470B521332J42395m2099k7298L5213n4622j16123N5120J25210r5696l9828J7886
$$ plain form
3459 2521490 2446874 2442518 2514338 2491881 2315869 2228640 2230953 2316820 2217040 2233013 2241869 2116092
3447 2116092 2238561 2212687 2234342 2338774 2226754 2175586 2175966 2149953 2104825 2116590 2279425
3436 2279425 2216482 2294944 2241474 2321684 2293738 2382244 2441719 2370635 2411791 2309708 2222971
3425 2222971 2258914 2317964 2296289 2286051 2374704 2545641 2534904 2503590 2518276 2619295 2699270
3414 2699270 2525954 2534025 2556807 2570637 2552834 2565122 2544889 2488517 2475334 2545754 2496538
3403 2496538 2448818 2465570 2548991 2584733 2670408 2673452 2625400 2632162 2659539 2669113 2752298 2929316
3391 2929316 2847008 2662840 2575033 2545003 2408710 2377141 2421178 2369127 2301257 2289483 2290540
3380 2290540 2320698 2427805 2422695 2336348 2274805 2196934 2106779 1977660 1891658 2012630 1985794
$$ packed form
3459B521490p4616m356P1820k2457j76012q7229K313Q5867r9780J5973Q856j25777
3447B116092J22469k5874K1655J04432j12020n1168L80k6013m5128J1765J62835
3436B279425o2943P8462n3470Q0210k7946Q8506N9475p1084M1156j02083q6737
3425B222971L5943N9050k1675j0238Q8653J70937j0737l1314J4686J01019P9975
3414B699270j73316Q071K2782J3830j7803J2288k0233n6372j3183P0420m9216
3403B496538m7720J6752Q3421L5742Q5675L044m8052O762K7377R574Q3185J77018
3391B929316q2308j84168q7807l0030j36293l1569M4037n2051o7870j1774J057
3380B290540L0158J07107n110q6347o1543p7871r0155j29119q6002J20972k6836
$$ plain form
3369 1985794 2049422 1962147 1817584 1949466 2089842 1948494 1884094 1869209 1854977 1808410 1704206
3358 1704206 1616292 1571941 1688865 1707251 1606907 1622677 1606090 1593192 1591721 1644205 1596993
3347 1596993 1474855 1407139 1379037 1490858 1635404 1629678 1469326 1518403 1532632 1515813 1508524
3336 1508524 1478472 1465291 1524921 1544928 1555121 1501803 1465162 1568539 1542828 1528834 1655427
3325 1655427 1721689 1611520 1625582 1691387 1654304 1595035 1530556 1573575 1550724 1578363 1572797
3314 1572797 1667364 1659627 1737742 1745066 1759217 1675087 1724295 1635159 1656949 1671376 1606235 1590073
3302 1590073 1703735 1787278 1711836 1681259 1727432 1752216 1713245 1739377 1820621 1865751 1902247
3291 1902247 1758041 1791278 2027128 2041338 1949914 1902840 1918761 1956154 1953307 1953503 2008418 1991399
$$ packed form
3369A985794O3628q7275j44563J31882J40376j41348o4400j4885j4232m6567j04204
3358A704206q7914m4351J16924J8386j00344J5770j6587j2898j471N2484m7212
3347A596993j22138o7716k8102J11821J44546n726j60352M9077J4229j6819p289
3336A508524l0052j3181N9630K0007J0193n3318l6641J03377k5711j3994J26593
3325A655427O6262j10169J4062O5805l7083n9269o4479M3019k2851K7639n566
3314A572797R4567p737P8115P324J4151q4130M9208q9136K1790J4427o5141j6162
3302A590073J13662Q3543p5442l0577M6173K4784l8971K6132Q1244M5130L6496
3291A902247j44206L3237K35850J4210r1424m7074J5921L7393k847J96N4915j7019
$$ plain form
3279 1991399 2029266 2037130 2031515 1994403 1934572 2022219 2152025 2281780 2327426 2375480 2534716
3268 2534716 2397036 2483898 2447445 2469646 2558981 2574855 2689348 2762350 2853573 2787229 2840027
3257 2840027 2895421 3176430 3394315 3411596 3601193 3792747 3926148 4055791 4132849 4206775
3247 4206775 4340237 4265202 4153381 4131432 4158173 4055921 3995895 3935892 3891292 3969944 4065902
3236 4065902 3903110 3679847 3599466 3613013 3488992 3320000 3105355 2926527 2692160 2492971
3226 2492971 2364330 2278674 2191940 2076213 1948293 1876696 1777714 1775918 1764600 1668728 1619467
3215 1619467 1685177 1415521 1347027 1306623 1320143 1370359 1273850 1221224 1226272 1268554 1223820
3204 1223820 1323846 1207514 1207447 1110083 1047127 930000 959072 994088 974308 897317 908704
$$ packed form
3279A991399L7867P864n615l7112n9831Q7647J29806J29755M5646M8054J59236
3268B534716j37680Q6862l6453K2201Q9335J5874J14493P3002R1223o6344N2798
3257B840027N5394K81009K17885J7281J89597J91554J33401J29643P7058P3926
3247D206775J33462p5035j11821k1949K6741j02252o0026o0003m4600P8652R5958
3236D065902j62792k23263q0381J3547j24021j68992k14645j78828k34367j99189
3226B492971j28641q5656q6734j15727j27920p1597r8982j796j1318r5872m9261
3215A619467O5710k69656o8494m0404J3520N0216r6509n2626N048M2282m4734
3204A223820J00026j16332o7r7364o2956j17127K9072L5016j9780p6991J1387
$$ plain form
3193 908704 997146 928699 889040 840848 959902 1061047 936241 846179 763925 820913 726758
3182 726758 704320 739553 598608 651875 691539 591680 651257 751422 699513 742191 764463
3171 764463 675557 693887 762565 662425 654731 695805 716124 641518 688553 639227 509900
3160 509900 507467 458665 574727 547957 533647 505229 349576 460722 536681 335052 335309
3149 335309 373370 611075 444911 364440 426103 415491 494774 546151 473407 447197 517740
3138 517740 400017 359196 439982 517825 481106 426505 352686 419420 427419 472983 472542 415224
3126 415224 434111 382115 399645 339062 299867 343898 319117 427749 298528 220216 224125
3115 224125 276920 325304 404560 386138 446754 330446 278759 289609 330459 331069 379091 495802
$$ packed form
3193I08704Q8442o8447l9659m8192J19054J01145j24806r0062q2254N6988r4155
3182G26758k2438L5233j40945N3267L9664r9859N9577J00165n1909M2678K2272
3171G64463q8906J8330O8678j00140p694M1074K0319p4606M7035m9326j29327
3160E09900k433m8802J16062k6770j4310k8418j55653J11146P5959k01629K57
3149C35309L8061K37705j66164q0471O1663j0612P9283N1377p2744k6210P0543
3138E17740j17723m0821Q0786P7843l6719n4601p3819O6734P999M5564m41n7318
3126D15224J8887n1996J7530o0583l9195M4031k4781J08632j29221p8312L909
3115B24125N2795M8384P9256j8422O0616j16308n1687J0850M0850O10M8022J16711
$$ plain form
3103 495802 463521 608481 554272 415370 321754 260808 320000 352990 401754 258900 264841
3092 264841 357484 409503 450835 325116 173489 254874 403076 397004 263583 215586 273232
3081 273232 274584 275095 235676 238730 302301 348090 264737 187325 162089 259783 298741 266655
3069 266655 284670 269615 240074 299358 192822 174117 239753 279442 251245 292579 226455
3058 226455 110040 105218 128214 249117 397619 307676 248292 245239 252446 143917 206566
3047 206566 248562 274126 437701 382492 229576 188591 253658 262690 274187 205708 212886 206187
3035 206187 154609 215380 165688 199247 226634 264829 217880 165210 238910 288307 293846 263661
3023 263661 346132 425446 358203 271666 326747 289430 237812 244213 197271 280608 245096 208911
$$ packed form
3103D95802l2281J44960n4209j38902r3616o0946N9192L2990M8764j42854N941
3092B64841R2643N2019M1332j25719j51627Q1385J48202o072j33421m7997N7646
3081B73232J352N11l9419L054O3571M5789q3353p7412k5236R7694L8958l2086
3069B66655J8015j5055k9541N9284j06536j8705O5636L9689k8197M1334o6124
3058B26455j16415m822K2996J20903J48502q9943n9384l053P207j08529O2649
3047B06566M1996K5564J63575n5209j52916m0985O5067R032J1497o8479P178o699
3035B06187n1578O0771m9692L3559K7387L8195m6949n2670P3700M9397N539l0185
3023B63661Q2471P9314o7243q6537N5081l7317n1618O401m6942Q3337l5512l6185
$$ plain form
3011 208911 247230 297350 312382 308139 388370 309545 289760 245628 271714 351630 303754 248012
2999 248012 138178 165523 168406 305888 294920 284505 302138 345986 377586 241546 212910
2988 212910 386509 442188 332006 259340 235164 320155 292494 310082 398155 546579 386613
2977 386613 395577 356722 352615 352843 453568 419572 506501 450587 380736 345264 407715 474796
2965 474796 454021 510511 534374 567610 601857 569321 496273 575992 517771 586014 738453
2954 738453 730280 749073 749078 835398 739672 634216 671698 650638 639148 673670 782318 835249
2942 835249 855679 839484 813848 936087 988994 1063063 1251386 1195409 1198639 1187318 1292835
2931 1292835 1433205 1508838 1474241 1654111 1615095 1420036 1398584 1550762 1457634 1423592 1458064
$$ packed form
3011B08911L8319N0120J5032m243Q0231p8825j9785m4132K6086P9916m7876n5742
2999B48012j09834K7345K883J37482j0968j0415J7633M3848L1600j36040k8636
2988B12910J73599N5679j10182p2666k4176Q4991k7661J7588Q8073J48424j59966
2977C86613Q964l8855m107K28J00725l3996Q6929n5914o9851l5472O2451O7081
2965D74796k0775N6490K3863L3236L4247l2536p3048P9719n8221O8243J52439
2954G38453q173J8793NQ6320r5726j05456L7482k1060j1490L4522J08648N2931
2942H35249K0430j6195k5636J22239N2907P4069J88323n5977L230j1321J05517
2931A292835J40370P5633l4597J79870l9016j95059k1452J52178r3128l4042L4472
$$ plain form
2920 1458064 1480732 1516870 1458902 1324396 1320242 1419295 1584940 1638568 1515119 1526171 1508025
2909 1508025 1610717 1568602 1502190 1533035 1738623 1922041 2086090 2241693 2393462 2663520
2899 2663520 2635960 2451651 2333752 2198791 1938274 1840380 1822091 1634588 1476385 1501439
2889 1501439 1502249 1350862 1420617 1372762 1287940 1351285 1400746 1363613 1313216 1234244 1224587 1252818
2877 1252818 1341247 1355443 1407145 1541072 1559289 1553892 1482452 1326833 1364068 1380327 1315468
2866 1315468 1267150 1172032 1154587 1145827 1142444 1017567 981192 938887 888576 897037 809818 832043
2854 832043 909533 879671 725214 710901 812877 748221 637010 579617 629786 609591 457270
2843 457270 426520 397869 402182 430956 544809 457896 287503 283870 266874 382547 330691
$$ packed form
2920A458064K2668L6138n7968j34506m154R9053J65645N3628j23449J1052j8146
2909A508025J02692m2115o6412L0845K05588J83418J64049J55603J51769K70058
2899B663520k7560j84309j17899j34961k60517r7894j8289j87503j58203K5054
2889A501439Q10j51387O9755m7855q4822O3345M9461l7133n0397p8972r657K8231
2877A252818Q8429J4196N1702J33927J8217n397p1440j55619L7235J6259o4859
2866A315468m8318r5118j7445q760l383j24877l6375m2305n0311Q461q7219K2225
2854H32043P7490k9862j54457j4313J01976o4656j11211n7393N0169k0195j52321
2843D57270l0750k8651M313K8774J13853q6913j70393l633j6996J15673n1856
$$ plain form
2832 330691 253770 203599 123683 48487 75512 194790 203310 152899 81254 173678 367441
2821 367441 364184 211921 177638 239047 202809 157549 298002 379300 299245 308616 301068 153811
2809 153811 8424 27634 19344 118717 86865 99062 90036 -7418 -104626 -130396 -63897 -39293
2797 -39293 17041 52531 67907 194350 211164 212541 123195 201875 307096 380550 275120
2786 275120 159652 137932 111587 115913 69552 9060 61060 167035 137876 152884 163331
2775 163331 93669 119859 101109 116389 198035 71780 56768 28394 -17214 -105565 -61893
2764 -61893 -23830 -32695 -70423 -29000 41659 37281 144901 95183 67187 111987 82198 50021
2752 50021 -106750 -82609 -109710 -27391 -20735 -36885 5413 -94564 -134181 8822 -72073 -38992
$$ packed form
2832C30691p6921n0171p9916p5196K7025J19278Q520n0411p1645R2424J93763
2821C67441l257j52263l4283O1409l6238m5260J40453Q1298q0055R371p548j47257
2809A53811j45387J9210q290R9373l1852J2197r026r7454r7208k5770O6499K4604
2797c9293N6334L5490J5376J26443J6814J377q9346P8680J05221P3454j05430
2786B75120j15468k1720k6345M326m6361o0492N2000J05975k9159J5008J0447
2775A63331o9662K6190j8750J5280Q1646j26255j5012k8374m5608q8351M3672
2764f1893L8063q865l7728M1423P0659m378J07620m9718k7996M4800k9789l2177
2752E0021j56771K4141k7101Q2319O656j6150M2298r9977l9617J43003q0895L3081
$$ plain form
2740 -38992 27024 36209 -24852 111281 119235 64244 27016 -3329 -110409 -247769 -221631 -25611
2728 -25611 -996 -49478 -41086 -79631 -14964 16593 -61114 -64580 42856 13814 -15839 40537
2716 40537 69870 -36169 -11170 -15977 83750 82537 118131 36914 -88322 -135398 -92211 -98701
2704 -98701 5416 24294 -63449 8460 -39352 -38738 116980 182909 75621 52325 8835 -29322
2692 -29322 20491 -36062 -161211 -14146 101955 195613 79990 -162506 -184461 -235638 -224802
2681 -224802 -156539 -39511 -69280 -130805 -202338 -235060 -109196 -98605 -85688 -8726 -79046
2670 -79046 -105302 -72951 64548 19822 99531 54188 103427 -13902 -84263 -164827 -262375
2659 -262375 -147722 -187943 -89473 -16130 88286 40691 -77082 -117920 -18513 52546 49194
$$ packed form
2740c8992O6016R185o1061J36133P954n4991l7228l0345j07080j37360K6138J96020
2728b5611K4615m8482Q392l8545O4667L1557p7707l466J07436k9042k9653N6376
2716D0537K9333j06039K4999m807R9727j213L5594q1217j25236m7076M3187o490
2704i8701J04117J8878q7743P1909m7812O14J55718O5929j07288k3296m3490l8157
2692b9322M9813n6553j25149J47065J16101R3658j15623k42496k1955n1177J0836
2681b24802O8263J17028k9769o1525p1533l2722J25864J0591J2917P6962p0320
2670g9046k6256L2351J37499m4726P9709m5343M9239j17329p0361q0564r7548
2659b62375J14653m0221R8470P3343J04416m7595j17773m0838R9407P1059l352
$$ plain form
2648 49194 70176 91935 -14097 -15597 35653 -3924 20254 -184048 -195150 -168810 -134272 -86342
2636 -86342 -62968 48146 48803 33590 69017 37537 -88735 -23097 -89388 -39686 81242 -73981
2624 -73981 12027 97657 161603 93172 88595 6495 -17073 75057 -115937 -131156 -160808 -11097
2612 -11097 -33981 76697 66656 62738 -49079 -120110 -55561 -111041 -132640 38641 75554
2601 75554 6261 81852 65169 191124 123231 -32813 36275 21010 75366 23754 -40138
2590 -40138 -155906 -180905 -51090 60807 -38117 -72798 52621 -44288 -186358 -199587 -86552
2579 -86552 -39254 -61185 -37360 143254 113547 101681 -75971 -135830 -152329 -100783 -99755 -257322
2567 -257322 -118503 -72191 -157234 -76507 -48865 -63082 -29846 69870 26079 59271 24853
$$ packed form
2648D9194K0982K1759j06032j500N1250l9577K4178k04302j1102K6340L4538M7930
2636h6342K3374J11114O57j5213L5427l1480j26272O5638o6291M9702J20928j55223
2624g3981Q6008Q5630O3946o8431m577q2100k3568R2130j90994j5219k9652J49711
2612a1097k2884J10678j0041l918j11817p1031O4549n5480k1599J71281L6913
2601G5554o9293P5591j6683J25955o7893j56044O9088j5265N4356n1612o3892
2590d0138j15768k4999J29815J11897r8924l4681J25419r6909j42070j3229J13035
2579h6552M7298k1931K3825J80614k9707j1866j77652n9859j6499N1546J028j57567
2567b57322J38819M6312q5043Q0727K7642j4217L3236R9716m3791L3192l4418
$$ plain form
2556 24853 48229 41202 67485 89976 -20557 -21326 8038 15097 77098 80831 -23704 25768
2544 25768 34143 31515 -8120 -48631 10109 -94494 -143345 -96859 -72961 -60624 -38709 -78251
2532 -78251 -25663 27347 18232 28865 -34374 -31658 -58035 -36326 39452 -49421 -135457 -109637
2520 -109637 -65026 -134013 -76170 -170909 -89231 -1648 -21440 -50074 -73028 40009 138394
2509 138394 45381 -65231 77337 52642 -91196 27460 171719 56366 -12229 -106697
2499 -106697 -56470 -13329 -35374 50975 84939 7030 29023 -108354 -55273 -45069 -168228
2488 -168228 -174596 -29160 -153993 -154491 -34779 70447 45162 48349 54640 -1714 -20058 61185
2476 61185 33777 20002 -142428 -116309 -34485 -62065 -64900 -170506 -115474 -86811 -59959 -26550
$$ packed form
2556B4853K3376p027K6283K2491j10533p69K9364P059O2001L733j04535M9472
2544B5768Q375k628l9635m0511N8740j04603m8851M6486K3898J2337K1915l9542
2532g8251N2588N3010r115J0633o3239K716k6377K1709P5778q8873q6036K5820
2520a09637M4611o8987N7843r4739Q1678Q7583j9792k8634k2954J13037R8385
2509A38394r3013j10612J42568k4695j43838J18656J44259j15353o8595r4468
2499a06697N0227M3141k2045Q6349L3964p7909K1993j37377N3081J0204j23159
2488a68228o368J45436j24833m98J19712J05226k5285L187O291n6354j8344Q1243
2476F1185k7408j3775j62430K6119Q1824k7580k835j05606N5032K8663K6852L3409
$$ plain form
2464 -26550 -58916 -141516 -85334 -86606 -75413 -95351 -64638 21490 -54459 -70449 -102021 -97259
2452 -97259 -93531 -125499 -34640 -76157 -58846 -65771 29852 108820 95757 72957 23583 124614
2440 124614 152443 96416 -55028 -40999 68542 20351 77093 90795 -21737 -111253 -63108
2429 -63108 -66314 -221226 -49920 113657 -12208 -68207 -56046 -7082 -37234 -58142 -50360
2418 -50360 -204490 -183577 -88702 -16127 -34280 -58984 -16973 -15978 57565 8398 -33751 -41613
2406 -41613 36918 -42294 -64221 -94473 -56680 -126686 -75805 -92635 -60637 6789 67421 42169
2394 42169 11463 93507 56047 32662 -86954 -28102 -829 39234 124923 -29805 -179719
2383 -179719 -91989 -29267 -21873 105868 111207 66195 48938 -41770 12175 96189 -60974 2318
$$ packed form
2464b6550l2366q2600N6182j272J1193j9938L0713Q6128p5949j5990l1572M762
2452i7259L728l1968R0859m1517J7311o925R5623P8968j3063k2800m9374J01031
2440A24614K7829n6027j51444J4029J09541m8191N6742J3702j12532q9516M8145
2429f3108l206j54912J71306J63577j25865n5999J2161M8964l0152k0908P782
2418e0360j54130K0913R4875P2575j8153k4704M2011R95P3543m9167m2149p862
2406d1613P8531p9212k1927l0252L7793p0006N0881j6830L1998O7426O0632k5252
2394D2169l0706Q2044l7460k3385j19616N8852K7273M0063Q5689j54728j49914
2383a79719Q7730O2722P394J27741N339m5012j7257r0708N3945Q4014j57163O3292
$$ plain form
2371 2318 27761 24778 119875 101953 26991 134416 239794 215020 172037 200790 116777 31885
2359 31885 72489 74269 88138 71891 28770 69650 142079 116450 117884 -8407 -47272 -56325
2347 -56325 -108723 -17789 -66095 -18384 5307 -97370 -154895 -66908 -30524 -58869 22769 31678
2335 31678 -64921 -75760 103250 104123 137655 170452 165486 51552 87627 119199 86120 44079
2323 44079 -9028 -10733 31417 89134 31482 63177 146963 32272 -1697 -6925 -102207 -58475
2311 -58475 -90566 -29887 54914 16966 1942 19085 30471 937 -53718 -5169 39396 46711
2299 46711 111175 72170 -18882 32263 138971 111185 62124 78052 40205 9616 44220 119178
2287 119178 158250 16700 91596 33953 72246 105689 46550 127682 83980 57151 129238
$$ packed form
2371B318K5443k983R5097j7922p4962J07425J05378k4774m2983K8753q4013q4892
2359C1885M0604J780J3869j6247m3121M0880P2429k5629J434j26291l8865r053
2347e6325n2398R0934m8306M7711K3691j02677n7525Q7987L6384k8345Q1638Q909
2335C1678r6599j0839J79010Q73L3532L2797m966j13934L6075L1572l3079m2041
2323D4079n3107j705M2150N7717n7652L1695Q3786j14691l3969n228r5282M3732
2311e8475l2091O0679Q4801l7948j5024J7143J1386k9534n4655M8549M4565P315
2299D6711O4464l9005r1052N1145J06708k7786m9061J5928l7847l0589L4604P4958
2287A19178L9072j41550P4896n7643L8293L3443n9139Q1132m3702k6829P2087
$$ plain form
2276 129238 46843 148853 172203 197960 210550 97768 -39813 -25734 590 -13841 114668
2265 114668 128765 -8308 5760 140006 152170 117367 -30261 91476 80961 -13631 28578
2254 28578 24022 100320 97802 85714 103560 81452 107628 102463 53120 16824 97579 109650
2242 109650 69092 175529 150714 165432 151510 130121 126053 103556 82709 162546 164368 107699
2230 107699 79494 187060 274684 255088 192623 113931 197058 96640 72887 83234 161484
2219 161484 223278 219893 244024 185780 202560 141231 129485 230948 273949 283101 210980 272463
2207 272463 263708 366928 355233 299134 318473 320341 338736 381952 384605 383927 416908 390482
2195 390482 237361 371061 430568 340073 445987 419226 418224 580080 678775 690398 751559
$$ packed form
2276A29238q2395J02010K3350K5757J2590j12782j37581J4079K6324j4431J28509
2265A14668J4097j37073J4068J34246J2164l4803j47628J21737j0515r4592M2209
2254B8578m556P6298k518j2088J7846k2108K6176n165m9343l6296Q0755J2071
2242A09650m0558J06437k4815J4718j3922k1389m068k2497k0847P9837J822n6669
2230A07699k8205J07566Q7624j9596o2465p8692Q3127j00418k3753J0347P8250
2219A61484O1794l385K4131n8244J6780o1329j1746J01463M3001R152p2121O1483
2207B72463q755J03220j1695n6099J9339J868J8395M3216K653o78L2981k6426
2195C90482j53121J33700N9507r0495J05914k6761j002J61856R8695J1623O1161
$$ plain form
2184 751559 685244 618538 686964 697460 731773 866836 747851 715283 734833 680776 669170
2173 669170 658582 868882 925563 913955 968958 877744 930183 856302 830688 925291 969136
2162 969136 1058564 1109103 1094977 1123371 1130301 1110898 1256165 1364156 1358520 1355427 1345121 1301699
2150 1301699 1230887 1279134 1403496 1466333 1460323 1413398 1647716 1753476 1775378 1788190 1804097
2139 1804097 1759392 1669400 1906650 2012031 2050616 2257460 2305789 2307477 2470527 2671403 2774709
2128 2774709 2897152 3066353 3172752 3099176 3314491 3479866 3628556 3830443 4005594 4176136
2118 4176136 4492569 4853337 5257897 5624497 6196575 6763285 7284451 7371601 7590915 7974555
2108 7974555 8641045 9428737 10566130 11947738 13645410 15964015 19084466 23530478 29630971
$$ packed form
2184G51559o6315o6706O8426J0496L4313J35063j18985l2568J9550n4057j1606
2173F69170j0588K10300N6681j1608N5003r1214N2439p3881k5614R4603M3845
2162I69136Q9428N0539j4126K8394O930j9403J45267J07991n636l093j0306m3422
2150A301699p0812M8247J24362O2837o010m6925K34318J05760K1902J2812J5907
2139A804097m4705q9992K37250J05381L8585K06844M8329J688J63050K00876J03306
2128B774709J22443J69201J06399p3576K15315J65375J48690K01887J75151J70542
2118D176136L16433L60768M04560L66600N72078N66710N21166Q7150K19314L83640
2108G974555O66490P87692J137393J381608J697672K318605L120451M446012O100493
$$ plain form
2099 29630971 38402944 48024699 47545315 36528658 27347989 21552283 17798531 14955133
2091 14955133 12847098 11039521 9674813 8743310 8071006 7471979 6957276 6605796 6329576
2082 6329576 5917025 5398768 4909545 4636156 4303110 4007306 3800001 3734595 3504059 3269940
2072 3269940 3190023 2907543 2712634 2457068 2296368 2118445 2018194 2083954 1989129 1864618
2062 1864618 1781481 1667164 1581757 1610169 1529271 1506483 1485109 1374469 1209407 1162647 1139962
2051 1139962 1195159 1101609 1071479 1191238 1193644 1105638 946709 862331 964499 954937 926331
2040 926331 764472 661699 731343 801911 768595 611258 485732 510302 527543 635328 603868
2029 603868 559901 505966 520340 498636 371531 380097 387603 414390 428177 452198 409033 419278
$$ packed form
2099B9630971Q771973R621755m79384j1016657r180669n795706l753752k843398
2091A4955133k108035j807577j364708r31503o72304n99027n14703l51480k76220
2082F329576m12551n18257m89223k73389l33046k95804k07305o5406k30536k34119
2072C269940p9917k82480j94909k55566j60700j77923j00251O5760r4825j24511
2062A864618q3137j14317q5407K8412q0898k2788k1374j10640j65062m6760k2685
2051A139962N5197r3550l0130J19759K406q8006j58929q4378J02168r562k8606
2040I26331j61859j02773O9644P0568l3316j57337j25526K4570J7241J07785l1460
2029F03868m3967n3935J4374k1704j27105Q566P506K6787J3787K4021m3165J0245
$$ plain form
2017 419278 388582 387993 376886 385896 398503 285183 216600 234533 203445 261399 245530 231783
2005 231783 229184 299000 98990 160516 184742 152626 230198 241141 149686 55552 161356
1994 161356 263851 110026 72832 192429 246343 164010 169022 171026 153834 161125 97068 92266
1982 92266 186022 12483 77981 90134 106289 138869 107790 37783 104192 122652 170773 167303
1970 167303 212084 78646 50814 64192 136723 194000 213640 232440 178430 272941 153636
1959 153636 -68882 -91101 24159 154957 180671 128376 80170 70726 156103 111483 30037
1948 30037 56299 96744 123812 14468 64307 -4792 -104724 62087 396 52507 52214 36788
1936 36788 196746 270119 217748 244710 167318 138977 61323 -21748 27603 84570 40225 26315
$$ packed form
2017D19278l0696n89j1107R010J2607j13320o8583J7933l1088N7954j5869j3747
2005B31783k599O9816k00010O1526K4226l2116P7572J0943r1455r4134J05804
1994A61356J02495j53825l7194J19597N3914q2333N012K004j7192P291o4057m802
1982I2266R3756j73539O5498J2153J6155L2580l1079p0007O6409J8460M8121l470
1970A67303M4781j33438k7832J3378P2531N7277J9640J8800n4010R4511j19305
1959A53636k22518k2219J15260J30798K5714n2295m8206r444Q5377m4620q1446
1948C0037K6262M0445K7068j09344M9839o9099r9932J66811o1691N2111k93j5426
1936C6788J59958P3373n2371K6962p7392k8341p7654q3071M9351N6967m4345j3910
$$ plain form
1924 26315 113918 200375 102205 151809 30634 37678 26900 39455 24856 -10485 17897 112006
1912 112006 125197 -26601 -39146 100910 56225 -114717 -120757 18587 -99191 -161605 -10783
1901 -10783 111454 45786 13729 25788 83620 6490 -128243 -6200 112713 83748 -94931
1890 -94931 -98559 -57409 -98375 -75173 -45352 -22639 69515 -2319 -53088 -80816 -131224 -147857
1878 -147857 -72068 47169 165490 163842 89651 -23544 -82293 -73528 -92030 935 -60297
1867 -60297 1845 42784 -111599 -161672 -67962 -41265 -181670 -180830 -67202 -215201 -172112
1856 -172112 -91346 -35878 -24822 -86502 -161949 -750 66623 60127 103000 -37210 -59738
1845 -59738 4040 3717 17541 21659 18602 -14946 93011 19909 45469 130669 -159 -13844
$$ packed form
1924B6315Q7603Q6457r8170M9604j21175P044j0778J2555j4599l5341K8382R4109
1912A12006J3191j51798j2545J40056m4685j70942o040J39344j17778o2414J50822
1901a0783J22237o5668l2057J2059N7832p7130j34733J22043J18913k8965j78679
1890i4931l628M1150m0966K3202K9821K2713R2154p1834n0769k7728n0408j6633
1878a47857P5789J19237J18321j648p4191j13195n8749Q765j8502R2965o1232
1867f0297O2142M0939j54383n0073R3710K6697j40405Q40J13628j47999M3089
1856a72112Q0766N5468J1056o1680p5447J61199O7373o496M2873j40210k2528
1845e9738O3778l23J3824M118l057l3548J07957p3102K5560Q5200j30828j3685
$$ plain form
1833 -13844 69701 107348 124221 284680 214337 84433 78450 183362 134328 128451 81056 61696
1821 61696 7342 -40011 -99960 154189 140157 63899 183521 173677 -4296 -20623 33674
1810 33674 -29740 -53224 -38545 -59582 -74543 2435 -11873 -159919 18891 126593 55730
1799 55730 -102811 -158546 -95667 -40684 85943 119833 84429 24645 74687 122938 94450
1788 94450 82546 62065 38662 79472 -28741 10082 110348 127808 -72909 -173175 -9834
1777 -9834 -20205 -4671 -126235 -104571 -70455 -70157 -103157 -79117 9013 48879 -41947 -21754
1765 -21754 7565 -196877 -107979 -35404 -68295 -49104 -19417 3318 95438 -54942 -4728
1754 -4728 -36769 10393 75 -152260 -135222 -119739 -136621 -117864 -87455 -111024 -147025 -101778
$$ packed form
1833a3844Q3545L7647J6873J60459p0343j29904n983J04912m9034n877m7395j9360
1821F1696n4354m7353n9949K54149j4032p6258J19622r844j77973j6327N4297
1810C3674o3414k3484J4679k1037j4961P6978j4308j48046J78810J07702p0863
1799E5730j58541n5735O2879N4983J26627L3890l5404n9784N0042M8251k8488
1788I4450j1904k0481k3403M0810j08213L8823J00266J7460k00717j00266J63341
1777i834j0371J5534j21564K1664L4116K98l3000K4040Q8130L9866r0826K0193
1765b1754K9319k04442Q8898P2575l2891J9191K9687K2735R2120j50380N0214
1754d728l2041M7162j0318j52335J7038J5483j6882J8757L0409k3569l6001M5247
$$ plain form
1742 -101778 -7538 -47158 -53674 -54049 -58694 -64335 8756 -3410 -13594 18349 -14759 -26473 37392
1729 37392 -16702 -10147 73573 -53655 -39519 49119 -120271 -227001 -117320 -45653 -113714
1718 -113714 -195829 -122127 15284 -20555 -107658 -83368 -108838 -77748 -71744 -127416 -94487 -186935
1706 -186935 -143744 -19476 -41882 71738 -60758 -14686 29857 -29875 -5200 -3078 -63231
1695 -63231 -25529 -62942 -52882 -50097 -170954 -85719 -64004 6344 108259 92759 -72453
1684 -72453 -69368 34511 -5224 4967 -9954 -55614 -93494 -146993 -46656 -35616 -55812 -10981
1672 -10981 7748 -38623 -151925 -149500 -164168 -40488 -33185 -94887 -66017 -51111 25053 -55621
1660 -55621 -88312 39899 1605 7262 44770 -92302 -68548 -175414 -201114 -49252 -147359
$$ packed form
1742a01778R4240l9620o516l75m645n641P3091j2166j0184L1943l3108j1714O3865
1729C7392n4094O555Q3720j27228J4136Q8638j69390j06730J09681P1667o8061
1718a13714q2115P3702J37411l5839q7103K4290k5470L1090O004n5672L2929r2448
1706a86935M3191J24268k2406J13620j32496M6072M4543n9732K4675K122o0153
1695f3231L7702l7413J0060K785j20857Q5235K1715P0348J01915j5500j65212
1684g2453L085J03879l9735J0191j4921m5660l7880n3499J00337J1040k0196M4831
1672a0981J8729m6371j13302K425j4668J23680P303o1702K8870J4906P6164q0674
1660e5621l2691J28211l8294N657L7508j37072K3754j06866k5700J51862r8107
$$ plain form
1649 -147359 -91003 -94108 -10626 -93906 -109114 -78382 -176073 -139432 -112148 -47852 1067 150550
1637 150550 -60897 3246 14906 -7147 15397 -12215 7205 -52633 -49353 -34975 -23928 1565
1625 1565 -50967 26769 86715 -42746 -187887 -83949 -9857 -24951 -93178 -162117 -108223
1614 -108223 -18657 -9462 62413 -105324 -174384 -198139 -134160 -38383 10196 -45511 -37610 28842
1602 28842 15076 15678 -29200 -44066 108042 106441 28192 18375 -45309 -144419 -162360 -55691
1590 -55691 30807 114199 -71246 -152605 -136157 34678 -25893 45461 107138 2104 -92333
1579 -92333 -93788 -109528 -118793 -122333 -6023 -11078 6773 -136160 -71693 -142021 -9524 80767
1567 80767 79861 149158 -32635 -108647 34573 57946 25408 -4465 -136353 -158648 -156394 -99201
$$ packed form
1649a47359N6356l105Q3482q3280j5208L0732r7691L6641K7284O4296M8919J49483
1637A50550k11447O4143J1660k2053K2544k7612J9420n9838L280J4378J1047K5493
1625A565n2532P7736N9946j29461j45141J03938P4092j5094o8227o8939N3894
1614a08223Q9566R195P1875j67737o9060k3755O3979R5777M8579n5707P901O6452
1602B8842j3766O02m4878j4866J52108j601p8249r817o3684r9110j7941J06669
1590e5691Q6498Q3392j85445q1359J6448J70835o0571P1354O1677j05034r4437
1579i2333j455j5740r265l540J16310n055J7851j42933O4467p0328J32497R0291
1567H0767r06O9297j81793p6012J43220K3373l2538k9873j31888k2295K254N7193
$$ plain form
1555 -99201 -20788 -55137 -167720 -158350 -54099 -105773 12981 65038 -82619 -16497 12952
1544 12952 -120747 -126342 35681 2380 -81933 -65037 28816 83783 48811 -37405 -50453 19479
1532 19479 22968 -1249 -103215 -126023 -5112 -9549 -52573 -100814 5657 15886 -4296 -120755
1520 -120755 -136926 -63834 33937 70665 -47961 49435 141210 51096 35342 -14478 -23613 -32263
1508 -32263 35435 8905 -83426 -158101 -75818 6670 -5724 46084 -106154 -151815 -129598 -150826
1496 -150826 31140 100464 -34774 -92663 -83992 -22457 113141 6718 -132846 -160300 -143245
1485 -143245 -110196 -103512 -49144 19879 -81461 31892 -51086 -106405 -65750 -67758 15207 28137
1473 28137 -128400 -145977 -144306 -21351 -4187 -112216 -54018 46723 -36466 -88639 -140403
$$ packed form
1555i9201P8413l4349j12583R370J04251n1674J18754N2057j47657O6122K9449
1544A2952j33699n595J62023l3301q4313J6896R3853N4967l4972q6216j3048O9932
1532A9479L489k4217j01966k2808J20911m437m3024m8241J06471J0229k0182j16459
1520a20755j6171P3092R7771L6728j18626R7396R1775r0114j5754m9820r135q650
1508c2263O7698k6530r2331p4675Q2283Q2488j2394N1808j52238m5661K2217k1228
1496a50826J81966O9324j35238n7889Q671O1535J35598j06423j39564k7454J7055
1485a43245L3049O684N4368O9023j01340J13353q2978n5319M0655k008Q2965J2930
1473B8137j56537j7577J671J22955J7164j08029N8198J00741q3189n2173n1764
$$ plain form
1462 -140403 -149493 -107774 -69615 -22705 -93048 -40025 -112236 -40991 50635 29606 -44571 -120654
1450 -120654 -107587 -52630 -51487 -175487 -79792 -5344 -79918 -61042 -47427 -62623 -128509 -75442
1438 -75442 -115775 -75536 -149830 18504 -21639 -39302 30288 -48596 3702 -47495 -103608 2462
1426 2462 -7648 -89458 -43927 2300 -101461 -97114 -96903 -111235 -37317 900 -45851 -139680
1414 -139680 -72650 -61464 -21686 -62221 -243255 -86010 -85739 -102589 -105826 -69853 13844 -127961
1402 -127961 -41900 49250 70478 70813 79633 120092 80229 88755 -40168 -112040 42014 108660
1390 108660 184419 84780 -25456 -27371 -65553 -89612 -31579 33727 21844 93694 128625 82620
1378 82620 109249 25894 -38274 19765 39264 -95248 -63706 36079 -28838 -53000 -20976 65956
$$ packed form
1462a40403r090M1719L8159M6910p0343N3023p2211P1245R1626k1029p4177p6083
1450a20654J3067N4957J143j24000R5695P4448p4574J8876J3615j5196o5886N3067
1438g5442m0333M0239p4294J68334m0143j7663O9590p8884N2298n1197n6113J06070
1426B462j0110q1810M5531M6227j03761M347K11j4332P3918L8217m6751r3829
1414a39680O7030J1186L9778m0535j81034J57245K71j6850l237L5973Q3697j41805
1402a27961Q6061R1150K1228L35Q820M0459l9863Q526j28923p1872J54054O6646
1390A08660P5759r9639j10236j915l8182k4059N8033O5306j1883P1850L4931m6005
1378H2620K6629q3355o4168N8039J9499j34512L1542R9785o4917k4162L2024Q6932
$$ plain form
1366 65956 46691 -98802 -132750 -81540 -87108 -46770 -10018 -61159 -39786 -106959 -128812 -16479
1354 -16479 -16618 12615 -29747 -26760 14771 -11000 -97901 -78783 -46219 57218 5636 -61731
1342 -61731 -188104 -70452 98313 6267 -35656 -84939 -53035 31797 -2033 17638 -130215
1331 -130215 -121431 -60375 -104418 -6850 -61769 -6432 -96273 -64973 -87291 -25935 3406 -20437
1319 -20437 -82719 14740 40448 -42811 84128 49007 -46302 -114984 1633 15476 72167
1308 72167 122052 46978 -25562 -72311 -10492 -1823 -55113 -136338 -80687 -114070 -83010 21230
1296 21230 -5834 4153 85850 62595 -14221 -191186 -90832 -46419 -120826 -157379 -178370 -141484
1284 -141484 -179990 -165019 -89005 -23329 87358 -24541 4498 -51832 -112177 -146159 -90606
$$ packed form
1366F5956j9265j45493l3948N1210n568M0338L6752n1141K1373o7173k1853J12333
1354a6479j39K9233m2362K987M1531k5771q6901J9118L2564J03437n1582o7367
1342f1731j26373J17652J68765r2046m1923m9283L1904Q4832l3830J9671j47853
1331a30215Q784O1056m4043R7568n4919N5337q9841L1300k2318O1356K9341k3843
1319b0437o2282R7459K5708q3259J26939l5121r5309o8682J16617J3843N6691
1308G2167M9885p5074p2540m6749O1819Q669n3290q1225N5651l3383L1060J04240
1296B1230k7064R987Q1697k3255p6816j76965J00354M4413p4407l6553k0991L6886
1284a41484l8506J4971P6014O5676J10687j11899K9039n6330o0345l3982N5553
$$ plain form
1273 -90606 -51063 821 59910 -77927 37822 61320 6741 9858 -44841 -63153 -145412 -79094
1261 -79094 -53521 -103229 44294 37947 -6864 -140673 -104963 -63456 65429 53361 74798
1250 74798 71698 -56481 -81782 -102571 -30910 -21260 -65995 -974 69518 27579 -112942 -17038
1238 -17038 -145548 -136729 121608 131006 87160 63651 14825 -151170 -109105 -110949 -56399 -23053
1226 -23053 12078 9197 45826 87895 -31554 -63269 -113427 -57647 -174095 -66591 -82175
1215 -82175 -131662 26320 45443 -14880 -39048 -60217 -16698 -28269 -27631 -9436 -24494 -45956
1203 -45956 13603 134215 120680 102087 -66299 -83929 36109 -59 -26030 -2071 5889
1192 5889 -72479 -13788 63181 -45167 -72117 11826 -12275 -126701 -57153 34886 78328 -60534
$$ packed form
1273i0606L9543N1884N9089j37837J15749K3498n4579L117n4699j8312q2259O6318
1261g9094K5573m9708J47523o347m4811j33809L5710M1507J28885j2068K1437
1250G4798l100j28179k5301k0789P1661R650m4735O5021P0492m1939j40521R5904
1238a7038j28510Q819K58337R398m3846k3509m8826j65995M2065j844N4550L3346
1226b3053L5131k881L6629M2069j19449l1715n0158N5780j16448J07504j5584
1215h2175m9487J57982J9123o0323k4168k1169M3519j1571O38J8195j5058k1462
1203d5956N9559J20612j3535j8593j68386j7630J20038l6168k5971K3959P960
1192E889p8368N8691P6969j08348k6950Q3943k4101j14426O9548R2039M3442j38862
$$ plain form
1180 -60534 -87915 -84426 -100688 -111303 -32135 7509 17276 49360 86140 -60248 -34811 8640
1168 8640 -33982 -35577 43962 -106520 -213662 -65493 425 40211 -56728 31549 93975 -64780
1156 -64780 -61302 80284 60450 -9435 63089 30409 31908 -90357 8957 41163 -87401 -19246
1144 -19246 -31871 -32280 -103742 2452 87191 166357 89056 -92139 -81946 38045 10131 122894
1132 122894 140810 125007 -42985 3259 120422 41927 -88927 -72291 -7732 48398 19139
1121 19139 49247 23295 109272 122854 -44898 -11903 46354 -100083 -85435 -11695 -12604 1592
1109 1592 13334 -13829 -19288 43548 17755 6895 -8201 -63303 -11177 88525 79661 -10862
1097 -10862 9443 6944 -42262 3717 -47235 16468 56858 -6230 -44294 91623 -36190 46809
$$ packed form
1180f0534k7381L489j6262j0615P9168L9644R767L2084L6780j46388K5437M3451
1168H640m2622j595P9539j50482j07142J48169O5918L9786r6939Q8277O2426j58755
1156f4780L478J41586j9834o9885P2524l2680J499j22265R9314L2206j28564O8155
1144a9246j2625m09p1462J06194Q4739P9166p7301j81195J0193J19991k7914J12763
1132A22894J7916j5803j67992M6244J17163p8495j30854J6636O4559N6130k9259
1121A9139L0108k5952Q5977J3582j67752L2995N8257j46437J4648P3740r09J4196
1109A592J1742k7163n459O2836k5793j0860j5096n5102N2126R9702q864r0523
1097a0862K0305k499m9206M5979n0952O3703M0390o3088l8064J35917j27813Q2999
$$ plain form
1085 46809 39213 64441 71857 33551 182791 -14643 -53522 -14265 -25022 -67416 -68524 1874
1073 1874 -48204 -28276 54388 -71071 -71368 9257 -77031 -35505 -103337 -47529 -20674 37014
1061 37014 -6692 -107215 -7331 72753 66736 108912 61144 43875 70085 71270 -23282 60135
1049 60135 103152 -3912 -155649 -68993 -20413 42706 16404 29130 -16975 46938 96122
1038 96122 4049 102109 27935 -38220 -80600 -179621 -97242 -93944 -100856 -40592 37670 82889
1026 82889 128156 84761 -31311 -22826 -38763 78913 31492 -123116 -186820 -83521 -77705
1015 -77705 22550 -91628 -170620 -52337 56136 -91749 -160400 -141171 2067 28045 39231
1004 39231 -3326 -89965 -171031 -134559 99943 93139 48429 23608 -10466 -105856 -2307 -50270
$$ packed form
1085D6809p596K5228P416l8306J49240j97434l8879L9257j0757m2394j108P0398
1073A874n0078J9928Q2664j25459k97Q0625q6288M1526o7832N5808K6855N7688
1061C7014m3706j00523R9884Q0084o017M2176m7768j7269K6210J185r4552Q3417
1049F0135M3017j07064j51737Q6656M8580O3119k6302J2726m6105O3913M9184
1038I6122r2073R8060p4174o6155m2380r9021Q2379L298o912O0264P8262M5219
1026H2889M5267m3395j16072Q485j5937J17676m7421j54608o3704J03299N816
1015g7705J00255j14178p8992J18283J08473j47885o8651J9229J43238K5978J1186
1004C9231m2557q6639q1066L6472K34502o804m4710k4821l4074r5390J03549m7963
$$ plain form
992 -50270 -149091 15338 -619 -20419 3499 8501 -7713 -33282 -126651 -119002 -33566 -65331
980 -65331 -91982 -91988 -73013 95254 111128 23157 38424 105852 -30953 -59468 -80127 -14035
968 -14035 -37184 -27707 5437 -24636 -50696 -60676 56993 30425 -73916 -111691 -59822 -76334
956 -76334 -147339 -216848 -80848 49708 105993 -22176 -63244 -12309 -86309 25481 -20724
945 -20724 -66409 -6196 25752 -25647 -32020 45635 -31463 84742 -53959 -71829 -88851 -74778
933 -74778 122568 89719 46061 79452 106921 41602 -24567 25465 -34071 -8271 55669 28053
921 28053 -120888 -165166 -113164 -38618 4100 47175 26082 17858 28727 -35688 -105474 -74137
909 -74137 -74352 2071 -50401 -117943 -53915 -27268 -21817 -33385 -167125 -257421 -230752 -69265
$$ packed form
992e0270r8821J64429j5957j9800K3918N002j6214k5569r3369P649Q5436l1765
980f5331k6651oJ8975J68267J5874q7971J5267O7428j36805k8515k0659O6092
968a4035k3149R477L3144l0073k6060r980J17669k6568j04341l7775N1869j6512
956g6334p1005o9509J36000J30556N6285j28169m1068N0935p4000J11790m6205
945b0724m5685O0213L1948n1399o373P7655p7098J16205j38701j7870j7022J4073
933g4778J97346l2849m3658L3391K7469o5319o6169N0032n9536K5800O3940k7616
921B8053j48941m4278N2002P4546M2718M3075k1093q224J0869o4415o9786L1337
909g4137k15P6423n2472o7542O4028K6647N451j1568j33740r0296K6669J61487
$$ plain form
897 -69265 -121554 -196597 -14047 -29802 43229 10449 59393 41770 -50346 -54397 19390 25377
885 25377 60690 151472 122422 5023 71195 54858 -12120 -35173 -13595 31875 28781 7515
873 7515 -111754 -131835 -34216 2337 -26238 34825 95940 -4962 30184 34212 -1437 44806
861 44806 97866 78565 4593 -23165 103318 82858 -1029 -58251 -67651 -49347 -7481 26066
849 26066 -26705 49012 -20830 21532 36289 64154 57344 115975 53402 18273 -29812 -50968
837 -50968 7079 -97298 -151809 -120950 -72744 -103802 -112703 26826 76156 48071 43369 5890
825 5890 6858 34728 -49287 -106149 -73570 -135066 -196946 -85288 -46816 -57844 82796 98716
813 98716 157500 -16 13351 64794 29290 54735 66200 104658 10496 -45102 -121566 -148106
$$ packed form
897f9265n2289p5043J82550j5755P3031l2780M8944j7623r2116m051P3787N987
885B5377L5313R0782k9050j17399O6172j6337o6978k3053K1578M5470l094k1266
873G515j19269k0081R7619L6553k8575O1063O1115j00902L5146M028l5649M6243
861D4806N3060j9301p3972k7758J26483k0460q3887n7222r400J8304M1866L3547
849B6066n2771P5717o9842M2362J4757K7865o810N8631o2573l5129m8085k1156
837e0968N8047j04377n4511L0859M8206l1058q901J39529M9330k8085m702l7479
825E890R68K7870q4015n6862L2579o1496o1880J11658L8472j1028J40640J5920
813I8716N8784j57516J3367N1443l5504K5445J1465L8458r4162n5598p6464k6540
$$ plain form
801 -148106 -12426 2778 70669 38432 32102 34842 -64835 -92864 -133501 -75480 1698 -63481
789 -63481 -59451 -84552 59272 32062 33827 45743 -74475 33208 -65255 -90539 62423 18018
777 18018 -5701 40450 -7713 42352 20339 85827 79370 70522 -2476 87686 129938 113997
765 113997 111279 188564 165439 93986 54078 29118 29020 2553 161480 51472 28186 85592
753 85592 37158 139549 154426 140838 133403 -79470 5938 98439 -8910 27858 85344 96799
741 96799 -6140 127829 68740 135942 195678 126593 54804 -1464 -53525 -34655 81575
730 81575 43574 103767 224216 32018 -96899 -54415 -14780 -120487 -81976 -146077 -171891
719 -171891 38980 19266 -35610 -105867 -7575 25566 116153 85085 18226 65810 15684 5999
$$ packed form
801a48106J35680J5204O7891l2237o330K740r9677k8029m0637N8021P7178o5179
789f3481M030k5101J43824k7210J765J1916j20218J07683r8463k5284J52962m4405
777A8018k3719M6151m8163N0065k2013O5488o457q848p2998R0162M2252j5941
765A13997k718P7285k3125p1453l9908k4960r8k6467J58927j10008k3286N7406
753H5592m8434J02391J4877j3588p435k12873Q5408R2501j07349L6768N7486J1455
741I6799j02939J33969n9089O7202N9736o9085p1789n6268n2061J8870J16230
730H1575l8001O0193J20449j92198j28917M2484L9635j05707L8511o4101k5814
719a71891K10871j9714n4876p0257R8292L3141R0587l1068o6859M7584n0126r685
$$ plain form
707 5999 35552 -80964 -28420 -39547 -70729 -100361 -4364 13988 55441 142583 129707 35135
695 35135 17229 41234 75490 -7390 -29994 76840 -26667 13917 132774 144315 59970
684 59970 56910 57274 -50362 -108492 -123188 -47449 -59331 -101303 -36296 39352 71574 56300
672 56300 9967 -9807 -8490 55868 120858 91165 -168319 -211709 -136133 -145498 -41960 50876
660 50876 -46557 -59817 -33713 -79660 64594 -33347 72919 141844 162171 85901 -46763
649 -46763 158185 234391 143819 60326 -47141 -14297 93869 50720 -133137 -129274 -11822
638 -11822 -57937 -65157 -71102 -5242 -62123 -79071 -71976 -23632 -70220 -129745 -99836 -76034 1429
625 1429 141987 189189 93969 37151 -41487 -60052 -136814 -191457 -102027 -28030 71786 6459
$$ packed form
707E999K9553j16516N2544j1127l1182k9632R5997J8352M1453Q7142j2876r4572
695C5135j7906K4005L4256q2880k2604J06834j03507M0584J18857J1541q4345
684E9970l060L64j07636n8130j4696P5739j1882m1972O5007P5648L2222j5274
672E6300m6333j9774J317O4358O4990k9693k59484m3390P5576r365J03538R2836
660E0876r7433j3260K6104m5947J44254r7941J06266O8925K0327p6270j32664
649d6763K04948P6206r0572q3493j07467L2844J08166m3149j83857L863J17452
638a1822m6115p220n945O5860n6881j6948P095M8344m6588n9525K9909K3802P7463
625A429J40558M7202r5220n6818p8638j8565p6762n4643Q9430P3997R9816o5327
$$ plain form
613 6459 -177456 -104153 -67430 -76453 -30292 -4483 -16778 -12033 -22609 75568 86416 112903
601 112903 46711 40713 71289 49086 -18304 -27105 35186 138892 40786 20083 -53193 27375
589 27375 151786 -55148 -71198 -90823 -62962 87035 102692 39088 24964 4326 95466
578 95466 245172 147767 46926 56373 83391 63325 -39060 -19918 16723 20693 29508 -112351
566 -112351 -238645 -5671 62483 -6782 -98649 23043 -3334 45164 35148 -15626 48129
555 48129 33552 26671 54891 81309 54207 -92293 -55373 17243 -34131 -88291 -170932 95933
$$ packed form
613F459j83915P3303L6723r023M6161K5809j2295M745j0576R8177J0848K6487
601A12903o6192n998L0576k2203o7390q801O2291J03706r8106k0703p3276Q0568
589B7375J24411k06934j6050j9625K7861J49997J5657o3604j4124k0638R1140
578I5466J49706r7405j00841R447K7018k0066j02385J9142L6641L970Q815j41859
566a12351j26294K32974O8154o9265r1867J21692k6377M8498j0016n0774O3755
555D8129j4577o881K8220K6418k7102j46500L6920P2616n1374n4160q2641K66865
$$ [...]
##END NTUPLES=NMR SPECTRUM
##END=
