##TITLE=1H_CA-9182-3
 CDCl3
 8 sc, 
 9.8.2023
##JCAMPDX= 6.0         $$ Bruker NMR JCAMP-DX V2.0
##DATA TYPE= NMR SPECTRUM
##DATA CLASS= NTUPLES
##ORIGIN= UXNMR, Bruker Analytische Messtechnik GmbH
##OWNER= root
$$ XWIN-NMR		Version 3.5
$$ Wed Aug  9 16:02:10 2023 Russian Standard Time (UT+4h)  she@DPX200
##.OBSERVE FREQUENCY= 200.13135
##.OBSERVE NUCLEUS= ^1H
##.ACQUISITION MODE= SIMULTANEOUS
##.ACQUISITION SCHEME= undefined
##.AVERAGES= 8
##.DIGITISER RES= 18
##SPECTROMETER/DATA SYSTEM= spect
##.PULSE SEQUENCE= zg30
##.SOLVENT NAME= CDCl3
##.SHIFT REFERENCE= (INTERNAL, CDCl3, 0, 15.7348)
##AUDIT TRAIL= $$ (NUMBER, WHEN, WHO, WHERE, WHAT)
$$ ##TITLE= Audit trail, XWIN-NMR		Version 3.5
$$ ##JCAMPDX= 5.01
$$ ##ORIGIN= Bruker BioSpin GmbH
$$ ##OWNER= she
$$ F:/spectra/data/she/nmr/H-F/1/pdata/1/auditp.txt
$$ ##AUDIT TRAIL=  $$ (NUMBER, WHEN, WHO, WHERE, WHAT)
(   1,<2023-08-09 16:00:50.79 +0400>,<she>,<DPX200>,
      <created by zg, POWCHK disabled, PULCHK disabled
       configuration hash MD5:
       00 E9 B6 7A A2 85 ED C7 34 08 36 98 17 FE 4E 26
       data hash MD5: 16K
       55 2C 57 B2 B9 CD B3 8D 04 80 55 2B A9 77 B9 F5>)
(   2,<2023-08-09 16:01:02.70 +0400>,<she>,<DPX200>,
      <Start of raw data processing
       efp BC_mod = 2 LB = 0.24 FT_mod = 6 PKNL = 1 PHC0 = -21043.04 PHC1 = 8.252722 SI = 16K 
       data hash MD5: 16K
       7C 5C 86 4D EA 2B 4F F1 4B C2 90 3D A2 8A 0C 3F>)
(   3,<2023-08-09 16:01:18.50 +0400>,<she>,<DPX200>,
      <pk PHC0 = -157.0451 PHC1 = -1.4 
       data hash MD5: 16K
       5E 1B 3A 64 0A 45 56 8A 53 0A 95 72 4D 07 36 4C>)
(   4,<2023-08-09 16:01:21.65 +0400>,<she>,<DPX200>,
      <abs ABSG = 5 
       data hash MD5: 16K
       DA C1 D4 1B DC 38 59 DF 57 77 52 C5 AA E8 7D DD>)
$$ ##END=
$$ 
$$ hash MD5
$$ B2 C2 0B BD 59 39 A2 21 19 15 DF DD 0C C8 AE DE
##$RELAX= 
##$RELAX= 
##$RELAX= 
##$RELAX= 
##$RELAX= 
##$RELAX= 
$$ Bruker specific parameters
$$ --------------------------
##$DU= <F:/spectra>
##$EXPNO= 1
##$NAME= <H-F>
##$PROCNO= 1
##$TYPE= <nmr>
##$USER= <she>
##$AMP= (0..31)
100 100 100 100 100 100 100 100 100 100 100 100 100 100 100 100 100 100 
100 100 100 100 100 100 100 100 100 100 100 100 100 100 
##$AQSEQ= 0
##$AQ_mod= 1
##$AUNM= <au_zg>
##$AUTOPOS= <>
##$BF1= 200.13
##$BF2= 200.13
##$BF3= 200.13
##$BF4= 200.13
##$BF5= 200.13
##$BF6= 200.13
##$BF7= 200.13
##$BF8= 200.13
##$BYTORDA= 1
##$CFDGTYP= 0
##$CFRGTYP= 5
##$CHEMSTR= <none>
##$CNST= (0..31)
1 1 145 1 1 1 1 1 1 1 1 1 1 1 1 1 1 1 1 1 1 1 1 1 1 1 1 1 1 1 1 1 
##$CPDPRG= <>
##$CPDPRG1= <>
##$CPDPRG2= <>
##$CPDPRG3= <>
##$CPDPRG4= <mlev>
##$CPDPRG5= <mlev>
##$CPDPRG6= <mlev>
##$CPDPRG7= <mlev>
##$CPDPRG8= <mlev>
##$CPDPRGB= <>
##$CPDPRGT= <>
##$D= (0..31)
0 1.2 0 0 0 0 0 0 0 0.06 0 0.03 0 0 0 0 0.0002 0 0 0 0 0 0 0 0 0 0 0 0 
0 0 0 
##$DATE= 1691582450
##$DBL= (0..7)
120 120 120 120 120 120 120 120 
##$DBP= (0..7)
150 150 150 150 150 150 150 150 
##$DBP07= 0
##$DBPNAM0= <>
##$DBPNAM1= <>
##$DBPNAM2= <>
##$DBPNAM3= <>
##$DBPNAM4= <>
$$ [...]
##$SUBNAM3= <"">
##$SUBNAM4= <"">
##$SUBNAM5= <"">
##$SUBNAM6= <"">
##$SUBNAM7= <"">
##$SUBNAM8= <"">
##$SUBNAM9= <"">
##$SW= 18.05172834244
##$SWIBOX= (0..15)
0 0 2 0 0 0 0 0 0 0 0 0 0 0 0 0 
##$SW_h= 3612.71676300578
##$TD= 16384
##$TD0= 1
##$TE= 0
##$TE2= 300
##$TE3= 300
##$TEG= 300
##$TL= (0..7)
0 120 120 120 120 120 120 120 
##$TP= (0..7)
150 150 150 150 150 150 150 150 
##$TP07= 0
##$TPNAME0= <>
##$TPNAME1= <>
##$TPNAME2= <>
##$TPNAME3= <>
##$TPNAME4= <>
##$TPNAME5= <>
##$TPNAME6= <>
##$TPNAME7= <>
##$TPOAL= (0..7)
0.5 0.5 0.5 0.5 0.5 0.5 0.5 0.5 
##$TPOFFS= (0..7)
0 0 0 0 0 0 0 0 
##$TUNHIN= 0
##$TUNHOUT= 0
##$TUNXOUT= 0
##$USERA1= <user>
##$USERA2= <user>
##$USERA3= <user>
##$USERA4= <user>
##$USERA5= <user>
##$V9= 5
##$VALIST= <valist>
##$VCLIST= <CCCCCCCCCCCCCCC>
##$VD= 0
##$VDLIST= <DDDDDDDDDDDDDDD>
##$VPLIST= <PPPPPPPPPPPPPPP>
##$VTLIST= <TTTTTTTTTTTTTTT>
##$WBST= 1024
##$WBSW= 4
##$XGAIN= (0..3)
0 0 0 0 
##$XL= 0
##$YL= 0
##$YMAX_a= 697194
##$YMIN_a= -461594
##$ZGOPTNS= <>
##$ZL1= 120
##$ZL2= 120
##$ZL3= 120
##$ZL4= 120
##$ABSF1= 15.74433
##$ABSF2= -2.307519
##$ABSG= 5
##$ABSL= 3
##$ALPHA= 0
##$AQORDER= 0
##$ASSFAC= 0
##$ASSFACI= 0
##$ASSFACX= 0
##$ASSWID= 0
##$AUNMP= <proc_1d>
##$AZFE= 0.1
##$AZFW= 0.1
##$BCFW= 0
##$BC_mod= 2
##$BYTORDP= 0
##$COROFFS= 0
##$CY= -3
##$DATMOD= 1
##$DC= 0
##$DFILT= <>
##$DTYPP= 0
##$F1P= 0
##$F2P= 0
##$FCOR= 1
##$FTSIZE= 16384
##$FT_mod= 6
##$GAMMA= 0
##$GB= 0
##$INTBC= 1
##$INTSCL= 3.70164e-10
##$ISEN= 128
##$LB= 0.24
##$LEV0= 0
##$LPBIN= 0
##$MAXI= 10000
##$MC2= 0
##$MEAN= 0
##$ME_mod= 0
##$MI= 1.114404
##$NCOEF= 0
##$NC_proc= -6
##$NLEV= 6
##$NOISF1= 3.799351
##$NOISF2= 2.8
##$NSP= 0
##$NTH_PI= 0
##$NZP= 0
##$OFFSET= 15.73477
##$PC= 1
##$PHC0= -21200.08
##$PHC1= 6.852722
##$PH_mod= 1
##$PKNL= yes
##$PPARMOD= 0
##$PSCAL= 0
##$PSIGN= 0
##$REVERSE= no
##$SF= 200.130007359535
##$SI= 16384
##$SIGF1= 3
##$SIGF2= 2
##$SINO= 5.538805
##$SIOLD= 16384
##$SREGLST= <1H.CDCl3>
##$SSB= 0
##$STSI= 16384
##$STSR= 0
##$SW_p= 3612.71676300578
##$SYMM= 0
##$S_DEV= 0
##$TDeff= 16384
##$TDoff= 0
##$TI= <>
##$TILT= no
##$TM1= 0
##$TM2= 0
##$TOPLEV= 0
##$USERP1= <user>
##$USERP2= <user>
##$USERP3= <user>
##$USERP4= <user>
##$USERP5= <user>
##$WDW= 1
##$XDIM= 16384
##$YMAX_p= 518249480
##$YMIN_p= -455063
$$ End of Bruker specific parameters
$$ ---------------------------------
##NTUPLES= NMR SPECTRUM
##VAR_NAME=  FREQUENCY,     SPECTRUM/REAL,   SPECTRUM/IMAG
##SYMBOL=    X,             R,               I
##VAR_TYPE=  INDEPENDENT,   DEPENDENT,       DEPENDENT
##VAR_FORM=  AFFN,          ASDF,            ASDF
##VAR_DIM=   16384,         16384,           16384
##UNITS=     HZ,            ARBITRARY UNITS, ARBITRARY UNITS
##FACTOR=    0.220516191357247, 1,           1
##FIRST=     3148.99960011074, 0,            0
##LAST=      -463.717162895041, 0,           0
##MIN=       -463.717162895041, -455063,     0
##MAX=       3148.99960011074, 518249480,    0
$$ Real data points
##PAGE= N=1
##DATA TABLE= (X++(R..R)), XYDATA
$$ [...]
7693 620304 607722 579933 666117 639298 619875 602956 616933 593501 560375 509972 549378 620629
7681 620629 555347 564020 615706 650062 605614 570659 567207 647448 655031 684164 628656 594656
7669 594656 609750 584742 606992 603574 605369 669863 637337 609059 654488 725325 657825 656210
7657 656210 695830 564324 559475 664724 654155 631125 681717 718023 687945 627601 586778
7646 586778 685488 690304 609472 587107 636417 673101 671104 732125 697731 766018 803149 684532
7634 684532 595573 691351 703024 696200 673474 699951 744607 743568 719078 716727 750041 725232
7622 725232 764667 788400 773375 689123 688943 684335 723632 777847 718402 821449 831929 808909
7610 808909 774530 771968 754818 763809 729073 726980 713435 721904 722465 678024 767871 749933 716301
7597 716301 766539 778210 792811 698496 623502 651616 736481 685607 712635 673073 675767 679765
7585 679765 656413 638182 678039 741217 643474 669240 699111 712038 692218 747421 821889 838120
7573 838120 732904 668494 789850 745670 708984 674203 841919 840435 804811 814484 882091
7562 882091 841969 779676 961896 853861 825698 782680 873558 910989 957568 859564 854750
7551 854750 965467 975175 905777 920802 1024395 955271 956796 861969 1054718 1093878 982146
7540 982146 1018237 1145144 1205733 1032949 990077 982899 1094103 972011 1012839 1064530 1093158
7529 1093158 943566 974912 1035157 1071285 1086718 1043192 1061375 1017244 1070823 934727 994521
7518 994521 995823 1028022 935766 948253 1070166 1044172 987626 964044 1102097 934069 840219
7507 840219 918046 1091003 1007074 839338 935544 1002235 992672 867340 908663 929710 981120
7496 981120 896607 887964 958939 1018305 936866 901456 973196 1022624 1017132 856732 969682 979007
7484 979007 977584 915322 1068611 1119396 1024362 925050 1033790 1122968 971303 916957 1011638
7473 1011638 1211082 1060675 1027562 1138076 1254715 1163431 1059012 1155117 1227308 1239860
7463 1239860 1103783 1110875 1206002 1314266 1138608 1166408 1237915 1200475 1152574 1165329 1310168
7452 1310168 1315466 1219412 1191824 1448615 1392839 1238675 1201837 1400457 1343575 1202999 1263554
7441 1263554 1381410 1428549 1327130 1238664 1346000 1462693 1342765 1280027 1305368 1403572
7431 1403572 1452151 1337598 1342765 1404308 1396343 1285101 1279924 1337325 1357543 1313341 1420617
7420 1420617 1485562 1363271 1232824 1389464 1469299 1305752 1284140 1328817 1452518 1490024
7410 1490024 1386594 1343085 1513882 1506830 1386997 1368452 1450475 1534982 1440045 1294205 1413377
7399 1413377 1535603 1444475 1351037 1488868 1585858 1544624 1444881 1522529 1570835 1411143 1424921
7388 1424921 1620048 1667827 1508040 1478607 1629565 1672336 1550482 1432983 1572918 1762257
7378 1762257 1679052 1552986 1633763 1764175 1678119 1544013 1604064 1666713 1615442 1524078 1570454
7367 1570454 1744418 1725417 1664457 1589267 1675372 1604870 1534298 1545405 1703912 1677776 1571835
7356 1571835 1653527 1722576 1604322 1506513 1573087 1711777 1762689 1589816 1586868 1684331 1731350
7345 1731350 1607909 1530010 1654527 1757568 1624036 1565940 1603825 1812507 1769264 1686678
7335 1686678 1747688 1807718 1650722 1561579 1670685 1683563 1598926 1595017 1758013 1744506 1625873
7324 1625873 1556067 1667073 1720276 1592655 1619241 1747282 1806544 1712801 1688387 1772241 1805425
7313 1805425 1766831 1712301 1710069 1807760 1854533 1725233 1760453 1848024 1801862 1796186 1950169
7302 1950169 1878686 1786917 1793918 1875804 1899868 1801401 1661660 1859371 1926899 1812773 1792089
7291 1792089 1859630 1953691 1870430 1886468 1886885 1981565 1956518 1844621 1844310 1888103 1920843 1888480
7279 1888480 1861674 1942599 1971962 1892162 1871215 2008065 2003554 1897151 1917888 2107189 1971994
7268 1971994 1870901 1960867 2101078 1947560 1903890 1929259 2045152 2021303 1891602 1927151
7258 1927151 2045641 2092544 2024808 2063551 1975340 2039361 1973274 1924681 1963507 2042912 1965386
7247 1965386 1956158 2066851 2109220 2074564 2033601 2150474 2169915 2116443 2148507 2174962 2168510
7236 2168510 2085895 2084865 2150784 2298222 2170325 2153806 2261198 2271339 2162773 2150911 2103523
7225 2103523 2242178 2276380 2215362 2277318 2363836 2402032 2246814 2294154 2274961 2366579 2266537
7214 2266537 2193423 2263037 2384763 2386882 2317114 2479940 2374562 2346305 2385257 2431516 2366785
7203 2366785 2351509 2344212 2460425 2534293 2438333 2465688 2397962 2554291 2562288 2549717 2545443 2592051
7191 2592051 2606336 2544138 2536658 2555946 2464531 2391221 2455633 2573818 2556712 2510951 2470553
7180 2470553 2541436 2585733 2543345 2540655 2551541 2545846 2599238 2624569 2603736 2614352 2588060 2601761
7168 2601761 2525188 2609219 2577062 2637188 2656553 2744526 2666639 2632985 2627663 2708534 2661804 2670435
7156 2670435 2722912 2709126 2775177 2761772 2722744 2721165 2747584 2691658 2784451 2677683 2641087
7145 2641087 2643351 2679425 2693235 2734150 2720892 2767552 2759715 2728614 2781307 2774807 2707050 2759006
7133 2759006 2781689 2773585 2806022 2888450 2794766 2812295 2822422 2929397 2844021 2821606 2844043
7122 2844043 2907627 2902159 2809088 2859919 2813860 2903736 2958931 2938105 2896535 2987793 2970252 2924263
7110 2924263 2913590 2993440 3069667 3000692 2948011 2959905 3032875 3059522 3052466 3033227 2940547 2977689
7098 2977689 2905155 3021663 3015076 3039953 3026795 3118849 3142872 3175235 3143448 3079276 3179666
7087 3179666 3156593 3109167 3063532 3149066 3161267 3119297 3106450 3169931 3191001 3131484 3133019 3164720
7075 3164720 3294130 3316277 3269253 3326178 3301888 3286674 3264487 3303340 3223902 3234350 3220056
7064 3220056 3310894 3325309 3351644 3284458 3332569 3391116 3324105 3211775 3284732 3394809 3329518
7053 3329518 3299326 3289413 3424619 3379667 3293718 3236306 3294845 3333263 3286101 3221226 3304103
7042 3304103 3338557 3312172 3353799 3253052 3216827 3317307 3347232 3365194 3265258 3211419 3208537
7031 3208537 3288988 3184584 3192736 3184180 3294039 3298484 3182395 3147050 3298728 3406491 3220646
7020 3220646 3229823 3247223 3289907 3250086 3246385 3215316 3143254 3218348 3180821 3166652 3158166 3316981
7008 3316981 3346127 3292600 3293719 3243001 3356122 3409427 3335823 3230129 3329563 3344758 3454893
6997 3454893 3399202 3332482 3350237 3497712 3433442 3319702 3413652 3512841 3517980 3440980 3436191
6986 3436191 3438217 3489743 3520083 3438262 3459456 3424224 3491341 3534277 3469634 3493551 3626202
6975 3626202 3614318 3500637 3500531 3571520 3630727 3589131 3581762 3455598 3569561 3566675 3585358 3605090
6963 3605090 3501773 3533565 3661986 3569273 3478246 3513648 3557768 3562245 3601634 3589462 3589953 3648038
6951 3648038 3628886 3478502 3500529 3601763 3658243 3646719 3572307 3604152 3598668 3646216 3502790
6940 3502790 3527620 3553973 3571348 3586103 3653643 3595102 3632900 3722566 3729276 3626585 3583581
6929 3583581 3680652 3733245 3790096 3643383 3597212 3750782 3784401 3723995 3641097 3742786 3779526
6918 3779526 3757529 3693592 3684353 3759023 3773015 3729493 3715274 3753242 3823153 3968305 3882312
6907 3882312 3833268 3781523 3901118 3888049 3848845 3752942 3826667 3890543 3875097 3788706 3760588
6896 3760588 3938869 3968724 3924306 3842742 3856632 3956634 3987652 3908408 3871467 3998807 4009294
6885 4009294 4013634 3900814 3914383 3983839 4089475 4025850 3937201 3943358 3985760 4184507 4089210
6874 4089210 3972621 3994330 4195509 4275354 4154331 4021367 4172195 4208679 4231881 4128415
6864 4128415 4128138 4277372 4355547 4332775 4277884 4337139 4482205 4458896 4435678 4427382 4363089 4408298
6852 4408298 4537125 4502776 4487069 4507246 4720066 4781532 4659106 4579653 4736320 4981732
6842 4981732 4865848 4836685 4953351 5155404 5156749 5050769 5022087 5155611 5322319 5351873
6832 5351873 5278367 5385228 5529099 5625421 5591895 5613673 5683726 5896125 6018226 6006368 6084224
6821 6084224 6219669 6321734 6477350 6473217 6586990 6828769 7092966 7113700 7183855 7449822
6811 7449822 7811728 8186623 8359032 8609106 9043703 9647643 10162936 10544349 11052969 11801806
6801 11801806 12498592 13123634 13735160 14456555 15190575 15649926 15790469 15677011 15387809
6792 15387809 14964060 14324033 13539978 12769079 12089315 11443454 10973135 10366272 9870996
6783 9870996 9541598 9278004 8791454 8460888 8223881 8099227 7914001 7574554 7303233 7171714
6773 7171714 7105165 6846460 6594778 6383990 6394216 6377821 6158094 5879294 5828189 5797146
6763 5797146 5765568 5662527 5534962 5461072 5424933 5381622 5234472 5067938 5124608 5256172
6753 5256172 5207143 5013945 5072699 5061763 5115589 4973049 4816780 4709493 4742423 4728857 4608152
6742 4608152 4469133 4460996 4609541 4514424 4389584 4258243 4341625 4267671 4172340 3971737 4047923
6731 4047923 4038280 4048567 4011252 3917178 3962944 4043048 4108907 3876749 3786354 3816335 3952309
6720 3952309 3909838 3800958 3694691 3731854 3876834 3693913 3641576 3484105 3582298 3589920 3519845
6709 3519845 3473726 3555068 3654014 3571087 3474211 3398264 3498497 3473177 3534263 3464224 3414179
6698 3414179 3513362 3642359 3579817 3504179 3495601 3460437 3460121 3462114 3453719 3414528 3499438 3487728
6686 3487728 3407520 3305887 3332497 3455869 3408125 3330927 3308598 3383052 3402871 3325024 3225227
6675 3225227 3298123 3361286 3355200 3267918 3228208 3300023 3340198 3346709 3139949 3175334 3224231 3300760
6663 3300760 3204736 3198953 3271436 3282629 3227110 3174532 3206466 3173898 3280049 3228020 3115225
6652 3115225 3149565 3226600 3228854 3172738 3084730 3017221 3128843 3147048 3109158 2999722 2975346
6641 2975346 3117198 3146098 2992566 2927777 3071818 3102000 3050781 2822912 2892014 2898678 2972846
6630 2972846 2929958 2928871 2943111 2985843 2890568 2850282 2813490 2887703 2927006 2919856 2908908 2833638
6618 2833638 2914201 2897308 2854094 2802850 2763043 2850204 2919020 2867618 2743506 2793636 2876409
6607 2876409 2906115 2843805 2824181 2880001 2889264 2740221 2711683 2771620 2732666 2734102 2714277 2721488
6595 2721488 2704921 2771414 2723976 2718137 2677388 2818648 2767063 2740326 2755873 2762922 2690253 2737911
6583 2737911 2736283 2587697 2567820 2674065 2726886 2635570 2511922 2644811 2717355 2605005 2537255
6572 2537255 2552469 2603343 2711228 2642173 2507320 2514860 2625036 2556513 2498702 2555205 2583793
6561 2583793 2657607 2537800 2599217 2562449 2593153 2575473 2567243 2545325 2486934 2484415 2571728 2577834
6549 2577834 2512886 2486938 2519375 2506244 2508972 2497620 2499513 2500874 2443606 2457861 2513932 2508575
6537 2508575 2492307 2462779 2448480 2473717 2472682 2370095 2334745 2389676 2371150 2401688 2326996
6526 2326996 2356650 2275947 2190191 2216639 2292315 2287922 2268848 2205903 2326121 2341811 2284584
6515 2284584 2237192 2254217 2289343 2265315 2175290 2220690 2238899 2216899 2222343 2169894 2171621 2035398
6503 2035398 2074028 2098024 2156972 2123882 2125466 2149156 2145279 2209727 2080430 2089772 2164982 2165759
6491 2165759 2072662 2184503 2229953 2265662 2212789 2089872 2176086 2117867 2128064 2051813 2137995
6480 2137995 2072344 2169705 2151017 2146884 2138757 2130988 2063184 2026124 2148648 2099971 2185340 2109589
6468 2109589 2253328 2121544 2214684 2172435 2106396 2095762 2089834 2181343 2171498 2189991 2100954
6457 2100954 2192651 2158466 2113813 2071352 2162946 2151699 2063836 2131006 2080482 2099824 2033613
6446 2033613 2170668 2103771 2066831 2066343 2072495 2072849 2069819 2025098 1954377 2042543 1953488 1937315
6434 1937315 1833706 2048325 1997975 1994439 1929669 1951924 1948339 1899173 1984282 1927741 1896413
6423 1896413 1841231 1849529 1812502 1879364 1773012 1821900 1948404 1879672 1869410 1814011 1945947
6412 1945947 1842784 1899305 1761900 1804978 1873549 1848277 1767742 1799081 1871166 1808032 1852656
6401 1852656 1799424 1906103 1756980 1766319 1852739 1928128 1834349 1750724 1806319 1822173 1823902
6390 1823902 1777350 1895067 1836496 1888191 1831979 1927826 1927334 1865037 1880688 1853591 1981687
6379 1981687 1913714 1885675 1845249 2013760 1904944 1813196 1773084 1816313 1909848 1806889 1800174
6368 1800174 1855201 1975794 1769323 1763730 1713353 1765441 1788680 1751253 1741824 1757631 1861461
6357 1861461 1722771 1777981 1683397 1739984 1812425 1902959 1775781 1747045 1728765 1672769 1761952
6346 1761952 1778530 1795872 1709820 1794725 1746472 1704091 1617991 1717486 1810073 1705173 1704313 1682809
6334 1682809 1751011 1677030 1810387 1702280 1724013 1715236 1736166 1638888 1695884 1773966 1765982
6323 1765982 1837760 1710834 1801310 1774877 1782751 1755649 1813924 1798510 1741528 1795925 1813326
6312 1813326 1850535 1772674 1912310 1911075 1926450 1823680 1877591 1907544 1911907 1938888 1847674
6301 1847674 1982552 2007536 2009353 1906053 2010189 1972470 2027569 1977475 1997769 2087562 2127879
6290 2127879 2065573 2151949 2267502 2136890 2171163 2152924 2208252 2178340 2185253 2128285 2146649
6279 2146649 2113622 1954776 2012853 1965378 1963648 1775044 1825332 1808439 1926021 1890069 1807436
6268 1807436 1908066 1865457 1751018 1664718 1713844 1735772 1699177 1533374 1654494 1673089 1620512
6257 1620512 1545909 1609128 1646400 1611618 1586022 1580763 1579833 1521612 1554447 1558484 1546974 1552532
6245 1552532 1466950 1447573 1475999 1545087 1474144 1500894 1497476 1490976 1391460 1503858 1561966 1511009
6233 1511009 1388776 1391464 1577805 1525882 1424800 1317568 1489860 1445947 1379327 1380116 1445304
6222 1445304 1449130 1481782 1445669 1405059 1524966 1510210 1480229 1449927 1498827 1437968 1433649 1569388
6210 1569388 1571250 1499206 1444015 1589102 1545873 1389370 1426403 1572825 1484953 1418794 1410721
6199 1410721 1498463 1576932 1491329 1367933 1392023 1440456 1409054 1420887 1405935 1384620 1467463
6188 1467463 1405747 1434910 1429934 1397939 1433599 1542932 1491512 1473273 1477231 1429693 1440825 1443778
6176 1443778 1402456 1452609 1526826 1467793 1429980 1456279 1511566 1471860 1405223 1445082 1472925
6165 1472925 1472780 1386957 1408939 1464357 1478275 1512683 1486809 1413379 1417148 1495519 1494656 1516496
6153 1516496 1470990 1548247 1549418 1594341 1506801 1469282 1530116 1539525 1552434 1510957 1453997 1473367
6141 1473367 1535567 1494162 1517388 1525205 1457278 1452538 1474629 1578639 1503806 1506998 1536152 1589483
6129 1589483 1575509 1633995 1620098 1625408 1518235 1590972 1657203 1642635 1672764 1628860 1591463
6118 1591463 1599328 1636194 1702497 1688284 1691216 1708025 1650845 1558874 1631011 1608283 1670080 1750756
6106 1750756 1702106 1727435 1747089 1737115 1676359 1666790 1607034 1742688 1784650 1733121 1708471 1849467
6094 1849467 1827180 1834903 1892400 1858236 1934636 1912157 1900686 1849597 1949382 1994759 2065304 1993674
6082 1993674 1912302 2000563 2032326 2114563 2015138 2118245 2125392 2163624 2119965 2185689 2219640
6071 2219640 2296074 2312601 2325052 2391259 2464766 2489197 2411084 2538155 2495897 2593945 2599606
6060 2599606 2618679 2721769 2746692 2760127 2822613 2960075 2933096 2949150 2987020 3147457 3154752
6049 3154752 3216520 3302977 3387079 3398349 3397975 3488864 3585796 3691342 3675341 3812310 3896346
6038 3896346 4085487 4053899 4091167 4177157 4400403 4572470 4624735 4849657 4929297 5112329
6028 5112329 5318658 5521026 5639424 5826397 6074883 6428225 6690895 6779529 7111915 7531481
6018 7531481 7838400 8087539 8332241 8730084 9082311 9161599 9210515 9358205 9499836 9607361
6008 9607361 9642932 9754957 9920008 10201198 10311165 10463113 10823409 11150815 11500323 12022296
5998 12022296 12525685 12972520 13663953 14398286 15225551 16102775 16875943 17903310 18918117
5989 18918117 19687900 20314057 20922999 21350517 21414763 21235325 20794549 20402337 19940294 19504369
5979 19504369 19090564 18767245 18548279 18378247 18264984 18383335 18683018 18913858 19297802
5970 19297802 19796172 20493867 21159811 22051282 23108135 24236289 25353175 26530580 27750208
5961 27750208 28746578 29361617 29604660 29517446 28940875 28044331 26745423 25548487 24442161
5952 24442161 23292932 22110387 21124932 20319537 19748131 19178884 18718178 18492211 18265657
5943 18265657 18166905 18162611 18320579 18567041 18886299 19273450 19759174 20291269 20725982 21106769
5933 21106769 21393758 21502380 21212368 20804634 20109247 19249431 18086439 16977007 16035332
5924 16035332 14996005 14144867 13157527 12437821 11874227 11374319 10753544 10344318 10069514
5915 10069514 9857093 9559011 9180058 9072950 8967670 8844151 8699663 8701442 8635258 8589569
5905 8589569 8443452 8349496 8112639 7753854 7478878 7188167 6770909 6307011 5982296 5721284
5895 5721284 5543401 5191795 4862025 4710366 4536330 4325684 4051960 3954729 3865749 3766472
5885 3766472 3572342 3403393 3424591 3370535 3226838 3120285 3129675 2995379 2951915 2833253
5875 2833253 2806981 2727670 2757026 2769137 2688861 2588467 2433051 2510626 2560258 2518774 2335849
5864 2335849 2361447 2444955 2339166 2236837 2142212 2226888 2240919 2150358 2083624 2115487 2087926
5853 2087926 2068976 1997886 1963332 1981222 1998510 1906810 1789745 1852179 1819749 1884087 1845884
5842 1845884 1815910 1713763 1815162 1862048 1782808 1666341 1562007 1810940 1762008 1732883
5832 1732883 1597172 1615291 1685438 1721641 1633789 1558519 1676658 1606316 1431274 1388445 1512972
5821 1512972 1489202 1577820 1472833 1547811 1496127 1538136 1558360 1514580 1417788 1365335 1547046
5810 1547046 1456289 1431047 1305449 1421816 1479921 1468041 1392045 1353260 1457281 1482703 1525456
5799 1525456 1368623 1418684 1501794 1564050 1418383 1454306 1559968 1572744 1554904 1543460 1603390
5788 1603390 1543117 1615471 1639536 1634633 1577862 1662474 1692786 1740269 1660950 1717383 1798260 1711760
5776 1711760 1658986 1594026 1762103 1741529 1748268 1656179 1647845 1723209 1741642 1690639 1628825 1755107
5764 1755107 1784087 1832656 1743199 1801546 1840372 1856077 1845180 1781147 1681666 1654640 1889838
5753 1889838 1852294 1769880 1795189 1928426 1874211 1734251 1763472 1870562 1936945 1958470 1955838
5742 1955838 1859419 1963784 1939825 1942927 1912703 1930901 1952751 1977213 1950400 1880709 1994414
5731 1994414 1982576 2013122 2025041 2009424 1933063 2097191 2113029 2038467 2061964 2130872 2343980
5720 2343980 2278312 2227720 2302779 2483547 2477883 2444701 2447673 2516392 2535869 2576075 2635721 2654341
5708 2654341 2890448 2939843 2960802 2907436 2982422 2996469 3037148 3028373 2928857 2993356 3032536
5697 3032536 3063420 2940603 2894568 2897223 3108386 3093870 3005142 3031818 3164341 3154244 3048573
5686 3048573 3110962 3136046 3177353 3161575 3208688 3220138 3234777 3226044 3287111 3190203 3173976 3313221
5674 3313221 3417866 3475805 3387059 3444982 3548690 3648467 3618041 3596314 3564652 3713239 3816606
5663 3816606 3720185 3798768 3851504 3962410 3900211 3947921 3980753 3981713 4053341 4154913 4177979
5652 4177979 4131578 4287397 4410121 4457831 4302592 4534219 4682031 4726849 4617057 4654571
5642 4654571 4775050 4824705 4797474 4775602 4876486 4955091 5143566 5055369 5004273 5018734 5100663
5631 5100663 5046031 5021271 5140244 5228175 5326135 5376042 5509636 5522948 5572029 5755381 5937885
5620 5937885 5924711 5888960 6117662 6240337 6304527 6307151 6591128 6742590 6831180 6766374 6987177
5609 6987177 7138137 7256599 7228720 7269153 7456179 7518712 7511055 7442533 7567011 7639753 7642177
5598 7642177 7497214 7454078 7464182 7377163 7427632 7563533 7555411 7380648 7401369 7550513 7605014
5587 7605014 7531843 7552764 7702896 7865770 7894822 7992680 8184959 8294329 8383312 8453485 8639140
5576 8639140 8840558 9023568 9049145 9143687 9310357 9457965 9357422 9306956 9395743 9355760
5566 9355760 9219021 9149297 9099908 8973743 8822980 8764916 8698092 8550700 8316949 8354618
5556 8354618 8390226 8241881 8091333 8149285 8192698 8132327 7973000 7926566 7944105 7945522 7889367
5545 7889367 7886376 7908736 7905563 7914167 7892374 7950226 8024360 8030029 8039969 8172203 8179448 8141514
5533 8141514 8194743 8319376 8337301 8286528 8288683 8330672 8316117 8233143 8357836 8392228 8383167
5522 8383167 8347946 8395981 8547915 8599187 8617186 8704608 8849417 8894554 9068903 9082777 9106456
5511 9106456 9179104 9230903 9330541 9387298 9416800 9390756 9438458 9464653 9578868 9543441 9565694
5500 9565694 9640577 9779411 9709077 9673270 9930933 10034282 9999518 9969616 10150676 10261276
5490 10261276 10361462 10483045 10667402 10760234 10858977 10881896 10958333 11025266 10988993 11078068 11019668
5479 11019668 10954857 10867351 10860869 10717520 10634839 10580351 10460554 10360288 10296104 10225757 10079955
5468 10079955 10106034 9961101 10093360 10023324 10060843 9984015 9952630 9978137 10002843 10106526 10037763
5457 10037763 10127033 10144215 10190544 10159407 10238681 10376218 10503073 10504049 10557500 10579546 10719548
5446 10719548 10893065 10877238 10994524 11178609 11406159 11526943 11658200 11934661 12149737 12362009
5436 12362009 12610085 12932907 13215472 13519965 13851998 14340942 14501917 14702283 15019084
5427 15019084 15199226 15358847 15556445 15921779 16215147 16529738 16658055 16892976 17080814
5418 17080814 17283746 17357970 17528347 17671584 17775198 17892323 17957871 18090054 18326946 18598565
5408 18598565 18741654 18963608 19297702 19778322 20185813 20628351 21192697 21825230 22636849
5399 22636849 23322652 23949644 24309844 24736068 25151474 25681043 26218417 26853622 27598229
5390 27598229 28272965 29023081 29742734 30610725 31326645 32092367 32599468 33061258 33556284
5381 33556284 34026028 34407956 34625885 34869647 35202309 35627956 35936148 36284067 36786090
5372 36786090 37444232 38094843 38776165 39572395 40496905 41479358 42332718 43106300 43766806
5363 43766806 44683456 45719167 47030135 48453640 50152143 52116849 54459522 57133611
5355 57133611 60043905 63320392 66985548 71340240 75929478 80978996 86480990 92510320
5347 92510320 98682055 104927485 111236466 117384332 123306746 128572605 133086868 136301425
5339 136301425 138026212 137845934 135439270 131286299 125888772 119463846 112330882 105044124
5331 105044124 97709865 90469150 83430475 76757895 70529283 64984213 59934167 55467242
5323 55467242 51522653 47918636 44884565 42218531 39906772 37658320 35738300 33944249
5315 33944249 32517800 31205637 29936448 28872662 28017774 27167166 26255382 25549413 24877519
5306 24877519 24365894 23737080 23087786 22649877 22179590 21649565 21103263 20723579 20281568
5297 20281568 19914875 19539993 19170951 18730934 18317688 17949067 17603632 17193178 16723297
5288 16723297 16368936 15907604 15586934 15121150 14658322 14257668 13949288 13581302 13204584
5279 13204584 12897374 12560988 12299868 11891627 11571517 11344799 11098701 10887262 10625646
5270 10625646 10381358 10083357 9897028 9592336 9406641 9194751 9087834 8852914 8730837
5261 8730837 8514595 8353978 8368740 8237031 8035121 7906231 7963333 7893027 7844645 7716006
5251 7716006 7715453 7747910 7685750 7565998 7540415 7556378 7563988 7481455 7366700 7319962 7249790 7094736
5239 7094736 7064031 6916799 6701522 6590646 6657537 6554970 6273467 6140108 6069844 6107089
5229 6107089 5953421 5756927 5754329 5760083 5718162 5573498 5549240 5495137 5393038 5364988 5328426
5218 5328426 5340019 5241955 5208669 5248730 5228380 5212916 5159717 5124349 5198591 5166170 5137274
5207 5137274 5046636 5141252 5090011 5022674 5023519 5164373 5199486 5080481 5042327 5165893 5289157
5196 5289157 5149818 5222781 5340541 5335246 5210731 5183224 5297108 5333789 5245584 5167823 5282617
5185 5282617 5235506 5178510 5127943 5178266 5245008 5229607 5192826 5185947 5260758 5243804 5312816 5328762
5173 5328762 5437094 5362146 5403135 5485847 5699992 5645303 5575116 5679861 5799475 5790460 5787334
5162 5787334 6000124 6074217 6057294 6036731 6160706 6191826 6310286 6238016 6361426 6508895
5152 6508895 6447718 6590207 6697321 6894149 6923165 7081977 7218478 7504280 7656789 7755968
5142 7755968 8023495 8304336 8642767 8772186 8922656 8927914 8898953 8615273 8656571 8796726
5132 8796726 8897738 8802195 8945778 9218234 9308314 9447599 9518318 9900395 10068913 10192004
5122 10192004 10335342 10661953 10886707 11042951 11307978 11599791 12000157 12264165 12566745
5113 12566745 12902238 13365733 13670025 14098547 14586092 15142086 15697412 16204876 16976316
5104 16976316 17704472 18428276 19318613 20546041 21689699 22899187 24177776 25747958 27536200
5095 27536200 29320672 31064457 32898364 34830016 36286461 37446843 38246449 38710762
5087 38710762 38895739 38732459 38415985 38246139 38072610 37682601 37283929 36913689 36638834
5078 36638834 36243822 36011109 35953981 36133515 36540229 37105036 38116901 39329293 40841718
5069 40841718 42587950 44745143 47127297 49777774 52452373 55404973 58166751 60454016
5061 60454016 62269220 63532034 64305299 64610617 64764957 64729014 64740510 64260689 63185714
5052 63185714 61552902 59459517 56836417 53889538 50857322 48077036 45586486 43367491
5044 43367491 41550687 40117769 39105718 38330503 37858182 37723634 37795618 38187540 38616102
5035 38616102 39208714 39779560 40368880 40779949 41216961 41510638 41670231 41668247 41561795 41267198
5025 41267198 40565173 39435724 37836180 35988304 33715116 31306222 28992107 26917899
5017 26917899 24861815 22977501 21333002 20045741 18789670 17582353 16638599 15777131
5009 15777131 14951432 14233250 13607348 12994199 12442645 12008054 11554602 11194961 10839821
5000 10839821 10528696 10139986 9852135 9537063 9333455 8963222 8824679 8691831 8501669
4991 8501669 8222145 8106260 8020897 7894191 7727030 7575799 7459612 7248379 7175263 7094491
4981 7094491 7099278 6982476 6920226 6802798 6732571 6684226 6629033 6556977 6521197 6479175 6441146
4970 6441146 6419685 6485924 6442901 6306722 6209784 6325115 6354844 6344960 6254863 6387344 6437106
4959 6437106 6425923 6379847 6570638 6547793 6539959 6626198 6712748 6798454 6815422 6896498 6918405
4948 6918405 7030287 7052519 7122000 7120897 7319768 7426200 7470394 7621649 7771835 7887818
4938 7887818 7902546 8015324 8254116 8369962 8389945 8518706 8804987 9005462 9112844 9207190
4928 9207190 9465963 9647309 9898603 10048811 10328214 10600618 10825671 10983754 11277934 11544333
4918 11544333 11812230 12126909 12440868 12857085 13184711 13498202 13858712 14419757 14726115
4909 14726115 15159316 15748177 16379098 16884007 17422744 18203674 18981641 19840935 20623829
4900 20623829 21725433 22928730 24151184 25590915 27089002 28837925 30688201 32717997
4892 32717997 34807024 37192537 39568323 41870695 43773899 45497529 46754234 47381051
4884 47381051 47475881 47360818 46949261 46237520 45666075 44979763 44433309 43751898 43175542 42709445
4874 42709445 42400007 42090037 41974069 42251039 42732657 43420497 44348434 45743518 47443096
4865 47443096 49416903 51431073 53636671 56025100 58324517 60249111 61773746 62949953
4857 62949953 63551389 63677282 63298903 62912651 62149542 61246538 60024135 58733578 56995184
4848 56995184 54785194 52436923 49966972 47377245 44714524 42437679 40391895 38655008
4840 38655008 37080578 35920693 35035469 34369596 33933915 33665441 33571959 33633058 33864757
4831 33864757 34036897 34275669 34572933 34832543 35027013 35212084 35335044 35218668 34807719
4822 34807719 33977900 33026734 31388679 29595963 27657461 25786721 23841854 22165880
4814 22165880 20655771 19360427 18173239 16910531 16081554 15323538 14534041 13770258 13281066
4805 13281066 12712208 12254426 11715411 11231829 10863354 10593530 10247160 9908908 9710912
4796 9710912 9392132 9131667 8861586 8770873 8682032 8359404 8250432 8123748 8026971 7770572
4786 7770572 7645967 7553506 7590172 7374387 7290106 7323898 7196451 7060103 7023067 7021348 6875136
4775 6875136 6809302 6692855 6759024 6706439 6660542 6625546 6713435 6666205 6565456 6529094 6540318
4764 6540318 6614295 6524487 6394732 6463888 6651848 6554454 6460870 6603655 6643104 6617936 6550785
4753 6550785 6710756 6710197 6709153 6644925 6803625 6820658 6767827 6776133 6875736 6942935 6908266 7051882
4741 7051882 7085924 7205398 7268395 7305266 7356915 7529145 7475125 7417433 7378794 7418222 7445333
4730 7445333 7301650 7359037 7467592 7508983 7416069 7506212 7758280 7741782 7749765 7800375 7899707
4719 7899707 7904603 7920146 8006901 8108986 8095763 8195001 8336365 8369698 8342907 8291827 8324879
4708 8324879 8479379 8598365 8526360 8622596 8793212 8902454 8890986 8928689 9103528 9225917
4698 9225917 9235886 9233364 9475420 9575293 9648490 9755120 9973719 10098815 10169063 10365234 10615926
4687 10615926 10811129 10804434 10997468 11121747 11282578 11237067 11318816 11526726 11732085 11914315
4677 11914315 12022744 12205194 12459998 12677050 12805849 13105318 13396902 13669265 13799825
4668 13799825 14094796 14481081 14708684 14883489 15170665 15396600 15401797 15443819 15558778 15700104
4658 15700104 15743099 15800331 15957491 16109788 16160319 16245325 16547241 16677838 16803166 16896794
4648 16896794 17134139 17362051 17675289 17762356 17949635 18267793 18645214 18905761 19169615 19553614
4638 19553614 19929416 20276865 20530072 21011237 21408674 21712953 22122418 22721976 23026572
4629 23026572 23368503 23863849 24341909 24737101 25069833 25494900 25979045 26443849 26895240
4620 26895240 27319380 27830336 28381317 28917806 29381786 29988053 30603837 31333632 31897435
4611 31897435 32703689 33584007 34603846 35436449 36521536 37727287 39021612 40309229 41788634
4602 41788634 43550580 45142351 46893540 48632341 50483275 52154660 53794466 55304616
4594 55304616 56738222 57831790 58769493 59588122 60302907 60904074 61363756 61744647 62100831
4585 62100831 62765116 63331565 64029457 65065988 66311031 67554239 68952080 70694719 72707651
4576 72707651 74866544 76982266 79380688 81863227 84399604 86878147 89436760 91776642
4568 91776642 94050049 95963257 97261390 97783813 97352978 95914978 93388719 90321762
4560 90321762 86922555 83734400 80874334 78567306 76669306 75224998 74246074 73733835
4552 73733835 73547351 73587551 74035085 74796693 75832148 76871333 77999813 78977352 79701183
4543 79701183 79955601 79609952 78710887 77202395 75194828 72732101 69986898 66929213 63874459
4534 63874459 60898882 58094976 55465514 53023323 50851927 48882011 47106399 45502573
4526 45502573 44176199 42846182 41843139 40848777 39933034 39072993 38521999 37909776 37341221
4517 37341221 36881513 36531008 36228787 35874255 35650917 35572411 35534937 35435898 35473573 35498560
4507 35498560 35527514 35700344 35865789 36070291 36281727 36572655 36846299 37352020 37800945 38229798
4497 38229798 38807304 39494963 40232803 40928962 41767203 42686615 43869074 44794763 45960266
4488 45960266 47338061 48761796 50126181 51768043 53484332 55395088 57161097 59064059
4480 59064059 61122114 63112017 65050330 66954002 68747934 70413521 71871710 73041737
4472 73041737 74061546 74905224 75374402 75708676 75890959 75943466 75877174 75649912 75529053 75616677
4462 75616677 75858147 76038918 76464052 77091694 77992256 78816695 79921327 81138808 82330536
4453 82330536 83565384 84729902 85676645 86473690 86971767 87246655 87096982 86552016 85802466
4444 85802466 84749422 83441722 81941505 80318553 78498151 76743158 75073717 73286529
4436 73286529 71578744 70000332 68515397 67189219 65880264 64911355 64030595 63222022 62479381
4427 62479381 61921766 61560253 61260395 60806371 60474994 60337843 60186557 59947080 59695172
4418 59695172 59293830 58709152 58209668 57739966 57238691 56977135 56653556 56361609 56311596 56290071
4408 56290071 56265476 56458150 56870188 57311244 57836084 58572853 59603216 60755500 61965296
4399 61965296 63261960 64938699 66557258 68233356 69905918 71625273 73164599 74552065
4391 74552065 75554324 76411027 77276463 78080765 79120545 80423592 82066808 83972396 86254716
4382 86254716 89065310 92481672 96459296 101110575 106603774 112824985 119777929 127433481
4374 127433481 136268049 146230048 157351010 169883385 184495558 201297007 220345168
4367 220345168 241246563 262927454 283098086 298000304 303282673 295923343 277672948
4360 277672948 253326175 227713635 203514132 182203908 163715459 147910618 134493617
4353 134493617 123156460 113527272 105236754 97852677 91399335 85851120 80807007 76310247
4345 76310247 72394957 68772707 65270909 62151736 59409503 56987848 54826510 52748483
4337 52748483 51059088 49422795 47851863 46375819 45174944 43923860 42855929 41762634
4329 41762634 40617511 39770193 38876095 37925308 37103533 36274321 35432317 34656362 33765532
4320 33765532 33020911 32334848 31566200 30824735 30375569 29864291 29289250 28805173 28602009
4311 28602009 28274340 27872787 27449974 27259668 27060608 26743126 26460533 26322740 26131883
4302 26131883 25795169 25396806 25062985 24852207 24496589 24013727 23589718 23381766 23104644
4293 23104644 22715644 22461783 22171936 21955339 21666010 21283542 21041397 20716956 20419698
4284 20419698 20071526 19793665 19382826 19113684 18842448 18658553 18490935 18373059 18180924
4275 18180924 18004276 17948182 17791277 17674688 17648083 17697245 17680147 17661414 17710964 17943522
4265 17943522 18038244 18098737 18158446 18297735 18484338 18464969 18474043 18507053 18498286 18418909 18339749
4254 18339749 18297785 18152150 17964656 17758820 17671681 17593842 17379742 17040009 17010340 16794112
4244 16794112 16714023 16510019 16381660 16334396 16194475 15978514 15834317 15768149 15543812 15396857
4234 15396857 15291759 15174279 15035664 14939073 14772859 14706576 14657929 14579023 14427787 14409305
4224 14409305 14319430 14345587 14258217 14085542 14013164 13905156 13734391 13662737 13471083 13310596
4214 13310596 13196690 13059337 12874191 12737075 12615855 12605049 12593608 12520676 12390283 12406708
4204 12406708 12390720 12379325 12350536 12349063 12347679 12250848 12183909 12094503 11924452 11763648 11690217
4193 11690217 11503424 11377950 11315977 11216056 11049222 10888590 10734331 10622604 10533112 10448349
4183 10448349 10265557 10171776 10090093 10070362 9964189 9870387 9843339 9955630 9927792 9866651 9945651
4172 9945651 9962497 9914359 10024855 10182899 10173471 10162554 10241128 10299448 10330098 10306696 10310030
4161 10310030 10430548 10388607 10206627 10168969 10167532 10102238 9980050 9842293 9712551 9684339
4151 9684339 9588963 9548182 9616085 9665400 9618400 9589722 9741635 9881477 9869178 9861893 10039413
4140 10039413 9997857 9949864 9915912 10032460 10137997 10096600 10063589 10190661 10359306 10313590
4130 10313590 10292185 10468264 10664870 10770359 10876818 11079380 11375788 11641344 11898964 12401481
4120 12401481 12802130 13089129 13308828 13297679 13107767 12864388 12538631 12283019 12162600 11919799
4110 11919799 11801042 11722732 11697448 11546455 11571836 11503988 11432068 11422241 11436953 11517012 11619343
4099 11619343 11726359 11730741 11799592 11856950 11965577 11925352 11974072 11990536 12128312 12257053 12233989
4088 12233989 12389661 12544417 12682664 12710519 12842487 12874133 12816402 12820251 12822051 12840733 12781652
4077 12781652 12819463 12752504 12809073 12801515 12954817 12956975 13029493 13046217 13075606 13139384 13257910
4066 13257910 13294823 13414023 13647521 13713693 13864156 13942386 14073951 14070412 14140798 14226879 14410525
4055 14410525 14385325 14437791 14737908 14873926 15016331 15164118 15412597 15731714 16096053 16444297
4045 16444297 16825133 17360673 17751711 18250551 18745159 19400855 19990961 20638022 21293691
4036 21293691 22211924 22967684 23812621 24691148 25547900 26495826 27319763 28221539 28970863
4027 28970863 29807041 30601024 31594168 32505552 33583379 34638877 35785587 37117061 38358513
4018 38358513 39578644 40665670 41771163 42489234 43246710 43900677 44453876 45087583 45746795
4009 45746795 46563546 47505011 48720180 49790994 51247911 52514125 53782035 54936924
4001 54936924 56033520 56856710 57510936 58029225 58236998 58300735 57769714 56866262 55422011
3992 55422011 53844187 51977827 50176199 48441189 46736497 44922311 43112304 41367446
3984 41367446 39572932 37837793 36092027 34553955 33165074 31905590 30718665 29736025
3976 29736025 28753028 27748675 26909641 25904295 25074780 24137009 23267213 22260631 21405107
3967 21405107 20432316 19639381 18856312 18024321 17282737 16566491 16043149 15393221 14936966
3958 14936966 14302930 13835116 13256178 12882645 12416230 11954717 11480790 11100681 10822906
3949 10822906 10398144 10202528 9895841 9653877 9323516 9099308 8851449 8619077 8408026
3940 8408026 8164033 8072214 7811248 7737098 7525962 7426745 7248987 7219652 7040485 6997385
3930 6997385 6870581 6574220 6510579 6346701 6161478 5945708 5824785 5639883 5614605 5479439
3920 5479439 5355049 5212332 5082005 5012951 4930534 4781141 4660897 4639955 4479959 4423555
3910 4423555 4352797 4320535 4246258 4116577 4096048 4118190 4127283 4039417 3954805 3912582 4030800
3899 4030800 3985543 3963928 3921479 3981876 3904144 3817391 3836126 3680242 3620137 3513759 3436524
3888 3436524 3309504 3191683 3119792 3125319 3131487 2928877 2897028 2892885 2878554 2756425 2609760
3877 2609760 2606311 2728301 2679820 2486447 2545191 2531957 2499127 2336263 2396723 2443373 2457258
3866 2457258 2355607 2375629 2317559 2303908 2342114 2325990 2373215 2262017 2191853 2158709 2258649
3855 2258649 2156942 2148302 2195254 2202450 2222914 2059762 2042250 2111398 2121561 1991265 2048043
3844 2048043 2043139 2029055 1984706 1877939 1950916 1913169 1930525 1874076 1857130 1840959 1860132
3833 1860132 1752304 1765391 1704459 1752930 1720003 1712888 1625475 1480399 1522653 1649821 1709745
3822 1709745 1541931 1501895 1634101 1731715 1539152 1507775 1633460 1715671 1663626 1456224
3812 1456224 1538889 1676260 1600553 1446340 1454939 1438172 1467746 1434846 1362126 1440208 1409805
3801 1409805 1382516 1369445 1482814 1366938 1447434 1474783 1466705 1349754 1281451 1400251 1399388
3790 1399388 1368887 1214651 1284059 1373191 1390078 1305994 1266940 1288948 1352576 1262858 1190335
3779 1190335 1270119 1270732 1335307 1295063 1276004 1268804 1284425 1308922 1368886 1357107 1321335 1384912
3767 1384912 1341172 1336588 1214737 1327486 1315165 1302759 1216026 1237287 1317082 1366723 1272937
3756 1272937 1196138 1265314 1344146 1347843 1234912 1251332 1320945 1360398 1283965 1326258 1362919
3745 1362919 1319069 1350991 1364746 1302795 1311417 1353729 1335323 1304325 1314204 1352242 1363784 1280786
3733 1280786 1277646 1194814 1254300 1261147 1276240 1197397 1221962 1329963 1280181 1247358 1185975 1144915
3721 1144915 1258250 1313480 1209204 1144623 1249828 1222829 1229203 1202797 1213893 1244857 1351656
3710 1351656 1222019 1188096 1239415 1324788 1352878 1210963 1209609 1302696 1335754 1263688 1283010
3699 1283010 1324281 1390576 1342235 1309535 1288235 1369479 1433721 1414615 1405103 1350984 1454718
3688 1454718 1496883 1468975 1400651 1342874 1424159 1406252 1349415 1323296 1452966 1431928 1393824
3677 1393824 1291678 1281983 1407542 1423306 1331439 1287758 1318598 1303209 1395701 1273025 1197824
3666 1197824 1257097 1358578 1329020 1240517 1202254 1242075 1311961 1302431 1393300 1404186 1445889
3655 1445889 1346807 1320017 1314522 1312735 1417132 1423790 1402987 1322764 1346243 1428925 1393183 1305053
3643 1305053 1284457 1393289 1404273 1405515 1319549 1383110 1379351 1423565 1385109 1323849 1366006 1533886
3631 1533886 1445212 1337628 1428001 1448307 1537997 1451638 1397314 1379612 1481147 1440000 1443137
3620 1443137 1538651 1497304 1543200 1500716 1544053 1471481 1555987 1580669 1646458 1507135 1481948
3609 1481948 1581448 1664947 1736621 1558857 1664811 1714150 1755702 1592806 1642826 1706316 1810706
3598 1810706 1778130 1632470 1809146 1963504 1909314 1786127 1856273 1871167 1905536 1920269 1994268
3587 1994268 2002105 1973616 2021088 2049418 2062552 1947073 2056724 2149433 2267347 2187332 2237768
3576 2237768 2334143 2433494 2343706 2226369 2289286 2361236 2448911 2338952 2551247 2610914 2591189
3565 2591189 2483113 2486716 2603198 2666753 2632468 2602422 2770359 2677803 2726295 2741880 2729447
3554 2729447 2637496 2700178 2751118 2743697 2753579 2700936 2800717 2837579 2822527 2693230 2755353 2849458
3542 2849458 2842627 2802728 2708145 2857205 2933447 2937159 2846125 2946586 2937755 2978202 3013779 3094085
3530 3094085 3084772 2976177 3040512 3110529 3113207 3156719 3293229 3212127 3250453 3187142 3304200
3519 3304200 3464749 3447914 3401020 3367712 3523258 3596143 3689072 3667087 3736781 3920795 3923463
3508 3923463 3949172 3919024 4045255 3994505 3995581 4016876 4137354 4135270 4157510 4205903 4273804
3497 4273804 4196061 4267191 4329716 4259044 4382855 4314394 4439284 4399744 4286764 4252829 4342103
3486 4342103 4374717 4325134 4345961 4328804 4433291 4410591 4460433 4364789 4445946 4492953 4534876
3475 4534876 4499130 4499068 4610003 4588578 4617120 4591971 4692556 4733147 4899292 4873384 4893980
3464 4893980 4897976 4955320 4949200 5013510 5170854 5185324 5250567 5379849 5471524 5413503 5607115
3453 5607115 5685278 5697918 5788707 5912868 6008842 6104618 6166989 6237045 6472610 6500222 6632344
3442 6632344 6685157 6813924 6892504 7021382 7146843 7263790 7395580 7413594 7489160 7564312
3432 7564312 7674251 7748595 7927374 7987794 8082776 8192842 8352203 8496475 8551951 8698174
3422 8698174 8667426 8756642 8878636 8989934 9018415 9162438 9379476 9453694 9601734 9652112
3412 9652112 9891841 9972237 10019565 10114107 10328302 10424455 10557831 10801456 10875023 10985111
3402 10985111 11176683 11370206 11489637 11688347 11835729 12093593 12302758 12461214 12731994
3393 12731994 12901880 13134767 13412639 13671218 13890865 14287631 14588117 14781341 15079119
3384 15079119 15443818 15857375 16213127 16560192 16855427 17087580 17339978 17689508 17990387
3375 17990387 18336924 18588885 18828479 19113431 19421273 19567767 19803903 20098387 20183090 20274551
3365 20274551 20353081 20481769 20617830 20685261 20629061 20704420 20818028 20756920 20681442 20647463 20689980
3354 20689980 20664165 20600330 20535995 20604014 20578570 20548216 20551085 20518966 20494688 20441163 20572125
3343 20572125 20596421 20705881 20804519 20940224 21123500 21214900 21406844 21612797 21892194 22168852
3333 22168852 22399465 22771304 23263536 23528514 23884988 24290480 24806595 25315603 25737833
3324 25737833 26273598 26900962 27535514 28001954 28643274 29271580 29958961 30669840 31414246
3315 31414246 32200317 32951509 33769122 34634468 35582510 36531397 37490740 38460926 39634888
3306 39634888 40806306 42023924 43276968 44775437 46381929 48056441 49784635 51760339
3298 51760339 53942047 56227821 58592097 61326058 64416891 67569009 71111863 74886867
3290 74886867 78957276 83189138 87519843 91915350 96340547 100562266 104566246 108105664
3282 108105664 111126434 113566166 115403359 116753292 117692169 118348490 118847465 119326116 119913040
3273 119913040 120504434 121173521 121768381 122303085 122499064 122200045 121401203 120231986 118598300
3264 118598300 116395282 113961871 111410603 108805774 106266100 103972396 101943450 100231394
3256 100231394 98836110 97812107 97214952 96836376 96753217 96948343 97406207 98080092 98852248
3247 98852248 99779665 100976866 102286629 103611492 105171927 107000515 109054239 111218333
3239 111218333 113639420 116482813 119632852 122993854 126801136 131097941 135798023 140879116
3231 140879116 146367404 152423858 158834249 165493391 172385695 179393213 186222690 192601815
3223 192601815 198414763 203367374 207374332 210263714 212190432 213235712 213576560 213276144
3215 213276144 212531440 211558526 210460647 209162285 207453354 205526908 203173917 200125255
3207 200125255 196143024 191445553 186036965 179741939 172748772 165371602 157813266 149903824
3199 149903824 142022010 134449401 127425479 120745293 114557811 108921005 103791091 98822355
3191 98822355 94161725 90130917 86555491 83421295 80682932 78257464 76123204 74548742
3183 74548742 73023735 71566105 70428678 69404460 68425238 67547715 66835835 66175199 65524949
3174 65524949 64671010 64066735 63445295 62806526 62142768 61691962 61250321 60788531 60587538
3165 60587538 60563006 60599794 60703882 60984321 60735903 60047289 59349301 58831956 58345315 58136882
3155 58136882 58137187 58225428 58343204 58579348 58990484 59378373 59770147 60235748 60772102 61194883
3145 61194883 61529608 61879286 62024873 62181462 62139633 62072427 61935689 61726229 61565585 61363706
3135 61363706 61203638 61242220 61517599 61925067 62495715 63319219 64066543 64625723 65180606 66018211
3125 66018211 66980855 68007057 69068457 70179369 71306462 72437244 73445510 74244944
3117 74244944 75015640 75781624 76510969 77146196 78107644 79303638 80688598 82145466 83934110
3108 83934110 86273373 88751647 91480899 94821651 98566453 102621632 107202548 112445841
3100 112445841 118152520 124385298 131081561 138140764 145525731 153183133 160570032 167861220
3092 167861220 174787643 181313788 187147742 192244542 196619094 200209835 202943200 204686881
3084 204686881 205936611 206428027 206171668 205341491 204260778 202621145 200481177 197930798
3076 197930798 195113504 191915027 188261888 184341453 180141226 175726523 171058356 166209081
3068 166209081 161306692 156336414 151383503 146365341 141457430 136464919 131628333 126688114
3060 126688114 121704560 116865027 112065747 107404156 103195927 99406591 95946814 92809426
3052 92809426 90111928 87986133 86183045 84749579 83813396 83509342 83395370 83487762 83922277
3043 83922277 84665514 85439957 86288893 87021084 87714297 88137655 88174756 87904304 87169406 86107536
3033 86107536 84753934 82973811 81011139 78992617 76692259 74301221 72008076 69769647
3025 69769647 67455802 65204807 63032184 60885994 58696129 56460159 54417809 52347055
3017 52347055 50251737 48346847 46521166 44818031 43195409 41704043 40340483 38990508
3009 38990508 37782161 36642685 35508580 34548261 33704839 32836142 31955082 31282349 30583423
3000 30583423 29990912 29483516 29024966 28582736 28156827 27843238 27692575 27509511 27203360
2991 27203360 27186184 27212666 27169473 27314483 27496909 27698134 27935034 28068350 28294923 28568166
2981 28568166 28616644 28734284 28801737 28623411 28365757 28052672 27595950 27010149 26354898 25716027
2971 25716027 25157031 24416807 23821467 23166637 22540644 21949489 21575329 21102935 20618058
2962 20618058 20277729 20024221 19753907 19538069 19298506 19199299 18977314 18784672 18720892 18583711
2952 18583711 18505054 18442339 18406291 18427515 18425532 18392309 18296399 18363359 18406483 18461884 18534237
2941 18534237 18619291 18805521 18852611 18958668 19173328 19461393 19618596 19854552 20042669 20330602
2931 20330602 20552619 20897841 21158555 21395319 21628814 21902154 22138370 22436854 22730967
2922 22730967 22977640 23293099 23623348 23812089 24100037 24396388 24731536 25112949 25489797
2913 25489797 25762046 26181554 26610018 26929691 27360041 27798167 28192538 28644061 29106810
2904 29106810 29636314 30365503 30941557 31517831 32107666 32810462 33545017 34361526 35083655
2895 35083655 35839732 36647278 37605415 38482122 39358804 40381920 41455696 42616349 43857969
2886 43857969 45168879 46569766 47969959 49445700 50882906 52351997 54062626 55842944
2878 55842944 57622035 59473397 61549746 63691749 65955352 68071408 70376104 72743942
2870 72743942 75210900 77715700 80330558 83149606 86167823 89435265 92959236 96792635
2862 96792635 100983781 105519399 110462126 115732390 121638595 128288569 135711907 144065296
2854 144065296 153670256 164394634 176585046 190332608 205678542 222864690 242177935
2847 242177935 264237614 288901690 316777478 348199410 383002862 420052786 457197279
2840 457197279 489861146 512238544 518249480 504404142 472991413 431309304 387240850
2833 387240850 345748558 309249404 278151589 252292573 230804650 212632825 197149809
2826 197149809 183686496 171789918 161052623 151411158 142370252 134014813 126034903 118469698
2818 118469698 111168751 104354031 98050088 92362858 87392341 82817866 78669186 74702380
2810 74702380 71102783 67743994 64718543 61841187 59209302 56831315 54793923 52734566
2802 52734566 50798129 49239891 47693096 46369278 44994891 43763748 42583185 41498821
2794 41498821 40343428 39221908 38336898 37423101 36679554 35823982 34971952 34092572 33300976
2785 33300976 32347052 31392100 30342191 29366106 28477958 27471838 26660356 25822898 25106483
2776 25106483 24324743 23669575 22870643 22122647 21492729 20860893 20289801 19651184 19051798
2767 19051798 18569213 18042919 17377191 16941236 16510739 16112358 15679052 15224142 14879820
2758 14879820 14612810 14311808 13952477 13796616 13509843 13336077 13175934 13061984 12853748
2749 12853748 12674025 12532845 12274838 11998262 11549210 11401627 11153745 10882968 10452752
2740 10452752 10151424 9907641 9643013 9447629 9182073 8933772 8670042 8568692 8229122
2731 8229122 8012940 7831466 7656909 7485973 7230902 7035465 6892153 6856446 6637762 6523158
2721 6523158 6283779 6197451 6034659 5974970 5735186 5615796 5630839 5463928 5252761 5121543
2711 5121543 5169926 5086590 4984777 4847625 4865671 4836318 4833479 4751988 4656381 4700565 4718572
2700 4718572 4749028 4638609 4644496 4575786 4538851 4480587 4411685 4402849 4191137 4188996 4052259
2689 4052259 3871436 3722213 3761172 3583477 3536525 3360455 3307933 3167486 3084133 2921959
2679 2921959 2882247 2859002 2757351 2777309 2621256 2599156 2540363 2598761 2421263 2235988 2134132
2668 2134132 2224897 2259045 2155900 2152036 2156994 2220611 2208619 2113092 2084832 2252690 2212050
2657 2212050 2113173 2094603 1986105 2122811 2007858 1907129 1919764 1986898 1902664 1991418 1925986
2646 1925986 1806572 1807680 1786149 1793237 1775959 1671806 1635124 1686938 1640997 1595864 1526938
2635 1526938 1643368 1607544 1526044 1405692 1390545 1436170 1355964 1305448 1157245 1269536 1228655
2624 1228655 1149710 1125619 1212900 1195660 1088778 1189760 1082283 1137813 1169927 1316697 1293837
2613 1293837 1186655 1198668 1322145 1260697 1111019 1153774 1167764 1233204 1129515 1111093 1126355
2602 1126355 1231335 1197214 1231340 1237353 1227314 1291211 1243752 1281368 1278745 1388385 1366730
2591 1366730 1413332 1399188 1391707 1355742 1343404 1406663 1262265 1231213 1255398 1337273 1237188
2580 1237188 1195748 1207383 1318930 1332618 1361635 1375456 1390343 1395016 1359399 1395807 1366070
2569 1366070 1448745 1450785 1547545 1617265 1677113 1817012 2011019 2159395 2188590 2284293 2538501
2558 2538501 2717383 2849310 2832857 2870614 2885110 2719958 2498886 2360628 2206241 2100153
2548 2100153 1811600 1647340 1520817 1594898 1450246 1379911 1224781 1170571 1166050 1034789
2538 1034789 981195 1001881 909637 807556 932208 888853 856303 757686 833806 821092 705228
2527 705228 665021 745570 711060 622124 591761 635446 671464 645604 586245 601450 623132 687231
2515 687231 627365 627587 588002 671111 610372 537964 533196 550255 476263 447831 515604 481807
2503 481807 471854 435471 449011 387216 352101 415115 504959 359826 285862 325433 396451 341183
2491 341183 297657 323591 177325 157041 160469 174488 118823 164039 159907 167752 52398 -22248
2479 -22248 70967 56710 37423 2419 -50575 -52560 -8997 -38611 -53596 -76133 -12004 23068
2467 23068 -44434 -28082 7011 42651 44441 107790 76626 102000 58935 212117 202392 111074
2455 111074 133971 196560 129040 70885 184460 153706 155038 62358 82554 101653 72259 47216
2443 47216 66568 63097 75182 173564 91952 79482 122526 197808 93322 39271 142943 64303
2431 64303 167625 146249 172183 23904 95583 138553 112296 -7753 16563 47415 15221
2420 15221 -24133 -88138 -56 -16812 -12444 -12953 -38475 -83182 -75684 -87956 -110598 -122471 -137005
2407 -137005 -119639 -95498 -36863 -151650 -82184 -133160 -91232 -139897 -192842 -54795 -132330
2396 -132330 -129000 -248804 -142447 -162345 -205148 -253975 -198271 -203299 -181349 -175477 -224124 -258740
2384 -258740 -260561 -197240 -267936 -267742 -253984 -151689 -210200 -310140 -264436 -273992 -168376 -149322
2372 -149322 -200170 -219175 -97326 -85294 -149316 -199856 -189582 -138822 -114291 -207613 -239064
2361 -239064 -135395 -240719 -177018 -198187 -176379 -216636 -188847 -173011 -184488 -164863 -125865
2350 -125865 -134822 -220653 -262359 -230434 -232297 -240198 -168189 -208249 -133746 -81510 -203862 -277247
2338 -277247 -303858 -226889 -188771 -215149 -270642 -202929 -239190 -333451 -294032 -317754 -258506 -198907
2326 -198907 -231506 -313907 -317791 -343500 -265428 -310909 -294504 -324825 -288031 -314746 -332455 -240744
2314 -240744 -242361 -255995 -194111 -219008 -292479 -277019 -280105 -224514 -264868 -279649 -166078 -169378
2302 -169378 -204647 -164375 -115762 -107272 -86325 -124360 -115686 -88828 -135930 -198239 -212558 -201661
2290 -201661 -213027 -223613 -231155 -148247 -124138 -134116 -166325 -161940 -198023 -170550 -134923 -155250
2278 -155250 -168452 -147471 -122402 -166059 -146316 -164768 -148859 -84943 -56972 -83584 -119492 -132023
2266 -132023 -225794 -193774 -211749 -188344 -185894 -184139 -185301 -168368 -166937 -195194 -145973 -233774
2254 -233774 -244498 -278478 -249988 -207806 -199808 -241927 -204750 -208322 -299373 -288927 -251547 -245107
2242 -245107 -269047 -256690 -190836 -179658 -218814 -172375 -166817 -199556 -224813 -193753 -144835 -125669
2230 -125669 -117564 -144068 -124906 -52450 -77634 -165244 -130403 -67404 -71586 -56966 -110679 32982
2218 32982 -25461 13255 -52330 -12809 77965 36347 38391 4623 35865 -112928 -106898 -56021
2206 -56021 -42093 -34256 3943 48020 -42958 -65051 -21661 35181 -8551 71882 48123 36284
2194 36284 34069 20188 36603 -6479 60838 56256 88458 -39592 79281 111397 125791 102679
2182 102679 85829 31509 61355 107855 42173 62820 63051 130601 129308 73960 76858 55484
2170 55484 6392 -6542 74912 47698 113921 176250 170521 77948 99124 142821 159519 229764
2158 229764 208669 217038 201866 255282 269859 298040 317064 404322 342213 360155 424495 431135
2146 431135 432246 445795 476125 521287 583477 582119 650672 687243 728258 760318 780283 765060
2134 765060 820344 856530 930985 964300 1020407 1026029 1101914 1199919 1242019 1281558 1367087 1566847
2122 1566847 1613818 1681470 1863790 2151864 2288035 2335854 2407316 2596877 2808098 3122908
2112 3122908 3639524 4140749 4838355 5577530 6620293 7916665 9616292 11489564 13912016
2103 13912016 15845002 14118727 10697773 8009923 6328131 5058196 4097146 3470448
2095 3470448 3114201 2745928 2345687 2105745 1990684 1799965 1651287 1607626 1522477 1359615
2085 1359615 1118301 1108733 975541 821751 800457 729769 797775 671024 579218 523438 543874
2074 543874 472658 413549 402547 418502 460152 338877 293242 293624 389098 249210 228975 226061
2062 226061 300049 303141 255575 237472 252342 170714 116449 189795 72138 33668 72740 112596
2050 112596 54605 6991 53091 66819 146601 30286 29777 -19766 67295 -46913 -74148 -91950
2038 -91950 -5081 -35586 -155182 -75596 -109326 -41421 -126612 -92449 -103519 -15343 -123354
2027 -123354 -67245 -86107 -146985 -90340 -116544 -2513 -97995 -95652 -111905 -94323 -99444 -99130
2015 -99130 -102867 -107660 -111838 -222013 -153475 -199218 -119737 -176335 -126817 -122756 -80044 -103532
2003 -103532 -72785 50577 -19269 -104379 -113098 -15830 -108182 -67917 -148945 -9916 -37268
1992 -37268 -53636 -36354 -25048 -23566 -42074 14385 -74793 27794 3768 -46691 1620 -23632
1980 -23632 17353 22062 67847 -10413 23330 -43993 33380 -35876 -86135 -100312 -109704 -88645
1968 -88645 -174574 -55253 -102986 -23738 -61685 -98178 -126112 -78868 -138444 -61482 -8379 -37254
1956 -37254 -37794 -67075 -55440 -86029 -48325 -151288 -209934 -130047 -94170 -79464 -206881 -84047
1944 -84047 -131300 -121091 -122806 -109393 -192364 -226888 -202928 -148136 -197282 -214726 -164803 -161314
1932 -161314 -132588 -272103 -173404 -160344 -136802 -187185 -179344 -157499 -123412 -142503 -163527 -90171
1920 -90171 -93085 519 -29697 -148970 -93203 -41932 11790 -56402 -46255 -117344 -76670 -95413
1908 -95413 -75550 -112662 -50458 -3239 17667 -8163 -40062 -13050 -4760 -21345 -34620 -46356
1896 -46356 -82767 2660 -24581 -143956 -194298 -49501 -197416 -282987 -122955 -58306 -89162
1885 -89162 -128695 -231926 -156526 -177539 -149304 -150432 -153174 -289933 -254153 -126236 -191770 -240100
1873 -240100 -225654 -216126 -212292 -236387 -254720 -208254 -190148 -279346 -299811 -288579 -257178 -141847
1861 -141847 -159307 -298047 -210965 -117020 -212734 -241317 -177985 -105129 -156545 -222618 -289878
1850 -289878 -219449 -227404 -145491 -224556 -225207 -211977 -221784 -169962 -108061 -160367 -157608 -51442
1838 -51442 -69620 -78466 -122074 -66449 -35699 -5830 -70570 -130557 19149 25863 -71088 -80966
1826 -80966 28979 14621 38850 -59135 -48200 22926 17616 89563 -26834 -29463 -21475 83110
1814 83110 -276 16514 53131 141892 91050 45727 15159 -83286 35205 8538 -60646 -208391
1802 -208391 -111185 -27207 -32542 -169537 -116227 -16503 -114062 -101992 -155133 -88621 -92968 -130683
1790 -130683 -166491 -210389 -122493 -172799 -130558 -225448 -150056 -169814 -109701 -181809 -214840 -231012
1778 -231012 -204517 -130619 -239230 -345587 -343357 -172873 -196292 -340604 -455063 -297298 -253237
1767 -253237 -286359 -407265 -390261 -247991 -241870 -277896 -419783 -334150 -305607 -325374 -287312
1756 -287312 -297011 -344600 -286149 -228096 -341119 -262547 -321719 -268964 -299977 -262183 -401269
1745 -401269 -229314 -177048 -243064 -358368 -398531 -212123 -254992 -324430 -325664 -182219 -218185
1734 -218185 -291330 -282174 -233874 -125228 -147913 -166582 -234659 -189767 -184366 -123357 -164725 -205731
1722 -205731 -211446 -177999 -132084 -177275 -146919 -209820 -92034 -116619 -100178 -237547 -140754
1711 -140754 -156538 -255126 -277898 -174555 -58458 -155232 -183602 -234268 -133642 -98335 -99535
1700 -99535 -188143 -166452 -115761 -196401 -190162 -182430 -125394 -118184 -138979 -150396 -98305 -88495 -87757
1687 -87757 -106544 -155924 -170371 -119817 12477 -173279 -203691 -219433 -86213 -81600 -142334
1676 -142334 -114880 -71631 20272 -46025 -74172 -126306 -149292 -163475 -142919 -213214 -210366 -208679
1664 -208679 -165290 -173221 -155976 -179241 -182288 -137475 -208513 -253561 -218911 -117036 -106472 -204185
1652 -204185 -195533 -108732 -125899 -205542 -212889 -223497 -153964 -233917 -271997 -194690 -177131 -207158
1640 -207158 -234217 -280719 -298933 -171235 -170151 -240212 -218776 -318664 -243208 -220655 -223229 -275153
1628 -275153 -318264 -294463 -224110 -237469 -237976 -240162 -250763 -239650 -288995 -269397 -307039 -264069
1616 -264069 -276219 -252332 -265220 -245495 -213930 -285314 -300202 -236425 -266232 -233115 -228255 -242578
1604 -242578 -271097 -250077 -274257 -242511 -243576 -227453 -196109 -163742 -281372 -199776 -162427 -157979
1592 -157979 -187318 -254483 -159530 -103515 -98318 -187496 -115040 -127809 -34224 -107355 -117844 -138971
1580 -138971 -89111 -66962 -125025 -177855 -138689 -44710 -162062 -98731 -90577 -69151 46318
1569 46318 10274 -13790 -4282 34320 -93833 -47718 -108152 -88509 -82078 12314 -101622 -107465
1557 -107465 -32549 -72458 10164 -93408 -22015 -94861 27608 -57647 -40805 -46675 63276
1546 63276 80767 15039 -34487 -29128 -7515 -65858 -42228 -46562 -6864 -705 52207 9178
1534 9178 -51963 -8679 -143270 -87879 -80757 -56297 -25805 40369 -87606 -90210 -65692 -59770
1522 -59770 -103050 -142802 -66859 -203226 -102664 -173276 -65521 -72915 -11597 -88981 -134665
1511 -134665 -105317 -84426 -102587 -132265 -92187 -112435 -136523 -127875 2079 -66903 -109978 -135907
1499 -135907 -209103 -263358 -227233 -123999 -162075 -146178 -261063 -173475 -168079 -169278 -140509 -110460
1487 -110460 -36746 -137158 -61953 -125820 -54022 -117360 -114838 -88801 -25124 -121052 -192003 -138601
1475 -138601 -76314 -32400 -131980 -60640 -69119 12327 14889 -36850 -15050 -80682 -43038 -99229
1463 -99229 -50832 -104630 -46803 -139932 -48474 -56400 -122828 -55812 -68674 -41068 -53973 107034
1451 107034 26223 58475 -124154 -39476 16467 98195 -26430 -45651 25761 53448 59817
1440 59817 -25509 -10287 -23589 1001 -42715 -34860 -3699 -19895 -35426 -31796 65553 -46945
1428 -46945 -56727 -22920 -52849 -109288 -68906 -14706 20270 29453 -83343 -105261 -132160 -53223
1416 -53223 -51509 -21304 10388 50740 -55390 -79067 -36147 -70116 -82215 -172301 -127041 -102144
1404 -102144 -108302 -166463 -119146 -65717 -134111 -98658 -162364 -74447 -52474 1261 -55540 -67783
1392 -67783 -169551 -176933 -105934 -71067 -98777 -145256 -7303 38647 32324 -62981 31439 62488
1380 62488 -46787 -115516 -109816 -35904 -78306 -113261 -79812 -55544 -68528 -24878 -5804 7200
1368 7200 34633 -52 -6491 -57620 -51896 -148009 -82431 -90761 -101372 -57031 -33086 50667 37457
1355 37457 -20593 -113817 23164 -10965 29878 -95560 -64219 33973 9083 -53415 -124823
1344 -124823 -115789 -120066 -72697 -57433 -12996 -117795 -135217 -60226 -33023 -16439 -38770 -29078
1332 -29078 -33932 -47602 -67910 -113405 -59397 -20420 -96066 -116401 -72465 -20680 -37997 -103014
1320 -103014 -18434 -47988 -62968 -94646 -56886 -23815 -84956 -60459 -36866 -96620 -108679 -80593
1308 -80593 -29881 30492 40186 -31557 -115790 -181653 -152947 -194343 -116775 -120078 -160941 -145008
1296 -145008 -128090 -32699 -7157 -34723 -74735 2019 -7678 -71271 -128200 -128354 -118312 -157492
1284 -157492 -101924 -72980 -80848 -108986 -135314 -130359 -65833 -62692 -106046 -37776 -64353 -51714
1272 -51714 -175078 -147508 -188687 -87200 -129803 -70399 -51977 -85132 -151365 -127379 -18130
1261 -18130 -79860 -66134 -154399 -41526 -49345 -106402 -110465 -16115 -21309 2836 -21820 -139148
1249 -139148 -34258 -58302 -98078 -97035 -113731 -81510 -50356 3911 -7050 -82 -83703 -4530
1237 -4530 37176 -15778 -64115 -30691 -7311 -33462 -37024 32716 69017 35093 19313 38069
1225 38069 105424 133596 85631 -18366 -5067 83015 19459 6496 19343 54202 -14093 -266
1213 -266 53760 95455 99658 73856 161664 167950 145899 50928 89045 15252 22334 -3411 18229
1200 18229 81358 35762 20276 -31652 24039 12028 -45092 -55737 18966 -20029 -54979 -63870
1188 -63870 -104422 434 -53997 -64792 -77128 -90276 -179487 -153886 -92263 -120499 -66528 -154257
1176 -154257 -120629 -83830 -65135 -145247 -104110 -125371 -66005 -73084 -96605 -105971 -140043 -33889
1164 -33889 -592 15400 -30159 4373 -40981 11139 -28891 -118817 17043 17512 5872 32603
1152 32603 94034 20800 54018 96136 67395 35178 38863 69724 93108 144933 61910 97131
1140 97131 136416 134102 85416 185400 179463 117389 82442 155723 227018 156846 147527 139802 145838
1127 145838 162829 169400 202234 152049 137237 55699 138716 146669 125694 54049 72495 107949
1115 107949 151999 93962 67087 120843 116996 73881 10569 114403 39773 112403 135001 126548
1103 126548 176765 174781 111197 10486 -7836 -4945 -81502 -92773 693 112143 3206
1092 3206 -1616 13051 82781 -26735 -20540 43826 24205 -56671 -72714 -4798 57624 100218
1080 100218 15096 60938 10244 -4537 -25214 15022 -13415 27931 -27207 6055 2790 28735
1068 28735 21567 54025 101789 58292 52428 38292 65494 68417 42258 39719 138260 123761 34071
1055 34071 56792 126663 107707 64609 114186 150895 80126 32406 33333 18596 22773 18267 -56188
1042 -56188 -45775 -14316 17638 437 46909 61664 46943 -96870 -103992 32111 -19025 -128060
1030 -128060 -42244 -83724 -143153 -44575 -37996 -23028 -29965 -54430 -73262 584 -5563 -37983
1018 -37983 -43170 -162079 -147111 -43328 -44851 -110900 -62547 -88353 -113290 -83858 -4428 -39999
1006 -39999 -31909 22860 -62741 -114625 -114806 -25276 -98486 -52833 -97275 -77780 -18687 -26554 -50920
993 -50920 27501 -25915 -36174 26706 -87984 41118 41536 51304 7534 14420 1029 23071
981 23071 65720 -14673 61053 33325 12577 -43228 16335 3013 42195 82912 62502 21936
969 21936 21762 66904 -88940 -17943 -5156 88130 67934 57447 -19225 22981 99409 40805
957 40805 30185 -79288 9663 38693 50869 8717 45257 45076 56733 47401 -24137 -36280
945 -36280 -32869 50806 -53098 -43136 -121199 17543 -33302 -72812 -60464 -37914 -10977 -165073
933 -165073 -43575 -39364 9234 -36103 71161 -24826 -33415 -33793 -94211 -107058 -65481 -12622
921 -12622 -115266 33176 -230 -39418 -65915 65686 9854 -49773 -84740 -33214 64505
910 64505 -100703 -74737 98252 238760 72879 46407 74522 94424 70717 2992 7146
899 7146 62027 119024 40333 113478 97422 93060 101197 92028 110490 95101 60726 27068 150141
886 150141 125586 60976 73080 186115 65144 -13567 33995 171485 146688 74207 -39651
875 -39651 108828 169403 -30952 -35043 122732 133129 39320 42934 153143 175504 80837 18628
863 18628 86578 118437 89378 41256 103317 172940 74008 -24227 83732 203934 82498
852 82498 27378 47573 138564 36575 -26552 15812 90187 35213 -18147 46017 136870 16085
840 16085 -108711 -93573 -4882 -15753 -57765 -32512 87728 47131 -4783 -52527 16329 88230
828 88230 39017 -80981 -16032 35979 -13263 7477 70466 129285 24096 -15633 73324 94137
816 94137 22829 -33305 73595 138283 99705 41967 102732 148819 103088 71990 119425 168393
804 168393 136128 82384 38181 121525 55403 83427 134129 276659 211843 33043 53068
793 53068 143008 147803 64831 35662 -19527 17489 -18152 -16320 64501 129779 44894 -2054
781 -2054 81348 71673 79185 53788 51878 37795 126524 80115 81055 83996 55644 43734 -8561
768 -8561 26396 -9760 5610 -8287 25058 -8148 -3158 -41260 19456 75335 -5811 -60246
756 -60246 -5840 36018 -14032 21643 7520 29124 -3934 4405 45819 -30576 -56459 -63196
744 -63196 -2067 -26210 39497 4777 -10661 24136 64155 59765 -17882 56477 -38365 16475
732 16475 -17356 15794 30478 18250 -11879 90682 138893 7317 1246 26068 45741 -17600
720 -17600 36840 87092 84867 81932 3083 100762 106752 61815 10618 121099 74887 3661
708 3661 -44140 26481 108485 84405 102979 75202 204235 103593 127112 105056 237689 234627
696 234627 145021 95720 153376 206209 139387 159029 153208 128753 89664 161284 61753 51711
684 51711 23756 -20692 80287 56914 91553 13010 111542 105375 51421 35381 76519 91388
672 91388 -8676 -4452 29562 162007 93733 46062 -6390 170203 78313 10728 62936 59717
660 59717 97978 42396 79567 130361 188872 58886 82806 88457 77012 85720 142378 121543
648 121543 68671 147424 135516 176612 77134 118491 60513 140875 123862 51961 61656 72631
636 72631 127243 33597 71367 11986 88196 79341 75783 18257 56102 56346 43704 114444 47313
623 47313 102401 33984 52199 23684 84124 114655 56904 75229 9132 101866 61128 113082
611 113082 19315 63291 134198 129344 58310 16728 57760 25844 41063 17064 145478 42680
599 42680 34965 -125 46355 32 54075 61075 86122 40645 -4483 122638 5817 33763
587 33763 -57379 -1455 2615 89393 32051 -16905 134495 108059 81301 11871 111031 145910
575 145910 153527 31188 91396 162083 86294 69425 120482 142392 40615 123371 59808 43926
563 43926 -6321 142063 192978 209347 72848 19614 163711 162100 144015 31337 49873
552 49873 96002 147819 -17698 23997 170650 182918 98406 51765 120090 144681 117891 112700
540 112700 191534 136622 89182 83166 129609 128242 59922 77469 160355 173916 33890 67445
528 67445 149970 208290 46965 -20561 81500 105401 20288 -95533 -23699 76949 -59
517 -59 -59279 -7899 74710 51082 -11147 63480 131744 119014 53924 11864 22074 32578 -19989
504 -19989 -7048 62969 67037 -6504 -7204 113947 131576 45986 120825 144017 101879 46780
492 46780 52229 105671 156519 -45205 -29368 71202 137442 -17764 29691 118143 76279 60400
480 60400 27171 100416 137253 101181 -49300 -32930 -28885 13413 -14 -25526 -4557 176317
468 176317 72900 -14726 30209 42389 45261 40417 106601 55050 -6482 120698 205584 26329
456 26329 -46024 46708 109070 18212 -20865 15002 56602 116040 21836 75270 52656 119979
444 119979 140538 111908 117265 165329 161624 119209 153737 138865 115333 67700 124034 85384
432 85384 78011 133123 169853 167212 37513 118856 221360 240252 105311 119515 170826 178095
420 178095 111600 134467 168433 132336 255911 225355 196952 182916 291016 197293 145766
409 145766 114578 117094 173551 134394 184151 207083 250821 232186 221192 167356 193652 213816
397 213816 257318 184725 88589 230627 241013 217537 158509 111781 121358 221728 173109 127156
385 127156 118166 151004 190181 123003 38249 94410 244086 154612 80987 140554 198435 155003
373 155003 82587 22523 -33472 110417 88069 80605 32094 103364 169071 75427 40679 57116
361 57116 185637 157179 150976 41376 11890 73370 144180 137132 52874 57591 168709 244303
349 244303 45522 77082 108056 220974 178464 128548 100465 275177 377181 261146 253972
338 253972 262479 410691 285649 173643 112870 281084 264578 206148 234400 215946 228633
327 228633 234517 249285 128976 228353 294155 402256 281168 160798 235086 316150 257776
316 257776 135006 271366 281488 290476 229020 203062 177449 261534 252276 103812 11394 143100
304 143100 261431 127357 115446 90249 131785 122708 115551 92224 77043 156164 143581 212883
292 212883 65572 73326 164053 233580 5550 -16923 75292 120942 80389 -10923 20539 31987
280 31987 185332 42264 -14418 -18804 86666 123960 21025 -19352 85806 207707 76704
269 76704 89683 21983 93607 191609 191582 84769 77263 244061 218453 179337 19733 208295
257 208295 287912 209868 71703 175374 205234 213126 236464 133720 155232 228520 335797
246 335797 211001 192259 234131 364514 322377 244012 240605 317490 403526 338823 285171 203117
234 203117 297238 387406 350044 170684 212829 347977 357879 254494 207489 335805 319265
223 319265 279921 191720 175928 273811 298525 184171 75661 181977 240300 240972 154208 55180
211 55180 77981 213698 158807 42418 81177 134286 191916 152796 77034 20490 193679
200 193679 225943 125286 -5431 60769 149691 181970 73600 26490 79877 141067 151670
189 151670 38057 68902 116666 199583 76852 6839 105133 157610 139221 87104 54863
178 54863 94978 169084 116105 40862 7634 58035 118299 116046 69897 155600 250868 264550
166 264550 210962 100003 153887 231333 224630 157280 151008 105147 196649 214467 58981 129473
154 129473 306950 267953 115918 173114 240076 320701 268232 148311 188235 172505 174959
143 174959 223947 162971 106086 199021 228914 150661 135373 213674 242947 272090 181927 103469
131 103469 151805 235063 180746 112114 138870 155086 244981 137659 33970 138966 229367
120 229367 205792 138007 168386 161437 182049 147973 159414 199636 231772 237694 207728 177783
108 177783 112657 197789 217965 171257 90910 165258 277753 230274 139685 157051 229696 265801
96 265801 228944 129687 195549 215252 237075 166388 155086 214229 274815 240446 191943 231007
84 231007 191973 238496 191882 150865 13249 149362 278993 228593 122443 173835 260886
73 260886 243041 188519 120412 241739 281090 206559 133838 204022 215470 233438 156228 75290
61 75290 176128 196507 198272 124917 181695 176063 188661 243291 196594 166760 137612 234849
49 234849 206549 91096 66574 205262 180476 91872 18332 177972 214459 196686 135537
38 135537 164514 211978 123846 136245 92876 137893 152149 173900 111270 128899 168004 182599
26 182599 199479 168053 199777 207805 239214 225903 172695 118231 186132 221021 82408 44912
14 44912 143645 260105 209404 197265 161027 199395 205010 209688 204243 242254 233323 220231 220311
1 220311 139723
0 139723
$$ Imaginary data points
##PAGE= N=2
##DATA TABLE= (X++(I..I)), XYDATA
16383 -3059965 -2997454 -2959353 -2981540 -2903821 -2883356 -2830087 -2835335 -2796359 -2687238 -2607187 -2587809
16372 -2587809 -2581701 -2504772 -2453254 -2432308 -2454231 -2353229 -2301695 -2262839 -2307521 -2209882 -2150294
16361 -2150294 -2149047 -2110921 -2077234 -1977565 -1959774 -1871101 -1804501 -1798351 -1861756 -1819180 -1709761
16350 -1709761 -1644212 -1619417 -1594486 -1515972 -1422494 -1430970 -1462046 -1338873 -1279431 -1245358 -1230117
16339 -1230117 -1212957 -1102230 -1090633 -1063452 -1048599 -932850 -943689 -900825 -854640 -787871 -766305
16328 -766305 -769761 -659162 -617037 -590811 -589198 -499389 -463612 -416065 -425002 -334985 -256111 -245631
16316 -245631 -236088 -226033 -144473 -110644 -111309 -63499 28610 79001 108231 157582 195504 203693
16304 203693 233661 379072 355326 347801 340260 471918 500403 508278 500531 531878 658998 629347
16292 629347 631416 668494 764773 727815 690404 708508 809604 885498 914765 876048 981159
16281 981159 1048181 997287 1080088 1130305 1107101 1154652 1149673 1180828 1259144 1232410 1195209 1321754
16269 1321754 1365881 1334087 1380732 1413439 1396658 1370247 1415637 1451582 1536976 1509897 1515344
16258 1515344 1610922 1635924 1607437 1659294 1695787 1680972 1802038 1813414 1804575 1834770 1864883
16247 1864883 1868906 1879081 1942689 1929759 1971347 1977666 2064008 2065807 2026256 2000116 2097733 2185683
16235 2185683 2167284 2177245 2238363 2283361 2257168 2290956 2329894 2365020 2291098 2368782 2434101
16224 2434101 2514814 2475581 2424199 2615533 2633993 2640071 2580808 2587822 2631261 2646050 2619717
16213 2619717 2659537 2837749 2721716 2761552 2824973 2908465 2771567 2740132 2726207 2826251
16203 2826251 2874141 2791740 2860542 2863075 2939878 2902796 3008244 3009363 2976098 3008067 3099116
16192 3099116 3044700 3024455 2995004 2995576 3144394 3130362 3123787 3095935 3192060 3150009 3145560 3121316
16180 3121316 3200691 3333294 3246840 3285310 3307708 3365249 3275273 3320514 3234609 3275829 3274881
16169 3274881 3308796 3373174 3347780 3351353 3294889 3371492 3328158 3338896 3292074 3404433 3459163
16158 3459163 3366064 3301162 3465845 3567153 3378730 3362105 3512972 3632898 3477860 3364701
16148 3364701 3442512 3569639 3551158 3430688 3501735 3556756 3503813 3445607 3584798 3589267 3540188
16137 3540188 3536649 3564025 3543497 3510086 3477206 3489001 3538254 3554216 3438733 3400135 3619101
16126 3619101 3594152 3446144 3514151 3629802 3631196 3505113 3437326 3636268 3705512 3529330
16116 3529330 3519082 3714747 3674881 3569248 3556035 3629733 3654773 3613328 3569795 3658759 3667815
16105 3667815 3610667 3631665 3725677 3722808 3586170 3511719 3658753 3792062 3703732 3515829 3712587
16094 3712587 3809923 3640797 3581799 3762786 3860447 3761276 3697471 3746475 3885953 3769654
16084 3769654 3704168 3675903 3780170 3750585 3722514 3771478 3876325 3848301 3763742 3816786 3847615
16073 3847615 3830375 3730012 3781079 3885230 3928756 3742999 3732475 3912626 3905851 3733105
16063 3733105 3681169 3887172 3917527 3756833 3743425 3897766 3904394 3779903 3694515 3848764
16053 3848764 3838843 3759321 3804158 3768227 3819543 3757996 3727472 3780362 3872424 3739961 3708039
16042 3708039 3852828 3944511 3829684 3680282 3765636 3833990 3772351 3568880 3719676 3915606
16032 3915606 3773312 3663337 3740680 3905100 3771247 3667935 3651398 3729969 3756191 3735458
16022 3735458 3748901 3770865 3769233 3671698 3741910 3699577 3800618 3703681 3748262 3816116 3835932
16011 3835932 3688657 3789830 3893914 3867961 3826778 3813653 3960225 3947677 3860586 3729648
16001 3729648 3949615 3970652 3769040 3770645 3931851 4072417 3912371 3852027 3935098 4043851
15991 4043851 3886855 3868915 3911857 4054110 3965547 3913555 4010458 3990094 3961370 3844822 3961983
15980 3961983 3980656 4008560 3835639 3976817 4069730 3998713 3859181 3912710 4097875 4022134
15970 4022134 3862560 3842051 3972939 3865852 3780054 3761824 3929482 3948912 3733689 3717527
15960 3717527 3777392 3872231 3825723 3858534 3814425 3901273 3881951 3790407 3805128 3879975 3774759
15949 3774759 3689023 3783006 3818196 3809627 3754826 3904630 3955085 3845870 3763141 3771195 3816852
15938 3816852 3794293 3784534 3817466 3920700 3851240 3729203 3708526 3894940 3892310 3809264 3778766
15927 3778766 3833287 3939654 3794289 3763714 3797814 3869633 3789338 3776842 3859772 3884498 3875577
15916 3875577 3823563 3842122 3883507 3959528 3834556 3889138 3975891 3876148 3831051 3959575 3955376
15905 3955376 3905630 3894998 3891696 3991337 3905524 3830849 3787510 3929839 3958149 3893540 3820458
15894 3820458 3899916 3943248 3864888 3789993 3843487 3943416 3867354 3822143 3828710 3966052 3940600
15883 3940600 3847604 3842599 3824903 3816754 3834909 3888759 3854609 3919785 3826314 3818262 3879428 3797112
15871 3797112 3631293 3760914 3911465 3811057 3727462 3731882 3856490 3761542 3718233 3762425
15861 3762425 3963368 3895817 3746308 3723814 3776022 3814343 3752166 3717890 3689370 3859129 3817262
15850 3817262 3870319 3936829 3951943 3814429 3847521 3949987 3935636 3915692 3776252 3865316 3951907
15839 3951907 3925555 3848978 3954995 3954591 3865655 3809435 3912816 4048560 3958965 3890294 3947438
15828 3947438 4069718 3934936 3915348 3917922 4018900 3981110 3932833 3930843 3904389 3940183 3900277
15817 3900277 3935449 3879835 3882389 3887906 3900266 3901201 3836600 3863429 3841055 3883991 3859471 3878700
15805 3878700 3957747 3934129 3894236 3884689 3864320 3908705 3914648 3778635 3817117 3821243 3860974 3820979
15793 3820979 3812904 3760104 3918174 3882912 3782330 3759046 3795823 3851509 3869595 3868172 3777221
15782 3777221 3817755 3835283 3823645 3823960 3819101 3780320 3866215 3854317 3787708 3851328 3821364 3897230
15770 3897230 3867537 3843477 3887673 3869488 3895484 3892743 3879086 3872178 3955315 3992775 4000495 3964843
15758 3964843 3939057 3934862 3999187 3944256 3926646 4009479 3986177 3976995 3873179 3933930 3990750
15747 3990750 3954770 3942677 3972826 4004988 3975739 3934893 3904892 3966765 3925372 3987816 3966137
15736 3966137 3958749 3964337 4039955 3974214 3974527 3975082 3905501 3997808 4004399 3997715 3977607 4028938 4006625
15723 4006625 3938246 3773718 3847876 3983346 3981818 3919238 3931459 3999480 3926563 3967996 3935260
15712 3935260 3916555 3974492 3959817 3924722 3912231 3916743 3890196 3869359 3821929 3912010 3870070
15701 3870070 3884184 3891456 3971343 3892978 3923349 4010382 4018193 3832871 3789647 3958050 3961756
15690 3961756 3984459 3863211 3972665 3946580 3968189 3870637 3883704 3890371 3929876 3940555 3952911
15679 3952911 4003416 3910765 3979726 3922889 3885697 3913933 3940357 3982431 4002514 3994364 3914743
15668 3914743 3976514 3955066 3928764 3876347 3935243 3975517 3984159 3950838 3984562 4089614 4003786
15657 4003786 3915450 3869504 3953376 3933053 4014705 3968726 3901791 3945347 3970231 3988502 3903782
15646 3903782 3917679 3895606 3990205 3928601 3905154 3954977 3923980 3960116 3922567 3845501 3851191
15635 3851191 3998289 3999401 3921831 3882526 3966169 4041361 3965721 3891044 3954235 3942542 3949409
15624 3949409 4002800 3964216 3918792 3916522 3991524 3988926 3903587 3928216 4045829 4013372 3957250
15613 3957250 3961132 4030158 4101370 4069595 4033548 3941594 4095786 4128607 3944046 3946407 4007040
15602 4007040 4033162 3978536 3945505 3997525 4099601 4081234 4016210 4065887 4021477 4092707 4146488
15591 4146488 4103178 4065220 4111551 4121848 4183843 4092797 3968511 3982098 4105171 4129365 4031825
15580 4031825 4104824 4098376 4148706 4111238 4025974 4027369 4086527 4069918 3952597 3942615 4015017 4084405
15568 4084405 4012778 3966551 3988817 4006139 3960242 3989407 3960354 3869450 3942716 4019768 3982641
15557 3982641 3869841 3854369 3919914 3964559 3871947 3820842 3931164 4000681 3948179 3788371 3779323
15546 3779323 3916334 3940370 3894341 3813053 3900539 3951055 3873477 3807483 3818179 3879107 3990665
15535 3990665 3906667 3933320 3973747 3897711 3938100 3955079 3921577 3965705 4105706 4089200 3973219
15524 3973219 3963849 3910690 3998225 4089030 4054229 4044605 4130998 4143584 4085184 4044057 4069057 4196465
15512 4196465 4144036 3987107 4041032 4149220 4217830 4190337 4110400 4131541 4170863 4114052 4093298
15501 4093298 4189499 4117027 4133679 4131450 4082369 4065043 4054095 4018160 4088302 4120816 4031236
15490 4031236 4018795 4093103 4073754 4042350 3975039 4023971 4078840 3973488 3879416 3999319 4104389
15479 4104389 3967459 3960640 3967691 4029098 3956318 3932664 3909740 3947645 3945967 3928142 3913253 3843650
15467 3843650 3987122 4012145 3990737 3936692 3920527 3871231 3922814 3904672 3884715 3835302 3830962
15456 3830962 3928219 3840520 3880879 3828885 3944208 3941610 3888770 3850239 3885245 3944646 3915722
15445 3915722 3980689 3941865 4001962 3991203 4025536 3961293 4078163 4079627 4135773 4095202 3953841
15434 3953841 4017651 4093218 4129834 4063865 4071211 4048966 4147296 4054269 4054620 4114044 4126069 4141976
15422 4141976 3997475 4068414 4064112 4150978 4017469 4155661 4141034 4062264 4129311 4184493 4181216
15411 4181216 4057491 4097092 4110448 4273162 4042712 4093185 4158915 4117018 4025223 3943569 4059054
15400 4059054 4120663 4116731 3980871 4076959 4111277 4102480 4009211 4053837 4068408 4049640 4014294
15389 4014294 3947113 4118387 4050520 4048081 4005300 4095216 4041256 4034684 4085376 4131299 4115348
15378 4115348 3954494 4019244 4127090 4114093 4031133 4058062 4088215 4114668 3971483 3988858 4080507
15367 4080507 4078975 4166856 4079524 4135890 4092623 4119811 3950764 4083219 4158724 4147014 4189278
15356 4189278 4200493 4268136 4164915 4176709 4183520 4292696 4161775 4163058 4255385 4315412 4213165
15345 4213165 4186344 4295414 4256868 4274142 4133230 4213577 4183808 4226187 4126713 4148624 4279239
15334 4279239 4299261 4268559 4235900 4367037 4294744 4271500 4175183 4258220 4263906 4223193 4159779
15323 4159779 4253328 4207926 4100461 4182181 4121533 4122392 4056414 4065945 4105864 4190249 4059085
15312 4059085 4043447 4157253 4128810 4182570 4065053 4075602 4004588 4087177 3933557 4029387 4109000
15301 4109000 4039673 3974194 3982731 4004054 3995115 3990526 3985209 4150786 4040434 4016088 3961135 4029644
15289 4029644 4045358 4004915 4080301 4062832 4046420 3925982 4031619 4088028 4136134 4040150 4036628
15278 4036628 4108151 4153407 4061827 4005559 4092489 4044691 4057215 4015346 4063876 4036894 4100958
15267 4100958 4055407 4116929 4064729 4013638 4078891 4114098 4178956 4166388 4137707 4104716 4181332
15256 4181332 4155309 4163554 4095402 4215915 4122022 4058479 4041323 4105018 4223277 4213140 4144294
15245 4144294 4164103 4277236 4107521 4101168 4197646 4235431 4149659 4162036 4127388 4188597 4156112
15234 4156112 4042708 4066097 4126749 4166255 4146240 4223522 4225237 4247697 4172865 4104615 4164916
15223 4164916 4173806 4203055 4172934 4200492 4200793 4180393 4083604 4151530 4224932 4183458 4064776 4174166
15211 4174166 4242856 4116026 4061276 4127092 4198560 4169347 4115072 4104334 4185545 4159099 4179674
15200 4179674 4189091 4203023 4295040 4244757 4215005 4241052 4225097 4106945 4177188 4221507 4258532
15189 4258532 4229601 4156241 4264321 4287752 4110539 4150237 4315696 4254500 4139443 4155376
15179 4155376 4219969 4275387 4196201 4086694 4185814 4235051 4176014 4133260 4159833 4145420 4164509
15168 4164509 4141502 4100048 4239264 4188253 4078936 4091979 4099639 4129422 4176261 4145617 4144245
15157 4144245 4125907 4044545 4079249 4146817 4142875 4078211 4163288 4213045 4150744 4084401 4089187 4128384
15145 4128384 4093710 4014592 4011057 4059537 4104189 4034805 4057091 4023254 4054210 4072296 4088051
15134 4088051 4112833 4071979 4025201 4090744 4134850 4016398 4012915 4073731 4109180 4113992 4061134
15123 4061134 4089323 4188852 4208093 4063847 4120604 4245033 4166390 4105817 4088264 4226799 4285118
15112 4285118 4196783 4148767 4221767 4221964 4170502 4189077 4205866 4203276 4211521 4195405 4185184 4230531
15100 4230531 4161083 4177519 4226715 4232643 4162514 4177178 4180717 4250975 4214489 4133664 4250961
15089 4250961 4194838 4122341 4090685 4204761 4227526 4198280 4142378 4144810 4226046 4161784 4160619
15078 4160619 4090328 4117063 4039166 4077337 4125705 4088385 4092074 4129336 4206889 4143996 4145253 4138880
15066 4138880 4235889 4140466 4142091 4154069 4177389 4223285 4151020 4098671 4130623 4275084 4135286
15055 4135286 4156181 4153159 4190652 4093782 4106481 4142081 4131626 4159306 4137886 4305011 4265689
15044 4265689 4272442 4209350 4308508 4299889 4256355 4239681 4234008 4241267 4237324 4298265 4301241 4326332
15032 4326332 4272296 4302602 4238355 4276797 4207836 4110669 4218991 4377041 4383429 4244792 4323623
15021 4323623 4304266 4319742 4187197 4292502 4309573 4231754 4290425 4393253 4466335 4306219
15011 4306219 4293631 4266772 4351455 4265179 4216761 4182926 4299594 4277454 4222127 4334995 4373887
15000 4373887 4393259 4247478 4234066 4206398 4312698 4198824 4225122 4353946 4304120 4227152
14990 4227152 4124820 4222635 4179853 4252096 4231186 4365893 4348850 4192368 4214379 4265948 4294336
14979 4294336 4172005 4199133 4222453 4292964 4144248 4145006 4155248 4187781 4169168 4215797 4205461
14968 4205461 4154403 4242348 4188907 4223193 4205113 4205475 4214930 4323569 4252415 4268364 4316649 4254247
14956 4254247 4321372 4246596 4280146 4264743 4326516 4190401 4220140 4283689 4349617 4335068 4278163
14945 4278163 4372137 4277741 4235866 4288082 4356312 4311310 4322745 4308137 4324281 4315577 4299626
14934 4299626 4390431 4363051 4377316 4293254 4284681 4376108 4397557 4357895 4256471 4343758 4324214
14923 4324214 4359325 4284232 4343004 4358631 4400044 4379804 4395465 4414313 4347187 4387920 4360286
14912 4360286 4451599 4362616 4321880 4328871 4426473 4362137 4388816 4425312 4354457 4440577 4348466
14901 4348466 4420928 4389659 4368940 4205047 4364571 4393027 4380469 4257962 4207383 4421092
14891 4421092 4444774 4341942 4233520 4396510 4307892 4450681 4378138 4346859 4365763 4383086
14881 4383086 4397108 4365159 4398949 4311956 4388481 4327834 4384602 4350447 4329842 4397388 4383961
14870 4383961 4314613 4257242 4344381 4301847 4338608 4312224 4316628 4316549 4344612 4277401 4335476 4370167
14858 4370167 4274122 4323168 4265461 4348507 4298847 4369382 4303688 4304134 4233643 4250223 4309431 4247487
14846 4247487 4250897 4202756 4336001 4244203 4308350 4261196 4306157 4290155 4307181 4356102 4238884
14835 4238884 4309638 4253538 4358069 4283538 4259719 4254469 4303443 4234339 4177331 4269015 4291365
14824 4291365 4423080 4343503 4292526 4351794 4396366 4344151 4315390 4344299 4367794 4435043 4345615
14813 4345615 4343381 4349270 4394119 4361476 4372960 4436679 4407125 4408297 4381119 4462802 4435464 4383224
14801 4383224 4336226 4432452 4391326 4431168 4377907 4373105 4419460 4348898 4389044 4456620 4469066
14790 4469066 4414007 4395975 4380320 4403423 4351339 4344705 4397258 4400595 4403991 4372469 4417860 4385427
14778 4385427 4375720 4369698 4325369 4333308 4367094 4369168 4380283 4370179 4348497 4408191 4388444 4404381
14766 4404381 4351000 4351802 4411229 4449565 4382382 4305083 4388558 4393472 4347559 4335304 4392545 4465633
14754 4465633 4390791 4311124 4346783 4359929 4332626 4325993 4380349 4392349 4328564 4312237 4409957
14743 4409957 4421953 4353242 4305854 4419845 4435392 4371195 4328159 4300381 4356316 4385055 4327637
14732 4327637 4346382 4430079 4455037 4376424 4374031 4423392 4380566 4326276 4307129 4397724 4478286
14721 4478286 4419617 4324781 4409739 4425410 4370981 4408355 4385807 4272623 4350797 4427586 4322396
14710 4322396 4292953 4411330 4398256 4422589 4440852 4324440 4358363 4450037 4398223 4291185 4298535
14699 4298535 4396795 4420141 4321465 4287373 4310851 4508363 4474159 4369955 4352863 4413919 4433106
14688 4433106 4409206 4478201 4487913 4456380 4425285 4368683 4378248 4413278 4380327 4404925 4452246 4472191
14676 4472191 4419453 4424826 4412651 4430425 4406084 4373519 4433910 4498254 4406644 4398528 4438902 4416928
14664 4416928 4370704 4392808 4407361 4486635 4469035 4416610 4501012 4497410 4396303 4414975 4421878
14653 4421878 4418289 4421980 4454408 4371405 4303779 4307082 4358659 4322453 4370574 4448670 4381333 4377962
14641 4377962 4337469 4363518 4370192 4366736 4316079 4326241 4242056 4231326 4344685 4333133 4336305 4283663
14629 4283663 4300113 4299557 4379514 4306308 4272130 4282306 4283994 4235194 4232071 4304659 4338596 4399595
14617 4399595 4292506 4317339 4390713 4430498 4285771 4211283 4289351 4286502 4337534 4275723 4252033
14606 4252033 4287946 4360617 4309733 4343804 4299324 4354448 4363893 4292957 4293267 4285160 4342243 4268289
14594 4268289 4414620 4418176 4342256 4374664 4460109 4371447 4343664 4363662 4409744 4444975 4382940
14583 4382940 4346045 4482276 4488312 4396420 4464539 4499623 4517660 4440662 4393041 4502878 4500303
14572 4500303 4503887 4397499 4429382 4417109 4474996 4403742 4393633 4466786 4434234 4410658 4444363
14561 4444363 4499725 4417916 4425729 4539635 4573466 4513029 4423174 4460668 4542224 4365667 4310380
14550 4310380 4411675 4469148 4490187 4414483 4385717 4523991 4469130 4355582 4372856 4495700
14540 4495700 4436937 4377835 4393868 4335253 4462364 4409244 4354806 4382023 4453981 4346627 4352207
14529 4352207 4417659 4427757 4406636 4444408 4549967 4419105 4429494 4427106 4541748 4492996 4412474
14518 4412474 4400745 4527611 4543946 4405853 4335321 4411547 4545337 4449283 4497821 4485260 4558124
14507 4558124 4507640 4478284 4471628 4460288 4551975 4510471 4561473 4511786 4513839 4428116 4542053
14496 4542053 4543694 4520225 4495662 4597132 4605924 4403069 4414485 4525903 4671821 4537208 4515480
14485 4515480 4554669 4589660 4550946 4525668 4542931 4630334 4633610 4546317 4657349 4564425 4474729
14474 4474729 4442611 4560450 4610113 4655862 4586557 4580233 4659853 4495097 4515052 4489764 4632082
14463 4632082 4479951 4382685 4461426 4608608 4629715 4460487 4559573 4573348 4593551 4457317
14453 4457317 4415799 4549728 4680648 4480423 4471311 4530113 4546622 4528298 4567136 4621697 4512661
14442 4512661 4428914 4437659 4541565 4504144 4484081 4601640 4698500 4596464 4503184 4588536 4690561
14431 4690561 4670546 4562826 4550880 4646790 4657313 4566829 4565500 4634968 4798178 4746318 4550121
14420 4550121 4605452 4628603 4610378 4593794 4644581 4613704 4684091 4669110 4703979 4762580 4742117
14409 4742117 4692106 4659149 4717936 4622439 4579485 4700620 4779051 4713742 4618494 4675605 4769347
14398 4769347 4710730 4591147 4626516 4728500 4694913 4586770 4625160 4601696 4611328 4586937 4532342
14387 4532342 4581824 4582392 4568990 4610809 4605469 4552913 4617492 4607226 4605867 4617720 4575095 4586563
14375 4586563 4675865 4639842 4512056 4562965 4679010 4623377 4556483 4609032 4688443 4678692 4519646
14364 4519646 4452005 4601475 4544570 4511471 4575578 4546080 4612631 4592526 4507926 4513051 4462944
14353 4462944 4496258 4550726 4547952 4557495 4616002 4616468 4629994 4765378 4701553 4602761 4593141 4641584
14341 4641584 4528642 4536418 4537125 4599358 4668397 4498818 4587599 4654014 4659061 4598260 4630369 4662356
14329 4662356 4687335 4704119 4670306 4665114 4640734 4640430 4547403 4591248 4629756 4692124 4715645 4703687
14317 4703687 4672259 4646118 4619959 4625670 4684685 4655685 4688849 4658005 4702231 4615975 4602365
14306 4602365 4664411 4643866 4650037 4598941 4732900 4677482 4617822 4609175 4696440 4585226 4660789
14295 4660789 4661633 4580981 4645921 4623164 4624907 4530203 4584523 4608373 4598181 4461899 4619541
14284 4619541 4613858 4529588 4585300 4621426 4640328 4608693 4723526 4705141 4694540 4590511 4620722
14273 4620722 4662770 4647164 4573549 4615515 4676631 4606853 4644777 4599809 4656642 4660950 4654188 4563426
14261 4563426 4621301 4608526 4633413 4613641 4597993 4659444 4605344 4613191 4580102 4711078 4589998
14250 4589998 4602201 4667094 4652227 4655799 4676709 4678211 4588923 4576851 4551674 4687593 4619643
14239 4619643 4619567 4664809 4707539 4656814 4631131 4659639 4606970 4718052 4738001 4715531 4672812 4759906
14227 4759906 4767339 4705986 4645584 4662428 4705089 4660806 4688287 4657823 4681691 4612481 4652742
14216 4652742 4698600 4669117 4675317 4674679 4677357 4633078 4584553 4679855 4805631 4717759 4694022 4659106
14204 4659106 4672108 4672560 4708801 4730190 4692343 4780630 4775295 4682835 4666648 4748101 4704590 4650726
14192 4650726 4720136 4766322 4717411 4725091 4836271 4752465 4681474 4771378 4767794 4654533 4637534
14181 4637534 4781564 4799231 4787241 4676034 4688252 4725571 4739576 4740946 4722313 4688211 4741869
14170 4741869 4778938 4574994 4691527 4806750 4826320 4734741 4705283 4685268 4735854 4737927 4658069
14159 4658069 4693889 4664376 4783142 4797706 4775913 4720349 4784571 4826145 4735407 4707297 4711203
14148 4711203 4678768 4670499 4744586 4734190 4760016 4837656 4833886 4794469 4706101 4705852 4822430 4806155
14136 4806155 4661650 4736677 4784935 4783167 4751127 4778761 4760706 4748517 4874705 4806327 4733082
14125 4733082 4722421 4818855 4855411 4782359 4754975 4820437 4784202 4759213 4814981 4796362 4800249
14114 4800249 4779397 4840193 4791329 4765579 4851067 4921561 4889207 4734756 4751164 4828551 4905192
14103 4905192 4812965 4792686 4803031 4849034 4850210 4812353 4712836 4740610 4852780 4756264 4732299
14092 4732299 4767575 4802134 4727351 4718498 4725378 4693484 4773018 4725836 4705949 4623406 4705779 4689034
14080 4689034 4763383 4679197 4652256 4721613 4734581 4690707 4693644 4712968 4673818 4711754 4627040
14069 4627040 4683066 4705103 4738339 4711084 4647977 4655964 4683045 4718190 4710183 4692632 4761108 4812100
14057 4812100 4808747 4834359 4825029 4834724 4886559 4882336 4807085 4739477 4866309 4845892 4871410 4739535
14045 4739535 4765556 4869453 4782786 4758721 4825440 4883249 4882839 4985712 4862929 4870895 4887121
14034 4887121 4874325 4891197 4831638 4804771 4887521 4895520 4775949 4825086 4783769 4878642 4887305
14023 4887305 4873107 4836028 4811302 4980368 5006106 4879976 4895728 4951765 4932200 4940653 4859268
14012 4859268 4895614 4915215 4891930 4843960 4783975 4797377 4870955 4932171 4856948 4854792 4848132 4954829
14000 4954829 4857776 4861372 4923608 4934082 4958151 4875141 4819286 4854116 4953990 4893532 4895178 4840585
13988 4840585 4846795 4884494 4850439 4796088 4772606 4869334 4783134 4779222 4783535 4806969 4828866 4909448
13976 4909448 4891969 4763961 4809184 4868013 4941314 4885099 4772795 4797660 4909004 4816732 4825151
13965 4825151 4862362 4896190 4841161 4818465 4785443 4838907 4991688 4873277 4804660 4852647 4923268
13954 4923268 4956812 4999287 4929237 4928010 4921817 4992112 4992845 4932099 4815411 4849404 5011989 4944847
13942 4944847 4753877 4783853 4921471 4863232 4791933 4793553 4891042 4975105 4932087 4827494 4916918
13931 4916918 5034845 4985303 4915732 4902876 4889302 4983268 4963139 4867154 4867605 4939264 4881511
13920 4881511 4881724 4896757 4801549 4763093 5001835 4982129 4859021 4867128 4937939 4997611 4896865
13909 4896865 4830815 4908605 5020911 4918356 4856421 4881295 4931770 4953451 4932513 4870684 4907923
13898 4907923 4994066 4976868 4876563 4882070 4971146 4954847 4937169 4877090 4896823 4881241 4879186
13887 4879186 4897908 4901447 4844881 4861655 4906674 4912578 4874817 4882521 4918400 4985877 4913174 4846557
13875 4846557 4942616 4929809 4928516 4850418 4864976 4923088 4944185 4898440 4865670 4871472 4914692 4882326
13863 4882326 4838620 4828494 4821102 4847246 4860544 4864627 4814231 4819699 4882552 4913917 4829732 4785004
13851 4785004 4906035 4862923 4782811 4758862 4770423 4770297 4833768 4855710 4806628 4860929 4870603 4987913
13839 4987913 4880942 4809286 4813479 4897789 4861725 4845073 4869926 4980995 5017804 4967963 4974267
$$ [...]
##END NTUPLES=NMR SPECTRUM
##END=
