##TITLE=1H_CA-9182-22
 CDCl3
 8 sc, 
 10.8.2023
##JCAMPDX= 6.0         $$ Bruker NMR JCAMP-DX V2.0
##DATA TYPE= NMR SPECTRUM
##DATA CLASS= NTUPLES
##ORIGIN= UXNMR, Bruker Analytische Messtechnik GmbH
##OWNER= root
$$ XWIN-NMR		Version 3.5
$$ Thu Aug 10 13:45:11 2023 Russian Standard Time (UT+4h)  she@DPX200
##.OBSERVE FREQUENCY= 200.13135
##.OBSERVE NUCLEUS= ^1H
##.ACQUISITION MODE= SIMULTANEOUS
##.ACQUISITION SCHEME= undefined
##.AVERAGES= 8
##.DIGITISER RES= 18
##SPECTROMETER/DATA SYSTEM= spect
##.PULSE SEQUENCE= zg30
##.SOLVENT NAME= CDCl3
##.SHIFT REFERENCE= (INTERNAL, CDCl3, 0, 15.7304)
##AUDIT TRAIL= $$ (NUMBER, WHEN, WHO, WHERE, WHAT)
$$ ##TITLE= Audit trail, XWIN-NMR		Version 3.5
$$ ##JCAMPDX= 5.01
$$ ##ORIGIN= Bruker BioSpin GmbH
$$ ##OWNER= she
$$ F:/spectra/data/she/nmr/H-F/1/pdata/1/auditp.txt
$$ ##AUDIT TRAIL=  $$ (NUMBER, WHEN, WHO, WHERE, WHAT)
(   1,<2023-08-10 13:44:01.39 +0400>,<she>,<DPX200>,
      <created by zg, POWCHK disabled, PULCHK disabled
       configuration hash MD5:
       00 E9 B6 7A A2 85 ED C7 34 08 36 98 17 FE 4E 26
       data hash MD5: 16K
       46 92 F0 F3 89 58 27 A3 6E D1 5C D5 4B 2B E5 92>)
(   2,<2023-08-10 13:44:03.75 +0400>,<she>,<DPX200>,
      <Start of raw data processing
       efp BC_mod = 2 LB = 0.24 FT_mod = 6 PKNL = 1 PHC0 = -21043.38 PHC1 = 8.65272 SI = 16K 
       data hash MD5: 16K
       9C 58 A3 7A C4 BF DC D5 D6 39 E0 2E 43 90 AC F4>)
(   3,<2023-08-10 13:44:25.92 +0400>,<she>,<DPX200>,
      <pk PHC0 = -160.1298 PHC1 = 3.200001 
       data hash MD5: 16K
       0F E5 13 F5 98 4A F3 3E 3A 81 1E 97 E3 A1 60 CB>)
(   4,<2023-08-10 13:44:29.62 +0400>,<she>,<DPX200>,
      <abs ABSG = 5 
       data hash MD5: 16K
       D5 D0 BE 93 9A D3 8F 09 94 8F 16 46 4B CA 75 D8>)
$$ ##END=
$$ 
$$ hash MD5
$$ F1 CF 29 1A 26 54 D0 75 45 3F DB AD 00 73 35 66
##$RELAX= 
##$RELAX= 
##$RELAX= 
##$RELAX= 
##$RELAX= 
##$RELAX= 
$$ Bruker specific parameters
$$ --------------------------
##$DU= <F:/spectra>
##$EXPNO= 1
##$NAME= <H-F>
##$PROCNO= 1
##$TYPE= <nmr>
##$USER= <she>
##$AMP= (0..31)
100 100 100 100 100 100 100 100 100 100 100 100 100 100 100 100 100 100 
100 100 100 100 100 100 100 100 100 100 100 100 100 100 
##$AQSEQ= 0
##$AQ_mod= 1
##$AUNM= <au_zg>
##$AUTOPOS= <>
##$BF1= 200.13
##$BF2= 200.13
##$BF3= 200.13
##$BF4= 200.13
##$BF5= 200.13
##$BF6= 200.13
##$BF7= 200.13
##$BF8= 200.13
##$BYTORDA= 1
##$CFDGTYP= 0
##$CFRGTYP= 5
##$CHEMSTR= <none>
##$CNST= (0..31)
1 1 145 1 1 1 1 1 1 1 1 1 1 1 1 1 1 1 1 1 1 1 1 1 1 1 1 1 1 1 1 1 
##$CPDPRG= <>
##$CPDPRG1= <>
##$CPDPRG2= <>
##$CPDPRG3= <>
##$CPDPRG4= <mlev>
##$CPDPRG5= <mlev>
##$CPDPRG6= <mlev>
##$CPDPRG7= <mlev>
##$CPDPRG8= <mlev>
##$CPDPRGB= <>
##$CPDPRGT= <>
##$D= (0..31)
0 1.2 0 0 0 0 0 0 0 0.06 0 0.03 0 0 0 0 0.0002 0 0 0 0 0 0 0 0 0 0 0 0 
0 0 0 
##$DATE= 1691660640
##$DBL= (0..7)
120 120 120 120 120 120 120 120 
##$DBP= (0..7)
150 150 150 150 150 150 150 150 
##$DBP07= 0
##$DBPNAM0= <>
##$DBPNAM1= <>
##$DBPNAM2= <>
##$DBPNAM3= <>
##$DBPNAM4= <>
$$ [...]
##$SUBNAM3= <"">
##$SUBNAM4= <"">
##$SUBNAM5= <"">
##$SUBNAM6= <"">
##$SUBNAM7= <"">
##$SUBNAM8= <"">
##$SUBNAM9= <"">
##$SW= 18.05172834244
##$SWIBOX= (0..15)
0 0 2 0 0 0 0 0 0 0 0 0 0 0 0 0 
##$SW_h= 3612.71676300578
##$TD= 16384
##$TD0= 1
##$TE= 0
##$TE2= 300
##$TE3= 300
##$TEG= 300
##$TL= (0..7)
0 120 120 120 120 120 120 120 
##$TP= (0..7)
150 150 150 150 150 150 150 150 
##$TP07= 0
##$TPNAME0= <>
##$TPNAME1= <>
##$TPNAME2= <>
##$TPNAME3= <>
##$TPNAME4= <>
##$TPNAME5= <>
##$TPNAME6= <>
##$TPNAME7= <>
##$TPOAL= (0..7)
0.5 0.5 0.5 0.5 0.5 0.5 0.5 0.5 
##$TPOFFS= (0..7)
0 0 0 0 0 0 0 0 
##$TUNHIN= 0
##$TUNHOUT= 0
##$TUNXOUT= 0
##$USERA1= <user>
##$USERA2= <user>
##$USERA3= <user>
##$USERA4= <user>
##$USERA5= <user>
##$V9= 5
##$VALIST= <valist>
##$VCLIST= <CCCCCCCCCCCCCCC>
##$VD= 0
##$VDLIST= <DDDDDDDDDDDDDDD>
##$VPLIST= <PPPPPPPPPPPPPPP>
##$VTLIST= <TTTTTTTTTTTTTTT>
##$WBST= 1024
##$WBSW= 4
##$XGAIN= (0..3)
0 0 0 0 
##$XL= 0
##$YL= 0
##$YMAX_a= 202806
##$YMIN_a= -129664
##$ZGOPTNS= <>
##$ZL1= 120
##$ZL2= 120
##$ZL3= 120
##$ZL4= 120
##$ABSF1= 15.72816
##$ABSF2= -2.323689
##$ABSG= 5
##$ABSL= 3
##$ALPHA= 0
##$AQORDER= 0
##$ASSFAC= 0
##$ASSFACI= 0
##$ASSFACX= 0
##$ASSWID= 0
##$AUNMP= <proc_1d>
##$AZFE= 0.1
##$AZFW= 0.1
##$BCFW= 0
##$BC_mod= 2
##$BYTORDP= 0
##$COROFFS= 0
##$CY= -3
##$DATMOD= 1
##$DC= 0
##$DFILT= <>
##$DTYPP= 0
##$F1P= 0
##$F2P= 0
##$FCOR= 1
##$FTSIZE= 16384
##$FT_mod= 6
##$GAMMA= 0
##$GB= 0
##$INTBC= 1
##$INTSCL= 3.70164e-10
##$ISEN= 128
##$LB= 0.24
##$LEV0= 0
##$LPBIN= 0
##$MAXI= 10000
##$MC2= 0
##$MEAN= 0
##$ME_mod= 0
##$MI= 1.114404
##$NCOEF= 0
##$NC_proc= -8
##$NLEV= 6
##$NOISF1= 3.799351
##$NOISF2= 2.8
##$NSP= 0
##$NTH_PI= 0
##$NZP= 0
##$OFFSET= 15.73036
##$PC= 1
##$PHC0= -21203.51
##$PHC1= 11.85272
##$PH_mod= 1
##$PKNL= yes
##$PPARMOD= 0
##$PSCAL= 0
##$PSIGN= 0
##$REVERSE= no
##$SF= 200.130008241906
##$SI= 16384
##$SIGF1= 3
##$SIGF2= 2
##$SINO= 5.538805
##$SIOLD= 16384
##$SREGLST= <1H.CDCl3>
##$SSB= 0
##$STSI= 16384
##$STSR= 0
##$SW_p= 3612.71676300578
##$SYMM= 0
##$S_DEV= 0
##$TDeff= 16384
##$TDoff= 0
##$TI= <>
##$TILT= no
##$TM1= 0
##$TM2= 0
##$TOPLEV= 0
##$USERP1= <user>
##$USERP2= <user>
##$USERP3= <user>
##$USERP4= <user>
##$USERP5= <user>
##$WDW= 1
##$XDIM= 16384
##$YMAX_p= 297815115
##$YMIN_p= -782706
$$ End of Bruker specific parameters
$$ ---------------------------------
##NTUPLES= NMR SPECTRUM
##VAR_NAME=  FREQUENCY,     SPECTRUM/REAL,   SPECTRUM/IMAG
##SYMBOL=    X,             R,               I
##VAR_TYPE=  INDEPENDENT,   DEPENDENT,       DEPENDENT
##VAR_FORM=  AFFN,          ASDF,            ASDF
##VAR_DIM=   16384,         16384,           16384
##UNITS=     HZ,            ARBITRARY UNITS, ARBITRARY UNITS
##FACTOR=    0.220516191357247, 1,           1
##FIRST=     3148.11708267778, 0,            0
##LAST=      -464.599680327999, 0,           0
##MIN=       -464.599680327999, -782706,     0
##MAX=       3148.11708267778, 297815115,    0
$$ Real data points
##PAGE= N=1
##DATA TABLE= (X++(R..R)), XYDATA
$$ [...]
5583B3278484P2182K8766q6048k54168J04231j44554J38080L1183J42565O9923
5573B3380644j67083K19217M71841K68996K48362Q2056L05508L21456m2241M67599
5563B5556355M48365M59896L26180N95457L42034K07700O79043N32169L77354
5554B9524553K10738O08917L27516K14725M48265M68002L5532j96031j03309n29096
5544C1009812n8313m15964o10088m8431l06161o24038n42936m80633r6368l8060
5534B7788820o0342l13708j43315M6762J36823J34082K90864L8283j79217j48769
5524B7590283r8102r5166j92040l19523l83570J38024m1323k96776k54531L67515
5514B6414791K49101K5600L66589p4590N9580j75237R6065k30047k10266K77101
$$ plain form
5583 23278484 23350666 23379432 23293384 23039216 23143447 22998893 23136973 23168156 23310721 23380644
5573 23380644 23213561 23432778 23904619 24173615 24421977 24504033 24809541 25130997 25088756 25556355
5563 25556355 26004720 26464616 26790796 27386253 27728287 27935987 28615030 29147199 29524553
5554 29524553 29735291 30344208 30671724 30886449 31334714 31802716 31838248 31642217 31538908 31009812
5544 31009812 30951499 30535535 29925447 29877016 29570855 28946817 28403881 27923248 27826880 27788820
5534 27788820 27728478 27414770 27271455 27318217 27455040 27589122 27879986 27918269 27739052 27590283
5524 27590283 27492181 27397015 27204975 26885452 26501882 26639906 26598583 26301807 26047276 26414791
5514 26414791 26663892 26689492 27056081 26981491 27041071 26865834 26961899 26731852 26521586 26798687
5504B6798687k64884j94866O2758k5153l80169j60875j2568k23748j63789q5185
5494B5350208k24407m7371k96005j30285m07023k56127P7238n1668j97336j21238
5484B3695986k36568k87447k6432J37223L61259J87251r6096O2526N5633l45080
5474B3508255J44701J46449k31793j5640j9554k08931j14421N6795K60260K1357
5464B3547478L9712Q6213K33154r3998K66565J57014J09446J83975k43656O0338
5454B4346241k90764k88247k58290k04485l73625K2200q1798K06255q8798j62053
5444B2826636O5098r3781J80843J48611o248K35706K76657J37469K67331L39205
5434B4377527L14390k87009P6003M84632J56860N96Q6100M42742J51372L10904
$$ plain form
5504 26798687 26533803 26338937 26401695 26376542 25996373 25835498 25822930 25599182 25435393 25350208
5494 25350208 25125801 25078430 24782425 24652140 24245117 23988990 24066228 24014560 23817224 23695986
5484 23695986 23459418 23171971 23145539 23282762 23644021 23831272 23735176 23797702 23853335 23508255
5474 23508255 23652956 23799405 23567612 23551972 23532418 23323487 23209066 23265861 23526121 23547478
5464 23547478 23587190 23673403 23906557 23812559 24079124 24236138 24345584 24529559 24285903 24346241
5454 24346241 24055477 23767230 23508940 23304455 22930830 22953030 22871232 23077487 22988689 22826636
5444 22826636 22891734 22797953 22978796 23127407 23121159 23356865 23633522 23770991 24038322 24377527
5434 24377527 24691917 24404908 24480911 24965543 25122403 25122999 25209099 25651841 25803213 26114117
5424B6114117M35874K64867J08563M4683K92043M48751L50107L74792N26790J59943
5414B9120530L00089L80766L96191K87849J92916K22471P90180M58787L76155
5405C2525934M17608R95121P83819O43997R86405O99180J013996R20399R51719
5396C9938178L84223O01404N89470M06439M91853K66255L92500M67501L05710
5387D3843533K83093J19082N1265p3713J23417N34180M65368P61340P56662K12106
5377D7076333O47686R67873J075357J018949J243118J616486J593155J668256
5369E6907213K216575K840433K936241L325659M201573M739962N179553N891908
5361H8239117O678188O990227O593078O895207O850531O651557O471453O127466
$$ plain form
5424 26114117 26549991 26814858 26923421 26968104 27260147 27708898 28059005 28433797 28960587 29120530
5414 29120530 29420619 29801385 30197576 30485425 30678341 30900812 31690992 32149779 32525934
5405 32525934 32943542 33938663 34722482 35366479 36352884 37052064 38066060 38986459 39938178
5396 39938178 40322401 40923805 41513275 41919714 42411567 42677822 43070322 43537823 43843533
5387 43843533 44126626 44245708 44296973 44223260 44346677 44880857 45346225 46107565 46864227 47076333
5377 47076333 47724019 48691892 49767249 50786198 52029316 53645802 55238957 56907213
5369 56907213 59123788 61964221 64900462 68226121 72427694 77167656 82347209 88239117
5361 88239117 94917305 101907532 108500610 115395817 122246348 128897905 135369358 141496824
5353A41496824N367182L563585M98131k534274m782377o248747o929180p781068
5345A22650076p550767q075428q056382p905392p404600o562998n911942n192184
5337F5990383m657457m017449l525661k872696k854985k087456j748709j868775
5329D2357195j715493j614877j487761j502976j270568j090567r64893q33305
5321C1876755j082326p37333q38529p36393q80209p34884n87737l86568p41180
5312B5151596o34276n88739l34607l78842n66910m87761l42988n00231l95304
5303B0921938j98852m03642q0668m91452k44547j55241j94155m15536m89860k4526
5293A8223459j05569k17148K46989J3437k00392j98992j35836k03228k76442k06004
$$ plain form
5353 141496824 146864006 150427591 150925722 148391448 143609071 137360324 130431144 122650076
5345 122650076 115099309 107023881 98967499 91062107 83657507 77094509 71182567 65990383
5337 65990383 61332926 57315477 53789816 50917120 48062135 45974679 44225970 42357195
5329 42357195 40641702 39026825 37539064 36036088 34765520 33674953 32710060 31876755
5321 31876755 30794429 30057096 29218567 28482174 27601965 26867081 26279344 25892776 25151596
5312 25151596 24517320 23928581 23593974 23215132 22648222 22160461 21817473 21317242 20921938
5303 20921938 20723086 20319444 20238776 19747324 19502777 19347536 19153381 18737845 18247985 18223459
5293 18223459 18117890 17900742 18147731 18161168 17960776 17761784 17625948 17422720 17146278 16940274
5283A6940274j40752k34600j1046K17957K23064k14758p3017j73043J60355L34059
5273A7028493J7120L1969R918j54620n7893L05816J59794K62345J39117R5325
5263A7837384r3530N6460O2269j51086j72574N7479j84888j5679k03094k33409
5253A6959332J96064K83160Q7150J26603L3288j16245j54404l36392r0270j71780
5243A6816506m69221n29671m52097K40251m30070q72550k29794k52378m19807
5234A3401169l59552n70265l87772j08582o4786K552p4432j86750l19704K9221
5224A1361099k08001k49227O1555J87611l73217J8273O8860k04380n6407K14332
5214A0820498m7226J14117k45036j30726j94783M2147K20170M5455K62795j92217
$$ plain form
5283 16940274 16799522 16564922 16553876 16771833 16994897 16780139 16707122 16534079 16694434 17028493
5273 17028493 17045613 17077582 17087500 16932880 16874987 17180803 17340597 17602942 17742059 17837384
5263 17837384 17743854 17800314 17862583 17711497 17538923 17596402 17411514 17395835 17192741 16959332
5253 16959332 17155396 17438556 17525706 17652309 17685597 17569352 17414948 17078556 16988286 16816506
5243 16816506 16347285 15817614 15365517 15605768 15175698 14303148 14073354 13820976 13401169
5234 13401169 13041617 12471352 12083580 11974998 11910212 11912764 11838332 11651582 11331878 11361099
5224 11361099 11153098 10903871 10965426 11153037 10779820 10798093 10866953 10662573 10606166 10820498
5214 10820498 10773272 10887389 10642353 10511627 10316844 10358991 10579161 10624616 10887411 10695194
5204A0695194q0298o2991j14578J26167j01639j83953n0865m4961j73036o9905
5194I939135k6525j16427J52377K59431J959k97628l27403l0323L93k45388J02150
5183I411751J6743j14446k74059j20585P1728q5570j11932m0056k98063K9083
5173H484594l5897j22964j99895l10956j2072j3961j08932J95702K36171j7754
5163H094036j9051j16421k65202l76365R3228K26548L76150k413l14357j22289
5153G573864l6833O9709J31295l69845o7538J47920r9668p3036O8138R9659m9156
5142G394509k22902j28791K42774R5171j48565p6125K70456m9746O7064K29202
5132G673047J26244J42O7624J9617J48347J18468J98837j38048j20020J63610
$$ plain form
5204 10695194 10614896 10551905 10437327 10563494 10461855 10277902 10227037 10182076 10009040 9939135
5194 9939135 9912610 9796183 9948560 10207991 10209950 9912322 9584919 9554596 9554989 9309601 9411751
5183 9411751 9428494 9314048 9039989 8919404 8991132 8905562 8793630 8753574 8455511 8484594
5173 8484594 8448697 8325733 8125838 7814882 7802810 7788849 7679917 7875619 8111790 8094036
5163 8094036 8074985 7958564 7693362 7316997 7410225 7636773 8012923 8010510 7696153 7573864
5153 7573864 7537031 7606740 7738035 7368190 7300652 7448572 7348904 7275868 7344006 7443665 7394509
5142 7394509 7171607 7042816 7285590 7380761 7232196 7156071 7426527 7376781 7443845 7673047
5132 7673047 7799291 7799433 7867057 7886674 8035021 8153489 8352326 8214278 8094258 8257868
5122H257868k4299L1997P8047j49407n44003O700M3999J00005q8393o0422K99886
5111G951978J01571j28291j97961J75626m4862j78350L8092L03604p8907J79803
5101H122303j84007k5090p3140l07724o8109K37032J2333l14049M6612o3543q0952
5090G301666N348j94766l7180k04590m42722K46773K11057j65542j0868J69316
5080F878492j80863N3352k4309j24769J49545n0213j0666j4901n5098J02062k69235
5069F453397K54111J67610R8780P0181O8201k4555L52432j9723J36674n9043m88030
5058G010035K47205J99033J02811M2446j79043M1310K45899k26631k23869J32421
5048G391617m14643j38561L26496Q8025K84413j66489p8094J276j44632m9060
$$ plain form
5122 8257868 8233569 8265566 8343613 8194206 7650203 7656903 7700902 7800907 7712514 7652092 7951978
5111 7951978 8053549 7925258 7727297 7902923 7858061 7679711 7717803 8021407 7942500 8122303
5101 8122303 7938296 7913206 7840066 7532342 7464233 7701265 7713598 7399549 7446161 7382618 7301666
5090 7301666 7307014 7112248 7075068 6870478 6427756 6674529 6885586 6720044 6709176 6878492
5080 6878492 6697629 6750981 6726672 6601903 6751448 6701235 6690569 6675668 6620570 6722632 6453397
5069 6453397 6707508 6875118 6973898 7044079 7112280 7087725 7440157 7420434 7557108 7498065 7010035
5058 7010035 7257240 7456273 7559084 7601530 7422487 7463797 7709696 7483065 7259196 7391617
5048 7391617 6976974 6838413 7164909 7252934 7537347 7370858 7292764 7294040 7149408 7100348
5038G100348R1903l43265o8218R8340j34109J32932K89294k73907J15107j00888
5028F907537P4258j19564m5972J42736j17705o5267k91292P1007J87590l75788
5018F367540J54685K32887J73937M9307J19750l01141j26548N60351r5523q5929
5008G049316K31778Q4806k66272L51474L8980k20583r7887J70953J98376M1546
4998G582487n3024M6232p6194q5931K16604J0120j32033n4518j17704n1421j28743
4987G155875R457J12137P2317j30990j63022j55664O3534K9645Q0029j87409K34351
4976G120260l5902Q1586j58499l7548J42346k99614R4752J48701J57262o7096
4966G146248j30141J28114J09553Q6062Q2767j03732L4914J60368p0325J34431
$$ plain form
5038 7100348 7192251 6848986 6780768 6879108 6744999 6877931 7167225 6893318 7008425 6907537
5028 6907537 6981795 6862231 6816259 6958995 6841290 6776023 6484731 6555738 6743328 6367540
5018 6367540 6522225 6755112 6929049 6978356 7098106 6796965 6670417 7230768 7135245 7049316
5008 7049316 7281094 7365900 7099628 7451102 7490082 7269499 7171612 7342565 7540941 7582487
4998 7582487 7529463 7575695 7499501 7413570 7630174 7640294 7508261 7453743 7336039 7284618 7155875
4987 7155875 7165332 7277469 7349786 7218796 7055774 6900110 6963644 6993289 7073318 6885909 7120260
4976 7120260 7084358 7165944 7007445 6969897 7112243 6812629 6907381 7056082 7213344 7146248
4966 7146248 7016107 7144221 7253774 7339836 7422603 7318871 7353785 7514153 7443828 7578259
4956G578259J24888M0580k8047J18298K32360q0241J98086K61184J73641J04329
4946H723337n4756J05608L49790p5773j08993K16794Q1132k92244l08297K02789
4936H839387J1351J26455M7376k17131J16187K83693j61165j48895J87724L772
4926I088754o1282k04045k42042m750j39049k81492L23787O757j2582R6408M7488
4915H617952j63238j38678K75355J47798J44641J63554k18607k35739j46498K6909
4905H473449l09006j05282J52023L29160m26125o2388M40946m3362J66089J3742
4895H629246J42125O3427P9870J61617Q89j80336L4456J152L8129m6976J8867
4884H942466J23633l7070J64537o4373j72055r3489J13972O3048l6059j77151
$$ plain form
4956 7578259 7703147 7743727 7715680 7833978 8066338 7986097 8184183 8445367 8619008 8723337
4946 8723337 8668581 8774189 9123979 9048206 8939213 9156007 9237139 8944895 8636598 8839387
4936 8839387 8850738 8977193 9024569 8807438 8923625 9207318 9046153 8897258 9084982 9088754
4926 9088754 9027472 8823427 8581385 8576635 8437586 8156094 8479881 8486638 8474056 8570464 8617952
4915 8617952 8454714 8316036 8591391 8739189 8883830 9047384 8828777 8593038 8446540 8473449
4905 8473449 8164443 8059161 8211184 8540344 8114219 8051831 8492777 8449415 8615504 8629246
4895 8629246 8771371 8834798 8914668 9076285 9077174 8896838 8931294 8932446 8970575 8923599 8942466
4884 8942466 9066099 9029029 9193566 9129193 8957138 8863649 8977621 9040669 9004610 8827459
4874H827459J38723j58833k25161K42563L08682o790j03864j3614q2114J70789
4864I097840K95261r6839J7449J27382K02442K24492q8617J09323K26332L9068
4854A0154133j79639K18188L68860j8586m7042K41206J07219k93588j8669J45922
4844A0678004o2974l07532r6545J57095J97323j42977p5566Q4920M4713k7961
4834A0448500j25867J47485J10948M3776j37266J33838L68635M63487k54091M3425
4824A1242870K28697P0195Q1171l09434j00754M47482L56404l99520L54341L36077
4814A2307529R7146r884j15679J0937k1551L9423J43183N92291J26624N2661K50948
4803A3473628M18635J54147M51700J35561P0067M13873J43488L9624J49076J71217
$$ plain form
4874 8827459 8966182 8807349 8582188 8824751 9133433 9126643 9022779 9009165 8927051 9097840
4864 9097840 9393101 9296262 9313711 9441093 9643535 9868027 9779410 9888733 10115065 10154133
4854 10154133 9974494 10192682 10561542 10542956 10495914 10737120 10844339 10550751 10532082 10678004
4844 10678004 10615030 10307498 10210953 10368048 10565371 10422394 10346828 10431748 10476461 10448500
4834 10448500 10322633 10470118 10581066 10624842 10487576 10621414 10990049 11453536 11199445 11242870
4824 11242870 11471567 11541762 11622933 11313499 11212745 11660227 12016631 11617111 11971452 12307529
4814 12307529 12404675 12394791 12279112 12290049 12268498 12307921 12451104 13043395 13170019 13222680 13473628
4803 13473628 13892263 14046410 14498110 14633671 14703738 15117611 15261099 15300723 15449799 15621016
4793A5621016M57377M80574M88970O11698N95812O97446Q33180R73088J290229
4784B2049390J683951K185579K744195K974339L329409J913868k78958j965694
4776C4636079l708629l290836k412447k100374j374855n81257l38020l45634j47745
4767B0336282j37487j20742m1765m16561J88091O4026L3153k6067m7226L86448
4757B0218152K49850l4074M04601J81574L7372L11293R6887K70202J32684L72314
4747B2240855J23222K21075K17330K61809M69324m8839J35150L30341K34582O7458
4737B4252307K98025P51995N12184L87685J80314N91796O37287P81008N58128
4728B8950729R13735P94378P03413Q45822J340156J582404J987735K372340K397132
$$ plain form
4793 15621016 16078393 16558967 17047937 17659635 18255447 18952893 19786073 20759161 22049390
4784 22049390 23733341 25918920 28663115 31637454 34966863 36880731 36601773 34636079
4776 34636079 30927450 27636614 25224167 23123793 21748938 21167681 20829661 20484027 20336282
4767 20336282 20198795 20078053 20036288 19619727 19807818 19871844 19904997 19878930 19831704 20218152
4757 20218152 20468002 20433928 20838529 21020103 21057475 21368768 21465655 21735857 21868541 22240855
4747 22240855 22364077 22585152 22802482 23064291 23533615 23484776 23619926 23950267 24184849 24252307
4737 24252307 24550332 25302327 25814511 26202196 26382510 26974306 27611593 28392601 28950729
4728 28950729 29864464 30658842 31362255 32208077 33548233 35130637 37118372 39490712 41887844
4719D1887844K991953L058436O04574n78119j386065l083299l145909k549669
4711C7799746j596816j156132m94487O153m62419k26410L57998J43919M4012K46373
4701C4661937L9703J00331M17085K49261J02006K70614L94622J06822O44865K12397
4691C7199643K36220M51157J70951L21707M7274M3297K36340K57124k01837j98632
4681C8563244J06091J94076J37707L14934M23321M36639O85248Q29481O54693
4672D2345434L89480L03457M92853N44022M12029N57699L89738P1102O3953J00245
4662D5670012j37003J09623J34605k34923L6557J18348N3032N2472j66165o0536
4652D5576022J06104J41359K248J11757r5390K63588K71237K46123J17781L6527
$$ plain form
4719 41887844 44879797 47938233 48542807 47964688 46578623 43495324 40349415 37799746
4711 37799746 36202930 35046798 34552311 34558464 34096045 33869635 34227633 34371552 34415564 34661937
4701 34661937 34701640 34801971 35219056 35468317 35570323 35840937 36235559 36342381 36987246 37199643
4691 37199643 37435863 37887020 38057971 38379678 38426952 38470249 38706589 38963713 38761876 38563244
4681 38563244 38669335 38863411 39001118 39316052 39739373 40176012 40861260 41690741 42345434
4672 42345434 42734914 43038371 43531224 44075246 44487275 45044974 45434712 45505814 45569767 45670012
4662 45670012 45533009 45642632 45777237 45542314 45578871 45697219 45750251 45802723 45636558 45576022
4652 45576022 45682126 45823485 45825733 45937490 45842100 46105688 46376925 46623048 46740829 46777356
4642D6777356L00766k158M40761M40790J49022M93614M98361M95032K37430J22309
4632D9953283K44297N17528O40658N08254R31997Q71715R70655J125909J001862
4623E6766158J205976J371331J407107J379908J006232J206974R78181M39969
4615F5761836K32698K08703K79565N07087L38890M21562Q23264J074529J035822
4606G0683956J162137J390292J948528K035388K105490K688444L284796L960316
4598H9259347M278561M668935M692420L849324K556976O41902j430463j511534
4590A07005468j420384k53997R01811K308567L268107M245079N230480N709436
4582A26994567M890456L934597K570090R26322p02089j785870k152019l002371
$$ plain form
4642 46777356 47078122 47075964 47516725 47957515 48106537 48600151 49098512 49593544 49830974 49953283
4632 49953283 50197580 50715108 51355766 51864020 52796017 53667732 54638387 55764296 56766158
4623 56766158 57972134 59343465 60750572 62130480 63136712 64343686 65321867 65761836
4615 65761836 65994534 66203237 66482802 66989889 67328779 67750341 68573605 69648134 70683956
4606 70683956 71846093 73236385 75184913 77220301 79325791 82014235 85299031 89259347
4598 89259347 93537908 98206843 102899263 106748587 109305563 109947465 108517002 107005468
4590 107005468 105585084 105331087 106232898 108541465 111809572 116054651 121285131 126994567
4582 126994567 131885023 135819620 138389710 139316032 138613943 136828073 134676054 131673683
4574A31673683l105143l106427l436700l631316l264151l308106l232043l101811
4566A05487986k795576k273163k384814k455050k048822j824881j824443j429335
4558H8451902j644833k608621k425604k545589j783889j684423j543673j449026
4550G2766244j379361j531459j524642j222021j218466q69178j357949r03250
4542F2759918p26964p01892o83083p73270j027225o07375o73319m23156p29823
4533E6413811r40581n75234m49985k27607l54492k72828k97901m45171m43364
4524E2406648j75424j99655l58898l42355k25106k98708n66567n03095n26753
4515D9210087r73968j076904p71730r62268r72741o86134j148690o15911m62505
$$ plain form
4574 131673683 128568540 125462113 122025413 118394097 115129946 111821840 108589797 105487986
4566 105487986 102692410 100419247 98034433 95579383 93530561 91705680 89881237 88451902
4558 88451902 86807069 84198448 81772844 79227255 77443366 75758943 74215270 72766244
4550 72766244 71386883 69855424 68330782 67108761 65890295 65021117 63663168 62759918
4542 62759918 62032954 61331062 60647979 59874709 58847484 58240109 57566790 57143634 56413811
4533 56413811 55473230 54897996 54448011 54220404 53865912 53593084 53295183 52850012 52406648
4524 52406648 52231224 52031569 51672671 51330316 51105210 50806502 50239935 49736840 49210087
4515 49210087 48236119 47159215 46387485 45425217 44452476 43766342 42617652 42001741 41539236
4506D1539236m20059o08102m42960j75380j02758j53388J17737r3017p9488K5794
4496C9607615L89029O1531j31649k54626k93197l76466m19813k01567k76809j24487
4486C7979561j43740P362P9399J98080L51679O22794L72870K66184O99611J44273
4476D0578073M42226M63330K58659O22243K03148j00627K2981J90406n0363p2869
4466D2557207Q7710K4956J71272Q5547j65314K12349p1581K55382Q3597p4058
4456D3167067M35022K37674j0894R0671k00252K9137K76264l8977K9524k38319
4446D3776917j32087k18162m8119N74495M04432M59476P23473O52032O37422R19591
4436D7749470O94198P37132O82418R82182J237441J212906J051639J450813J545950
$$ plain form
4506 41539236 41119177 40511075 40068115 39892735 39789977 39636589 39754326 39661309 39581821 39607615
4496 39607615 39996644 40058175 39926526 39671900 39378703 39002237 38582424 38380857 38104048 37979561
4486 37979561 37835821 37843183 37922582 38120662 38472341 39095135 39468005 39734189 40433800 40578073
4476 40578073 41020299 41483629 41742288 42364531 42567679 42467052 42490033 42680439 42630076 42557207
4466 42557207 42644917 42669873 42841145 42926692 42761378 42973727 42902146 43157528 43241125 43167067
4456 43167067 43602089 43839763 43828869 43919540 43719288 43748425 44024689 43985712 44015236 43776917
4446 43776917 43644830 43426668 43378549 43953044 44357476 44816952 45540425 46192457 46829879 47749470
4436 47749470 48443668 49180800 49863218 50845400 52082841 53295747 54347386 55798199 57344149
4427E7344149J498718J765581J617199J734838K106524K184822K519255K624151
4419G3395237K540896K400305K315204J492613J235148R73850M49983K68479M16907
4410H5488622O23403M36814K82386J29258k59226m94291j25671M98934N86718
4401H7166947J184147J974529K550941L239807L201062L968873M912154O196214
4393A14394674Q079401J0086529J2783555J5963043J9262233K0786917J9147237
4386B20503589J0579939o641361k2068961k6722530k3145244j8368729j4459560
4379A19677143j0667045q004206n892785m460719l451495k606344k109405j987684
4371H0497460j989268j546159j552872j372836q31599o31609p17370r88024r22693
$$ plain form
4427 57344149 58842867 60608448 62225647 63960485 66067009 68251831 70771086 73395237
4419 73395237 75936133 78336438 80651642 82144255 83379403 84353253 84803236 85071715 85488622
4410 85488622 86112025 86548839 86831225 86960483 86701257 86206966 86081295 86580229 87166947
4401 87166947 88351094 90325623 92876564 96116371 99317433 103286306 108198460 114394674
4393 114394674 122474075 132560604 145344159 161307202 180569435 201356352 220503589
4386 220503589 231083528 224442167 202373206 175650676 152505432 134136703 119677143
4379 119677143 109010098 101005892 95113107 90652388 87200893 84594549 82485144 80497460
4371 80497460 78508192 76962033 75409161 74036325 73204726 72573117 71855747 70867723 69945030
4362F9945030o38590n35586n98220p44254m85229k14588l39128k97039N6260k155
4352F6146501J67845K82880N71922M23142Q50037J209541J368139J678714K338010
4343G5036731K649040L161741L583162M317812N401559O549951P283142Q244428
4335A16227566R051431R236340Q231426N686844J433629l869214q164210j0672917
4327A27160895j0862964j0037013q677533p368198o394570n291761m345108l323957
4319G0859791l246946k906205k170109j846354j775931j462967j116669j565020
4311E4769590j267604j226253j674153j446113j420464j442216j205564j291009
4303D3796214j278885r08632q90761p91104q82801q19949n06183n40144o17428
$$ plain form
4362 69945030 69306440 68770854 68172634 67428380 66943151 66728563 66389435 66092396 66148656 66146501
4352 66146501 66314346 66597226 67169148 67592290 68442327 69651868 71020007 72698721 75036731
4343 75036731 77685771 80847512 84430674 88748486 94150045 100699996 107983138 116227566
4335 116227566 125278997 134515337 142746763 148433607 149867236 145998022 137833812 127160895
4327 127160895 116297931 106260918 97583385 90215187 83820617 78528856 74183748 70859791
4319 70859791 67612845 64706640 62536531 60690177 58914246 57451279 56334610 54769590
4311 54769590 53501986 52275733 50601580 49155467 47735003 46292787 45087223 43796214
4303 43796214 42517329 41608697 40717936 39926832 39044031 38224082 37717899 37177755 36560327
4294C6560327q46302m67829o17617k63947r9948k26010l82915k81088n0834M6443
4284C3370280k96706j99150k60465q4956k0496j51622K46693k70057k34332l49829
4274C1749360l43692l49875k76096r6122n80414n03633n79349l66132l04722o3151
4264B8286174k77300p5749p9022k95156j35156j2270R0801k67510K1316j90469
4254B7065659k63107l969P5954j69372j94978q8988j80817j94240k88743K6251
4244B5783650k30578P128L3526K36622P5299k65258J56389K79480j92346k40309
4234B5643603j74362L4572M44073q6175r1950K57676j05769J45885J12755K16541
4224B6396849K23235J2377Q835K50413L37204j6845K63087Q8268K82710J83993
$$ plain form
4294 36560327 35714025 35246196 34628579 34364632 34264684 34038674 33655759 33374671 33323837 33370280
4284 33370280 33073574 32874424 32613959 32529003 32508507 32356885 32603578 32333521 32099189 31749360
4274 31749360 31405668 31055793 30779697 30683575 30103161 29599528 29020179 28654047 28349325 28286174
4264 28286174 28008874 27933125 27854103 27558947 27423791 27411521 27502322 27234812 27256128 27065659
4254 27065659 26802552 26798583 26874537 26705165 26510187 26421199 26240382 26046142 25757399 25783650
4244 25783650 25553072 25560200 25593726 25830348 25905647 25640389 25796778 26076258 25883912 25643603
4234 25643603 25469241 25503813 25947886 25861711 25769761 26027437 25921668 26067553 26180308 26396849
4224 26396849 26620084 26632461 26641296 26891709 27228913 27212068 27475155 27563423 27846133 28030126
4214B8030126L61536K19197j7522N06136P78436J78988K14115L16707J76045J20688
4204C0884452Q1377m9537k17415l7155R9016L73785K89251J71663R1247J85157
4194C1871841J57504l7985j39286K21424l47350n68231j14840n38227q2807l77727
4184C0044316m72679j35755j6359j44278j28116q5141O6040q9426K587J50125
4174B9191314k13966j24443K69658N815L7343K22810j833Q0790K23859M32109
4164C0123456L50414K27313J91964M70475M85855M51384N00140K64284Q104j12850
4154C2960539j79901k93120k11859l13751k66039m2893J01684m8057r4927k61561
4144C1350115n18399n27921l49612o1987j98166j19990l4755J01007N1397l47035
$$ plain form
4214 28030126 28391662 28610859 28593337 29099473 29877909 30056897 30271012 30587719 30763764 30884452
4204 30884452 30965829 30916292 30698877 30661722 30760738 31134523 31423774 31595437 31686684 31871841
4194 31871841 32029345 31991360 31852074 32073498 31726148 31157917 31043077 30504850 30422043 30044316
4184 30044316 29571637 29435882 29419523 29275245 29147129 29061988 29128028 29038602 29041189 29191314
4174 29191314 28977348 28852905 29122563 29128378 29165721 29388531 29386698 29467488 29691347 30123456
4164 30123456 30473870 30701183 30893147 31363622 31849477 32300861 32801001 33065285 33073389 32960539
4154 32960539 32780638 32487518 32275659 31961908 31695869 31652976 31754660 31706603 31611676 31350115
4144 31350115 30831716 30303795 29954183 29892196 29694030 29574040 29539285 29640292 29691689 29344654
4134B9344654k94213k62556k79660k04474J5334j23519j0185K20847K07405M60020
4124B9073653r7589Q8823K09989K38275L45508M15589o6509J37912L2347q3078
4114C0294920Q0885k33860k23608k38597m25411j90364k19273k17632m39884o2956
4104B8124220l65667k41594p212k91228n1781k59252N9822j93750R6055o6153
4094B6803460N4564L8606J01540J02983N2764j83510j61389r9168l5149K19053
4084B6893754K80969K03888J78565J06254J86047J99370L79685L75324K17343
4075B9021199N23058L87249J96320O5474L8279L20705K73587M98113L67528O8911
4065C1760423L7181L02875O56203N03739K03462L54035j23272J04149L72429q9782
$$ plain form
4134 29344654 29050441 28787885 28508225 28303751 28319085 28195566 28185381 28406228 28613633 29073653
4124 29073653 28976064 29064887 29274876 29513151 29858659 30274248 30207739 30345651 30377998 30294920
4114 30294920 30375805 30141945 29918337 29679740 29254329 29063965 28844692 28627060 28187176 28124220
4104 28124220 27758553 27516959 27509747 27218519 27166738 26907486 26967308 26773558 26869613 26803460
4094 26803460 26858024 26896630 26998170 27101153 27153917 26970407 26809018 26709850 26674701 26893754
4084 26893754 27174723 27378611 27557176 27663430 27849477 28048847 28428532 28803856 29021199
4075 29021199 29544257 29931506 30127826 30193300 30231579 30552284 30825871 31323984 31691512 31760423
4065 31760423 31797604 32100479 32756682 33260421 33463883 33817918 33694646 33798795 34171224 34081442
4055C4081442J4184J39645k5250l25508l34077k44531L20376r2174J03790j93459
4045C3444438m83210K47998N1943m2422M61222j56276K270j55201R3500J26768
4035C3591030j97093J52142J7037j6757j0100K2619K99263M50057l26682j01404
4025C3880112j80761k40859J01530j10274k93381K9097l4469K0338j47385J25034
4015C3148982L30670L79006j42972l09557m1945l3843J95246M8147l9763K08430
4005C3742401J00029j38199K49064N96055L40827q109K85166q3141K08742M60809
3995C5753644J17897J82661L08953J76190O32929J83386O39713L39927K04726
3986C8540026p2503n2699q4330l89833m7656j04810R4791j7440k19547j87593
$$ plain form
4055 34081442 34095626 34235271 34210021 33884513 33550436 33305905 33626281 33534107 33637897 33444438
4045 33444438 32961228 33209226 33261169 33218747 33679969 33523693 33525963 33370762 33464262 33591030
4035 33591030 33393937 33546079 33563116 33546359 33536259 33558878 33858141 34308198 33981516 33880112
4025 33880112 33699351 33458492 33560022 33449748 33156367 33185464 33150995 33171333 33023948 33148982
4015 33148982 33479652 33858658 33715686 33406129 33364184 33330341 33525587 33573734 33533971 33742401
4005 33742401 33842430 33704231 33953295 34549350 34890177 34882068 35167234 35084093 35292835 35753644
3995 35753644 35871541 36054202 36363155 36539345 37172274 37355660 37995373 38335300 38540026
3986 38540026 38467523 38414824 38330494 37940661 37893005 37788195 37882986 37865546 37645999 37458406
3976C7458406N3268k47882j73547n07061o65450p03678p83978m98389o67512n93731
3966C2670446j04266l48599p66106n77748j11064k48950p31941p44983q08174
3957B8228615r75019p69409q48521p13865o48059r23056l88077k37411l75120
3948B2350078o84784n86028m15619k08229n59577o43868p30245n94988j20556
3939A7806184m21929j79632n05532m13929m24654k18245m57573j73040m95353
3930A4516297n01110M8482m05554l05775j99705l72640j17973l20885M2677k99937
3920A2083877l83952k18301l95660k18992O7080j44409r8530J21926m75112l73951
3910I963976j43022J08600k99244l43566j38796P3655k61767n62645q8260r4206
$$ plain form
3976 37458406 37511674 37263792 37090245 36583184 35917734 35214056 34430078 33931689 33264177 32670446
3966 32670446 32566180 32217581 31451475 30873727 30762663 30513713 29781772 29036789 28228615
3957 28228615 27253596 26484187 25635666 24921801 24273742 23350686 22962609 22725198 22350078
3948 22350078 21665294 21079266 20663647 20455418 19895841 19251973 18521728 17926740 17806184
3939 17806184 17384255 17204623 16699091 16285162 15860508 15642263 15184690 15011650 14516297
3930 14516297 14015187 14063669 13658115 13352340 13152635 12779995 12662022 12341137 12383814 12083877
3920 12083877 11699925 11481624 11085964 10866972 10934052 10789643 10691113 10813039 10337927 9963976
3910 9963976 9820954 9929554 9630310 9286744 9147948 9221603 8959836 8397191 8308931 8214725
3900H214725O4414J37799j35376k52047j21513l23022q0261N4976q7254j79964
3890G292477J80999j92224K7125l0860r6013N5134n7001L9551k9557n7619l31592
3879F800420j43593j96028J51722L4645k0265k02606j0524k49641R9673J7726
3869F281529l3993j73491m84345L63062J4455o0197K26m6766j72336N957O7953
3858E762054j88507J79052j48594o9032J75090j45281n6502q8739k15293J31997
3848E336245m4194P9135K19992j913q8963l4576j01879m178j27784l294N6916
3837E285507M1280j58612j1002q5867j30630N5567o7650J21243o4572L7856q514
3826E014606R6541j48352j858K28055R2422K96266k73647p9097J38654m3331j0907
$$ plain form
3900 8214725 8279139 8416938 8281562 8029515 7908002 7584980 7504719 7559695 7472441 7292477
3890 7292477 7473476 7281252 7308377 7277517 7181504 7236638 7179637 7219188 7189631 7132012 6800420
3879 6800420 6656827 6460799 6612521 6647166 6626901 6424295 6413771 6164130 6263803 6281529
3869 6281529 6247536 6074045 5589700 5952762 5967217 5907020 5907246 5860480 5688144 5694101 5762054
3858 5762054 5573547 5752599 5604005 5534973 5710063 5564782 5508280 5419541 5204248 5336245
3848 5336245 5292051 5371186 5591178 5589265 5500302 5465726 5363847 5359669 5231885 5228591 5285507
3837 5285507 5326787 5168175 5157173 5071306 4940676 4996243 4928593 5049836 4985264 5023120 5014606
3826 5014606 5111147 4962795 4960937 5188992 5281414 5577680 5304033 5224936 5363590 5320259 5309352
3815E309352m04600l3604L0648K8958l248r1092j09053p2846j1357j08807L7157
3804D571508R8524l2293N4513l1645m7475J38003Q052L9048j75702M9442Q8346
3793D760321O2768o4798k66123j85085O6005r2143J58672L1338N1914j2034l63661
3782D147174J29066L14237J20130k9674q8071K3539l50908j24671k7818K39053
3772D352057K12837j89389J64081n196k3606m21797Q7533J10244N4892j48790
3762D192866j05184P7603l8480K35497K09719P1019m9984N0206N8690j53417J28426
3751D676961k03733l8517J88533N9161k26317p8926j94292J25482p2203j17843
3741D118306J52062J69955m5815L7945j67787J62072J45751o8723J4731k94189
$$ plain form
3815 5309352 4904752 4871148 4901796 4930754 4927506 4836414 4727361 4654515 4643158 4534351 4571508
3804 4571508 4670032 4637739 4692252 4660607 4613132 4751135 4759187 4798235 4622533 4671975 4760321
3793 4760321 4823089 4758291 4492168 4307083 4373088 4280945 4439617 4470955 4522869 4510835 4147174
3782 4147174 4276240 4590477 4710607 4680933 4592862 4616401 4265493 4140822 4113004 4352057
3772 4352057 4564894 4375505 4539586 4534390 4510784 4088987 4176520 4286764 4341656 4192866
3762 4192866 4087682 4165285 4126805 4362302 4572021 4643040 4593056 4643262 4701952 4548535 4676961
3751 4676961 4473228 4434711 4623244 4682405 4456088 4377162 4182870 4308352 4236149 4118306
3741 4118306 4270368 4440323 4394508 4432453 4264666 4426738 4572489 4503766 4518497 4224308
3731D224308J99440k12446J76603j14118J00876j05407M8728O1753j43628j15967
3721D120142K62963J21941n3549M3209n4724J10428P6915j17151j44232K07759
3711D573701J53519j01066j15713j03988L52282k55988l54711Q980K38057J11963
3701D507036m5159M25211j68436J40132k30542J1773K53710o4618j19833j75899
3691D533375J70097J69597n0056j80623j57249k05891M13222k3429k4146M05360
3681E050257k74246r8615Q4555K4116J07755R0966p2342M0591J29014l9882O6213
3670E108382J0197n8653j89370j65620J95284L4591k3035K21333O9552K10432
3660E413093M020k82420K96968J15134q425j27447k2724m18954J73118L71393
$$ plain form
3731 4224308 4423748 4211302 4387905 4273787 4374663 4269256 4317984 4379737 4236109 4120142
3721 4120142 4383105 4505046 4451497 4494706 4439982 4550410 4627325 4510174 4365942 4573701
3711 4573701 4727220 4626154 4510441 4406453 4758735 4502747 4148036 4157016 4395073 4507036
3701 4507036 4461877 4887088 4718652 4858784 4628242 4640015 4893725 4829107 4709274 4533375
3691 4533375 4703472 4873069 4823013 4642390 4485141 4279250 4692472 4669043 4644897 5050257
3681 5050257 4776011 4677396 4761951 4786067 4893822 4984788 4912446 4953037 5082051 5042169 5108382
3670 5108382 5118579 5059926 4870556 4704936 4900220 4934811 4911776 5133109 5202661 5413093
3660 5413093 5417113 5134693 5431661 5546795 5538370 5410923 5388199 4969245 5142363 5513756
3650E513756j15582P631j2815n0405J35313k6179n8364k75566J6816K40256k92884
3639E081977r1641m2918J04309K77564P8278J61532J12566j68831P0263L12467
3629E895566M9868l5026r3101j25697n385j38495J10071K21133k22637k18704
3619E437593K23547j36030r0945L7282j10752O1982L7601L12089O5457k9103J63720
3608E972441R8963j48646l88612K90849l9700j10775J17006L11493j76881J22359
3598F048497J05679M7728k7210L9267J56491j90665K24719k3688j39702K47214
3588F488330K48736J2103k22883k10641L16259Q8733j27205K2636j42027J16755
3578F590796J52585P8725K16444k2923L5615k47504j36192K86184j20304k41373
$$ plain form
3650 5513756 5398174 5405805 5392990 5342585 5477898 5451719 5393355 5117789 5134605 5374861 5081977
3639 5081977 4990336 4947418 5051727 5329291 5407569 5569101 5681667 5512836 5583099 5895566
3629 5895566 5945434 5910408 5817307 5691610 5686225 5547730 5657801 5878934 5656297 5437593
3619 5437593 5661140 5525110 5434165 5471447 5360695 5422677 5460278 5772367 5837824 5808721 5972441
3608 5972441 6071404 5922758 5534146 5824995 5785295 5674520 5791526 6103019 5926138 6048497
3598 6048497 6154176 6201904 6174694 6213961 6370452 6179787 6404506 6380818 6241116 6488330
3588 6488330 6737066 6749169 6526286 6315645 6631904 6720637 6593432 6616068 6474041 6590796
3578 6590796 6743381 6822106 7038550 7015627 7051242 6803738 6667546 6953730 6833426 6592053
3568F592053L61978K27168R2077j1510P4864K07917L6165R6146j33732j0064O5582
3557G598644K17467K47433K27762o8330J51516K2659N4882P2193K61391j7009
3547H768608L227O9271j41100o7002L15614J96604N612K55349M9548L14576r2005
3536I678302r2801K54217N7797l8638J02831j67750J5196N9364J88633K65269
3526A0322420J12519J21288L6505M5128m6749k9977J42753p2603j06882O0037
3516A0584439N2924K9994L87136m8676k10771L8231O2473j42137L31544O7257
3506A1152414N0318L00722p6516K05731J7353j03334j22547J8283K81028K90916
3496A2014368R526k37680K40350J59402j12588M01173p9688m2291L34067R6801
$$ plain form
3568 6592053 6954031 7181199 7273276 7261766 7336630 7544547 7580712 7676858 7543126 7533062 7598644
3557 7598644 7816111 8063544 8291306 8222976 8374492 8397151 8452033 8524226 8785617 8768608
3547 8768608 8771835 8841106 8700006 8633004 8948618 9145222 9150834 9406183 9455731 9770307 9678302
3536 9678302 9585501 9839718 9897515 9858877 9961708 9793958 9809154 9868518 10057151 10322420
3526 10322420 10434939 10556227 10592732 10637860 10591111 10561134 10703887 10631284 10524402 10584439
3516 10584439 10637363 10667357 11054493 11005817 10795046 10833277 10895750 10753613 11085157 11152414
3506 11152414 11202732 11503454 11426938 11632669 11650022 11546688 11424141 11442424 11723452 12014368
3496 12014368 12023894 11786214 12026564 12185966 12073378 12474551 12394863 12352572 12686639 12783440
3486A2783440M276k84155j8850N16125J13596k765K63689K68000R4623J08250
3476A3846229M90411K81728l48569m5580p797Q0007N34547K82478K16269L44225
3466A5673948K79476M19286L88173J31973L55954r2691K03298L42577J82584L10244
3456A8194822J59769J34282N18952R5201J97025J62012K23882M14418J08364K61710
3446B0470437L74575q7659K63605L64109K34071N9197K66209L69496J50317J53243
3436B2617600L23444L68686P7150N51696J63633J66000K01022J93764o4890K5978
3426B4624083J23796K43480O2401J35514J39150L9352L95448J94862L20284N85473
3416B6863843K41706n4019K48148J98633K878L00277q2694L35752N9910j58416
$$ plain form
3486 12783440 12787716 12503561 12484711 13000836 13114432 13111667 13375356 13643356 13737979 13846229
3476 13846229 14336640 14618368 14269799 14224219 14216422 14296429 14830976 15113454 15329723 15673948
3466 15673948 15953424 16372710 16760883 16892856 17248810 17156119 17359417 17701994 17884578 18194822
3456 18194822 18354591 18488873 19007825 19103026 19300051 19462063 19685945 20100363 20208727 20470437
3446 20470437 20845012 20757353 21020958 21385067 21619138 21678335 21944544 22314040 22464357 22617600
3436 22617600 22941044 23309730 23386880 23938576 24102209 24268209 24469231 24662995 24598105 24624083
3426 24624083 24747879 24991359 25053760 25189274 25328424 25367776 25763224 25958086 26278370 26863843
3416 26863843 27105549 27051530 27299678 27498311 27501189 27801466 27718772 28054524 28114434 27956018
3406B7956018K74514M33482K52722O1049N42468j49169k66065P9979L1523L38323
3396B9554844m1479J2348L2168L01828O7461J656p2352L01428K16123r228O2963
3385C0427760K65351L49744j2888J61693L48636M09493L01555L92064O1940N50783
3375C3256131K67901L5217K91897l0363m3558J54187L62209J18512r3667J22034
3365C4440500J022r8992K40641J87426j426J49170L54218L40011K23817K02538
3355C6038925L783k00496k02797j42542r8609j80513P6396j60015j05027j21728
3345C4907377K409L15625L30370M26370J71521J09809L01398K29577M16912M85567
3335C7696935M05490N19008J87468K31154M99899R41132M93326N16824L95178
$$ plain form
3406 27956018 28230532 28664014 28916736 28977785 29520253 29371084 29105019 29184998 29216521 29554844
3396 29554844 29513365 29525713 29557881 29859709 29927170 29928826 29856474 30157902 30374025 30364797 30427760
3385 30427760 30693111 31042855 31029967 31191660 31540296 31949789 32251344 32643408 32705348 33256131
3375 33256131 33524032 33559249 33851146 33820783 33777225 33931412 34293621 34412133 34318466 34440500
3365 34440500 34441522 34342530 34583171 34770597 34769171 34918341 35272559 35612570 35836387 36038925
3355 36038925 36042708 35842212 35639415 35496873 35398264 35217751 35294147 35134132 35029105 34907377
3345 34907377 34909786 35225411 35555781 35982151 36153672 36263481 36564879 36794456 37211368 37696935
3335 37696935 38102425 38621433 38808901 39040055 39539954 40481086 40974412 41491236 41886414
3326D1886414L45717N64617M32064K48615M29661M14924O58989N94562M09604
3317D5985167O47576M90722L76892N44234N96970O34057M74070K13920N31600
3308E0495208P66426N37134O51230N45517M95448P84539Q75985Q33776O48415
3299E6633678O79560J118383R83107J022161O98901R59126J460376J356800J501172
3290F6413264J475522J332436J261325J267929J470470J906143J675017J963694
3282G8765800K389089K259188K264052K659328K700176K541683L475966L694077
3274A00749359K981914L167874L484857L993954M264057L796411M035123M216842
3266A30690391M289520M254515M070167M900290M578136M011672M153433L956648
$$ plain form
3326 41886414 42232131 42796748 43228812 43477427 43907088 44322012 44981001 45575563 45985167
3317 45985167 46632743 47123465 47500357 48044591 48641561 49275618 49749688 49963608 50495208
3308 50495208 51261634 51798768 52449998 52995515 53490963 54275502 55151487 55985263 56633678
3299 56633678 57313238 58431621 59414728 60436889 61135790 62094916 63555292 64912092 66413264
3290 66413264 67888786 69221222 70482547 71750476 73220946 75127089 76802106 78765800
3282 78765800 81154889 83414077 85678129 88337457 91037633 93579316 97055282 100749359
3274 100749359 103731273 106899147 110384004 114377958 118642015 122438426 126473549 130690391
3266 130690391 134979911 139234426 143304593 148204883 152783019 156794691 160948124 164904772
3258A64904772M105437L796817L759653L849450L229472L032788K680582K469243
3250A91828214K372043K363598K041405J875454J506245J549480J146411O73006
3242B05355856Q79498N56718P28486Q16383O70727J397824J114817J175148J308294
3233B14003751J201896P63609J74836j91118o51767j231036j928644k578963l006291
3224B06556273l322168l229576l116824k740042k444900k551552k582599k236319
3216A84332293k349809l013138l118302m015605m413567m802372m942247n330018
3208A52347235n435693n303591m864244m691410m554583m556213m552683l541976
3200A14846842l319176k989709k933972k403380j906870j969388j332370j446519
$$ plain form
3258 164904772 169010209 172807026 176566679 180416129 183645601 186678389 189358971 191828214
3250 191828214 194200257 196563855 198605260 200480714 201986959 203536439 204682850 205355856
3242 205355856 206235354 206792072 207520558 208336941 209007668 210405492 211520309 212695457 214003751
3233 214003751 215205647 215969256 216144092 215952974 215301207 214070171 212141527 209562564 206556273
3224 206556273 203234105 200004529 196887705 194147663 191702763 189151211 186568612 184332293
3216 184332293 181982484 178969346 175851044 171835439 167421872 162619500 157677253 152347235
3208 152347235 146911542 141607951 136743707 132052297 127497714 122941501 118388818 114846842
3200 114846842 111527666 108537957 105603985 103200605 101293735 99324347 97991977 96545458
3192I6545458j229094j278407j038363j147183j484381j006946j088954r80236
3184H7291894j004474j034505j113787j118474r69653j154581r45427q71715r90014
3175G8089264p28875q20423q70770r30495r78683m95254p94730p50622q07002
3166G0912410r55000n57099p17817j173066p57397p31591j029042n78071o12838
3157F3800489q26404o00788l48030n10759k01070K4164k54302j80576P3547j193
3147F0975078j32483M819K32020K84482L35444L51921L02793L14639L75337n2131
3137F2991919J56787N70998J58736L43189K65147L53957N89109N73660K32430
3128F6235932N28941N00470O29167N64166R5413K10684P6907O4045k03076J69604
$$ plain form
3192 96545458 95316364 94037957 92999594 91852411 90368030 89361084 88272130 87291894
3184 87291894 86287420 85252915 84139128 83020654 82051001 80896420 79950993 79079278 78089264
3175 78089264 77360389 76539966 75669196 74738701 73760018 73264764 72470034 71719412 70912410
3166 70912410 69957410 69400311 68682494 67509428 66752031 66020440 64991398 64413327 63800489
3157 63800489 62974085 62373297 62025267 61514508 61313438 61337602 61083300 60902724 60976271 60975078
3147 60975078 60842595 60847414 61079434 61363916 61699360 62051281 62354074 62668713 63044050 62991919
3137 62991919 63148706 63719704 63878440 64221629 64486776 64840733 65429842 66003502 66235932
3128 66235932 66764873 67265343 67894510 68458676 68554089 68764773 68841680 68905725 68702649 68872253
3118F8872253K25001k85097j77552J95217K72407K202j73953J66637L00140K49738
3108F9646993R4580K73163K71047N00576r5827j5133R8028L87243O67256j1275
3098G1816651N55742J048516Q70363O71040P74338P93003J094824J213570J071824
3089G9909871J268635R75473J219559J356070J644310J309830J398047J566585
3081I0648380J645014J885088J572582J683747J935560J745205J336092J127627
3073A03579295R64504Q68875M76359R811m09787o19631j218444j454618j768877
3064A00427487j704993k075915k172935k093448j837880j999015j584043j660257
3056H5299001j421276j007227j168500q19584o49807j49742m66674n93267o22511
$$ plain form
3118 68872253 69097254 68812157 68634605 68829822 69102229 69104431 68930478 69097115 69397255 69646993
3108 69646993 69741573 70014736 70285783 70786359 70690532 70675399 70773427 71160670 71827926 71816651
3098 71816651 72372393 73420909 74291272 74962312 75736650 76529653 77624477 78838047 79909871
3089 79909871 81178506 82153979 83373538 84729608 86373918 87683748 89081795 90648380
3081 90648380 92293394 94178482 95751064 97434811 99370371 101115576 102451668 103579295
3073 103579295 104543799 105412674 105889033 105898844 105489057 104869426 103650982 102196364 100427487
3064 100427487 98722494 96646579 94473644 92380196 90542316 88543301 86959258 85299001
3056 85299001 83877725 82870498 81701998 80882414 80232607 80082865 79616191 79022924 78400413
3047G8400413p23338o72427r50807q46581j035000j316172j336153j356608j432192
3038F8731135j481344j478880j557760j576037j355599r19426j101499q53600
3030E8406990o96764q68258m95842p11826k86289q098k08927j33122K14231L17103
3020E5529198L46701O48128L54014P86473P91623P98546J105140Q09603J079961
3011F2249387J313928J031673J286379J383280J098182R67877J121670R08248
3003G1360624Q06684Q55259P58635P99003N39517J61444K3573q5316l08811o29090
2993G4281522r07399r59101j130312j117036j458006j438928j510527j676390
2985F4083823j541845j862074j900409j893707j877632j820089j915555j649404
$$ plain form
3047 78400413 77677075 77004648 76053841 75207260 74172260 72856088 71519935 70163327 68731135
3038 68731135 67249791 65770911 64213151 62637114 61281515 60362089 59260590 58406990
3030 58406990 57710226 56841968 56346126 55634300 55348011 55339913 55130986 54997864 55212095 55529198
3020 55529198 55875899 56524027 56878041 57664514 58456137 59254683 60359823 61169426 62249387
3011 62249387 63563315 64594988 65881367 67264647 68362829 69330706 70452376 71360624
3003 71360624 72167308 73022567 73781202 74580205 75119722 75281166 75304739 75219423 74910612 74281522
2993 74281522 73374123 72415022 71284710 70167674 68709668 67270740 65760213 64083823
2985 64083823 62541978 60679904 58779495 56885788 55008156 53188067 51272512 49623108
2977D9623108j258908j204084j290134j328275r61007j196654o11250q91684o71173
2968D0209939p45764p12029p56286n12862k99115k61829j76006l74304j64888
2959C6206856l81341j58871J20550n3229L4884n1079o1588K11486j19935j28396
2949C5619337K036L3406l23273M2362m4455m4730m15005k57725k2585J57817l14185
2938C4433000j60118L4048K2912r7581j17643K12502K6916k28563J36152J91758
2928C4453383L02434J28137L99303L81805J67796M25982K79442L30490K92019
2919C7160791L27044Q75895R52969O87180Q51909O70584P63489O25277Q78633
2910D3793771R85578P71083N96062N01326N71603O74658Q16137P55020Q06483
$$ plain form
2977 49623108 48364200 47160116 45869982 44541707 43580700 42384046 41772796 40881112 40209939
2968 40209939 39464175 38752146 37995860 37482998 37183883 36922054 36746048 36371744 36206856
2959 36206856 35825515 35666644 35787194 35733965 35768849 35717770 35656182 35867668 35747733 35619337
2949 35619337 35621373 35654779 35331506 35373868 35329413 35284683 34869678 34611953 34589368 34747185 34433000
2938 34433000 34272882 34306930 34329842 34232261 34114618 34327120 34354036 34125473 34261625 34453383
2928 34453383 34755817 34883954 35283257 35665062 35832858 36258840 36538282 36868772 37160791
2919 37160791 37487835 38363730 39316699 40003879 40855788 41526372 42289861 42915138 43793771
2910 43793771 44779349 45550432 46146494 46647820 47219423 47894081 48710218 49465238 50271721
2901E0271721R48432J455880J265006J098698J579168J372736J662176J714522
2893F1368339K322033K157023K243849K575183L165495L353553L392868L099286
2885H3677629K798946K227261J541779J484819J502240J945169K501315K849144
2877A00528302L287607L862642M286468M486755M683144N058834N486924N631710
2869A37312386O247773O833807P117969P680462P452062P016842O510414N199421
2861A91371136M369607M651333N871174O403886N539981K721551l171810p907847
2853B09849011r860002q811504p047272m972785k816330j206836M97957K039851
2845A77672090K703930L838135M723221N341920N932470O896991P771513Q559719
$$ plain form
2901 50271721 51220153 52676033 53941039 55039737 56618905 57991641 59653817 61368339
2893 61368339 63690372 65847395 68091244 70666427 73831922 77185475 80578343 83677629
2885 83677629 86476575 88703836 90245615 91730434 93232674 95177843 97679158 100528302
2877 100528302 103815909 107678551 111965019 116451774 121134918 126193752 131680676 137312386
2869 137312386 143560159 150393966 157511935 165192397 172644459 179661301 186171715 191371136
2861 191371136 195740743 200392076 206263250 212667136 218207117 220928668 217756858 209849011
2853 209849011 199989009 191177505 184130233 179157448 176341118 175134282 175632239 177672090
2845 177672090 180376020 184214155 188937376 194279296 200211766 207108757 214880270 223439989
2837B23439989R524980J0641790J1959372J2781398J2366955J0282858N979494
2830B96976836Q38279l527340p952314j2030769j5744711j8632552j9567341j8593839
2822B01766249j6472729j4208166j2192712j0444684q464879p828878o627039
2815A25527162n570597n180107m476150m234719m080167m103010l863327m180235
2807H9838850m330447m286403l971723l921048l901062l740732l296764k744354
2799E9646317k609669k693850k397313k175092k006043k126383j867616j626985
2791D2143366j624418j390164j045775j378921j181299j078340j241062r47316
2783C2256071j025729r35978p45429j067773p34501m78459n99500m21730m24844
$$ plain form
2837 223439989 232964969 243606759 255566131 268347529 280714484 290997342 296976836
2830 296976836 297815115 294287775 286335461 274304692 258559981 239927429 220360088 201766249
2822 201766249 185293520 171085354 158892642 148447958 139983079 132154201 125527162
2815 125527162 119956565 114776458 110300308 106065589 101985422 97882412 94019085 89838850
2807 89838850 85508403 81222000 77250277 73329229 69428167 65687435 62390671 59646317
2799 59646317 57036648 54342798 51945485 49770393 47764350 45637967 43770351 42143366
2791 42143366 40518948 39128784 38083009 36704088 35522789 34444449 33203387 32256071
2783 32256071 31230342 30294364 29548935 28481162 27746661 27268202 26668702 26246972 25822128
2774B5822128p26461n61878p31757q23500m70290m45189m35379o64011o02475
2765B0361188k47834m46729n20889o41119l41705j63342m80281n66436l10799
2756A6642054l58925k96251j71722j55108k26387m13196r8876j5057o0527o7295
2746A4778710O022J4080j309k8721K25171J19463j19733j84933q04454k49304
2736A3754992k95598n46023k57082n68859o8662m8750J5371L95050L38526n1804
2726A2667161l60080k24502n02546m96796m97280o85074n19175m21778k56756
2717H703174l81641j55744J34470k74701n23137n1145j90017j10248r4361j70102
2707F886548k26506M3097m0393J52249j72584k8819j86562l26170J03671j08007
$$ plain form
2774 25822128 25095667 24533789 23802032 22978532 22508242 22063053 21627674 20963663 20361188
2765 20361188 20113354 19666625 19145736 18504617 18162912 17999570 17519289 16952853 16642054
2756 16642054 16283129 15986878 15815156 15660048 15433661 15020465 14921589 14906532 14846005 14778710
2746 14778710 14784732 14798812 14797503 14768782 14993953 15113416 14993683 14808750 14004296 13754992
2736 13754992 13459394 12913371 12656289 12087430 12018768 11970018 11985389 12380439 12718965 12667161
2726 12667161 12307081 12082579 11580033 11083237 10585957 9900883 9381708 8959930 8703174
2717 8703174 8321533 8165789 8300259 8025558 7502421 7451276 7261259 7151011 7056650 6886548
2707 6886548 6660042 6703139 6662746 6814995 6642411 6613592 6427030 6100860 6204531 6096524
2697F096524l40505m0026J46670j14966P0450M9774j52683j47153j99174K05366
2687E574277l14314q5072m9379k49786m6713j35344p3144j51177K62763m2472
2677D689639o3347l46958k79773J79589K02916n5484k99720J44401o6603j23176
2667C981484K22339m14158j9929J99306l67793o8974L21363m65186k14072m04289
2657B770091j2003K97208k29951J1556l46951P8483l3909j30668J05965l8487
2647B471334k01172j03807J95880N4976J6245j26589K69151J00292m04752m8905
2637B222653Q0338k3843l28001L12411K06722j52652k08090J42407J58640k55271
2627B155314M5240L4909P5967m52Q2976j85931R7470L8970j89506M5925j42925
$$ plain form
2697 6096524 5756019 5715993 5862663 5747697 5818147 5867921 5715238 5568085 5368911 5574277
2687 5574277 5259963 5174891 5125512 4875726 4829013 4693669 4620525 4469348 4732111 4689639
2677 4689639 4626292 4279334 3999561 4179150 4382066 4326582 4026862 4171263 4104660 3981484
2667 3981484 4203823 3789665 3769736 3969042 3601249 3532275 3853638 3388452 3174380 2770091
2657 2770091 2758088 3055296 2825345 2836901 2489950 2568433 2534524 2403856 2509821 2471334
2647 2471334 2270162 2166355 2362235 2417211 2433456 2306867 2576018 2676310 2271558 2222653
2637 2222653 2302991 2279148 1951147 2263558 2470280 2317628 2109538 2251945 2410585 2155314
2627 2155314 2200554 2235463 2311430 2310978 2393954 2208023 2305493 2344463 2154957 2200882 2057957
2616B057957q641K8626L7852l2662j77086K11935k48060J56247K04306k18648
2606B011826L8520P8475k17700k78347J70399j06290J09876P4749R8859l3269
2596A947098L7185l74934q3463J59377L15137R5681J1568K86145n190k32564l58870
2585A797170P1612j25064P6099j07200M32382K20984J67696j3205j23985j71568
2575B224921K70240k6869l40743M020p8381N6045J18966r8319r4353j10294P9134
2564B004367j13787J23647J35828k07876J43216m3350k0151k1250J02233M9591
2554B152468k2022K3750N9798J05256J20196O1683j4820k2590j08639r2340l3184
2543B229556J14896k0060k99423n5386l034k45737L6850K27407j83377l43710
$$ plain form
2616 2057957 2049316 2077942 2115794 2083132 1906046 2117981 1869921 2026168 2230474 2011826
2606 2011826 2050346 2128821 1911121 1632774 1803173 1696883 1806759 1881508 1980367 1947098
2596 1947098 1984283 1609349 1525886 1685263 2000400 2096081 2107649 2393794 2388604 2156040 1797170
2585 1797170 1868782 1743718 1819817 1712617 2144999 2365983 2533679 2520474 2396489 2224921
2575 2224921 2495161 2468292 2127549 2131569 2053188 2109233 2228199 2129880 2035527 1925233 2004367
2564 2004367 1890580 2014227 2150055 1942179 2085395 2042045 2021894 2000644 2102877 2152468
2554 2152468 2130446 2154196 2213994 2319250 2439446 2501129 2486309 2463719 2355080 2262740 2229556
2543 2229556 2344452 2324392 2024969 1969583 1966549 1720812 1757662 1985069 1801692 1457982
2533A457982O5554J72729J8826j30753k16719j3036o1704k94180L14893J69337
2523A482929k48757k22753k23619J13000R03Q3689J69352R1088J01923l3271k57665
2512A056819k9466m0335j47542M6754J2007J23436J73950j16548j62683k70124
2502F46268Q8454o3978Q8518p9317J28276j4616o1905j45566J31021j08428O8102
2491F76829R4579K54218k79103K15565N7886k21642l1157l5936j42763J47520
2481G35996j04671j71688O57166m63334j34833J59557k67068m635K61138j3189
2471F54439J3116p886j71609m8543J66418J96594j80486J0571J14588k11232o8276
2460D67694J09478L7669j4145j64448n0784o1476j21657J18763J36980J78588
$$ plain form
2533 1457982 1523536 1696265 1715091 1584338 1367619 1354583 1292879 998699 1313592 1482929
2523 1482929 1234172 1011419 787800 900800 901703 985392 1154744 1245832 1347755 1314484 1056819
2512 1056819 1027353 987018 839476 886230 898237 1021673 1195623 1079075 916392 646268
2502 646268 734722 670744 759262 679945 808221 793605 731700 586134 717155 608727 676829
2491 676829 771408 1025626 746523 962088 1019974 798332 767175 731239 588476 735996
2481 735996 631325 459637 1116803 653469 518636 678193 411125 406490 667628 654439
2471 654439 667555 659669 488060 439517 605935 802529 622043 632614 747202 535970 467694
2460 467694 577172 614841 600696 436248 385464 323988 202331 321094 458074 636662
2450F36662k50808J13972k12468K41613r0979k6727J47862j00756K27226N5293
2440G40890k39437m7929K99705J6895k79882p4369k3389j6523K5187j30070R3984
2429C65062J54743J22176R5065M8492N8950m71745o8862O9397l2915j0852R8005
2418D27516N5918P6079o04K665l8711k0405j64598J06043J44031o6536p5093N4863
2406E01168l1713k34491j5773K84951J2521j60778r2282O4669m01j1630M2920
2395C59161k77294M01574M6886j76098P1705O8466j83403j44741j34499M09959
2385D41716j13081j51790K05145Q2257q6318L37450L1146j31779P0583m7450J29555
2374G67434J02929J1721q1128J02658k01869O831j02457j01055k54752J77911
$$ plain form
2450 636662 385854 499826 287358 528971 437992 411265 559127 458371 685597 740890
2440 740890 501453 453524 753229 770124 490242 415873 392484 375961 401148 271078 365062
2429 365062 519805 641981 737046 785538 844488 372743 303881 373278 340363 329511 427516
2418 427516 483434 559513 558909 561574 522863 502458 337860 443903 587934 521398 446305 501168
2406 501168 469455 234964 219191 504142 516663 355885 263603 328272 327871 316241 359161
2395 359161 81867 483441 530327 354229 425934 494400 310997 166256 31757 441716
2385 441716 328635 176845 381990 464247 377929 715379 746525 614746 685329 637879 767434
2374 767434 870363 882084 800956 903614 701745 708576 606119 505064 250312 428223
2364D28223K92654q8825j97489O6479K7263j16414r3384j28132K55150J06414
2354E51939j8347K38047j0679k28382m5328j51602l16413l4759k2141R0368K14781
2343B67484K5248L5645L53164q1756l61894J97763J66149k18115j64872j79140
2333C9676L3827J10937R5230J60143N9125j04088M7676j96932p5989L12016j01823
2322C79798j16955n4533L941L9858m8581O5724p053R4539K44357l60749P7895
2311C18241N4718K4869m7939J6498J99018p4041j18526j8206K33581j28704j98930
2300B60579J18790L6341k2101j12574Q0909O2156J28312K46657k03399j81848
2290D13822j62761j22544J91710M5981j07191m3593P2769O7652J59394o3276k28955
$$ plain form
2364 428223 720877 632052 434563 501042 528305 411891 318507 190375 445525 551939
2354 551939 533592 771639 760960 532578 487250 335648 19235 -15524 -37665 52703 267484
2343 267484 292732 328377 681541 599785 237891 435654 601803 383688 218816 39676
2333 39676 73503 184440 279670 439813 498938 394850 442526 245594 169605 481621 379798
2322 379798 262843 208310 212251 252109 203528 269252 262199 356738 601095 240346 318241
2311 318241 372959 397828 349889 366387 565405 491364 372838 354632 588213 459509 260579
2300 260579 379369 415710 393609 281035 361944 424100 552412 799069 595670 413822
2290 413822 251061 128517 320227 366208 259017 215424 288193 355845 515239 451963 223008
2279B23008p1450P8306n6332p2599N5331P3896K14455J04602n6910j15837J33981
2268E10451J93721j16879k49919j51099J79228J07150J04202N8Q4697o3582q5417
2257E12611N064r7828M4203N8746j37824K92539J41127j30479r6525R0165P728
2246F89527J43132n6691k88459J7740r664Q4458j62150N8732K3187J25871K61177
2235H86860J2117J19289k30004q2251n9771l51q206M1499k1008O1597M9689J22365
2223H91825R5099j48880M4351p1951L22872K58314k51997j89948j30809j63319
2213F55557J98740M515r9655J65212N3916J29177Q8597l9144Q2057j32520K97291
2202A403743J13712k34303l87332K09791K66193p6420J03131M8869J48661n5589
$$ plain form
2279 223008 151558 229864 173532 100933 156264 230160 444615 549217 492307 376470 510451
2268 510451 704172 587293 337374 186275 365503 472653 576855 576913 661610 598028 512611
2257 512611 517675 419847 464050 522796 384972 677511 818638 688159 591634 681799 689527
2246 689527 832659 775968 487509 505249 495585 580043 417893 476625 499812 625683 886860
2235 886860 898977 1018266 788262 706011 646240 645889 637683 679182 658174 719771 769460 891825
2223 891825 986924 838044 882395 810444 1133316 1391630 1139633 949685 818876 655557
2213 655557 854297 858812 759157 924369 978285 1107462 1196059 1156915 1238972 1106452 1403743
2202 1403743 1517455 1283152 895820 1105611 1371804 1295384 1398515 1447384 1596045 1540456
2192A540456N2724J95686J24720P6966j52156J18944p3806k47497K75377K21709
2182B133123l1015k4670J02148O1200o8219J62865n4880O2609K00466J16461l8734
2171B621354N5713Q5413K0162J02807K30127m249J4086j00321M8519K31151K23188
2160C527950J8266p9922K23484J28108J00609L44362K32766j19733J7038p6372
2150D316556J75933N30910K18354J94214l3208m56K81465M96432k0591J66382
2140F325991O9927J89934Q5095M17145K71247L37856M66236J59070M30268M36327
2130I189096Q32179O41160L13277Q27066O59027R05540J180151J235186M50598
2121A6233280K91308J118827J443090J757677K682616K874186M069346N106955
$$ plain form
2192 1540456 1593180 1788866 1913586 1990552 1838396 1957340 1883534 1636037 1911414 2133123
2182 2133123 2102108 2077438 2179586 2240786 2172567 2335432 2280552 2343161 2543627 2660088 2621354
2171 2621354 2677067 2762480 2782642 2885449 3115576 3111327 3125413 3025092 3073611 3304762 3527950
2160 3527950 3546216 3466294 3689778 3817886 3918495 4262857 4495623 4375890 4392928 4316556
2150 4316556 4492489 5023399 5241753 5435967 5402759 5402303 5683768 6180200 6159609 6325991
2140 6325991 6395918 6585852 6670947 7088092 7359339 7697195 8163431 8322501 8752769 9189096
2130 9189096 10021275 10662435 10975712 11802778 12461805 13367345 14547496 15782682 16233280
2121 16233280 16524588 17643415 19086505 20844182 23526798 26400984 30470330 35577285
2113C5577285O844306Q734606J2718003J3737005J5297078J0270891j4556363
2106H8622811k3126224j6385043j0532195p497716n450059l732516k659164k120366
2098A7119528j610423r50011q33454m84086p09201o01894j042715j475411j054017
2089H358316p21855m91483p01512l60206m53214j15586j78188m04496P734m26497
2079D513013n30200j01928k9029J29815j88824l84495r8091J9943j47605r5326
2069C087273k16495O5903n14128o9003r0104j55105Q3957j61611Q8080M358J54280
2058B277405l0020m11952k19582n9632j77730K00435k51240j97419o6326r994
2048A053945k8902R1168k24161J10785K41659R1488j54722N9620j27374j70405
$$ plain form
2113 35577285 42421591 51156197 63874200 77611205 92908283 103179174 88622811
2106 88622811 65496587 49111544 38579349 31081633 25631574 21899058 19239894 17119528
2098 17119528 15509105 14559094 13725640 13241554 12532353 11930459 10887744 9412333 8358316
2089 8358316 7636461 7144978 6443466 6083260 5630046 5514460 5336272 4931776 4939510 4513013
2079 4513013 3982813 3880885 3851856 3981671 3792847 3408352 3310261 3330204 3182599 3087273
2069 3087273 2870778 2936681 2422553 2353550 2263446 2108341 2192298 2030687 2118767 2123125 2277405
2058 2277405 2247385 1835433 1615851 1556219 1378489 1578924 1327684 1130265 1063939 1053945
2048 1053945 1025043 1116211 892050 1002835 1244494 1335982 1181260 1240880 1113506 943101
2038I43101n3427m0707K7436j63208m439j6990j18105k3976K00915j05122k14152
2027D31326n5496J05810p3354K26350J44234l0096J28083k37162K560l61595R4738
2016C75398Q9010P3127m0832j45161P3011O7819P1140M0933o4104j81511J06629
2005D65459m5294k1330k2129r6767J33778L82077N9302k66328j28862j47685P853
1994C20074Q0004l24075j68534M5641J88463K18655l511j26753O0008k7729j65185
1983I7058M1211m1727K01737j06333k38227k546L2558l7857K27497o2305K33216
1972C44282m1661n9417J84682j79013l17841J44736J09600m557p2009K0661J52616
1961B82079J70380j50124j38011j61959J43877j10835j16886K35105O3669K38332
$$ plain form
2038 943101 889674 848967 876403 713195 708756 691766 573661 549685 750600 645478 431326
2027 431326 375830 481640 408286 634636 778870 748774 876857 639695 642255 280660 375398
2016 375398 464408 537535 496703 351542 424553 492372 563512 604445 540341 358830 465459
2005 465459 420165 398835 376706 279939 413717 795794 855096 588768 459906 312221 320074
1994 320074 400078 76003 -92531 -46890 141573 360228 356717 229964 289972 262243 97058
1983 97058 138269 96542 298279 191946 -46281 -48827 -16269 -54126 173371 111066 344282
1972 344282 302621 243204 427886 248873 -68968 75768 185368 180811 108802 129463 282079
1961 282079 452459 302335 164324 2365 146242 35407 -81479 153626 217295 455627
1951D55627j44741o6049J3783j82738k5580Q4241l0217N4689k5018k8201k27059
1940a21263r5570K65209P7730o2816j40226O5816K72121j93707k46520J21402
1930e7824j68534l9334J1909J85242K71438j97222j7470p9868Q6397K3219J67733
1919A85686j84052M011p4543K62506J02608k31051m8694R3826r8305K8502K83928
1908C24422j2884n3187j08532l8265p9427j7632K09419l29169R0081J46382L7730
1897A68938J53425l193k46099k25551J02253o8640N9799J03841n0160J04030N7861
1886A56504m4672J74754j95473j08369M195N11R8925N1550M0199k47622J9118
1875e0380M08042k91939n2360j29776P836M78263n0236l6066p5645j90248j01249
$$ plain form
1951 455627 310886 244837 258620 75882 50302 134543 104326 159015 133997 105796 -121263
1940 -121263 -216833 48376 126106 63290 -76936 -11120 261001 67294 -179226 -57824
1930 -57824 -226358 -265692 -253783 -68541 202897 5675 -11795 -91663 -5266 17953 185686
1919 185686 1634 5645 -68898 193608 296216 65165 16471 110297 11992 40494 324422
1908 324422 311538 258351 149819 111554 32127 14495 223914 -105255 -15174 131208 168938
1897 168938 322363 319170 73071 -152480 -50227 -118867 -59068 44773 -5387 98643 156504
1886 156504 111832 286586 91113 -17256 -13061 -12550 86375 137925 178124 -69498 -50380
1875 -50380 357662 65723 13363 -116413 -108577 369686 319450 283384 207739 17491 -83758
1864h3758k35099L66334R2247l60261m4505J41600J90729J55710j1819k83679
1854g2501J58953p325j43292K5286K63764j14989j55824j53247J34105L54940
1844B89870k24211j16104M17117K61534N3757M6779j70964k85746J81964k75747
1834A78249j16033j46976J10667P6892K1674J99938k09860l10449n5289K24230
1824b6957k5352l0381j35143J76792j16212j63403L20447R1716j05571M7127r0861
1813e7798K27079j40427k10714l8037J038J32967r7335J06697L74542j54729k0555
1802A22728m6481o871P5031j5356p0354J8311K2011k28763J30850j25436J15256
1791i074J88705j67822j36188J26519P3810K8271k28495n7599N5028l25535J81277
$$ plain form
1864 -83758 -318857 47477 139724 -220537 -265042 -123442 67287 222997 211178 -72501
1854 -72501 86452 79127 -64165 -38879 224885 109896 -45928 -199175 -65070 289870
1844 289870 65659 -50445 366672 628206 681963 728742 557778 272032 453996 178249
1834 178249 62216 -84760 25907 102799 124473 324411 114551 -195898 -251187 -26957
1824 -26957 -52309 -82690 -217833 -41041 -157253 -320656 -209 91507 -14064 33063 -57798
1813 -57798 169281 28854 -181860 -219897 -218859 -85892 -183227 -76530 298012 143283 122728
1802 122728 76247 69376 144407 129051 58697 77008 99019 -129744 1106 -124330 -9074
1791 -9074 179631 11809 -124379 2140 75950 104221 -124274 -181873 -126845 -452380 -271103
1780b71103Q7119p1854O1587J25009r5937J22904O7716k72941J43812L9111k46635
1769c11212J03554K18645k66092m8603M18895j41745j63610L3168j37293m6588
1759c40881L62249R4474o798j45153P4690L4679R498l614j52178L6744J08659
1748G2369k9023q0022j01387K02110r3496l8030j20195k44526p145J76896L75191
1737A12742M1410j36648k7387N791j65446l0811j39449K33144m8253m1868J39216
1726e7559J43859k10132j82191J92011P5901Q8726j19836N5342R9042J73976k19907
1715C9232j5776j45184l2815r8965p0303J56455J6042R483k9218m5634p6010O2317
1703b30376K77422K53928j82417k66125j33691J55523m8250K01727J50060k24230
$$ plain form
1780 -271103 -183984 -255838 -194251 -69242 -165179 -42275 25441 -247500 -103688 -64577 -311212
1769 -311212 -207658 10987 -255105 -303708 115187 -26558 -190168 -157000 -294293 -340881
1759 -340881 21368 115842 109044 -36109 38581 73260 82758 79144 -73034 -36290 72369
1748 72369 43346 -36676 -138063 64047 -29449 -67479 -187674 -432200 -439345 -262449 112742
1737 112742 154152 17504 -9883 -4092 -169538 -200349 -339798 -106654 -154907 -196775 -57559
1726 -57559 86300 -123832 -306023 -114012 -38111 50615 -69221 -13879 85163 259139 39232
1715 39232 23456 -121728 -154543 -253508 -323811 -167356 -151314 -141831 -171049 -216683 -292693 -230376
1703 -230376 47046 300974 118557 -147568 -281259 -125736 -173986 27741 177801 -46429
1693d6429J74176p8403j98546n4770j64653K40711M67014K68523m10444p1295
1683A25884L00016j75446k60002k10522j48659K09029N658K49901j93837p5L8915
1672e9138K3570J92975m9333j07600M6986j5926j69671J94955R8718r500j41255
1661D781r8345K4969Q4624j77262k16032N7818J50625o6945r7544K32404J44209
1650D3302o4409q6187R2252m2798J49368j1432K59852j51024l49103K12136o8776
1639a6819k22496N2543j07708K46612P231q1831N3967j21001o4107J99932j57503
1628b11180P0656k6176j35270N64603k701k55174k91702J98343K0128N2463M864
1617a1146p1120J57450J88480p1704k10918k03K15884J43917l87960M6706J66111
$$ plain form
1693 -46429 127747 49344 -149202 -203972 -368625 -127914 339100 607623 197179 125884
1683 125884 425900 250454 -9548 -220070 -368729 -159700 -154042 95859 -97978 -98053 -59138
1672 -59138 -35568 157407 108074 474 47460 31534 -138137 56818 155536 146036 4781
1661 4781 -93564 -68595 16029 -161233 -377265 -319447 -168822 -235767 -333311 -100907 43302
1650 43302 -21107 -107294 -15042 -57840 91528 80096 339948 188924 -160179 51957 -16819
1639 -16819 -239315 -186772 -294480 -47868 -40637 -122468 -68501 -189502 -253609 -53677 -211180
1628 -211180 -140524 -166700 -301970 262633 259932 4758 -286944 -88601 -68473 -16010 -11146
1617 -11146 -82266 75184 263664 191960 -18958 -19161 196723 340640 -47320 -614 165497
1606A65497k43870k4051J22816N0645K4040J29573J05884j23106j21465n6155
1596B9808j23149j95889N6390K77056R8739K02114k39630p8963M4125k25632J00906
1585e4125K80894p4291l93963J40393J00948j48001J71956q0141O7355J33319
1575A44344k867m5144l14525m7609L06335j60774k46417J91030j64508K85511
1565e4624J6653j97515J6642R8933J46228j50834J46100P3270p4631j34277K64459
1554A50404m19742n5910k9862L75348L7390j71743j27601P2949L4860M1162k13153
1543c05898L83727J58016M078L2676j48797J34260l7977p008q2322j55295p5824
1532a00364l9425o6654P3747L2974K89253j74731o1652r2931q638P3600l8683
$$ plain form
1606 165497 -78373 -102424 20392 71037 95077 224650 330534 207428 85963 29808
1596 29808 -93341 -289230 -232840 44216 142955 345069 105439 26476 70601 -155031 -54125
1585 -54125 226769 152478 -241485 -101092 -144 -148145 23811 -56330 11025 144344
1575 144344 141477 96333 -218192 -265801 40534 -120240 -366657 -175627 -340135 -54624
1565 -54624 -37971 -235486 -218844 -119911 26317 -124517 21583 94853 20222 -114055 150404
1554 150404 -269338 -325248 -355110 20238 57628 -114115 -241716 -168767 -133907 -92745 -305898
1543 -305898 77829 235845 239923 272599 123802 258062 220085 213077 130755 -24540 -100364
1532 -100364 -139789 -206443 -132696 -99722 189531 14800 -46852 -139783 -148421 -74821 -113504
1521a13504P6156N4816K7241K06668j56108L31752O6813k76117k18409j49584
1511a50276K64154j59479M9212J81348r1763p6659r9465r9382J31573J05891O6914
1500A22068j56332j11720J78192l3363K6151k23359J04905j03449K6013p5208
1490b46102J80432l50957L88392K49441n2247l30748n6377L9300Q2991k18562
1480c14437J99312K19195p2114N3709m443m6702k70916O5127r594r6658J22264
1469a55257L81552j49907l41746M2208K52306j19168r2509j5644P4641k1743j26060
1458b71327N6574J67346R614J70358J06050l0307j50294m9041l07589j222j71008
1447d70846J93645J55679J4592j6971n0380j80056O7069K24540k4925j99584j212
$$ plain form
1521 -113504 -37348 17468 44709 251377 95269 427021 493834 217717 -692 -150276
1511 -150276 113878 -45601 3611 184959 93196 16537 -82928 -182310 -50737 55154 122068
1500 122068 -34264 -145984 32208 -1155 24996 -198363 -93458 -196907 -170894 -246102
1490 -246102 -65670 -416627 -28235 221206 168959 -161789 -218166 -178866 -95875 -314437
1480 -314437 -115125 104070 31956 85665 81222 34520 -236396 -171269 -180863 -277521 -155257
1469 -155257 226295 76388 -265358 -223150 29156 -90012 -182521 -198165 -123524 -145267 -271327
1458 -271327 -214753 -47407 -37793 132565 238615 208308 58014 8973 -298616 -299838 -470846
1447 -470846 -277201 -121522 -106930 -123901 -174281 -354337 -287268 -62728 -87653 -287237 -288449
1436b88449K40360J07607J8105J11049k0121J47936o8566J08366p2787J5051K243
1425C00794l25258j68364q1019n6764J5642N9949R4721J69526L3378k16385J46096
1414b7684K03379o7591J16998R2415k12685j54454n1888j04702Q7705n9319j12766
1403b90592J69249k0829N4208l0743k24388L6538J11007K34846N6959j16154j20458
1392a40357n8006K6995n5081l87965K43670M55535j05655j60411j36690P9488
1382b38477R9402m6599J08348j6858j60544J19433j46669j3028L40127j58825
1372a13690J52387M9490j15639j09586O6722J56394K89921J39433k85772J10411
1362C40071k17278j13927K02548q7550J63590l32146j12239K6724K5214j54833
$$ plain form
1436 -288449 -48089 59518 77623 188672 168551 316487 247921 356287 283500 298551 300794
1425 300794 -24464 -192828 -273847 -330611 -314969 -255020 -160299 9227 42605 -173780 -27684
1414 -27684 175695 108104 225102 317517 104832 -49622 -101510 -206212 -118507 -177826 -290592
1403 -290592 -121343 -142172 -87964 -118707 -343095 -306557 -195550 39296 96255 -19899 -140357
1392 -140357 -198363 -171368 -226449 -614414 -370744 84791 -20864 -181275 -317965 -238477
1382 -238477 -139075 -185674 -77326 -94184 -254728 -135295 -281964 -294992 45135 -113690
1372 -113690 38697 88187 -27452 -137038 -70316 86078 375999 515432 229660 340071
1362 340071 122793 8866 211414 123864 287454 -44692 -156931 -130207 -104993 -259826
1352b59826J06646N326L816J34997o7031j1761J22662k26364J20556L9641J553
1341b9785Q568j13014L0992n0239k13636L39178j54446R3443K65227j36381k6811
1330A3096K40307n0225l01582l18733K40691K10170n3360L29673j28695k91062
1320a09720j37260K28525Q3808n388k03611J76504J76146P1827n6699k56491k24228
1309b56587P7457k19261L62687R5268k20633j15951J43843k2557K25865j32572
1299f2441K6527J18053r6652k19282N3216J17602Q701J09732Q0455o7144q7414
1288a8647J38946j28725j4803J76554j55556k10536J21575J21032j66555K93036
1278A56321k39055O7454o4493j34043K03468Q877l172J660J02130K0943o9092
$$ plain form
1352 -259826 -153180 -147854 -144038 -9041 -76072 -87833 34829 -191535 -70979 -31338 -29785
1341 -29785 -21217 -134231 -103239 -153478 -367114 -27936 -182382 -88939 176288 39907 13096
1330 13096 253403 203178 -98404 -417137 -176446 33724 -19636 310037 181342 -109720
1320 -109720 -246980 -18455 65353 59965 -143646 32858 209004 280831 224132 -32359 -256587
1309 -256587 -179130 -398391 -35704 59564 -161069 -277020 -133177 -155734 70131 -62441
1299 -62441 -35914 82139 -14513 -233795 -180579 -62977 -54276 55456 135911 68767 -18647
1288 -18647 120299 -8426 -23229 153325 -2231 -212767 -91192 29840 -136715 156321
1278 156321 -82734 -15280 -79773 -213816 -10348 -1471 -4643 -2983 99147 120090 50998
1267E0998j91813m1322K40806K5983n7110j69004K3822J76084j07328j60454J59651
1256d9687R0681M8705J44139j63794j14813J04871J88923k32841j586j45194O9798
1245f0798N8073k4960n9456K00123r7713J82394k56785k299J08698R711j21670
1234f4682l53209K32307L95114n4748j15995j14716J6961m103J70784P7161j45341
1223C9533Q3840k34082r6791J57108O578P4088J35519L6902k69993k49076M9051
1212b67323J79457k8072r7559q1516K05547J77412K222J269j92719K2369K15368
1201A36455r7663k20610P6881R1927k11342J85169K15344k74303m9724R5348M1070
1190a1448p1846K91598Q393m68593j1626R1765j8478N9130J23874M8764n6619
$$ plain form
1267 50998 -140815 -182137 58669 84652 27542 -141462 -117640 58444 -48884 -209338 -49687
1256 -49687 40994 89699 233838 70044 -44769 60102 249025 16184 14598 -130596 -60798
1245 -60798 -2725 -27685 -87141 112982 15269 197663 -59122 -61421 47277 56988 -64682
1234 -64682 -417891 -185584 209530 154782 38787 -75929 -58968 -63071 107713 184874 39533
1223 39533 123373 -110709 -207500 -50392 -43814 30274 165793 202695 -67298 -316374 -267323
1212 -267323 -87866 -115938 -213497 -295013 -89466 87946 90168 91437 -101282 -78913 136455
1201 136455 38792 -181818 -104937 -13010 -224352 -39183 176161 -98142 -147866 -52518 -11448
1190 -11448 -83294 208304 216697 -251896 -263522 -171757 -190235 -131105 -7231 41533 -15086
1179a5086J07089p1326j61079O5333J02875j34728J32326k9254p7017K06075k24015
1168i8807M9111J94853j26965m1387k35521K22147p8170L00441j50082j92765
1158a57145M01719M4494k1221l45124m7566J65968R3798J11721L06056j99152
1148C53548l58157j63344O1929o328j9115J94017j64683r7448Q1219j1903k9329
1137a59594J16548L3108J27062m4484K31398p1375j53182N4486Q5413k3821k17656
1126b2097r2771M8625J23459Q6340n1991J23792k29442l02305M7555K14487O3226
1115H878r1291K30774R1608j34194k43548O1936P126J99904p1784n8036R6032
1104I7405L10607j64392q3278j55681j40090j78918J25566K68321P4544j91256
$$ plain form
1179 -15086 92003 20677 -140402 -75069 27806 -106922 25404 -3850 -80867 125208 -98807
1168 -98807 -49696 145157 18192 -23195 -258716 -36569 -114739 185702 35620 -157145
1158 -157145 244574 289068 267847 -77277 -124843 41125 134923 246644 552700 353548
1148 353548 -4609 -167953 -106024 -112352 -131467 62550 -102133 -199581 -118362 -130265 -159594
1137 -159594 -43046 -9938 117124 72640 304038 232663 79481 133967 219380 195559 -22097
1126 -22097 -114868 -66243 57216 143556 91565 215357 -14085 -316390 -268835 -54348 8878
1115 8878 -82413 148361 239969 105775 -137773 -75837 -68711 131193 59409 1373 97405
1104 97405 408012 243620 160342 4661 -135429 -314347 -188781 79540 154084 -37172
1094c7172p2411R0006J35818k35277j70138L43506r3819j16467j27430K27797
1084e5587J3547j33608j93866K79624J38815k21548j09962K3226J88668J55684
1074H4993J73549p0161j13344J38172r1160J1672K3615r9145q3156q3447J07444
1063i68j54418k9023K31777m1214j36961R5877m9681m0681j88834j0733K5221
1052b99638k5930J83699n2804J05582P0496K22227Q1247K8300l52479l86528L48102
1041g7726k0303j55979J19662L4253J2650N7187q3650R6613K8552M6832J37811
1030A95902k55034P2961K75333l09694j02937R1156J1163L0102n8177N1685o2821
1019f0361L1427l998k03335O2678K11104k30854P5684j00505P283J00682J80152
$$ plain form
1094 -37172 -109583 -19577 116241 -119036 -289174 54332 -39487 -155954 -283384 -55587
1084 -55587 -42040 -175648 -369514 -89890 48925 -172623 -282585 -259359 -70691 84993
1074 84993 258542 188381 75037 213209 122049 133721 157336 58191 -24965 -108412 -968
1063 -968 -155386 -184409 47368 6154 -130807 -34930 -84611 -125292 -314126 -324859 -299638
1052 -299638 -325568 -141869 -194673 -89091 -18595 203632 284879 313179 -39300 -425828 -77726
1041 -77726 -98029 -254008 -134346 -100093 -87443 -30256 -113906 -17293 11259 58091 195902
1030 195902 -59132 13829 289162 -20532 -123469 -32313 -21150 8952 -49225 2460 -60361
1019 -60361 -28934 -32932 -236267 -173589 37515 -193339 -117655 -218160 -210877 -110195 69957
1008F9957R236R1369O3334m16641K5233J23374j41792N9776O0147J37087j88447
997a07367K760J09019k42211Q9855L00138L2309k56354m2753j00940M5431q1662
986b51775O8013L04151k39577O756J18064j04401R1816K02051l01325j46555J34334
975a18448J38758J43097j19353J4562p1312K532K23329M7152j65997j04670R6950
964H6600J48767j91597K1776k29730J70389K50654k19478l3217k9439L640q48
953b2483O780o4865j04761J57953J88743k51550P9460K22007l8153J22115l2953
942B62293j03326n9888k61431j54288J83650J21348J45285k3638K77J75022n2353
931B32951l22283K752J77638J1104l94792J7658l426O3845J76755K46090j66684
$$ plain form
1008 69957 79193 170562 233896 -182745 -157512 -34138 -175930 -116154 -56007 81080 -107367
997 -107367 -104607 4412 -237799 -147944 152194 184503 -71851 -114604 -215544 -170113 -251775
986 -251775 -183762 120389 -119188 -112432 5632 -98769 -6953 195098 -106227 -252782 -118448
975 -118448 20310 163407 44054 58616 -12696 -10164 213165 260317 94320 -10350 86600
964 86600 235367 43770 65546 -164184 6205 256859 37381 4164 -25275 -21635 -22483
953 -22483 -15703 -80568 -185329 -27376 161367 -90183 -10723 211284 173131 295246 262293
942 262293 158967 99079 -162352 -316640 -132990 -11642 133643 110005 110282 285304 232951
931 232951 -89332 -86580 91058 102162 -292630 -274972 -278398 -214553 -37798 208292 41608
920D1608j65455K7005o4554K32312j8069j86388J0247q9895m9672l1606M6393
909b48074J23635L80975j59113j91587J86040r8043M818J20931J24400o7819N704
898A81867l6989j23624J98919r1232k10317j65747n7441K62707J14222j99904
888a27539j09258K36947j14956J05831L53969J89140r6523j63801k91755k91L7211
877A8975o8057j27235J03392K44647J07335j9520r6712k45727j37294k19898N8533
866c81561M45385q4573j4981M4035L8336J5359j83796J71817k05911j92683R1180
855b57393K44079o3524r9361K4409m4459p9578J98652K44583j0286J50445k9820
844B77747J87142j31340j61258r4276l8685J40770m1787k18718J71801K42099
$$ plain form
920 41608 -123847 -96842 -161396 70916 52847 -133541 -123294 -213189 -262861 -294467 -248074
909 -248074 -124439 256536 97423 -94164 91876 -6167 -1349 119582 243982 176163 181867
898 181867 144878 21254 220173 128941 -81376 -247123 -304564 -41857 72365 -127539
888 -127539 -236797 150 -114806 -8975 344994 534134 437611 273810 -17945 -18236 18975
877 18975 -49082 -176317 -72925 171722 279057 259537 162825 -82902 -220196 -440094 -381561
866 -381561 63824 -20749 -35730 8305 46641 62000 -121796 50021 -155890 -348573 -257393
855 -257393 -13314 -76838 -176199 -151790 -196249 -275827 -77175 167408 157122 307567 277747
844 277747 464889 333549 172291 78015 39330 180100 138313 -80405 91396 333495
834C33495m7025j65153j86697P3673J21095k5879j30238P1812J55307l0914r8347
823G1129O3885l4091l9786K9049L52267k25024O73q2050l44211P1913J11631m7272
811g1887j5185J6683j60046N3749J79957l31260l0428m1308M748M52276J59757
800B17056r0177R9013o583M6179m48492k24274K08414J78190j71793k20461J54188
789b58740K94865J09960k4523J24947J44479m8541l61472j55235k8327K04477
779A890O9394j89116J73043j73359Q4080J25779k54457J92395K56552l15471N4538
768B5268p0113j65365J02422k01286J09903n3918L67505j38871J40319j48735
758c2871R2931K023J2285L1138j71691l7635K84723k27497j34235m1773K75591
$$ plain form
834 333495 286470 121317 -65380 8293 129388 103509 -26729 45083 200390 169476 71129
823 71129 135014 100923 61137 90186 442453 217429 218102 136052 -208159 -136246 -24615 -71887
811 -71887 -87072 -70389 -230435 -176686 3271 -327989 -358417 -399725 -394977 57299 217056
800 217056 126879 225892 219309 265488 -183004 -407278 -198864 -20674 -192467 -412928 -258740
789 -258740 36125 146085 121562 246509 390988 342447 -19025 -174260 -202587 1890
779 1890 71284 -117832 55211 -118148 -34068 91711 -162746 29649 286201 -29270 25268
768 25268 -44845 -210210 -107788 -309074 -199171 -253089 114416 -24455 115864 -32871
758 -32871 60060 62083 74368 105506 -66185 -103820 180903 -46594 -180829 -222602 52989
747E2989J34551j62774k57376J87335K34417j66119k29645m7457K13713K22168
737A81802j0733j12058O9046q163k74246k826J41407J07360J55475k77747M0304
726I621q1292Q9724r6634j3508K62110j6826k55332J18417J54791j05481j1669
715E3921L5602J02047k96713j00297K35631J09450P5531O0130k01597M8361J46095
704B68161k79450j62008K37773o5212K9863K52983m254j53859j15201N5892J17334
693A82022j28372j38202P3202L0600j95617l7487L53129j39769O6848k39571j72673
682c45890Q7762p7072K05914R251p1404K63381l03464m9757K924M44674L2030
671A98349l29101j13541n7087J41949R7071m5981P9044J27733P5613k69806j83930
$$ plain form
747 52989 187540 24766 -232610 -45275 189142 23023 -206622 -254079 -40366 181802
737 181802 171069 59011 128057 119894 -154352 -157178 -15771 91589 247064 -30683 9621
726 9621 -71671 18053 -78581 -92089 170021 153195 -102137 16280 171071 65590 53921
715 53921 89523 191570 -105143 -205440 30191 139641 215172 275302 73705 122066 268161
704 268161 -11289 -173297 64476 -736 29127 282110 277856 123997 8796 64688 182022
693 182022 53650 -84552 -11350 19250 -176367 -213854 139275 -494 66354 -173217 -345890
682 -345890 -258128 -335200 -129286 -120035 -191439 71942 -231522 -281279 -278355 166319 198349
671 198349 -130752 -244293 -301380 -159431 -62360 -108341 -29297 98436 174049 -95757 -279687
660b79687J08278p310J06303q1065J25382J94661n8267j22904m0037J31192J60960
649B37506q9522k11148P1796M8528m2974m8248L54381k43883k5057j18447p023
638g4091M46296j10708r715j78872l24287O8749K24315j01215o7578j43887J35597
627a35396j2968l4555p3183K44937J58078j01697J07702r9209j06764j09375Q9499
616g2931J89343k23785l6647q479l13595R1763K48359J21860L6109O1385Q4044
605A77426k20104r5392L9510J12041O7222J70769k65043j71790M1511l6511j27237
594c07598L16742J82700j04039L2796r0390J30631j47917r2052n9170j40686j05766
583c84749J5721J73179L07833r1427L4726J68541K9559k06966j20028J54239J3645
$$ plain form
660 -279687 -171409 -178719 -72416 -153481 -28099 166562 108295 -14609 -54646 76546 237506
649 237506 147984 -63164 8632 57160 14186 -34062 320319 76436 51379 -67068 -74091
638 -74091 372205 261497 251782 72910 -251377 -182628 41687 -59528 -127106 -270993 -135396
627 -135396 -148364 -182919 -256102 -11165 146913 45216 152918 53709 -53055 -162430 -72931
616 -72931 116412 -107373 -144020 -152499 -466094 -374331 -125972 -4112 31997 93382 177426
605 177426 -42678 -138070 -98560 13481 80703 251472 -13571 -185361 -143850 -180361 -307598
594 -307598 9144 191844 87805 120601 30211 160842 12925 -79127 -138297 -278983 -384749
583 -384749 -369028 -195849 111984 20557 55283 223824 253383 46417 -73611 80628 94273
572I4273j54327j84353J86103J64188j52121n0005K12152n604m3140k38755K35083
561F3494K14662m00167r6656O0260m1190j9935K31021j26039P0015M26280m4434
550C37311p3275j26870m9714n3142O2983M199q4407j38006J13862K50722k44075
539d12N3970K46873k87111k71756l6968p215J03937K18106J34754p590j29288
528A7300K2901m48k6751j87821r2452L27990l6212j45823j58547J60472L18530
517A99139l68648l6299J09025k7235J48361J7970l1379j06447r4753J81496J78799
506A70029M8955j81090J7230L8218k02662r2847J38244K12259R5809k7693q9991
495A26461j06033j28659J13206K9600J90280j55769J60676J15543m00996L0349
$$ plain form
572 94273 -60054 -244407 -58304 105884 -46237 -96242 115910 110306 67166 -171589 63494
561 63494 278156 -122011 -218667 -158407 -199597 -219532 11489 -114550 -44535 381745 337311
550 337311 264036 137166 87452 34310 97293 101492 17085 -120921 -7059 243663 -412
539 -412 53558 300431 13320 -258436 -295404 -302619 -198682 19424 154178 146588 17300
528 17300 40201 39753 13002 -174819 -267271 60719 24507 -121316 -279863 -119391 199139
517 199139 -169509 -205808 -96783 -124018 24343 42313 10934 -95513 -190266 -8770 170029
506 170029 218984 37894 55124 93342 -109320 -202167 -63923 148336 244145 216452 126461
495 126461 20428 -108231 4975 34575 224855 69086 229762 345305 -55691 -25342
485b5342J0494j25289R6399k6562K41992l7317j19496J20949k88434Q2615L29022
474B59031m2194j81397n5786k51470J3846j249p3950R3703M0026J62820J46735
463A10115j90185l13563L60415J25816p3964j80935J56919N516L9719J35747o5395
452A10205k5528j46160O4910j5229P6115r3910L01993k1734m3325j54120j88901
441a35684J30412K86903n0157j32709J14231p3702J12182k57345p6627r833j04300
430a96629J24113p9329L2414J60166k169j00494k33625K0866Q7897j35652J16083
419b06359K78192M2859m2113L9681K21080k06115r7058j65458J16928q1252J32102
408C2487j65623k54465L63459L05073k0032k97006k1092j95895R0221l12211J75887
$$ plain form
485 -25342 -14848 -140137 -43738 -70300 171692 134375 14879 135828 -152606 -69991 259031
474 259031 216837 35440 -20346 -271816 -257970 -259219 -333169 -239466 -199440 -36620 110115
463 110115 -80070 -393633 -33218 92598 18634 -162301 -5382 134 39853 175600 110205
452 110205 84677 -61483 3427 -11802 64313 -29597 272396 250662 207337 53217 -135684
441 -135684 -5272 281631 231474 98765 212996 139294 251476 -5869 -82496 -92329 -196629
430 -196629 -72516 -151845 -119431 40735 38566 -61928 -295553 -274687 -186790 -322442 -206359
419 -206359 71833 114692 72579 112260 333340 127225 30167 -135291 -18363 -99615 32487
408 32487 -133136 -387601 -24142 280931 260899 -36107 -57199 -253094 -162873 -475084 -299197
397b99197J13023j75903J85144L6403J92571J50928j13468n2590j77768L9267
387a01590p1067N3668q5252J54503N2693j44704J95669P4443k45757j83019J68849
376a31564J17078k10985m4520L0848O5658K70680J056k05075J93569k15353q6578
365b15186K46399q7337K64517l0490j50145j11366K08538j64954p4060J3224J13262
354A2402p9244j93537Q4595J24377R4915j02466O5055N8500j38811R8245j21539
343i7508j76591J87873K20013J3808J61937l41868n65226L02937K16053P6652
333a920m2962q9791m4875k53762K31719Q6517n219j8369p5261J88293j27864m2507
321a96001K6023j28014J52715M18070N6902j51817l42711j80768N8024N9093N0368
$$ plain form
397 -299197 -186174 -362077 -176933 -140530 52041 202969 89501 36911 -140857 -101590
387 -101590 -172657 -118989 -204241 -49738 2955 -141749 53920 128363 -117394 -300413 -131564
376 -131564 -14486 -225471 -269991 -239143 -173485 97195 98251 -106824 86745 -128608 -215186
365 -215186 31213 -56124 208393 177903 27758 -83608 124930 -40024 -114084 -100860 12402
354 12402 -66842 -260379 -175784 -51407 43508 -58958 6097 64597 -74214 24031 -97508
343 -97508 -274099 -86226 133787 147595 309532 -32336 -597562 -294625 -78572 -1920
333 -1920 -44882 -134673 -179548 -433310 -201591 -115074 -120293 -138662 -213923 -25630 -153494 -196001
321 -196001 -169978 -297992 -145277 272793 329695 177878 -164833 -345601 -287577 -228484 -178116
310a78116N9831L23110j59575j45010j21617P9077J03405j312n3443j53908Q7037
299a60521J44437r9335k77n4159j52334M4789M8053J86058J06068O183J24160
288A93122J23393l42250k79877J89606J22303n1209P6596k73559m1822J5959j02097
277c69835q9683J7508J34678L02513J2164k537l6559M975O195j89847R2508O70
265a17250J30573K33466j91613k8417n2134J39134q3005N4205J15720j66703Q8209
254A22185k4309k48418K71155J00492k26444k8059j80071q5209Q3100O7115J45096
243c367K9958k37440J89923K17843q0576j52805O0332L9200R5147q8140j07009
232c6934P1686L0861o8102j49590M7630J02267M9442k40053j0124K32967R4143
$$ plain form
310 -178116 -118285 204825 45250 -99760 -221377 -142300 -38895 -40207 -93650 -247558 -160521
299 -160521 -16084 -115419 -115696 -169855 -322189 -277400 -229347 -43289 62779 68962 193122
288 193122 316515 -25735 -305612 -116006 6297 -44912 31684 -241875 -283697 -267738 -369835
277 -369835 -459518 -442010 -307332 -4819 7345 4808 -31751 -26776 -20581 -210428 -117920 -117250
265 -117250 13323 246789 55176 26759 -25375 113759 30754 84959 200679 33976 122185
254 122185 97876 -150542 120613 221105 -5339 -33398 -213469 -298678 -215578 -148463 -3367
243 -3367 26591 -210849 -20926 196917 116341 -36464 23868 63068 158215 70075 -36934
232 -36934 34752 65613 -2489 -152079 -104449 -2182 47260 -192793 -202917 30050 124193
221A24193m6383j26321J42370J15544l59781j53338k26855k5164L8980J30407
211c86348K47073O8306J04283k37041R2327j55380K425J27050K5809q7620J53435
200d5681j009K2608j36872j55318P0716J51856K60475j34229k68472K04521l3616
189f5021p4005L442K24421K62259j70170j87306L3106j0312j29577K2406k44042
178c34799m9746J73043O5081r4430k6375P0685J42216n4811o4256J49580j07135
167a30947R7925R732j19020q4351J7114j472K37888j66119j63916K6292J07892
156a68982J9974J9717K78556j16307j23126R8336P6306K2591L4775m2237J06926
145B06529j04994Q9271j68349j08865p7490O6666R1076p3454K26215q1810j82336
$$ plain form
221 124193 77810 -48511 93859 209403 -150378 -303716 -530571 -555735 -516755 -386348
211 -386348 -139275 -70969 33314 -203727 -111400 -266780 -264355 -137305 -111496 -199116 -45681
200 -45681 -46690 -24082 -160954 -316272 -245556 -93700 166775 32546 -235926 -31405 -65021
189 -65021 -139026 -135584 88837 351096 180926 -6380 26726 16414 -113163 -90757 -334799
178 -334799 -384545 -211502 -146421 -240851 -267226 -196541 -54325 -109136 -173392 -23812 -130947
167 -130947 -33022 -23290 -142310 -226661 -209547 -211019 26869 -139250 -303166 -276874 -168982
156 -168982 -149008 -129291 149265 32958 -90168 8168 84474 107065 141840 99603 206529
145 206529 101535 190806 22457 -86408 -163898 -97232 -6156 -79610 146605 64795 -117541
134a17541Q4020k74177J22584J95213o4203l9622P5578j08900m3840k04013J6808
123c58093M1242L03340Q2139j55145K85418N9213r3321k40447Q5605o0916q3065
112a34030J15119n7069J81729J21528l20712J37285J84035q3784p2133k17065
102a45097K6172N8008l0122j01382J94271m2985R8267k26069m5271K92302k59296
91a81202O6122q25J18752j8932q3909k4609J47879P493k93167J61613J93662j39095
79d6218n5363p1291N8827P8767k800j42127M9920J01786K4336O3966M2104j94219
67i2312K5373r0762J21011J05344j13041q919P3534P4117j05274k05400R7837
56a18492J47531j55718j43024J3630O1154k05310L63090O4336p1363n4710l6551
$$ plain form
134 -117541 -33521 -307698 -185114 10099 -54104 -93726 -18148 -127048 -170888 -374901 -358093
123 -358093 -316851 -13511 68628 -86517 198901 258114 164793 -75654 9951 -50965 -134030
112 -134030 -18911 -75980 105749 227277 -93435 43850 227885 144101 71968 -145097
102 -145097 -118925 -60917 -91039 -192421 1850 -41135 57132 -168937 -214208 78094 -181202
91 -181202 -115080 -115905 2847 -16085 -99994 -124603 23276 30769 -262398 -100785 92877 -46218
79 -46218 -101581 -172872 -114045 -35278 -38078 -180205 -130285 -28499 -4163 59803 101907 -92312
67 -92312 -66939 -157701 -36690 68654 -44387 -53306 20228 94345 -10929 -216329 -118492
56 -118492 29039 -126679 -269703 -256073 -194919 -400229 -37139 27197 -44166 -98876 -135427
45a35427J931R4051K7837M7082R9123l09471l966j7533n2763M3504J20814j1454
33i6272N5099n3613p1791J1621J78898k2501j8805J0385N7928P4538N1300j51634
21B5153j19480N552m5983K8888P8411M3603j60915J6015J33129j60437n5815J46683
9f5196J44614l371j36020O2343p098k9593n4616P5891k6991
0d0037
$$ plain form
45 -135427 -133496 -39445 -11608 35474 134597 -174874 -178840 -196373 -249136 -205632 -84818 -96272
33 -96272 -41173 -94786 -166577 -154956 23942 1441 -17364 -6979 50949 125487 176787 25153
21 25153 -94327 -88775 -134758 -105870 -27459 16144 -144771 -128756 4373 -156064 -211879 -65196
9 -65196 79418 76047 -59973 2370 -4728 -34321 -88937 -13046 -40037
0 -40037
$$ Imaginary data points
##PAGE= N=2
##DATA TABLE= (X++(I..I)), XYDATA
16383c473016N4209J51638O9815l4698J28237k6436m463R9451L9716L8448n43
16372b957642L25403R3581r4048o0455J09469P027M3100J25937l0250L022p7939
16361b512795J21339M2979O4798J17441J86080j13171Q4186j00579J51081K54842
16351a703799r2999r1786M5945O3171J70380J6924l6717K98814j17057l0483K27179
16340a250428R9627j27573o3905M2499J95353P7558p4002J25524Q9227J8645J19389
16329g48086K6147J62829k76693J089N5093J51533J04712K0712p0710j02019J19457
16318e55936m187Q0551J07939J36351J15199N9127K7895j6604j97688K63846J34494
16307A50987N700J834j17483J17435J41572O4214q5878K86043J8015j76367j3489
$$ plain form
16383 -3473016 -3418807 -3267169 -3197354 -3232052 -3103815 -3130251 -3134714 -3035263 -2995547 -2957099 -2957642
16372 -2957642 -2632239 -2538658 -2632706 -2693161 -2583692 -2576665 -2533565 -2407628 -2437878 -2434856 -2512795
16361 -2512795 -2391456 -2348477 -2283679 -2166238 -1980158 -2093329 -2009143 -2109722 -1958641 -1703799
16351 -1703799 -1796798 -1888584 -1842639 -1779468 -1609088 -1592164 -1628881 -1330067 -1447124 -1477607 -1250428
16340 -1250428 -1150801 -1278374 -1342279 -1299780 -1104427 -1026869 -1100871 -975347 -886120 -867475 -748086
16329 -748086 -721939 -559110 -835803 -834714 -779621 -628088 -523376 -502664 -573374 -675393 -555936
16318 -555936 -560123 -479572 -371633 -235282 -120083 -60956 -33061 -49665 -247353 16493 150987
16307 150987 156687 158521 41038 158473 300045 364259 278381 564424 582439 406072 392583
16296C92583J56762j71041R0226O4955J48189R3893N4197P5863j56676K289J76157
16285I27397j00003O4630O5255J27140K7797M5685N7829q5903R0646M6415J78037
16274A444925q905j94490q240J14415L38463P3308k1026J9696k29187l4131N7949
16263A552777J74208m54k01880O8123L09932O1654R551o5983k6120K2372J88326
16252B092506p8106k0834p5972K93779J57500j02231K18689j78699j96068J27328
16242B237892k1015j28291J28748R9254p1999L90964n5085k05716N591O6589J90393
16231B637325J3622r9769j6868L245R7987o9424J12850J41377q5587J49527J27086
16220C011371L8291P8928k34765N352J01729J21415J39662k15715K28085k5084
$$ plain form
16296 392583 549345 378304 468530 533485 681674 775567 829764 905627 748951 751240 927397
16285 927397 827394 892024 957279 1084419 1112216 1157901 1215730 1129827 1220473 1266888 1444925
16274 1444925 1436020 1241530 1233290 1347705 1686168 1759476 1738450 1758146 1528959 1494828 1552777
16263 1552777 1726985 1726531 1524651 1592774 1902706 1964360 1973911 1907928 1881808 1904180 2092506
16252 2092506 2014400 1993566 1917594 2211373 2368873 2266642 2485331 2306632 2110564 2237892
16242 2237892 2216877 2088586 2217334 2316588 2244589 2635553 2580468 2374752 2380343 2446932 2637325
16231 2637325 2650947 2551178 2534310 2537555 2635542 2566118 2678968 2820345 2734758 2884285 3011371
16220 3011371 3049662 3128590 2893825 2899177 3000906 3122321 3261983 3046268 3274353 3249269
16210C249269p5815k33241r2779K68530L6525L5460j17487P8273J65219q2711
16200C231243n1240J21721N1235r1032J42195J17573k18128R4689k2135k31234
16190C144887J0597J28476L6903k8089M00589J00463j42343Q551m0895Q7313n1532
16179C654920Q485k21729j6210J68001J74165j14091o4167J97387R9862k15884
$$ plain form
16210 3249269 3173454 2940213 2847434 3115964 3152489 3187949 3070462 3148735 3313954 3231243
16200 3231243 3180003 3301724 3352959 3261927 3404122 3521695 3303567 3398256 3376121 3144887
16190 3144887 3155484 3283960 3320863 3292774 3693363 3793826 3651483 3660034 3619139 3706452 3654920
16179 3654920 3663405 3441676 3425466 3593467 3767632 3653541 3589374 3786761 3886623 3670739
$$ [...]
##END NTUPLES=NMR SPECTRUM
##END=
