##TITLE=1H_CA-9182-2
 CDCl3
 8 sc, 
 9.8.2023
##JCAMPDX= 6.0         $$ Bruker NMR JCAMP-DX V2.0
##DATA TYPE= NMR SPECTRUM
##DATA CLASS= NTUPLES
##ORIGIN= UXNMR, Bruker Analytische Messtechnik GmbH
##OWNER= root
$$ XWIN-NMR		Version 3.5
$$ Wed Aug  9 16:11:55 2023 Russian Standard Time (UT+4h)  she@DPX200
##.OBSERVE FREQUENCY= 200.13135
##.OBSERVE NUCLEUS= ^1H
##.ACQUISITION MODE= SIMULTANEOUS
##.ACQUISITION SCHEME= undefined
##.AVERAGES= 8
##.DIGITISER RES= 18
##SPECTROMETER/DATA SYSTEM= spect
##.PULSE SEQUENCE= zg30
##.SOLVENT NAME= CDCl3
##.SHIFT REFERENCE= (INTERNAL, CDCl3, 0, 15.7282)
##AUDIT TRAIL= $$ (NUMBER, WHEN, WHO, WHERE, WHAT)
$$ ##TITLE= Audit trail, XWIN-NMR		Version 3.5
$$ ##JCAMPDX= 5.01
$$ ##ORIGIN= Bruker BioSpin GmbH
$$ ##OWNER= she
$$ F:/spectra/data/she/nmr/H-F/1/pdata/1/auditp.txt
$$ ##AUDIT TRAIL=  $$ (NUMBER, WHEN, WHO, WHERE, WHAT)
(   1,<2023-08-09 16:10:40.21 +0400>,<she>,<DPX200>,
      <created by zg, POWCHK disabled, PULCHK disabled
       configuration hash MD5:
       00 E9 B6 7A A2 85 ED C7 34 08 36 98 17 FE 4E 26
       data hash MD5: 16K
       0A C1 2D FF B9 35 15 98 3E 13 3B D5 E9 5F D5 6F>)
(   2,<2023-08-09 16:10:42.64 +0400>,<she>,<DPX200>,
      <Start of raw data processing
       efp BC_mod = 2 LB = 0.24 FT_mod = 6 PKNL = 1 PHC0 = -21200.08 PHC1 = 6.852722 SI = 16K 
       data hash MD5: 16K
       60 C7 37 73 3C 86 6F 22 53 5E 6A 92 F5 55 E9 5C>)
(   3,<2023-08-09 16:11:04.07 +0400>,<she>,<DPX200>,
      <pk PHC0 = -1.497308 PHC1 = 3.199999 
       data hash MD5: 16K
       69 13 8D 20 4F 1C D8 A9 B7 AB F6 7D D5 A8 CE 2C>)
(   4,<2023-08-09 16:11:08.10 +0400>,<she>,<DPX200>,
      <abs ABSG = 5 
       data hash MD5: 16K
       44 86 5D 91 8F B9 5F 0C 32 23 D2 95 66 F0 67 9F>)
$$ ##END=
$$ 
$$ hash MD5
$$ 14 11 07 12 86 BE C5 93 FE 4C 14 4D E7 CB D0 43
##$RELAX= 
##$RELAX= 
##$RELAX= 
##$RELAX= 
##$RELAX= 
##$RELAX= 
$$ Bruker specific parameters
$$ --------------------------
##$DU= <F:/spectra>
##$EXPNO= 1
##$NAME= <H-F>
##$PROCNO= 1
##$TYPE= <nmr>
##$USER= <she>
##$AMP= (0..31)
100 100 100 100 100 100 100 100 100 100 100 100 100 100 100 100 100 100 
100 100 100 100 100 100 100 100 100 100 100 100 100 100 
##$AQSEQ= 0
##$AQ_mod= 1
##$AUNM= <au_zg>
##$AUTOPOS= <>
##$BF1= 200.13
##$BF2= 200.13
##$BF3= 200.13
##$BF4= 200.13
##$BF5= 200.13
##$BF6= 200.13
##$BF7= 200.13
##$BF8= 200.13
##$BYTORDA= 1
##$CFDGTYP= 0
##$CFRGTYP= 5
##$CHEMSTR= <none>
##$CNST= (0..31)
1 1 145 1 1 1 1 1 1 1 1 1 1 1 1 1 1 1 1 1 1 1 1 1 1 1 1 1 1 1 1 1 
##$CPDPRG= <>
##$CPDPRG1= <>
##$CPDPRG2= <>
##$CPDPRG3= <>
##$CPDPRG4= <mlev>
##$CPDPRG5= <mlev>
##$CPDPRG6= <mlev>
##$CPDPRG7= <mlev>
##$CPDPRG8= <mlev>
##$CPDPRGB= <>
##$CPDPRGT= <>
##$D= (0..31)
0 1.2 0 0 0 0 0 0 0 0.06 0 0.03 0 0 0 0 0.0002 0 0 0 0 0 0 0 0 0 0 0 0 
0 0 0 
##$DATE= 1691583039
##$DBL= (0..7)
120 120 120 120 120 120 120 120 
##$DBP= (0..7)
150 150 150 150 150 150 150 150 
##$DBP07= 0
##$DBPNAM0= <>
##$DBPNAM1= <>
##$DBPNAM2= <>
##$DBPNAM3= <>
##$DBPNAM4= <>
$$ [...]
##$SUBNAM3= <"">
##$SUBNAM4= <"">
##$SUBNAM5= <"">
##$SUBNAM6= <"">
##$SUBNAM7= <"">
##$SUBNAM8= <"">
##$SUBNAM9= <"">
##$SW= 18.05172834244
##$SWIBOX= (0..15)
0 0 2 0 0 0 0 0 0 0 0 0 0 0 0 0 
##$SW_h= 3612.71676300578
##$TD= 16384
##$TD0= 1
##$TE= 0
##$TE2= 300
##$TE3= 300
##$TEG= 300
##$TL= (0..7)
0 120 120 120 120 120 120 120 
##$TP= (0..7)
150 150 150 150 150 150 150 150 
##$TP07= 0
##$TPNAME0= <>
##$TPNAME1= <>
##$TPNAME2= <>
##$TPNAME3= <>
##$TPNAME4= <>
##$TPNAME5= <>
##$TPNAME6= <>
##$TPNAME7= <>
##$TPOAL= (0..7)
0.5 0.5 0.5 0.5 0.5 0.5 0.5 0.5 
##$TPOFFS= (0..7)
0 0 0 0 0 0 0 0 
##$TUNHIN= 0
##$TUNHOUT= 0
##$TUNXOUT= 0
##$USERA1= <user>
##$USERA2= <user>
##$USERA3= <user>
##$USERA4= <user>
##$USERA5= <user>
##$V9= 5
##$VALIST= <valist>
##$VCLIST= <CCCCCCCCCCCCCCC>
##$VD= 0
##$VDLIST= <DDDDDDDDDDDDDDD>
##$VPLIST= <PPPPPPPPPPPPPPP>
##$VTLIST= <TTTTTTTTTTTTTTT>
##$WBST= 1024
##$WBSW= 4
##$XGAIN= (0..3)
0 0 0 0 
##$XL= 0
##$YL= 0
##$YMAX_a= 692868
##$YMIN_a= -437123
##$ZGOPTNS= <>
##$ZL1= 120
##$ZL2= 120
##$ZL3= 120
##$ZL4= 120
##$ABSF1= 15.73477
##$ABSF2= -2.31708
##$ABSG= 5
##$ABSL= 3
##$ALPHA= 0
##$AQORDER= 0
##$ASSFAC= 0
##$ASSFACI= 0
##$ASSFACX= 0
##$ASSWID= 0
##$AUNMP= <proc_1d>
##$AZFE= 0.1
##$AZFW= 0.1
##$BCFW= 0
##$BC_mod= 2
##$BYTORDP= 0
##$COROFFS= 0
##$CY= -3
##$DATMOD= 1
##$DC= 0
##$DFILT= <>
##$DTYPP= 0
##$F1P= 0
##$F2P= 0
##$FCOR= 1
##$FTSIZE= 16384
##$FT_mod= 6
##$GAMMA= 0
##$GB= 0
##$INTBC= 1
##$INTSCL= 3.70164e-10
##$ISEN= 128
##$LB= 0.24
##$LEV0= 0
##$LPBIN= 0
##$MAXI= 10000
##$MC2= 0
##$MEAN= 0
##$ME_mod= 0
##$MI= 1.114404
##$NCOEF= 0
##$NC_proc= -7
##$NLEV= 6
##$NOISF1= 3.799351
##$NOISF2= 2.8
##$NSP= 0
##$NTH_PI= 0
##$NZP= 0
##$OFFSET= 15.72816
##$PC= 1
##$PHC0= -21201.58
##$PHC1= 10.05272
##$PH_mod= 1
##$PKNL= yes
##$PPARMOD= 0
##$PSCAL= 0
##$PSIGN= 0
##$REVERSE= no
##$SF= 200.130008682634
##$SI= 16384
##$SIGF1= 3
##$SIGF2= 2
##$SINO= 5.538805
##$SIOLD= 16384
##$SREGLST= <1H.CDCl3>
##$SSB= 0
##$STSI= 16384
##$STSR= 0
##$SW_p= 3612.71676300578
##$SYMM= 0
##$S_DEV= 0
##$TDeff= 16384
##$TDoff= 0
##$TI= <>
##$TILT= no
##$TM1= 0
##$TM2= 0
##$TOPLEV= 0
##$USERP1= <user>
##$USERP2= <user>
##$USERP3= <user>
##$USERP4= <user>
##$USERP5= <user>
##$WDW= 1
##$XDIM= 16384
##$YMAX_p= 448958011
##$YMIN_p= -977439
$$ End of Bruker specific parameters
$$ ---------------------------------
##NTUPLES= NMR SPECTRUM
##VAR_NAME=  FREQUENCY,     SPECTRUM/REAL,   SPECTRUM/IMAG
##SYMBOL=    X,             R,               I
##VAR_TYPE=  INDEPENDENT,   DEPENDENT,       DEPENDENT
##VAR_FORM=  AFFN,          ASDF,            ASDF
##VAR_DIM=   16384,         16384,           16384
##UNITS=     HZ,            ARBITRARY UNITS, ARBITRARY UNITS
##FACTOR=    0.220516191357247, 1,           1
##FIRST=     3147.67677824543, 0,            0
##LAST=      -465.039984760346, 0,           0
##MIN=       -465.039984760346, -977439,     0
##MAX=       3147.67677824543, 448958011,    0
$$ Real data points
##PAGE= N=1
##DATA TABLE= (X++(R..R)), XYDATA
$$ [...]
$$ plain form
5486 53356909 53195032 52873163 52369037 51927859 51276961 50350955 49661918 49058396 48520754
5477 48520754 47837125 47051311 46272690 45426629 44792168 43992197 43222380 42668907 42357338
5468 42357338 42014798 41533009 40857760 40240860 39801448 39449448 39052729 38752715 38411696
5459 38411696 38208199 37915062 37567234 37093696 36767986 36715180 36633089 36590498 36514587 36597733
5449 36597733 36668085 36778226 36886353 36806359 36975532 37167971 37410895 37638040 37907448 38137168
5439 38137168 38297068 38192398 38326556 38429683 38514653 38699466 38767783 38756870 38830430 38736780
5429 38736780 38655278 38822275 39013243 39059805 39025688 39097258 39103227 39278704 39270907 39351564 39543620
5418 39543620 39922210 40080258 40411711 40754533 41099490 41361267 41832965 42037892 42389490
$$ packed form
5486E3356909j61877l21869n04126m41178o50898r26006o89037o03522n37642
5477D8520754o83629p85814p78621q46061o34461p99971p69817n53473l11569
5468D2357338l42540m81789o75249o16900m39412l52000l96719l00014l41019
5459C8411696k03497k93137l47828m73538l25710n2806q2091m2591p5911Q3146
5449C6597733P0352J10141J08127p9994J69173J92439K42924K27145K69408K29720
5439C8137168J59900j04670J34158J03127Q4970J84813O8317j0913P3560r3650
5429C8736780q1502J66997J90968M6562l4117P1570N969J75477p797Q0657J92056
5418C9543620L78590J58048L31453L42822L44957K61777M71698K04927L51598
$$ plain form
5409 42389490 42731940 43024379 43326906 43873896 44156760 44725304 45010330 45347257 45854461
5400 45854461 46372650 46979900 47604846 48388900 49182189 49915884 50665324 51350698 52298871
5391 52298871 53481066 54590795 55694195 56778543 58003290 59101380 60040125 60661059
5383 60661059 61306870 62015360 62475249 63053359 63421026 63738820 63926088 63761149 63574687
5374 63574687 63321285 63187484 63141160 63279199 63180255 63334019 63310669 63413715 63220358 63425189
5364 63425189 63760386 64308201 64806078 65755751 66478816 67596097 68520296 69306239 70196295
5355 70196295 71521322 72971225 74508667 75893502 77716655 79603757 81434732 83266157
5347 83266157 85503124 88241450 91463050 94568873 97974793 101879010 106300267 111040727
$$ packed form
5409D2389490L42450K92439L02527N46990K82864N68544K85026L36927N07204
5400D5854461N18189O07250O24946P84054P93289P33695P49440O85374R48173
5391E2298871J182195J109729J103400J084348J224747J098090R38745O20934
5383F0661059O45811P08490M59889N78110L67667L17794J87268j64939j86462
5374F3574687k53402j33801m6324J38039r8944J53764k3350J03046j93357K04831
5364F3425189L35197N47815M97877R49673P23065J117281R24199P85943Q90056
5355G0196295J325027J449903J537442J384835J823153J887102J830975J831425
5347H3266157K236967K738326L221600L105823L405920L904217M421257M740460
$$ plain form
5339 111040727 116357801 122226875 129042124 136714699 145036823 153934656 163483734 173613541
5331 173613541 184137931 194849195 205484381 215907171 225676981 234644786 242024364
5324 242024364 247389218 250772498 251658528 249307040 243852153 235606222 225751688 214632094
5316 214632094 202822860 190614891 178609803 166640247 155060918 143792700 133484707
5309 133484707 124227078 115878168 108182071 101185040 94861730 89588248 84661329 80270017
5301 80270017 76276197 72814710 69847488 66781036 63800874 61296661 59103596 57306532
5293 57306532 55441121 53631388 51944279 50681237 49368002 48094331 46680972 45647648
5285 45647648 44609330 43788625 42757873 41878351 41139325 40352661 39492214 38558609 37982234
$$ packed form
5339A11040727N317074N869074O815249P672575Q322124Q897833R549078J0129807
5331A73613541J0524390J0711264J0635186J0422790R769810Q967805P379578
5324B42024364N364854L383280Q86030k351488n454887q245931r854534j1119594
5316B14632094j1809234j2207969j2005088j1969556j1579329j1268218j0307993
5309A33484707r257629q348910p696097o997031o323310n273482m926919m391312
5301H0270017l993820l461487k967222l066452k980162k504213k193065j797064
5293E7306532j865411j809733j687109j263042j313235j273671j413359j033324
5285D5647648j038318q20705j030752q79522p39026p86664q60447r33605n76375
$$ plain form
5276 37982234 37488543 36844000 36169127 35421576 35050782 34541746 33953792 33296713 32739694
5267 32739694 32423455 32237421 31940684 31434136 31040293 30814038 30534709 30211321 29922032
5258 29922032 29820670 29654288 29359791 29097188 28731878 28410338 28080723 27766561 27506377
5249 27506377 27223965 26808226 26583552 26234802 25802569 25506236 25105592 24676181 24375993
5240 24375993 23937000 23708606 23473006 23121980 22730394 22394177 22164690 21995229 21821437
5231 21821437 21539652 21487786 21355472 20917345 20661613 20217908 20061571 19813324 19474013 19127227
5221 19127227 18868032 18469161 18200252 18180496 18036029 17996043 17764034 17625179 17604589 17547849
5211 17547849 17403883 17492875 17569575 17573809 17431368 17507162 17699720 17717277 17657130 17765237 17699276
$$ packed form
5276C7982234m93691o44543o74873p47551l70794n09036n87954o57079n57019
5267C2739694l16239j86034k96737n06548l93843k26255k79329l23388k89289
5258B9922032j01362j66382k94497k62603l65310l21540l29615l14162k60184
5249B7506377k82412m15739k24674l48750m32233k96333m00644m29411l00188
5240B4375993m38993k28394k35600l51026l91586l36217k29487j69461j73792
5231B1821437k81785n1866j32314m38127k55732m43705j56337k48247l39311l46786
5221A9127227k59195l98871k68909j9756j44467l9986k32009j38855k0590n6740
5211A7547849j43966Q8992P6700M234j42441P5794J92558J7557o0147J08107o5961
$$ plain form
5200 17699276 17693741 17720263 17743962 17788286 17953324 18104445 18044725 18146700 17978421 17938494 18035671
5189 18035671 18120568 18221050 18463228 18530516 18804440 18736572 18927290 18971300 19224988 19534411
5179 19534411 19742720 19742975 19929763 19873023 19686759 19229805 19141783 18922358 18573196 18205070
5169 18205070 17863865 17516019 17281552 16665975 16177963 15873315 15848938 15567484 15404129 15063980
5159 15063980 14982147 14685074 14490287 13980430 13894204 13845105 13822065 13874985 13771828 13673158
5149 13673158 13671539 13481614 13281119 13309053 13377029 13479698 13622170 13605099 13629416 13595007 13429908
5138 13429908 13316634 13162830 13385650 13369725 13424531 13256367 13332027 13307242 13384460 13288523
5128 13288523 13475205 13599589 13827261 13656946 13713695 13583033 13604904 13553139 13511404 13453662
$$ packed form
5200A7699276n535K6522K3699M4324J65038J51121n9720J01975j68279l9927R7177
5189A8035671Q4897J00482K42178O7288K73924o7868J90718M4010K53688L09423
5179A9534411K08309K55J86788n6740j86264m56954q8022k19425l49162l68126
5169A8205070l41205l47846k34467o15577m88012l04648k4377k81454j63355l40149
5159A5063980q1833k97073j94787n09857q6226m9099k3040N2920j03157r8670
5149A3673158j619j89925k00495K7934O7976J02669J42472j7071K4317l4409j65099
5138A3429908j13274j53804K22820j5925N4806j68164P5660k4785P7218r5937
5128A3288523J86682J24384K27672j70315N6749j30662K1871n1765m1735n7742
$$ plain form
5118 13453662 13609828 13581801 13638508 13368643 13449221 13329574 13241572 13107512 13257982 13087187
5108 13087187 13193161 13165680 13277863 13033906 13028527 12887391 12971396 12784610 12825238 12912230
5098 12912230 12873600 12624289 12605483 12484554 12463793 12382619 12417880 12445144 12473306 12255802 12055172
5087 12055172 11875044 11932346 11909175 11849432 11872956 12014236 12061300 11941737 11953121 11714710
5077 11714710 11688392 11812345 12039731 12018464 12038511 11967166 11952032 11893418 11991826 11987842 12103156
5066 12103156 12248677 12253761 12266896 12173606 12009771 12006018 11765464 11841270 11836876 11979873 11965222
5055 11965222 11959807 11779725 11846524 11702942 11742377 11659945 12002452 12069974 12171464 11973890
5045 11973890 11969402 11634020 11332405 11182081 11335151 11259732 11308660 11275264 11185617 11196402 11523885
$$ packed form
5118A3453662J56166k8027N6707k69865Q0578j19647q8002j34060J50470j70795
5108A3087187J05974k7481J12183k43957n379j41136Q4005j86786M0628Q6992
5098A2912230l8630k49311j8806j20929k0761q1174L5261K7264K8162k17504k00630
5087A2055172j80128N7302k3171n9743K3524J41280M7064j19563J1384k38411
5077A1714710k6318J23953K27386k1267K0047p1345j5134n8614R8408l984J15314
5066A2103156J45521N084J3135r3290j63835l753k40554P5806m394J42997j4651
5055A1965222n415j80082O6799j43582L9435q2432L42507O7522J01490j97574
5045A1973890m488l35382l01615j50324J53070p5419M8928l3396q9647J0785L27483
$$ plain form
5034 11523885 11475123 11385278 11660456 12004301 12071378 12077905 11890363 11922302 11925673 11998280 11922454
5023 11922454 12062146 12110475 12132854 11981924 11753096 11636670 11685564 11568504 11474762 11452788
5013 11452788 11616842 11551070 11473734 11429836 11441644 11555460 11635722 11583906 11666120 11955221 12138274
5002 12138274 12001853 11846572 11852254 12141933 12260589 11991153 11847156 11672683 11675894 11409458
4992 11409458 11343456 11324020 11295749 11333491 11289131 10950715 10987510 11060583 11041737 10807675 10888600
4981 10888600 10808628 10907132 10907362 10701001 10572562 10635837 10596468 10475117 10371197 10441105 10374830
4970 10374830 10282122 10075255 10056527 10014921 10126770 9938195 9997805 9975498 9908443 9765653
4960 9765653 9661058 9488362 9668873 9776268 9875170 9776269 9966530 10013109 9898904 9844352
$$ packed form
5034A1523885m8762q9845K75178L43845O7077O527j87542L1939L371P2607p5826
5023A1922454J39692M8329K2379j50930k28828j16426M8894j17060r3742k1974
5013A1452788J64054o5772p7336m3898J1808J13816Q0262n1816Q2214K89101J83053
5002A2138274j36421j55281N682K89679J18656k69436j43997j74473L211k66436
4992A1409458o6002j9436k8271L7742m4360l38416L6795P3073j8846k34062Q0925
4981A0888600p9972R8504K30k06361j28439O3275l9369j21351j03920O9908o6275
4970A0374830r2708k06867j8728m1606J11849j88575N9610k2307o7055j42790
4960I765653j04595j72696J80511J07395R8902r8901J90261M6579j14205n4552
$$ plain form
4950 9844352 9837917 9970323 10359168 10262097 10181315 10110234 10203142 10163161 10272354 10445126 10507276
4939 10507276 10426522 10566688 10608719 10655630 10653174 10696892 10833280 10970042 11048285 11228170 11054450
4928 11054450 11134893 11264824 11566031 11837784 11863828 11993946 12040453 12050846 11953823 12125194
4918 12125194 12202096 12437896 12458010 12586399 12652069 12640264 12514674 12573922 12702458 12654517
4908 12654517 12486974 12595280 12567993 12557083 12356335 12241691 12089779 11840551 11909970 11946104
4898 11946104 11709030 11523139 11416879 11510624 11482098 11416756 11328547 11673826 11666186 11591204 11438405
4887 11438405 11470586 11458016 11586394 11463122 11538782 11785398 11917543 11781225 11554003 11534781
4877 11534781 11793979 11924033 12042760 11962934 12230533 12351650 12486813 12232563 12262581 12492037
$$ packed form
4950I844352o435J32406L88845r7071q0782p1081R2908l9981J09193J72772O2150
4939A0507276q0754J40166M2031M6911k456M3718J36388J36762P8243J79885j73720
4928A1054450Q0443J29931L01207K71753K6044J30118M6507J0393r7023J71371
4918A2125194P6902K35800K0114J28389O5670j1805j25590N9248J28536m7941
4908A2654517j67543J08306k7287j0910k00748j14644j51912k49228O9419L6134
4898A1946104k37074j85891j06260R3745k8526o5342q8209L45279p640p4982j52799
4887A1438405L2181j2570J28378j23272P5660K46616J32145j36318k27222j9222
4877A1534781K59198J30054J18727p9826K67599J21117J35163k54250L0018K29456
$$ plain form
4867 12492037 12773485 12846977 12901508 12910955 13211458 13350563 13241892 13226543 13645178 14223980
4857 14223980 14559561 14573172 14539565 14894951 14957585 14876266 14971360 15273122 15747387 15908613
4847 15908613 15655764 15556151 15570691 15690209 15631758 15691957 15972834 16434012 16778111 16516100
4837 16516100 16134558 16293848 16443814 16433234 16276295 16361158 16613422 16917590 16698146 16338558
4827 16338558 16128395 16457980 16683086 16595575 16639738 16956758 17314521 17216827 16743991 16848278
4817 16848278 17550670 18017009 18152266 18276815 18686501 19140805 19129571 18825560 18805964 19188541
4807 19188541 19796951 20182761 20000308 20099826 20334754 20360152 19983699 19713366 19973151 20564739
4797 20564739 20608127 20495718 20472387 20756706 21026470 20884238 20754339 21131225 21960251 22600390
$$ packed form
4867A2492037K81448P3492N4531R447L00503J39105j08671j5349M18635N78802
4857A4223980L35581J3611l3607L55386O2634q1319R5094L01762M74265J61226
4847A5908613k52849r9613J4540J19518n8451O0199K80877M61178L44099k62011
4837A6516100l81542J59290J49966j0580j56939Q4863K52264L04168k19444l59588
4827A6338558k10163L29585K25106q7511M4163L17020L57763r7694m72836J04287
4817A6848278P02392M66339J35257J24549M09686M54304j1234l04011j9596L82577
4807A9188541O08410L85810j82453R9518K34928K5398l76453k70333K59785N91588
4797B0564739M3388j12409k3331K84319K69764j42232j29899L76886Q29026O40139
$$ plain form
4787 22600390 22429837 22381091 22724459 23165833 23318169 23420144 23869097 25058159 25796473
4778 25796473 25857561 25873026 26338394 27092955 27599751 27846862 28425798 29549712 30482389 30870087
4768 30870087 31129873 31676418 32770653 33744858 34421366 35271696 36613759 37939525 38660904
4759 38660904 38973272 39739014 40978590 42314805 43330720 44653677 46618341 49002503
4751 49002503 51312225 53490510 56508234 60742803 65715330 71085202 77267255 84869000
4743 84869000 94408583 106104486 121062562 140297926 163030563 186791892 200600248
4736 200600248 199354912 185453348 159965335 133416524 111922624 96543206 86204880
4729 86204880 78989482 73271297 68730960 65353346 63072155 61460467 59855583 58399135
$$ packed form
4787B2600390j70553m8746L43368M41374J52336J01975M48953J189062P38314
4778B5796473O1088J5465M65368P54561N06796K47111N78936J123914R32677L87698
4768C0870087K59786N46545J094235R74205O76508Q50330J342063J325766P21379
4759C8660904L12368P65742J239576J336215J015915J322957J964664K384162
4751D9002503K309722K178285L017724M234569M972527N369872O182053P601745
4743H4869000R539583J1695903J4958076J9235364K2732637K3761329J3808356
4736B00600248j245336j3901564k5488013k6548811k1493900j5379418j0338326
4729H6204880p215398n718185m540337l377614k281191j611688j604884j456448
$$ plain form
4721 58399135 57521141 57287451 57175270 56854413 56725358 56878177 57446707 57686046 57862566
4712 57862566 58168012 58818418 59636946 60342586 61032365 62222728 63727334 65134508 66461161
4703 66461161 68359184 70751176 73716929 77222953 81044904 85818892 91660668 98305848
4695 98305848 106166353 116183326 129685828 147081864 166616962 188602671 205557126
4688 205557126 207850877 202808187 190472318 167121846 142610437 123218582 109203678
4681 109203678 99256285 91955541 86581828 82465825 78753183 75743683 73584645 71887896
4673 71887896 70458369 69212092 68128399 67265140 66375166 65564258 64636859 63798786 63502466
4664 63502466 63168284 63024203 62911315 63003312 63062312 62875794 62678989 62348982 62298486 62455033
$$ packed form
4721E8399135q77994k33690j12181l20857j29055J52819N68530K39339J76520
4712E7862566L05446O50406Q18528P05640O89779J190363J504606J407174J326653
4703F6461161J898023K391992K965753L506024L821951M773988N841776O645180
4695I8305848P860505J0016973J3502502J7396036J9535098K1985709J6954455
4688B05557126K293751n042690j2335869k3350472k4511409j9391855j4014904
4681A09203678r947393p300744n373713m116003l712642l009500k159038j696749
4673G1887896j429527j246277j083693q63259q89974q10908r27399q38073k96320
4664F3502466l34182j44081j12888R1997N9000j86518j96805l30007n0496J56547
$$ plain form
4654 62455033 62418426 62226275 62013750 61802647 61569165 61085454 60735627 60649165 60663116 60640018
4644 60640018 60622697 60715076 60551970 60413068 60479698 60358614 60507710 60712966 60721169 60554720
4634 60554720 60408247 60149866 59889645 59708323 59627944 59628675 59681499 59846190 59763178 59693363 59657589
4623 59657589 59381082 59299780 59382927 59572753 59696489 59591028 59391866 59096050 58748266 58441361
4613 58441361 58155525 58054182 58211263 58248144 58006232 58038491 58230414 58478661 58622119 58938347
4603 58938347 59318642 59813799 60212344 60821196 61334737 61901361 62556219 63300198 64021869
4594 64021869 64665978 65430625 66412798 67220607 67739290 68457558 69424778 70205245 71166612
4585 71166612 71992532 72920926 73918283 74933987 75870802 77125113 78423934 79754012 81042088
$$ packed form
4654F2455033l6607j92151k12525k11103k33482m83711l49827q6462J3951k3098
4644F0640018j7321R2379j63106j38902O6630j21084J49096K05256Q203j66449
4634F0554720j46473k58381k60221j81322q0379P31N2824J64691q3012o9815l5774
4623E9657589k76507q1302Q3147J89826J23736j05461j99162k95816l47784l06905
4613E8441361k85836j01343J57081L6881k41912L2259J91923K48247J43458L16228
4603E8938347L80295M95157L98545O08852N13541N66624O54858P43979P21671
4594F4021869O44109P64647R82173Q07809N18683P18268R67220P80467R61367
4585G1166612Q25920R28394R97357J015704R36815J254311J298821J330078J288076
$$ plain form
4576 81042088 82456760 83850061 85442006 86915922 88318932 89878122 91526863 93419559
4568 93419559 95214956 96959098 98763675 100691986 102622297 104528351 106435542 108493882
4560 108493882 110055150 111134443 111950680 112608736 113002294 113172166 113239713 113303485 113396498
4551 113396498 113574616 113674791 113941954 114515079 115572249 117156725 119244346 121245165 123751283
4542 123751283 126512918 129653039 132689019 136033723 139411703 142833856 145824653 148879889
4534 148879889 151633370 154153138 155748442 156644602 156081340 154335453 151022505 146647910
4526 146647910 141773849 137116090 132941971 129514311 126698941 124745332 123359978 122532768
4518 122532768 122115733 122163575 122678708 123530178 124679144 126156135 127975207 129606737 130983203
$$ packed form
4576H1042088J414672J393301J591945J473916J403010J559190J648741J892696
4568I3419559J795397J744142J804577J928311J930311J906054J907191K058340
4560A08493882J561268J079293Q16237O58056L93558J69872O7547O3772R3013
4551A13396498J78118J00175K67163N73125J057170J584476K087621K000819K506118
4542A23751283K761635L140121L035980L344704L377980L422153K990797L055236
4534A48879889K753481K519768J595304Q96160n63262j745887l312948m374595
4526A46647910m874061m657759m174119l427660k815370j953609j385354q27210
4518A22532768m17035M7842N15133Q51470J148966J476991J819072J631530J376466
$$ plain form
4509 130983203 131898890 132231973 131849583 130837645 129039391 126666429 123992464 120922168
4501 120922168 117557460 114241251 111091444 108424318 105768375 103573740 101354924 99462534
4493 99462534 97630565 95838987 93886239 92374414 91004570 89832448 88545965 87381115
4485 87381115 86188873 85238431 84352041 83761829 83212080 82825673 82597804 82504780 82326746
4476 82326746 82285889 82162373 82365718 82655242 82989447 83241473 83716895 84213677 84944888 85521463
4466 85521463 86302910 87311265 88401258 89302624 90335638 91695312 92984082 93958373 94972812
4457 94972812 96356031 97668192 98778891 99776283 100563263 101368255 102315217 102996543 103973539
4448 103973539 105176757 106557635 108219301 109935093 111840717 113877275 116296469 118930278
$$ packed form
4509A30983203R15687L33083l82390j011938j798254k372962k673965l070296
4501A20922168l364708l316209l149807k667126k655943k194635k218816j892390
4493I9462534j831969j791578j952748j511825j369844j172122j286483j164850
4485H7381115j192242r50442q86390n90212n49749l86407k27869r3024j78034
4476H2326746m0857j23516K03345K89524L34205K52026M75422M96782P31211N76575
4466H5521463P81447J008355J089993R01366J033014J359674J288770R74291J014439
4457I4972812J383219J312161J110699R97392P86980Q04992R46962O81326R76996
4448A03973539J203218J380878J661666J715792J905624K036558K419194K633809
$$ plain form
4440 118930278 121503307 124354711 127189396 129868454 131951966 133854175 135644656 137327657
4432 137327657 138601291 139420374 139776352 139940072 140074670 139995129 139986380 140325148 140887447 141754336
4422 141754336 142575180 143584046 144913755 146480217 148151011 149921154 151923816 154261448
4414 154261448 156685644 158882137 160786940 162470271 163780300 164809673 165246346 165204765
4406 165204765 165127342 165021465 164611691 164457403 164358998 164114394 163905752 163893900 163464845 162999109
4396 162999109 162644679 162239723 161869762 161672097 161733675 162349050 163053350 163417526 164012729
4387 164012729 164987974 165869798 166531080 167155967 167691892 168302973 169037884 169779816 170794062
4378 170794062 172140584 173693377 175539200 177549597 179808033 182339002 185192753 188301441
$$ packed form
4440A18930278K573029K851404K834685K679058K083512J902209J790481J683001
4432A37327657J273634Q19083L55978J63720J34598p9541q749L38768N62299Q66889
4422A41754336Q20844J008866J329709J566462J670794J770143K002662K337632
4414A54261448K424196K196493J904803J683331J310029J029373M36673m1581
4406A65204765p7423j05877m09774j54288r8405k44604k08642j1852m29055m65736
4396A62999109l54430m04956l69961j97665O1578O15375P04300L64176N95203
4387A64012729R75245Q81824O61282O24887N35925O11081P34911P41932J014246
4378A70794062J346522J552793J845823K010397K258436K530969K853751L108688
$$ plain form
4370 188301441 191822824 195803794 200336170 205663988 211662881 218297886 226024600 234850963
4362 234850963 244762133 255638435 267771293 281644572 297677499 316506368 338432489
4355 338432489 362713032 387252435 408602708 421380652 419984099 402219810 372777449
4348 372777449 339152807 306988441 278608831 254787029 234818467 218106846 204519086
4341 204519086 193083449 183192427 174776261 167140004 160249279 154256172 148941845 144322738
4333 144322738 140378242 136618147 133120567 130180402 127550117 124968441 122776517 121015383
4325 121015383 119630829 118407160 117291196 116354208 115314659 114364423 113817893 113308151 112936094
4316 112936094 112722307 112575796 112558889 112615826 112766183 113092844 113868773 114928040 116287684
$$ packed form
4370A88301441L521383L980970M532376N327818N998893O635005P726714Q826363
4362B34850963R911170J0876302J2132858J3873279J6032927J8828869K1926121
4355C38432489K4280543K4539403K1350273J2777944j396553j7764289k9442361
4348C72777449l3624642l2164366k8379610k3821802j9968562j6711621j3587760
4341B04519086j1435637r891022q416166p636257o890725n993107n314327m619107
4333A44322738l944496l760095l497580k940165k630285k581676k191924j761134
4325A21015383j384554j223669j115964r36988j039549r50236n46530n09742l72057
4316A12936094k13787j46511j6907N6937J50357L26661P75929J059267J359644
$$ plain form
4307 116287684 118117618 120273031 122966158 125917596 129258153 133454569 138351718 144002442
4299 144002442 150190455 157275333 165328366 174100550 183179266 192426412 200653332 206805308
4291 206805308 209729698 208382500 202777739 193949789 183261402 171840228 160663980 150550521
4283 150550521 141501980 133406200 125986226 119732049 114447692 109917278 105905436 102249270
4275 102249270 98973991 96369830 93890126 91310454 88796529 86795173 85038030 83300515
4267 83300515 81226732 79145182 77275171 75598727 73701681 71803972 70094621 68954443
4259 68954443 67810013 66501312 65147181 64195374 63309501 62296335 61014481 60224510 59759233
4250 59759233 59354805 58669436 57770155 57129689 56704738 56040166 55355862 54917776 54749088
$$ packed form
4307A16287684J829934K155413K693127K951438L340557M196416M897149N650724
4299A44002442O188013P084878Q053033Q772184R078716R247146Q226920O151976
4291B06805308K924390j347198n604761q827950j0688387j1421174j1176248j0113459
4283A50550521r048541q095780p419974o254177n284357m530414m011842l656166
4275A02249270l275279k604161k479704k579672k513925k001356j757143j737515
4267H3300515k073783k081550j870011j676444j897046j897709j709351j140178
4259F8954443j144430j308701j354131r51807q85873j013166j281854p89971m65277
4250E9759233m04428o85369q99281o40466m24951o64572o84304m38086j68688
$$ plain form
4241 54749088 54693536 54250384 53623691 53286454 53058838 52671803 52170514 51667659 51390208 51186803
4231 51186803 50581040 49737065 49131649 48460264 47888017 47433078 46940037 46597469 46670935 46536589
4221 46536589 45969785 45370518 45035639 44715547 44366035 43890500 43763439 43813981 43568650 43025029
4211 43025029 42511486 42264164 42218448 41815355 41567166 41383177 41517435 41449742 41393408 40951798
4201 40951798 40773283 40840454 40861993 40688625 40765788 40846016 40918556 40583908 40442220 40382639
4191 40382639 40739371 40748948 40848367 41178632 41657500 41896132 42055546 42081724 42307688 42687365
4181 42687365 43019805 43369934 43727169 44034664 44525478 44828484 45233233 45670909 46147696
4172 46147696 46694445 47078743 47291805 47578051 47686131 47702470 47447936 47337995 47336739 47172069
$$ packed form
4241E4749088n5552m43152o26693l37237k27616l87035n01289n02855k77451k03405
4231E1186803o05763q43975o05416o71385n72247m54939m93041l42568P3466j34346
4221D6536589n66804n99267l34879l20092l49512m75535j27061N0542k45331n43621
4211D3025029n13543k47322m5716m03093k48189j83989J34258o7693n6334m41610
4201D0951798j78515O7171K1539j73368P7163Q0228P2540l34648j41688n9581
4191D0382639L56732R577R9419L30265M78868K38632J59414K6178K25964L79677
4181D2687365L32440L50129L57235L07495M90814L03006M04749M37676M76787
4172D6147696N46749L84298K13062K86246J08080J6339k54534j09941j256j64670
$$ plain form
4162 47172069 46941520 46324197 46036551 45834977 45554590 45021381 44552517 44324834 44293170 43966022
4152 43966022 43738636 43593896 43790819 43781744 43638386 43566186 43767889 43925711 44007859 43839800
4142 43839800 44049891 44543136 44962688 45335969 45988615 46385853 47214551 47752280 48202293
4133 48202293 48698513 49154808 49346692 49057658 48692939 48391802 47977499 47585405 47205210
4124 47205210 47149520 47351232 47501092 47495037 47625458 47756410 48068244 48295489 48418764 48840968
4114 48840968 49464364 50138889 50632257 51074436 51844459 52672178 53196206 53217036 53249698 53459821
4104 53459821 53430894 53084069 52568618 52058576 51846720 51682752 51352044 51234209 51574831 52045598
4094 52045598 52224479 52372736 52611987 53118133 53460385 53649524 53792678 53943610 54154038
$$ packed form
4162D7172069k30549o17323k87646k01574k80387n33209m68864k27683l1664l27148
4152D3966022k27386j44740J96923r075j43358p2200K01703J57822Q2148j68059
4142D3839800K10091M93245M19552L73281O52646L97238Q28698N37729M50013
4133D8202293M96220M56295J91884k89034l64719l01137m14303l92094l80195
4124D7205210n5690K01712J49860o055J30421J30952L11834K27245J23275M22204
4114D8840968O23396O74525M93368M42179P70023Q27719N24028K0830L2662K10123
4104E3459821k8927l46825n15451n10042k11856j63968l30708j17835L40622M70767
4094E2045598J78881J48257K39251N06146L42252J89139J43154J50932K10428
$$ plain form
4085 54154038 54185768 53850302 53475120 53183944 52879445 52242852 51623090 51183636 50859800 50623460
4075 50623460 50165492 49778459 49694238 49690152 49439373 49169953 49167699 49566439 49788762 49816262
4065 49816262 49857932 50126746 50515289 50887751 51048698 51537514 52278563 52957105 53278417 53583888
4055 53583888 54183750 55084552 55755783 56176356 56726774 57490608 58191460 58410551 58367022 58368346
4045 58368346 58659043 58875300 58895160 58714409 58823338 59072868 59125358 59131031 59378511 59866427
4035 59866427 60433227 60948089 61383616 61841175 62202273 62234124 61674518 61041122 60277576 59556523
4025 59556523 58573107 57538860 57028908 56734288 56560272 56186677 55963679 55808106 55916451
4016 55916451 55796743 55586171 55500359 55601302 55738987 55792639 55501941 55639829 55766371 55913803
$$ packed form
4085E4154038L1730l35466l75182k91176l04499o36593o19762m39454l23836k36340
4075E0623460m57968l87033q4221m086k50779k69420k254L98740K22323K7500
4065D9816262M1670K68814L88543L72462J60947M88816P41049O78542L21312L05471
4055E3583888N99862R00802O71231M20573N50418P63834P00852K19091m3529J324
4045E8368346K90697K16257J9860j80751J08929K49530N2490N673K47480M87916
4035E9866427N66800N14862M35527M57559L61098L1851n59606o33396p63546p21053
4025E9556523r83416j034247n09952k94620j74016l73595k22998j55573J08345
4016E5916451j19708k10572q5812J00943J37685N3652k90698J37888J26542J47432
$$ plain form
4006 55913803 56004084 56077550 56209020 56408561 56447318 56266949 56147414 56132437 56116125 56068486
3996 56068486 56079733 56385513 56655957 57044895 57111880 57271663 57525171 57776222 57755633 57783328
3986 57783328 57858465 57924253 58092062 58211815 58044313 58084069 58280818 58535108 58689688 58857593
3976 58857593 59171184 59308102 59363926 59188352 59185795 59322210 59438278 59392709 59296282 59223042
3966 59223042 59186016 59216772 59139799 58929861 58989088 58968600 58822425 58730420 58489335 58163829
3956 58163829 57794047 57243822 56439686 55633008 54771275 54098276 53324205 52447653 51803095
3947 51803095 51094370 50510766 49945903 49232910 48397213 47744318 46700675 45733802 44785230
3938 44785230 43829461 42805774 41724866 40487885 39323627 38262693 37333824 36373541 35527367
$$ packed form
4006E5913803R0281P3466J31470J99541L8757j80369j19535j4977j6312m7639
3996E6068486J1247L05780K70444L88938O6985J59783K53508K51051k0589K7695
3986E7783328P5137O5788J67809J19753j67502L9756J96749K54290J54580J67905
3976E8857593L13591J36918N5824j75574k557J36415J16068m5569r6427p3240
3966E9223042l7026L0756p6973k09938N9227k0488j46175r2005k41085l25506
3956E8163829l69782n50225q04136q06678q61733o72999p74071q76552o44558
3947E1803095p08725n83604n64863p12993q35697o52895j043643r66873r48572
3938D4785230r55769j023687j080908j236981j164258j060934r28869r60283q46174
$$ plain form
3929 35527367 34773549 33985677 33230658 32239104 31293225 30466497 29759937 28870781 28042312
3920 28042312 27585093 27188618 26714859 25855006 25083903 24790077 24449774 23905723 23466927
3911 23466927 23017871 22867716 22616313 21987803 21284206 20922682 20656524 20287253 19803141
3902 19803141 19464724 19070317 18648080 18103775 17676064 17155615 16989467 16941167 16755523 16435571
3892 16435571 16132729 15810611 15532789 15131945 14708141 14744182 14773352 14501019 14016519 13681601
3882 13681601 13422152 13215840 12867096 12626315 12560471 12446278 12328171 12112913 11964303 11632583
3872 11632583 11458591 11208535 11025266 11039564 11051769 10945378 10937487 10611636 10409535 10187389
3862 10187389 10071248 10050849 10000867 9863081 9827985 9798246 9622399 9656996 9334474 9211972
$$ packed form
3929C5527367p53818p87872p55019r91554r45879q26728p06560q89156q28469
3920B8042312m57219l96475m73759q59853p71103k93826l40303n44051m38796
3911B3466927m49056j50155k51403o28510p03597l61524k66158l69271m84112
3902A9803141l38417l94407m22237n44305m27711n20449j66148m8300j85644l19952
3892A6435571l02842l22118k77822m00844m23804L6041K9170k72333m84500l34918
3882A3681601k59449k06312l48744k40781o5844j14193j18107k15258j48610l31720
3872A1632583j73992k50056j83269J4298J2205j06391p891l25851k02101k22146
3862A0187389j16141k0399m9982j37786l5096k9739j75847L4597l22522j22502
$$ plain form
3852 9211972 9105906 9182866 9183142 9081544 9006680 8920530 8859506 8756958 8517033 8310656 8437009
3841 8437009 8479521 8329609 8335690 8266542 8056177 7855787 7788428 7676571 7606990 7811799 7866679
3830 7866679 7878151 7877507 7705527 7593517 7343312 7351568 7377338 7536846 7471142 7593795 7473999
3819 7473999 7399289 7104942 6813969 6892025 7064185 7139651 7253057 7170593 7176373 6968419 6979142
3808 6979142 6838173 6775845 6911537 7121116 7038825 7006902 6885257 6768030 6556098 6418392
3798 6418392 6455108 6637786 6899916 6855457 6813317 6778402 6624754 6463838 6227052 6217341 6337410
3787 6337410 6503483 6684041 6468628 6289325 5956564 5874724 5886587 5961218 6087412 6350616
3777 6350616 6459417 6357693 5992885 5780061 5709935 5745876 5678788 5793932 5898951 6056665
$$ packed form
3852I211972j06066P6960K76j01598p4864q6150o1024j02548k39925k06377J26353
3841H437009M2512j49912O081o9148k10365k00390o7359j11857o9581K04809N4880
3830G866679J1472o44j71980j12010k50205Q256K5770J59508o5704J22653j19796
3819G473999p4710k94347k90973P8056J72160P5466J13406q2464N780k07954J0723
3808F979142j40969o2328J35692K09579q2291l1923j21645j17227k11932j37706
3798F418392L6716J82678K62130m4459m2140l4915j53648j60916k36786r711J20069
3787F337410J66073J80558k15413j79303l32761q1840J1863P4631J26194K63204
3777F350616J08801j01724l64808k12824p0126L5941o7088J15144J05019J57714
$$ plain form
3767 6056665 5907459 5634503 5420978 5334602 5559186 5630088 5712656 5823397 5896472 5798337
3757 5798337 5493350 5320279 5401720 5630095 5687799 5609001 5459815 5613671 5607065 5326958
3747 5326958 5183217 5213593 5324859 5452667 5503309 5506350 5499018 5596417 5365685 5192116 5343342
3736 5343342 5548334 5672061 5617878 5513236 5456241 5463443 5399486 5224316 5199260 5345911 5424929
3725 5424929 5449834 5296584 5434489 5441375 5338266 5220126 5055391 5264896 5510772 5481499
3715 5481499 5238033 5286727 5444230 5357756 5237907 5123392 5052895 5284219 5313894 5127263
3705 5127263 5000853 5208908 5245821 5225782 5149893 5259001 5381734 5385594 5277848 5196168 5195244
3694 5195244 5310851 5243693 5169700 5209084 5393614 5495167 5391041 5135268 5096185 5300731
$$ packed form
3767F056665j49206k72956k13525q6376K24584P0902Q2568J10741P3075r8135
3757E798337l04987j73071Q1441K28375N7704p8798j49186J53856o606k80107
3747E326958j43741L0376J11266J27808N0642L041p332R7399k30732j73569J51226
3736E343342K04992J23727n4183j04642n6995P202o3957j75170k5056J46651P9018
3725E424929K4905j53250J37905O886j03109j18140j64735K09505K45876k9273
3715E481499k43466M8694J57503q6474j19849j14515p0497K31324K9675j86631
3705E127263j26410K08055L6913k0039p5889J09108J22733L860j07746q1680r24
3694E195244J15607o7158p3993L9384J84530J01553j04126k55773l9083K04546
$$ plain form
3684 5300731 5402356 5236862 5125543 5175621 5354622 5290641 5161059 5217713 5201366 5174581
3674 5174581 5190916 5250984 5316318 5494089 5409747 5347843 5201791 5299750 5189825 5281096 5377875
3663 5377875 5297376 5278356 5261391 5322594 5354087 5369791 5452260 5500792 5534203 5458985 5393604
3652 5393604 5280615 5275876 5449156 5614186 5464284 5564701 5473242 5628834 5621755 5658295 5649205
3641 5649205 5634890 5627220 5516654 5690884 5850729 5811833 5888456 5930358 5819635 5813418 5851771
3630 5851771 5912750 6126627 6280317 6242542 6312937 6434902 6498986 6610401 6808977 6932567
3620 6932567 6968039 6943810 6910086 6914111 6914545 6615464 6346067 6274332 6387429 6427119 6470607
3609 6470607 6491084 6343894 6308657 6352756 6432643 6536783 6583807 6600741 6587977 6745391 6870017
$$ packed form
3684E300731J01625j65494j11319N0078J79001o3981j29582N6654j6347k6785
3674E174581J6335O0068O5334J77771q4342o1904j46052R7959j09925R1271R6779
3663E377875q0499j9020j6965O1203L1493J5704Q2469M8532L3411p5218o5381
3652E393604j12989m739J73280J65030j49902J00417r1459J55592p079L6540r090
3641E649205j4315p670j10566J74230J59845l8896P6623M1902j10723o217L8353
3630E851771O0979K13877J53690l7775P0395J21965O4084J11415J98576J23590
3620F932567L5472k4229l3724M025M34k99081k69397p1735J13097L9690M3488
3609F470607K0477j47190l5237M4099P9887J04140M7024J6934j2764J57414J24626
$$ plain form
3598 6870017 6784764 6787432 6990912 7194679 7355537 7331162 7393583 7502845 7554742 7351426 7216988
3587 7216988 7230425 7243796 7284437 7213338 7048447 7185675 7114556 7075757 7029317 7085957 7204545
3576 7204545 7356881 7401462 7414959 7407474 7352981 7479581 7687664 7628551 7731837 7977729 8055939
3565 8055939 7913777 8030179 8207961 8385459 8543429 8472049 8596518 8697053 8720108 8714119
3555 8714119 8844079 8993518 9175880 9135240 9275766 9339564 9409187 9336929 9434860 9428139 9632671
3544 9632671 9915634 10048106 10014964 10081291 10088645 10076881 10205858 10331574 10446283 10570478
3534 10570478 10603930 10645114 10561868 10453195 10598655 10889677 11121814 11236046 11443935 11476063
3524 11476063 11416875 11383878 11614125 11995453 12345791 12486700 12714408 12816518 12973475 12974475
$$ packed form
3598F870017q5253K668K03480K03767J60858k4375O2421J09262N1897k03316j34438
3587G216988J3437J3371M0641p1099j64891J37228p1119l8799m6440N6640J18588
3576G204545J52336M4581J3497p485n4493J26600K08083n9113J03286K45892P8210
3565H055939j42162J16402J77782J77498J57970p1380J24469J00535K3055n989
3555H714119J29960J49439J82362m0640J40526O3798O9623p2258R7931o721K04532
3544I632671K82963J32472l3142O6327P354j1764J28977J25716J14709J24195
3534A0570478L3452M1184q3246j08673J45460K91022K32137J14232K07889L2128
3524A1476063n9188l2997K30247L81328L50338J40909K27708J02110J56957J000
$$ plain form
3514 12974475 12893043 12892272 13196575 13559595 13982561 14244762 14460503 14395338 14299198 14512104
3504 14512104 14842465 15190337 15479051 15777496 15951202 15981292 16146195 16072239 16013398 16184167
3494 16184167 16434541 16576846 16825245 17023781 17115045 16919837 16833330 16938423 17015168 17219973
3484 17219973 17385478 17569594 17683868 17702499 17552443 17308852 17417359 17590930 17854639 18051726
3474 18051726 18027003 18179703 18098505 17965134 17673194 17779522 18089528 18596139 18887086 18940482
3464 18940482 18951502 19188598 19124850 19215868 19282298 19804748 20259180 20565510 20765634 21101101
3454 21101101 21286050 21450506 21593196 21799499 22311216 22983634 23383890 23612183 23640171 23866695
3444 23866695 24188555 24314000 24576815 25314481 25799603 26085680 26062057 26117405 26406496 26676244
$$ packed form
3514A2974475q1432p71L04303L63020M22966K62201K15741o5165r6140K12906
3504A4512104L30361L47872K88714K98445J73706L0090J64903p3956n8841J70769
3494A6184167K50374J42305K48399J98536R1264j95208q6507J05093P6745K04805
3484A7219973J65505J84116J14274J8631j50056k43591J08507J73571K63709J97087
3474A8051726k4723J52700q1198j33371k91940J06328L10006N06611K90947N3396
3464A8940482J1020K37096o3748R1018O6430N22450M54432L06330K00124L35467
3454B1101101J84949J64456J42690K06303N11717O72418M00256K28293K7988K26524
3444B3866695L21860J25445K62815P37666M85122K86077k3623N5348K89091K69748
$$ plain form
3434 26676244 27183053 27518921 27910089 28303191 28699342 28804865 28991365 29161323 29427352
3425 29427352 29838446 30311805 30528605 30931210 31275063 31363305 31400045 31856988 32322676 32858513
3415 32858513 33343597 33849517 34122467 34568554 34759517 34900390 35106143 35494981 35899704
3406 35899704 36327535 36563713 36695758 36837728 36989021 37030912 37240675 37511691 38117529 38472617
3396 38472617 38603153 38668741 38957546 38957757 38955152 39090533 39507320 39880380 40101403 40226181
3386 40226181 40441066 40542989 40707503 41045663 41483201 41842132 42318437 43024819 43443031
3377 43443031 43658764 43969335 44536909 45137444 45640189 46055992 46754756 47164907 47637339
3368 47637339 47955829 48243903 48572882 48882274 49295166 49718824 50021663 50490979 50668307
$$ packed form
3434B6676244N06809L35868L91168L93102L96151J05523J86500J69958K66029
3425B9427352M11094M73359K16800M02605L43853Q8242L6740M56943M65688N35837
3415C2858513M85084N05920K72950M46087J90963J40873K05753L88838M04723
3406C5899704M27831K36178J32045J41970J51293M1891K09763K71016O05838L55088
3396C8472617J30536O5588K88805K11k605J35381M16787L73060K21023J24778
3386D0226181K14885J01923J64514L38160M37538L58931M76305P06382M18212
3377D3443031K15733L10571N67574O00535N02745M15803O98764M10151M72432
3368D7637339L18490K88074L28979L09392M12892M23658L02839M69316J77328
$$ plain form
3359 50668307 50709558 50785001 50852893 50970721 51336303 51506239 51761285 51917135 52078370 51979317
3349 51979317 52000556 52039505 52172153 52296280 52505527 52632551 52698192 52834806 53399171 53652739
3339 53652739 54048188 54587086 55378774 56004678 56606756 57097698 57636669 57895438 58123971
3330 58123971 58301991 58630576 59098800 59541690 59911392 60274186 60655116 61107860 61560272
3321 61560272 61950862 62417496 62965125 63520493 63939547 64240528 64361345 64467500 64575152
3312 64575152 64894885 65130967 65609488 66132424 66708381 67063477 67666315 68235196 69072433
3303 69072433 69927025 70885366 71769428 73002777 74178237 75157567 76061087 77171391 78425395
3294 78425395 79604144 80621612 81961630 83369097 84893065 85967955 87042545 88048175
$$ packed form
3359E0668307M1251P5443O7892J17828L65582J69936K55046J55850J61235r9053
3349E1979317K1239L8949J32648J24127K09247J27024O5641J36614N64365K53568
3339E3652739L95449N38898P91688O25904O02078M90942N38971K58769K28533
3330E8123971J78020L28585M68224M42890L69702L62794L80930M52744M52412
3321F1560272L90590M66634N47629N55368M19054L00981J20817J06155J07652
3312F4575152L19733K36082M78521N22936N75957L55096O02838N68881Q37237
3303F9072433Q54592R58341Q84062J233349J175460R79330R03520J110304J254004
3294G8425395J178749J017468J340018J407467J523968J074890J074590J005630
$$ plain form
3286 88048175 89247678 90492065 91925007 93305088 94970669 96629177 98250807 99822663
3278 99822663 101519717 103323991 105152785 106952593 108888622 111286612 113905509 116514308
3270 116514308 119087090 121680805 124584966 127965510 131224030 134751410 138664453 143016674
3262 143016674 147171799 151347403 155659512 160364612 165162863 170259216 175226139 180454306
3254 180454306 186178792 192024601 197565564 203233346 209195059 215354733 221446200 227246327
3246 227246327 232684901 237946577 243022965 247784548 252248203 256837727 261457701 266521182
3238 266521182 271284819 276182315 280894022 285577003 289844617 293645196 297152754 300549860
3230 300549860 303613359 306162798 308198393 310209346 312526388 314978899 317627286 320706576
$$ packed form
3286H8048175J199503J244387J432942J380081J665581J658508J621630J571856
3278I9822663J697054J804274J828794J799808J936029K397990K618897K608799
3270A16514308K572782K593715K904161L380544L258520L527380L913043M352221
3262A43016674M155125M175604M312109M705100M798251N096353M966923N228167
3254A80454306N724486N845809N540963N667782N961713O159674O091467N800127
3246B27246327N438574N261676N076388M761583M463655M589524M619974N063481
3238B66521182M763637M897496M711707M682981M267614L800579L507558L397106
3230C00549860L063499K549439K035595K010953K317042K452511K648387L079290
$$ plain form
3222 320706576 324141547 327567864 331014657 334000109 336481409 338606225 340365847 341408748
3214 341408748 341518872 340840047 339751532 337928114 335371352 332343062 329103659 325808561
3206 325808561 322334889 318490323 314575354 310449021 305980293 301206176 296023384 290224315
3198 290224315 284354566 277914805 270664155 262920805 255149145 247229698 239178588 231171148
3190 231171148 223659843 216648955 210062979 203751025 197647590 191878557 186748784 181765619
3182 181765619 177281858 173223001 169659362 166550644 163554956 160311860 157511098 154914998
3174 154914998 152643589 150262936 148286622 146466311 144928750 142974260 141003890 138964942
3166 138964942 137437420 135895934 134243263 132820563 131500054 130372608 129247964 127930758
$$ packed form
3222C20706576L434971L426317L446793K985452K481300K124816J759622J042901
3214C41408748J10124o78825j088515j823418k556762l028290l239403l295098
3206C25808561l473672l844566l914969m126333m468728m774117n182792n799069
3198B90224315n869749o439761p250650p743350p771660p919447q051110q007440
3190B31171148p511305p010888o585976o311954o103435n769033n129773m983165
3182A81765619m483761m058857l563639l108718k995688l243096k800762k596100
3174A54914998k271409k380653j976314j820311j537561j954490j970370k038948
3166A38964942j527522j541486j652671j422700j320509j127446j124644j317206
$$ plain form
3158 127930758 126589749 125600396 124785579 124212891 123478012 122669745 121829728 120967156 120133652
3149 120133652 119246211 118117299 117608116 116862242 116185746 115369116 114794731 114206559 113297391
3140 113297391 112248307 111554468 110958049 110624354 110204557 109820642 109521074 109642717 109622110
3131 109622110 109445122 109388724 109802379 110152015 110527302 110348735 110343379 110317095 110114224 109557497
3121 109557497 109094563 108750044 108525747 108100173 107609546 107250563 107106505 106974655 106593466
3112 106593466 106333591 106548219 107180161 107833727 108063530 108506164 109009652 109565332 110003737
3103 110003737 110285803 110686224 111136634 111855220 112102994 112094277 112422496 112786072 113068289 113205397
3093 113205397 113326682 113708622 114021195 114374922 114537819 114933723 115534444 116049294 116416194
$$ packed form
3158A27930758j341009r89353q14817n72688p34879q08267q40017q62572q33504
3149A20133652q87441j128912n09183p45874o76496q16630n74385n88172r09168
3140A13297391j049084o93839n96419l33695m19797l83915k99568J21643k0607
3131A09622110j76988n6398M13655L49636L75287j78567n356k6284k02871n56727
3121A09557497m62934l44519k24297m25574m90627l58983j44058j31850l81189
3112A06593466k59875K14628O31942O53566K29803M42634N03488N55680M38405
3103A10003737K82066M00421M50410P18586K47774q717L28219L63576K82217J37108
3093A13205397J21285L81940L12573L53727J62897L95904O00721N14850L66900
$$ plain form
3084 116416194 117057748 117938496 118974651 119709037 120577841 121623953 122907946 124300907 125588864
3075 125588864 126658198 128034823 129632566 131490955 132879600 134361357 136185186 138105667
3067 138105667 139725534 141099382 142406846 144014491 145551212 146836786 147937300 149315770
3059 149315770 150421972 151587010 152373434 153266793 154160348 155049251 155526986 155592578 155391430
3050 155391430 154837875 153933471 152476998 150723324 149136168 147609950 145786261 143714874
3042 143714874 141588330 139759326 137868691 136104026 134145463 132625461 131418946 130169314
3034 130169314 128745658 127232671 125929954 124607448 123296482 121652958 119956136 118283832
3026 118283832 116340341 114093854 111437997 108923887 106618489 104258905 101839753 99389819
$$ packed form
3084A16416194O41554Q80748J036155P34386Q68804J046112J283993J392961J287957
3075A25588864J069334J376625J597743J858389J388645J481757J823829J920481
3067A38105667J619867J373848J307464J607645J536721J285574J100514J378470
3059A49315770J106202J165038P86424Q93359Q93555Q88903M77735O5592k01148
3050A55391430n53555r04404j456473j753674j587156j526218j823689k071387
3042A43714874k126544j829004j890635j764665j958563j520002j206515j249632
3034A30169314j423656j512987j302717j322506j310966j643524j696822j672304
3026A18283832j943491k246487k655857k514110k305398k359584k419152k449934
$$ plain form
3018 99389819 97026898 94862908 92579584 90381516 88426135 86860655 85593096 84321063
3010 84321063 83026298 81879559 80972728 80073842 79117854 78455266 78034928 77871930 77494889
3001 77494889 77073436 76748504 76645524 76634144 76909863 77202983 77547148 78249734 79189774 79757303
2991 79757303 80350107 81239226 82390741 83612989 84932124 86517111 88367366 90202889
2983 90202889 91868473 93525324 95307863 97355735 99676789 101821545 103942752 106012329
2975 106012329 107797208 109007190 109914103 110923106 111904150 112630169 113106339 113014446 112743115
2966 112743115 112080199 111160934 110040924 108745159 107488503 106239050 104480490 102639063
2958 102639063 100542505 98482728 96270089 93980575 91923270 90231382 88532252 86779250
$$ packed form
3018I9389819k362921k163990k283324k198068j955381j565480j267559j272033
3010H4321063j294765j146739r06831q98886r55988o62588m20338j62998l77041
3001G7494889m21453l24932j02980j1380K75719K93120L44165P02586R40040N67529
2991G9757303N92804Q89119J151515J222248J319135J584987J850255J835523
2983I0202889J665584J656851J782539K047872K321054K144756K121207K069577
2975A06012329J784879J209982R06913J009003R81044P26019M76170r1893k71331
2966A12743115o62916r19265j120010j295765j256656j249453j758560j841427
2958A02639063k096558k059777k212639k289514k057305j691888j699130j753002
$$ plain form
2950 86779250 84536334 82228826 80457136 78747506 77206561 75890002 74769149 73590584
2942 73590584 72440891 71308610 70033639 69134368 68539049 68158623 67914610 67676873 67334745
2933 67334745 67117499 66831586 66435084 66345225 66410121 66771599 67008594 67201645 67320385 67392363
2923 67392363 67330025 67349177 67593676 68152257 68761724 69166895 69187681 69265642 69298180 69292648 69419491
2912 69419491 69771595 70281323 71031423 71289691 71531016 71656869 72146403 72811173 73555621
2903 73555621 74386577 75544254 76425809 77497003 78321762 79019710 79875326 81386497 82890831
2894 82890831 84595341 86258981 88049948 89652801 91369082 93004169 95076744 97313218
2886 97313218 100262616 103117489 106290508 109643924 113085712 116689879 120923441 125745323
$$ packed form
2950H6779250k242916k307508j771690j709630j540945j316559j120853j178565
2942G3590584j149693j132281j274971q99271n95319l80426k44013k37737l42128
2933F7334745k17246k85913l96502q9859O4896L61478K36995J93051J18740P1978
2923F7392363o2338J9152K44499N58581O09467M05171K0786P7961L2538n532J26843
2912F9419491L52104N09728P50100K58268K41325J25853M89534O64770P44448
2903G3555621Q30956J157677Q81555J071194Q24759O97948Q55616J511171J504334
2894H2890831J704510J663640J790967J602853J716281J635087K072575K236474
2886I7313218K949398K854873L173019L353416L441788L604167M233562M821882
$$ plain form
2878 125745323 131174092 136747210 142209885 147115576 151849404 156102906 159901104 163366443
2870 163366443 166778876 170045721 173362925 177312889 181583057 186323535 191331719 196875773
2862 196875773 202675778 208843198 215277827 222559002 230060620 238045511 246161989 254019670
2854 254019670 261391633 268290693 274588009 281198315 287860787 295141386 302646476 310611920
2846 310611920 318363388 326484052 334733493 343752174 352443635 360497688 366126516 368138585
2838 368138585 364447800 356344479 346928377 339619327 335134238 333911268 335447227 339371663
2830 339371663 345114166 352603097 361412616 371922665 383883638 397433720 411633315
2823 411633315 425622062 437542076 445963121 448958011 446333622 438134480 425116511 407166606
$$ packed form
2878A25745323N428769N573118N462675M905691M733828M253502L798198L465339
2870A63366443L412433L266845L317204L949964M270168M740478N008184N544054
2862A96875773N800005O167420O434629P281175P501618P984891Q116478P857681
2854B54019670P371963O899060O297316O610306O662472P280599P505090P965444
2846C10611920P751468Q120664Q249441R018681Q691461Q054053N628828K012069
2838C68138585l690785q103321r416102p309050m485089j222970J535959L924436
2830C39371663N742503P488931Q809519J0510049J1960973J3550082J4199595
2823D11633315J3988747J1920014Q421045K994890k624389q199142j3017969j7949905
$$ plain form
2815 407166606 385539429 362068033 338540134 316380716 296140375 277990199 261851022
2808 261851022 247297383 234280440 222480983 211482506 201076565 191138032 181758751
2801 181758751 172522535 163620228 155087837 147166061 139495839 132458279 126021853 120290206
2793 120290206 114689257 109715503 105133808 101033280 96916728 93314368 89719239 86660659
2785 86660659 83809572 81109290 78586249 76256071 73772022 71710216 69509786 67601774
2777 67601774 65696145 64158129 62773127 61423175 59761548 58531826 57168957 56106859
2769 56106859 54862692 53902922 52897179 52271979 51598892 50933935 49967500 49026065 48000020
2760 48000020 46979377 45641825 44661272 43670333 42982707 42133794 41409492 40747916 40024347
$$ packed form
2815D07166606k1627177k3471396k3527899k2159418k0240341j8150176j6139177
2808B61851022j4553639j3016943j1799457j0998477j0405941r938533r379281
2801A81758751r236216q902307q532391p921776p670222p037560o436426n731647
2793A20290206n600949m973754m581695m100528m116552l602360l595129l058580
2785H6660659k851087k700282k523041k330178k484049k061806k200430j908012
2777F7601774j905629j538016j385002j349952j661627j229722j362869j062098
2769E6106859j244167r59770j005743o25200o73087o64957r66435r41435j026045
2760D8000020j020643j337552r80553r90939o87626q48913p24302o61576p23569
$$ plain form
2751 40024347 38998147 37840476 36632288 35523971 34411451 33302847 32294926 31071211
2743 31071211 30102174 29552925 28735137 27998362 27501935 27054744 26452035 25788210 25126785
2734 25126785 24564290 24125081 23562998 23105921 22752405 22463698 22068235 21652773 20809269
2725 20809269 20556595 20225626 19902364 19559275 19197815 18989205 18728441 18224967 17758781
2716 17758781 17324717 17182353 16872390 16536897 16237526 16302953 16129205 15661056 15148501 15042136
2706 15042136 14880758 14828453 14597102 14444460 14130226 14083869 13864180 13689710 13437436 13438808
2696 13438808 13137413 12966272 12659684 12699531 12708873 12536302 12138887 11785823 11675257 11708728
2686 11708728 11801194 11557468 11340784 11233469 11140000 10992754 10688252 10680166 10699955 10599716
$$ packed form
2751D0024347j026200j157671j208188j108317j112520j108604j007921j223715
2743C1071211r69037n49249q17788p36775m96427m47191o02709o63825o61425
2734B5126785n62495m39209n62083m57077l53516k88707l95463m15462q43504
2725B0809269k52674l30969l23262l43089l61460k08610k60764n03474m66186
2716A7758781m34064j42364l09963l35493k99371O5427j73748m68149n12555j06365
2706A5042136j61378n2305k31351j52642l14234m6357k19689j74470k52274J372
2696A3438808l01395j71141l06588L9847R342j72571l97415l53064j10566L3471
2686A1708728R2466k43726k16684j07315r3469j47246l04502q086J9789j00239
$$ plain form
2676 10599716 10448910 10294616 10236217 10328104 9901228 9670662 9561757 9709619 9777735 9563729
2666 9563729 9292848 9185970 9062597 8882308 8543770 8427517 8565659 8639628 8421926 8105651
2656 8105651 7920957 7838576 7914738 7696877 7600590 7883852 8048418 7918671 7540457 7332416
2646 7332416 7446425 7526684 7414414 7266521 7405574 7442244 7441899 7091189 6887999 6880468 7136342
2635 7136342 7092915 6884404 6813517 7129627 7016987 6810999 6550475 6515681 6694805 6706321
2625 6706321 6654141 6663412 6740012 6757824 6403495 6159956 6227404 6542025 6592193 6462812 6245034
2614 6245034 6285955 6228425 6271570 5910748 5880482 6105532 6330333 6189606 5952154 5877981
2604 5877981 6009179 6001748 5908577 5707484 6036433 6258115 6309380 6047871 5960574 5865316 5782255
$$ packed form
2676A0599716j50806j54294n8399R1887m26876k30566j08905J47862O8116k14006
2666I563729k70881j06878j23373j80289l38538j16253J38142P3969k17702l16275
2656H105651j84694q2381P6162k17861r6287K83262J64566j29747l78214k08041
2646G332416J14009Q0259j12270j47893J39053L6670l45l50710k03190p531K55874
2635G136342m3427k08511p0887L16110j12640k05988k60524l4794J79124J1516
2625F706321n2180R271P6600J7812l54329k43539O7448L14621N0168j29381k17778
2614F245034M0921n7530M3145l60822l0266K25050K24801j40727k37452p4173
2604E877981J31198p431r3171k01093L28949K21682N1265k61509q7297r5258q3061
$$ plain form
2593 5782255 5612384 5576000 5732591 5867348 5900584 5620178 5526938 5595819 5686642 5585566
2583 5585566 5505365 5610738 5889952 6010139 5799765 5421996 5306312 5434988 5733530 5576517
2573 5576517 5514822 5684845 5928902 5817671 5423974 5347395 5432371 5668470 5820593 5865756
2563 5865756 5949095 5944357 5731103 5430629 5505882 5551070 5962316 5837767 5767218 5863403 5807438
2552 5807438 5610327 5449452 5314675 5438996 5559836 5677489 5638647 5762241 5598310 5551128
2542 5551128 5307762 5181957 5279983 5489565 5571726 5594570 5365887 5247000 5087151 4911716
2532 4911716 4689875 4844684 4947975 4912561 4753738 4457007 4300982 4138589 4070806 3979672
2522 3979672 4039088 4037797 4117439 4006639 3916628 3762536 3691923 3511953 3451414 3563654 3452626
$$ packed form
2593E782255j69871l6384J56591J34757L3236k80406r3240O8881R0823j01076
2583E585566q0201J05373K79214J20187k10374l77769j15684J28676K98542j57013
2573E576517o1695J70023K44057j11231l93697p6579Q4976K36099J52123M5163
2563E865756Q3339m738k13254l00474P5253M5188M11246j24549p0549R6185n5965
2552E807438j97111j60875j34777J24321J20840J17653l8842J23594j63931m7182
2542E551128k43366j25805R8026K09582Q2161K2844k28683j18887j59849j75435
2532D911716k21841J54809J03291l5414j58823k96731j56025j62393o7783r1134
2522C979672N9416j291P9642j10800r0011j54092p0613j79970o0539J12240j11028
$$ plain form
2511 3452626 3486521 3361587 3316264 3159467 3060431 3089226 3040617 2976933 2972309 2959450 2879011
2500 2879011 2964576 2818077 2889309 2775886 2827133 2898746 2965217 2924455 2770378 2591588 2693306
2489 2693306 2529179 2556318 2657655 2729613 2641931 2475812 2292442 2400867 2383315 2409648
2479 2409648 2380818 2383732 2496203 2490382 2331159 2257405 2164604 2227032 2229107 2320171 2296349 2351825
2467 2351825 2296163 2084580 1995779 1964889 2025758 2103923 2172027 2105491 2274459 2260822 2061074
2456 2061074 1826007 1838686 2082221 2076751 2020958 2063231 2142719 2188274 1954105 1764646 1782412
2445 1782412 1907691 2059422 1982960 1987363 1958060 1949213 1916077 1710689 1735509 1764399 1918339
2434 1918339 1797262 1647796 1528113 1620160 1750245 1860463 1968876 1956317 1842370 1666616
$$ packed form
2511C452626L3895j24934m5323j56797r9036K8795m8609o3684m624j2859q0439
2500B879011Q5565j46499P1232j13423N1247P1613O6471m0762j54077j78790J01718
2489B693306j64127K7139J01337P1958q7682j66119j83370J08425j7552K6333
2479B409648k8830K914J12471n821j59223p3754r2801O2428K075R1064k3822N5476
2467B351825n5662k11583q8801l0890O0869P8165O8104o6536J68968j3637j99748
2456B061074k35067J2679K43535n470n5793M2273P9488M5555k34169j89459J7766
2445A782412J25279J51731p6462M403k9303q847l3136k05388K4820K8890J53940
2434A918339j21077j49466j19683R2047J30085J10218J08413j2559j13947j75754
$$ plain form
2424 1666616 1547817 1503817 1589355 1704447 1715910 1686778 1594492 1586015 1706084 1620737 1537956
2413 1537956 1705437 1623761 1737372 1663143 1673970 1627809 1511838 1397161 1364448 1454073 1482264
2402 1482264 1546783 1612194 1501124 1486369 1453778 1370215 1461794 1687388 1693744 1831579 1627633
2391 1627633 1434567 1320589 1351398 1440494 1500920 1613230 1582378 1586963 1404427 1105317 1240960
2380 1240960 1246992 1458016 1467522 1603305 1695958 1609883 1263409 1177102 1158821 1290662 1442783
2369 1442783 1468352 1501259 1377926 1149928 1040360 995614 1039710 1219244 1250482 1356561
2359 1356561 1302558 1348194 1177853 1214329 1101047 1122687 1229091 1299698 1127436 1188382 998645
2348 998645 1103542 940422 859096 888835 1160898 1355147 1360715 1154114 1074855 905083 814751
$$ packed form
2424A666616j18799m4000Q5538J15092J1463k9132r2286q477J20069q5347q2781
2413A537956J67481q1676J13611p4229J0827m6161j15971j14677l2713Q9625K8191
2402A482264O4519O5411j11070j4755l2591q3563R1579K25594O356J37835k03946
2391A627633j93066j13978L0809Q9096O0426J12310l0852M585j82536k99110J35643
2380A240960O032K11024R506J35783R2653q6075l46474q6307j8281J31841J52121
2369A442783K5569L2907j23333k27998j09568m4746M4096J79534L1238J06079
2359A356561n4003M5636j70341L6476j13282K1640J06404P0607j72262O0946j89737
2348I98645J04897j63120q1326K9739K72063J94249N568k06601p9259j69772r0332
$$ plain form
2337 814751 868351 1034289 1208909 1204207 1042745 1020234 987472 941849 947958 1060428 1201693
2326 1201693 1232903 1092369 967473 974852 1110559 994575 994675 902736 968566 1028172 1037720
2315 1037720 993230 945239 948615 1044733 983762 966647 1004899 977037 875868 792295 825997
2304 825997 1029857 929865 927824 893289 1058016 978863 950450 811019 795534 1005129 1141859
2293 1141859 1263144 1100194 1007448 987872 1061622 803705 807056 998062 1152894 1062631 1019687
2282 1019687 960738 1117242 995636 912638 766622 856630 947079 1070111 938878 906858
2272 906858 899041 1012155 869391 1034907 903012 1129027 1045328 1016866 755487 784349 828319
2261 828319 872342 858166 891985 1091024 1121839 979302 787580 687555 913828 928242 976353
$$ packed form
2337H14751N3600J65938J74620m702j61462k2511l2762m5623O109J12470J41265
2326A201693L1210j40534j24896P379J35707j15984J00r1939O5830N9606R548
2315A037720m4490m7991L376R6118o0971j7115L8252k7862j01169q3573L3702
2304H25997K03860r9992k041l4535J64727p9153k8413j39431j5485K09595J36730
2293A141859J21285j62950r2746j9576P3750k57917L351J91006J54832r0263m2944
2282A019687n8949J56504j21606q2998j46016R0008R0449J23032j31233l2020
2272I06858p817J13114j42764J65516j31895K26015q3699k8462k61379K8862M3970
2261H28319M4023j4176L3819J99039L0815j42537j91722j00025K26273J4414M8111
$$ plain form
2250 976353 910304 1079985 1195925 1000444 676142 590196 698737 824684 872330 894314
2240 894314 1051997 1060747 880041 579989 600546 596312 977264 1110494 978110 955052 1013865
2229 1013865 900600 784979 603755 773881 1081654 1215241 1045968 1100173 1037182 1009347
2219 1009347 642831 569554 849418 1279497 1291119 1096723 952357 874626 764853 567472
2209 567472 552216 848607 1283446 1411175 1163716 935745 711483 775551 830232 791061
2199 791061 912998 1355838 1454678 1193104 914937 849459 911411 1023628 1108879 1436144
2189 1436144 1649524 1673916 1459542 1146634 1138532 1386012 1572308 1663737 1640323 1644662 1716626
2178 1716626 1332783 1025847 869528 1109574 1413347 1461036 1365441 1529344 1525535 1364227
$$ packed form
2250I76353o6049J69681J15940j95481l24302q5946J08541J25947M7646K1984
2240H94314J57683Q750j80706l00052K0557m234L80952J33230j32384k3058N8813
2229A013865j13265j15621j81224J70126L07773J33587j69273N4205o2991k7835
2219A009347l66516p3277K79864M30079J1622j94396j44366p7731j09773j97381
2209E67472j5256K96391M34839J27729k47459k27971k24262O4068N4681l9171
2199G91061J21937M42840R8840k61574k78167o5478O1952J12217Q5251L27265
2189A436144K13380K4392k14374l12908q102K47480J86296R1429k3414M339P1964
2178A716626l83843l06936j56319K40046L03773M7689r5595J63903l809j61308
$$ plain form
2168 1364227 1137015 1122199 1375548 1644969 1682381 1649187 1516099 1421596 1294382 1080371
2158 1080371 1080243 1298503 1635227 1854499 1747179 1588077 1580091 1664178 1682635 1621028 1732831
2147 1732831 1971345 2187255 2183355 1955665 2005635 2213874 2187967 2469919 2629578 2985018
2137 2985018 3207597 3206386 3068371 3197907 3215263 3365247 3501787 3616511 3879936 4337080
2127 4337080 4567575 4569260 4773603 5288376 5590905 5865093 6250078 6929522 7620568 8420005
2117 8420005 9355595 10430643 11822252 13922948 16708445 20567625 24773316 29240413
2109 29240413 33088188 30008911 23555612 18029205 14033750 11675014 9835180 8466137
2101 8466137 7470261 6660113 5949071 5403881 5147345 4840563 4696423 4550782 4316375 3938258
$$ packed form
2168A364227k27212j4816K53349K69421L7412l3194j33088r4503j27214k14011
2158A080371j28K18260L36724K19272j07320j59102p986Q4087J8457o1607J11803
2147A732831K38514K15910l900k27690M9970K08239k5907K81952J59659L55440
2137B985018K22579j211j38015J29536J7356J49984J36540J14724K63425M57144
2127D337080K30495J685K04343N14773L02529K74188L84985O79444O91046P99437
2117H420005R35590J075048J391609K100696K785497L859180M205691M467097
2109B9240413L847775l079277o453299n526407l995455k358736j839834j369043
2101H466137r95876q10148p11042n45190k56536l06782j44140j45641k34407l78117
$$ plain form
2091 3938258 3592330 3154553 2899564 2593785 2439780 2487275 2269471 2170909 2153752 2116019
2081 2116019 2051117 2014877 1963814 1916749 1788584 1698116 1756834 1716761 1634022 1564017 1556563
2070 1556563 1341260 1349665 1326458 1374500 1362780 1405030 1226765 1239583 1201199 1242696 1236374
2059 1236374 956614 909913 1016567 1059004 1017256 855234 952958 1003129 861908 728567
2049 728567 730867 788022 904401 922920 728027 581085 748315 775174 739423 738935 783789
2038 783789 779658 748296 771808 631115 719116 593581 711506 557875 574967 767343 751331
2027 751331 642572 647398 608574 663007 468634 447110 370133 555886 581046 530182 409401
2016 409401 478097 532667 619437 463976 348733 398315 576729 461413 362467 324097 420427
$$ packed form
2091C938258l45928m37777k54989l05779j54005M7495k17804r8562j7157l7733
2081B116019o4902l6240n1063m7065j28165r0468N8718m0073q2739p0005p454
2070A556563k15303Q405k3207M8042j1720M2250j78265J2818l8384M1497o322
2059A236374k79760m6701J06654M2437m1748j62022R7724N0171j41221j33341
2049G28567K300N7155J16379J8519j94893j46942J67230K6859l5751m88M4854
2038G83789m131l1362K3512j40693Q8001j25535J17925j53631J7092J92376j6012
2027G51331j08759M826l8824N4433j94373k1524p6977J85753K5160n0864j20781
2016D09401O8696N4570Q6770j55461j15243M9582J78414j15316r8946l8370R6330
$$ plain form
2005 420427 434710 330089 273010 449815 591449 491946 245804 234834 301205 520704 428059
1994 428059 387278 520393 520983 581828 451879 388470 515413 632792 624136 482256 404651
1983 404651 574477 620741 431118 219705 345546 516567 471925 402006 273911 159170
1973 159170 359539 267329 203057 195471 282820 431135 429059 290180 340754 442222 502913
1962 502913 220884 312649 478214 589478 368203 180287 118815 245617 260254 148210
1952 148210 112281 388411 375303 278921 43307 161899 364632 413763 291454 200322 212475
1941 212475 388029 308224 158814 274578 437414 386702 356242 281915 283784 342605 356202
1930 356202 182552 43167 384089 482761 361816 297031 211808 160619 345509 305228 171875
$$ packed form
2005D20427J4283j04621n7079J76805J41634r9503k46142j0970O6371K19499r2645
1994D28059m0781J33115N90O0845j29949o3409J26943J17379q656j41880p7605
1983D04651J69826M6264j89623k11413J25841J71021m4642o9919j28095j14741
1973A59170K00369r2210o4272p586Q7349J48315k076j38879N0574J01468O0691
1962E02913k82029R1765J65565J11264k21275j87916o1472J26802J4637j12044
1952A48210l5929K76130j3108r6382k35614J18592K02733M9131j22309r1132J2153
1941B12475J75554p9805j49410J15764J62836n0712l0460p4327J869N8821J3597
1930C56202j73650j39385L40922R8672j20945o4785q5223n1189J84890m0281j33353
$$ plain form
1919 171875 260593 376494 251863 285007 237795 346756 474722 216718 10594 131591
1909 131591 209732 385820 280783 320178 313373 465186 265718 47949 106863 194689 327920
1898 327920 227693 279537 348479 309958 325076 186510 -20678 61886 145831 237701 213848
1887 213848 245277 186360 146391 135153 210781 176045 275600 337802 277853 263670 222907 301843
1875 301843 165875 19434 30468 229808 315324 344105 204576 49929 -30754 -67675 27112
1864 27112 155494 253329 396014 279369 237015 300571 135209 -112645 -54665 111376 429352
1853 429352 468081 318748 322500 182163 -52996 11417 -18173 218938 399368 399034 280525
1842 280525 137650 51216 -97494 41848 130519 264908 465289 460145 306519 111306
$$ packed form
1919A71875Q8718J15901j24631L3144m7212J08961J27966k58004k06124J20997
1909A31591P8141J76088j05037L9395o805J51813j99468k17769N8914Q7826J33231
1898C27920j00227N1844O8942l8521J5118j38566k07188Q2564Q3945R1870k3853
1887B13848L1429n8917l9969j1238P5628l4736R9555O2202n9949j4183m0763P8936
1875C01843j35968j46441J1034J99340Q5516K8781j39529j54647q0683l6921R4787
1864B7112J28382R7835J42685j16645m2354O3556j65362k47854N7980J66041L17976
1853D29352L8729j49333L752j40337k35159O4413k9590K37111J80430l34j18509
1842B80525j42875q6434j48710J39342Q8671J34389K00381n144j53626j95213
$$ plain form
1832 111306 -40088 -296778 -132561 71736 328293 436658 467273 340105 78247 -133519
1822 -133519 -99623 169215 179704 264211 366180 388442 263746 -33763 -105181 -10805 -76734
1811 -76734 56379 168925 210820 159354 136835 -165616 -245765 -84011 79871 228219 241750
1800 241750 194381 294679 134439 3998 -75993 -35313 106289 226336 196894 136621 37117
1789 37117 180905 161149 150407 33116 105950 197679 198416 42988 95364 144595 173052 141623
1777 141623 144419 192225 211705 227496 194780 277850 175106 192904 206280 118621 122374 78568
1765 78568 171760 156831 172217 148262 74555 16930 -146035 -49690 -31782 137528 64205
1754 64205 32563 54660 235600 41239 -121264 -79071 -13006 247400 243649 183859 259177
$$ packed form
1832A11306j51394k56690J64217K04297K56557J08365L0615j27168k61858k11766
1822a33519L3896K68838J0489Q4507J01969K2262j24696k97509p1418R4376o5929
1811g6734J33113J12546M1895n1466k2519l02451q0149J61754J63882J48348J3531
1800B41750m7369J00298j60240j30441p9991M0680J41602J20047k9442o0273r9504
1789C7117J43788j9756j0742j17291P2834R1729P37j55428N2376M9231K8457l1429
1777A41623K796M7806J9480J5791l2716Q3070j02744J7798J3376q7659L753m3806
1765G8568R3192j4929J5386k3955p3707n7625j62965R6345J7908J69310p3323
1754F4205l1642K2097J80940j94361j62503M2193O6065K60406l751n9790P5318
$$ plain form
1743 259177 322515 168333 -28841 -250312 -282497 73977 158415 76759 40046 133150 144411
1732 144411 60398 -4015 144704 297227 355442 246409 39475 135940 159099 70767 -49399
1721 -49399 50740 172627 292463 84880 -208132 -125891 27859 114545 -66308 -51365
1711 -51365 28810 100805 214762 130433 52664 162181 114028 24129 -124450 44846 288758
1700 288758 317152 186059 -15014 9991 203434 201689 64352 156757 300900 277861 107819
1689 107819 -67697 -35386 185167 161745 113215 132558 190666 256039 67740 -18095 89541
1678 89541 191176 282697 234537 33433 177165 98319 69495 -28121 -170129 103057 315607
1667 315607 322433 245570 82823 -27130 28474 -25763 -106694 94825 249126 291554 216679
$$ packed form
1743B59177O3338j54182j97174k21471l2185L56474Q4438q1656l6713R3104J1261
1732A44411q4013o4413J48719J52523N8215j09033k06934R6465K3159q8332j20166
1721d9399J00139J21887J19836k07583k93012Q2241J53750Q6686j80853J4943
1711e1365Q0175P1995J13957q4329p7769J09517m8153q9899j48579J69296K43912
1700B88758K8394j31093k01073K5005J93443j745j37337R2405J44143k3039j70042
1689A07819j75516L2311K20553k3422m8530J9343N8108O5373j88299q5835J07636
1678H9541J01635R1521m8160k01104J43732p8846k8824r7616j42008K73186K12550
1667C15607O826p6863j62747j09953N5604n4237q0931K01519J54301M2428p4875
$$ plain form
1656 216679 -58629 -97029 9752 -59226 -82084 30868 195471 146836 -146019 -216675 -141832
1645 -141832 -142754 -48971 74022 111149 245694 32314 -226615 -286500 -343885 -184378 -17161
1634 -17161 75139 121019 104189 158923 -36614 -137496 -111030 -19288 104517 189462 128531
1623 128531 13214 -148769 -249974 -208174 -36883 129518 181437 299845 242696 60111
1613 60111 -201628 -262200 -267141 -198426 74723 128195 113896 236496 51361 -157007 -65322
1602 -65322 -124103 -52106 -2404 42107 65964 134741 -200676 -310334 -302694 -117834 67381
1591 67381 254353 174848 265286 146433 -94137 -259600 -106785 71906 4538 -799 69116
1580 69116 -31503 12425 7933 21489 -15797 -61203 83296 145406 141223 45529 40755 -34905
$$ packed form
1656B16679k75308l8400J06781o8978k2858J12952J64603m8635k92855p0656P4843
1645a41832r22R3783J22993L7127J34545k13380k58929n9885n7385J59507J67217
1634a7161R2300M5880j6830N4734j95537j00882K6466R1742J23805Q4945o0931
1623A28531j15317j61983j01205M1800J71291J66401N1919J18408n7149j82585
1613F0111k61739o0572m941O8715K73149N3472j4299J22600j85135k08368R1685
1602f5322n8781P1997M9702M4511K3857O8777l35417j09658P640J84860J85215
1591F7381J86972p9505R0438j18853k40570j65463J52815J78691o7368n337O9915
1580F9116j00619M3928m492J3556l7286m5406J44499O2110m183r5694m774p5660
$$ plain form
1568 -34905 -79570 -157549 -13511 38260 11372 -68953 49183 80437 50419 -61760 -138708
1557 -138708 -174431 -21250 -29366 -4177 119560 252035 -24007 -30753 -184031 -222631 -212420
1546 -212420 -36168 29858 52131 52253 -3753 -105670 -198392 -278250 -184575 31884 174366
1535 174366 81976 64966 124179 -28898 -288477 -235723 -52036 208886 202558 84691 18679
1524 18679 87335 -101472 -209606 -126962 -15076 179440 243572 182759 8564 -159115 -262050
1513 -262050 -194890 -117300 69410 39017 -28946 -18755 -27972 -192638 -197771 -151540 -56107 89487
1501 89487 86161 -92541 -46729 -130292 -132035 -287549 -228628 -150268 28405 100934 50934 -25968
1489 -25968 -68104 -131248 -169550 -102335 128259 242046 209868 159889 -102451 -151297 -89882
$$ packed form
1568c4905m4665p7979J44038N1771k6888q0325J18136L1254l0018j12179p6948
1557a38708l5723J53181q116K5189J23737J32475k76042o746j53278l8600J0211
1546b12420J76252O6026K2273J22n6006j01917r2722p9858R3675K16459J42482
1535A74366r2390j7010N9213j53077k59579N2754J83687K60922o328j17867o6012
1524A8679O8656j88807j08134Q2644J11886J94516O4132o0813j74195j67679j02935
1513b62050O7160P7590J86710l0393o7963J0191r217j64666n133M6231R5433J45594
1501H9487l326j78702M5812q3563j743j55514N8921P8360J78673P2529n0000p6902
1489b5968m2136o3144l8302O7215K30594J13787l2178m9979k62340m8846O1415
$$ plain form
1478 -89882 -238842 -343697 -278800 133578 303629 17837 -142843 -66058 -186920 -89897
1468 -89897 46244 58535 240032 311820 126412 -43110 35094 28402 -107869 -147944 -63300
1457 -63300 -42558 175253 191503 -125121 -278516 -132766 -63112 -106132 -63937 -72341 -39990
1446 -39990 3434 -209176 -304111 -129861 -61384 37956 140130 225770 195632 126269 -42058
1435 -42058 -92439 -20902 95533 62201 180045 279006 171019 41640 -125468 -203347 -88018
1424 -88018 40364 35659 -9088 -59615 -54619 -96805 -275594 -243802 -119587 51801 146743
1413 146743 177872 -94532 -185200 -249188 -217581 -128931 -74769 55162 131503 175771 -39066
1402 -39066 -163805 -175389 -312610 -286518 -28436 95192 217602 100336 82123 4625 76900
$$ packed form
1478h9882j48960j04855O4897M12378J70051k85792j60680P6785j20862R7023
1468h9897J36141J2291J81497P1788j85408j69522P8204o692j36271m0075Q4644
1457f3300K0742K17811J6250l16624j53395J45750O9654m3020M2195q404L2351
1446c9990M3424k12610r4935J74250O8477R9340J02174Q5640l0138o9363j68327
1435d2058n0381P1537J16435l3332J17844R8961j07987j29379j67108p7879J15329
1424h8018J28382m705m4747n0527M996m2186j78789L1792J24215J71388R4942
1413A46743L1129k72404r0668o3988L1607Q8650N4162J29931P6341M4268k14837
1402c9066j24739j1584j37221K6092K58082J23628J22410j17266j8213p7498P2275
$$ plain form
1391 76900 55928 21750 46515 50698 42383 -47876 -267666 -195488 -228839 -148747 -25686 93367
1379 93367 84630 76205 -23721 71437 17389 -43799 -178248 -192475 -80552 120916 168968 36507
1367 36507 -101752 -236457 -302710 -309175 -85453 72915 43280 -20629 -149468 -112235 -38138
1356 -38138 42233 -43098 20692 98602 93203 303 -133064 -159406 -66164 23808 -30589 -92936
1344 -92936 -76960 122804 152271 6450 -81093 108168 189324 113554 -61496 -106775 39680
1333 39680 113458 -148254 -215240 -117494 27832 -67614 -165123 -141920 124108 64987 -200536
1322 -200536 -310501 -341886 -158459 32764 -41818 -183811 -66121 126562 26404 -166604
1312 -166604 -148183 154539 272100 98353 -169691 -35120 173303 140917 -129901 -174128
$$ packed form
1391G6900k0972l4178K4765M183q315r0259k19790P2178l3351Q0092J23061J19053
1379I3367q737q425r9926R5158n4048o1188j34449j4227J11923K01468M8052j32461
1367C6507j38259j34705o6253o465K23722J58368k9635o3909j28839L7233P4097
1356c8138Q0371q5331O3790P7910n399r2900j33367k6342R3242Q9972n4397o2347
1344i2936J5976J99764K9467j45821q7543J89261Q1156p5770j75050m5279J46455
1333C9680P3778k61712o6986R7746J45326r5446r7509K3203K66028n9121k65523
1322b00536j09965l1385J83427J91223p4582j41993J17690J92683j00158j93008
1312a66604J8421L02722J17561j73747k68044J34571K08423l2386k70818m4227
$$ plain form
1302 -174128 -79708 15313 -191893 -333330 -151323 122828 200313 132708 -185998 -102182 116010
1291 116010 7649 -202150 -157649 67438 156342 -25977 -142458 -21512 211945 294548
1281 294548 -164635 -310957 -35488 185078 165650 1824 -218704 -142165 21658 -95248
1271 -95248 -236232 -82293 109330 105909 -53649 -253521 -146660 -69651 -266067 -431904
1261 -431904 -320274 -9425 116647 -21361 -145721 -29494 101161 -13898 -179333 -177799
1251 -177799 51989 222159 -83159 -266128 -328336 -39883 -74891 -92574 15047 330960
1241 330960 333028 86179 -240092 -413659 -223683 25572 -67055 3705 107058 171616 1215
1230 1215 -226242 -404720 -273524 -12367 42490 25009 -51991 129766 -9805 -403486 -475096
$$ packed form
1302a74128R4420R5021k07206j41437J82007K74151P7485o7605l18706Q3816K18192
1291A16010j08361k09799M4501K25087Q8904j82319j16481J20946K33457Q2603
1281B94548m59183j46322K75469K20566j9428j63826k20528P6539J63823j16906
1271i5248j40984J53939J91623l421j59558j99872J06861P7009j96416j65837
1261d31904J11630L10849J26072j38008j24360J16227J30655j15059j65435J534
1251a77799K29788J70170l05318j82969o2208K88453l5008j7683J07621L15913
1241C30960K068k46849l26271j73567J89976K49255r2627P0760J03353O4558j70401
1230A215k27457j78478J31196K61157N4857j7481p7000J81757j39571l93681p1610
$$ plain form
1219 -475096 -342470 14025 190259 123686 27577 43302 -110456 -379451 -360575 -176609
1209 -176609 126751 -5501 -3017 7662 -70411 -225186 -290978 -311682 -17531 297359 374033
1198 374033 109238 -33763 -268580 -310507 -319628 -303431 -128520 192020 199401 116623 -56074
1187 -56074 -219025 -297677 -278759 -389396 -102581 152275 284836 100842 -122823 -236484
1177 -236484 -339998 -262611 -112476 32770 23374 83219 1034 -146354 -239671 -187436 -154219
1166 -154219 57962 175799 186604 104457 39112 -117886 -184400 -228895 -82094 111263 236417
1155 236417 260961 252438 35508 -241434 -203637 45278 16711 85402 80983 148629 7422
1144 7422 -161889 -280922 -248988 -151778 46806 147154 338072 211219 -41197 -134683 -363042
$$ packed form
1219d75096J32626L56495J76234o6573r6109J5725j53758k68995J8876J83966
1209a76609L03360j32252K484J0679p8073j54775o5792k0704K94151L14890P6674
1198C74033k64795j43001k34817m1927r121J6197J74911L20540P381q2778j72697
1187e6074j62951p8652J8918j10637K86815K54856J32561j83994k23665j13661
1177b36484j03514P7387J50135J45246r396N9845q2185j47388r3317N2235L3217
1166a54219K12181J17837J0805q2147o5345j56998o6514m4495J46801J93357J25154
1155B36417K4544q523k16930k76942L7797K48915k8567O8691m419O7646j41207
1144G422j69311j19033L1934R7210J98584J00348J90918j26853k52416r3486k28359
$$ plain form
1133 -363042 -406507 -193596 64861 150802 70406 -8578 -114911 -341177 -373905 -292830 49172
1122 49172 244331 70258 -54721 22419 -83424 -260616 -284307 -172519 -53268 10048
1112 10048 149672 83038 -75538 -147652 -191317 -290369 -119832 43790 161364 145354 140402
1101 140402 -58029 -193679 -259309 -240162 -72451 53832 144536 -72917 -86668 -77119 -197524
1090 -197524 -284390 -24578 2339 -88843 -59538 19484 -34497 -136174 -260559 -263539 -182919
1079 -182919 -77149 15628 27827 -65237 -116594 -202029 -264200 -214390 -7084 88824 22503
1068 22503 -924 63963 82135 -91005 -114280 -119612 -5922 101997 191441 155633 80188
1057 80188 18224 -35459 -243461 -163701 -89554 102195 186373 82261 75371 -35635 -6786
$$ packed form
1133c63042m3465K12911K58457Q5941q0396p8984j06333k26266l2728Q1075L42002
1122D9172J95159j74073j24979P7140j05843j77192k3691J11788J19251O3316
1112A0048J39624o6634j58576p2114m3665r9052J70537J63622J17574j6010m952
1101A40402j98431j35650o5630J9147J67711J26283R0704k17453j3751R549j20405
1090a97524q6866K59812K6917r1182K9305P9022n3981j01677j24385k980Q0620
1079a82919J05770R2777J2199r3064n1357q5435o2171M9810K07306R5908o6321
1068B2503k3427O4887J8172j73140k3275n332J13690J07919Q9444l5808p5445
1057H0188o1964n3683k08002P9760P4147J91749Q4178j04112o890j11006K8849
$$ plain form
1046 -6786 -81767 -180143 -230026 -62115 27936 33501 -40057 -77061 -2507 21467 -13882 -38955
1034 -38955 16521 117488 -132380 -236183 -150746 -46382 -150419 -87589 -135570 -33760 95935
1023 95935 23589 -197773 -214829 -158439 -6172 -52817 -10756 90404 318831 244981 11790
1012 11790 -176056 -78441 -62098 -78334 -90561 -18708 79262 -35644 -203488 -242964 -30335
1001 -30335 -17207 -24544 -9782 -57512 102048 49431 -77293 -263878 -260392 -185199 -224546 -243431
989 -243431 -101990 178430 172938 167792 -74606 -163267 -171376 -77507 -155083 -63966 139717 167505
977 167505 18730 -8726 -40068 42081 -186746 -83177 22197 120280 132243 5648 -308144
966 -308144 -331646 -221418 -176903 -67352 164777 144611 215919 77336 -119499 -146542 2916
$$ packed form
1046f786p4981r8376m9883J67911R0051N565p3558l7004P4554K3974l5349k5073
1034c8955N5476J00967k49868j03803Q5437J04364j04037O2830m7981J01810J29695
1023I5935p2346k21362j7056N6390J52267m6645M2061J01160K28427p3850k33191
1012A1790j87846R7615J6343j6236j2227P1853R7970j14906j67844l9476K12629
1001c0335J3128p337J4762m7730J59560n2617j26724j86585L486P5193l9347j8885
989b43431J41441K80420n492n146k42398q8661q109R3869p7576R1117K03683K7788
977A67505j48775k7456l1342Q2149k28827J03569J05374R8083J1963j26595l13792
966c08144k3502J10228M4515J09551K32129k0166P1308j38583j96835k7043J49458
$$ plain form
955 2916 -86564 42576 61248 71435 124675 -45547 -222388 -233008 -217656 -204976 -191030 29506
943 29506 56032 77189 9422 -130020 -300695 -169265 40833 95853 115947 129036 130052
932 130052 -3463 -220271 -231739 2796 75848 133258 33787 27294 74919 -66779 -316515
921 -316515 -309434 41890 248603 224713 225577 10124 702 -188103 -239693 -205107 -177268 15107
909 15107 153314 200454 19459 -99615 6234 -155129 18217 82887 193261 119311 16804
898 16804 -18434 -38806 -198347 -116571 -85678 161523 158656 219329 -77403 -212202 -195896
887 -195896 -221311 -214019 -106011 -52268 233316 195690 54404 -158504 -78411 7185 -181288
876 -181288 -200167 -153140 7088 65456 38227 -67265 -124163 11668 68403 -51392 -47369
$$ packed form
955B916q9480J29140J8672J0187N3240j70222j76841j0620J5352J2680J3946K20536
943B9506K6526K1157o7767j39442j70675J31430K10098N5020K0094J3089J016
932A30052j33515k16808j1468K34535P3052N7410r9471o493M7625j41698k49736
921c16515P081L51324K06713k3890Q64k15453r422j88805n1590L4586K7839J92375
909A5107J38207M7140j80995j19074J05849j61363J73346O4670J10374p3950j02507
898A6804l5238k0372j59541Q1776L0893K47201k867O0673k96732j34799J6306
887a95896k5415P292J08008N3743K85584l7626j41286k12908Q0093Q5596j88473
876a81288j8879M7027J60228N8368k7229j05492n6898J35831N6735j19795M023
$$ plain form
865 -47369 101636 270936 147871 -19115 -108720 -15014 27721 26024 20601 175743 221131
854 221131 137390 -153837 -171508 -235616 -73597 -20263 -52081 -13665 4501 -112887 -41765
843 -41765 -101450 -60174 3752 -20783 -42881 -151396 -30909 90213 7476 -113183 -111673
832 -111673 14715 -50621 -65531 -186689 -14428 -147333 -138081 -32980 -11424 -41075 -10881
821 -10881 19868 25630 8923 -16 -121500 -193512 -132892 -75655 9429 150630 21079 -66814
809 -66814 -38656 -103159 -72203 -182334 -214391 -74714 -27463 -131234 -143676 -168915 -91691
798 -91691 -127095 -49738 -6705 -72721 -25017 -41409 -121306 -174869 -138610 -113994 -201536 -146302
786 -146302 -72946 82822 17049 110442 26913 21684 41583 -792 -45302 -35416 11331 77990
$$ packed form
865d7369J49005J69300j23065j66986q9605R3706M2735j697n423J55142M5388
854B21131q3741k91227j7671o4108J62019N3334l1818L8416J8166j17388P1122
843d1765n9685M1276O3926k4535k2098j08515J20487J21122q2737j20659J510
832a11673J26388o5336j4910j21158J72261j32905R252J05101K1556k9651L0194
821a0881L0749N762j6707q939j21484p2012O0620N7237Q5084J41201j29551q7893
809f6814K8158o4503L0956j10131l2057J39677M7251j03771j2442k5239P7224
798i1691l5404P7357M3033o6016M7704j6392p9897n3563L6259K4616q7542N5234
786a46302P3356J55768o5773R3393q3529n229J9899m2375m4510R886M6747O6659
$$ plain form
774 77990 75168 36986 -75185 43695 24409 83610 -5953 -65380 29923 -23477 14095 54298
762 54298 77641 -16610 -97158 -57350 85413 256769 288975 203593 -63677 -135647 -59933
751 -59933 57837 -30699 -16011 133219 159488 -95201 -152281 -167598 12614 27145 25009
740 25009 -5718 53969 79425 14535 -105320 -158902 -12371 80511 218960 238711 202936
729 202936 75097 22339 -175110 -205785 -174286 -27328 -6927 -93134 -128147 41047 104758
718 104758 -95784 -176350 -184877 -16140 150280 41683 71437 35829 -52740 -210507 -177920
707 -177920 -71667 277117 317880 28577 -183638 -193070 -251814 -200302 -220720 -53374 163117
696 163117 303639 72221 -67916 -182068 -101502 -71159 -11774 -69930 172100 236969 55462
$$ packed form
774G7990k822l8182j12171J18880j9286N9201q9563n9427R5303n3400L7572M0203
762E4298K3343r4251q0548L9808J42763J71356L2206q5382k67270p1970P5714
751e9933J17770q8536J4688J49230K6269k54689n7080j5317J80212J4531k136
740B5009l0727N9687K5456o4890j19855n3582J46531R2882J38449J9751l5775
729B02936j27839n2758j97449l0675L1499J46958K0401q6207l5013J69194O3711
718A04758k00542q0566q527J68737J66420j08597K9754l5608q8569j57767L2587
707a77920J06253L48784M0763k89303k12215r432n8744N1512k0418J67346K16491
696A63117J40522k31418j40137j14152Q0566L0343N9385n8156K42030O4869j81507
$$ plain form
685 55462 -127353 -205352 -97556 46578 -68896 -6700 240191 315791 -21186 -265793 -277645
674 -277645 24300 27369 41410 91078 222881 137885 -3975 -219854 -265725 -83206 132758
663 132758 44729 -47853 53307 140642 -109221 -467121 -310337 -191311 40284 -26267 -4495
652 -4495 -111750 -9556 -113534 -348102 -360940 -73850 190305 150050 -210608 -243068 -151555
641 -151555 -5823 -382003 -399698 -126865 158986 38559 -184724 -252051 -185178 -186166 -123516
630 -123516 -263307 -169911 183388 288220 -140280 -217738 -63831 121264 -30100 -109823
620 -109823 -103989 69821 126319 -185690 -465724 -227946 16597 43644 -200699 -159315 -5852
609 -5852 212270 -20144 -387540 -321899 -63639 33005 -86352 -76735 134787 252766 -16095
$$ packed form
685E5462j82815p7999J07796J44134j15474O2196K46891P5600l36977k44607j1852
674b77645L01945L069J4041M9668J31803q4996j41860k15879m5871J82519K15964
663A32758q8029r2582J01160Q7335k49863l57900J56784J19026K31595o6551K1772
652d495j07255J02194j03978k34568j2838K87090K64155m0255l60658l2460R1513
641a51555J45732l76180j7695K72833K85851j20427k23283o7327O6873r88O2650
630a23516j39791R3396L53299J04832m28500p7458J53907J85095j51364p9723
620a09823N834J73810N6498l12009k80034K37778K44543K7047k44343M1384J53463
609e852K18122k32414l67396O5641K58260R6644j19357R617K11522J17979k68861
$$ plain form
598 -16095 -409787 -271448 -131444 -8460 34841 -127591 38121 85037 -78976 -373494
588 -373494 -379041 -91885 217272 214454 -158806 -91026 66916 -38887 -238202 -422656 -54979
577 -54979 346302 211107 -47457 -138191 -64417 11574 -297092 -230801 2541 353724 289041
566 289041 52171 -277769 -305256 -226289 -175411 -247484 -42099 236120 310002 56122 -252435
555 -252435 -249683 48664 33260 28764 76093 420845 511479 267141 -249984 -239782 -81117
544 -81117 17416 37704 133867 283625 332788 155433 -247794 -382474 -177911 -92389 -193344
533 -193344 -95425 104045 196203 58107 -241557 -313428 -193889 -47328 124518 121479 223134
522 223134 183796 190845 -134285 -236437 -66884 -607 23388 76722 268223 270734 17553
$$ packed form
598a6095l93692J38339J40004J22984M3301j62432J65712M6916j64013k94518
588c73494n547K87156L09157k818l73260O7780J57942j05803j99315j84454L67677
577e4979M01281j35195k58564r0734P3774P5991l08666O6291K33342L51183o4683
566B89041k36870l29940k7487P8967N0878p2073K05385K78219P3882k53880l08557
555b52435K752K98347j5404m496M7329L44752R0634k44338n17125J0202J58665
544h1117R8533K0288R6163J49758M9163j77355m03227j34680K04563Q5522j00955
533a93344R7919J99470R2158j38096k99664p1871J19539J46561J71846l039J01655
522B23134l9338P049l25130j02152J69553O6277K3995N3334J91501K511k53181
$$ plain form
511 17553 -232262 -241258 -84183 139432 62233 -12566 199499 270350 117644 -65306 -202344
500 -202344 -206064 -27375 79511 87473 56055 257579 173724 -51589 -308961 -370674 -240253
489 -240253 -45936 12741 151023 308113 89364 -116269 -372107 -334834 -208975 50609
479 50609 159755 232344 199555 160483 -151666 -290855 -340280 -95949 58810 122292 198117
468 198117 156986 39236 -233813 -545336 -377205 18997 251734 177961 265128 86249
458 86249 -43807 -290084 -460674 -316192 22503 435065 418538 137768 -8996 -67456
448 -67456 -479701 -642579 -394637 56656 450425 490855 44976 -27727 -81036 -299339 -486475
437 -486475 -322641 138045 356075 323725 221601 -43177 -39709 -202922 -151614 -157358 155891
$$ packed form
511A7553k49815q996J57075K23615p7199p4799K12065P0851j52706j82950j37038
500b02344l720J78689J06886P962l1418K01524q3855k25313k57372o1713J30421
489b40253J94317N8677J38282J57090k18749k05633k55838L7273J25859K59584
479E0609J09146P2589l2789l9072l12149j39189m9425K44331J54759O3482P5825
468A98117m1131j17750k73049l11523J68131L96202K32737p3773Q7167j78879
458H6249j30056k46277j70590J44482L38695M12562j6527k80770j46764n8460
448f7456m12245j62878K47942M51293L93769M0430m45879p2703n3309k18303j87136
437d86475J63834M60686K18030l2350j02124k64778L468j63213N1308n744L13249
$$ plain form
426 155891 391477 409742 -22556 -134818 -130943 -94546 -120114 23352 153595 325647 120437
415 120437 -159413 -302548 -144692 -132331 -243270 -323171 50200 344464 363412 75551
405 75551 -109142 -175812 -148065 -136206 -194620 12697 266608 111697 -31169 -174548 -118863
394 -118863 -116491 -154820 -201738 -43332 194421 255479 -61093 -357533 -342621 -60617 124484
383 124484 -13798 -7416 153845 377506 95609 -247195 -338682 -20530 158106 123416 -37276
372 -37276 187362 283585 101198 -206989 -216678 11711 213462 137942 18752 20486 170676
361 170676 133362 -120349 -297120 37680 266128 104566 -19587 121273 269841 321469
351 321469 -3769 -14779 -16000 283475 176716 15900 -51889 52877 203507 -11154 -242439
$$ packed form
426A55891K35586J8265m32298j12262L875L6397k5568J43466J30243J72052k05210
415A20437k79850j43135J57856J2361j10939p9901L73371K94264J8948k87861
405G5551j84693o6670K7747J1859n8414K07317K53911j54911j42866j43379N5685
394a18863K372l8329m6918J58406K37753O1058l16572k96440J4912K82004J85101
383A24484j38282O382J61261K23661k81897l42804r1487L18152J78636l4690j60692
372c7276K24638R6223j82387l08187r689K28389K01751p5520j19190J734J50190
361A70676l7314k53711j76771L34800K28448j61562j24153J40860J48568N1628
351C21469l25238j1010j221K99475j06759j60816o7789J04766J50630k14661k31285
$$ plain form
340 -242439 -115190 93050 121153 -124545 -222151 -39562 122469 -4556 -192358 -88877
330 -88877 184159 180959 -105357 -223206 -9842 259441 175281 -661 80803 202781 172376
319 172376 -100487 -50877 -72825 132457 4870 -257265 -222660 -23043 86288 22712 -156047
308 -156047 -179747 65574 127913 -37554 -200913 -200799 -18771 -41933 -143203 -252389 -5931
297 -5931 -29480 -20204 -50597 130342 196749 214894 31961 -85741 152166 119860 -132790
286 -132790 -12489 38580 116081 108300 -44775 -135285 -122150 -26684 125063 62948 -573
275 -573 163202 192909 34644 -267303 -166651 -104968 22712 -59440 -69867 16718 172990
264 172990 34831 48436 -119792 -1744 98545 352427 143380 112396 153334 56147 -262087
$$ packed form
340b42439J27249K08240K8103k45698r7606J82589J62031j27025j87802J03481
330h8877K73036l200k86316j17849K13364K69283q4160j75942Q1464J21978l0405
319A72376k72863M9610k1948K05282j27587k62135L4605J99617J09331o3576j78759
308a56047k3700K45321O2339j65467j63359J14J82028k3162j01270j09186K46458
297e931k3549R276l0393J80939O6407J8145j82933j17702K37907l2306k52650
286a32790J20301N1069P7501p781j53075r0510J3135R5466J51747o2115o3521
275e73J63775K9707j58265l01947J00652O1683J27680q2152j0427Q6585J56272
264A72990j38159J3605j68228J18048J00289K53882k09047l0984M0938r7187l18234
$$ plain form
253 -262087 -151625 -59055 169054 86909 -2712 -80801 178199 116312 51380 -170218 -51825
242 -51825 108328 163026 11443 10704 -42893 51854 -128887 -205710 -167045 83691 128738 119995
230 119995 -90461 -131238 -132329 -110291 3977 56184 62826 96968 97130 75334 10381 18689
218 18689 -55190 -130846 -38475 -2462 213890 172850 -72425 -77493 19503 7144 38924 -55355
206 -55355 -37066 -46424 -77581 -100041 -43161 -9036 183395 165260 252376 -73055 49856 126883
194 126883 181982 42320 205275 255078 375857 30708 -90730 -174666 -22950 -65322 1322
183 1322 -88443 137324 225162 34400 -239430 -184630 -157526 -19371 15193 -435 18514
172 18514 177403 21114 -163949 -233002 -51223 128454 173416 98424 112331 241957 164089
$$ packed form
253b62087J10462R2570K28109q2145q9621p8089K59000o1887o4932k21598J18393
242e1825J60153N4698j51583p39n3597R4747j80741p6823L8665K50736M5047q743
230A19995k10456m0777j091K2038J14268N2207O642L4142J62k1796o4953Q308
218A8689p3879p5656R2371L6013K16352m1040k45275n068R6996j2359L1780r4279
206e5355J8289r358l1157k2460N6880L4125J92431j8135Q7116l25431J22911P7027
194A26883N5099j39662J62955M9803J20779l45149j21438q3936J51716m2372O6644
183A322q9765K25767Q7838j90762k73830N4800K7104J38155L4564j5628J8949
172A8514J58889j56289j85063o9053J81779J79677M4962p4992J3907J29626p7868
$$ plain form
161 164089 -94594 -157684 -50862 179329 257704 35583 -38082 -6145 -107758 -212263 -160964
150 -160964 99015 396612 476380 303229 33518 -36602 -92146 -178489 -306136 52315 227437
139 227437 302020 140520 -66225 -189205 -136664 -100972 -155845 -100200 164290 137352 162181
128 162181 -13357 -63542 41372 53715 -5694 44695 201639 302995 136837 -30118 -187597
117 -187597 -100035 7058 84651 -10722 81579 214959 150900 -66917 -92366 39196 42822
106 42822 19009 47947 -71797 253 -28678 -111832 -183720 -35741 -1837 39751 49312 -19853
94 -19853 -28276 4079 -145972 -177558 -93724 12123 97455 138585 -7178 -96191 -42752 -50808
82 -50808 6002 150639 130570 123174 -74796 -244651 -110839 -88862 80634 90140 16649 -11513
$$ packed form
161A64089k58683o3090J06822K30191P8375k22121p3665L1937j01613j04505N1299
150a60964K59979K97597P9768j73151k69711p0120n5544q6343j27647L58451J75122
139B27437P4583j61500k06745j22980N2541L5692n4873N5645K64490k6938K4829
128A62181j75538n0185J04914J2343n9409N0389J56944J01356j66158j66955j57479
117a87597Q7562J07093P7593r5373R2301J33380o4059k17817k5449J31562L626
106D2822k3813K8938j19744P2050k8931q3154p1888J47979L3904M1588R561o9165
94a9853q423L2355j50051l1586Q3834J05847Q5332M1130j45763q9013N3439q056
82e0808N6810J44637k0069p396j97970j69855J33812K1977J69496R506p3491k8162
$$ plain form
70 -11513 134515 118732 24094 -58404 -31532 87797 194980 124818 70656 44501 49883 53485
58 53485 -93052 -72433 84401 22483 74004 32209 -35006 -119525 -98303 -78102 -57117 91132
46 91132 90964 55275 82668 -25434 -8630 12616 -49906 54974 120671 216059 146489 161938
34 161938 99123 80105 24071 -45645 -16067 11512 84022 210746 118032 -86411 -165664 -172345
22 -172345 61811 -41198 -19960 184492 218836 91279 -102860 -212954 -173582 -71092 41627
11 41627 73673 204707 158919 109431 -118885 -142402 -232389 -32026 59292 161308 170283
0 170283
$$ packed form
70a1513J46028j5783r4638q2498K6872J19329J07183p0162n4162k6155N382L602
58E3485j46537K0619J56834o1918N1521m1795o7215q4519K1222K0201K0985J48249
46I1132j68l5689K7393j08102J6804K1246o2522J04880O5697R5388o9570J5449
34A61938o2815j9018n6034o9716K9578K7579P2510J26724r2714k04443p9253o681
22a72345K34156j03009K1238K04452L4344j27557j94139j10094L9372J02490J12719
11D1627L2046J31034m5788m9488k28316k3517q9987K00363R1318J02016Q975
0A70283
$$ Imaginary data points
##PAGE= N=2
##DATA TABLE= (X++(I..I)), XYDATA
$$ plain form
16383 -5904529 -5943494 -5812757 -5562460 -5256955 -5150353 -5162427 -5222334 -5168059 -5154258 -5023679
16373 -5023679 -4985226 -4767842 -4590474 -4405178 -4485900 -4589616 -4538253 -4408727 -4416822 -4269055
16363 -4269055 -4149022 -3920517 -3673755 -3612845 -3747458 -3766140 -3664960 -3552388 -3541269 -3361896
16353 -3361896 -3169210 -2985445 -3003935 -3041849 -3046810 -2931320 -2908868 -2757553 -2635621 -2535301
16343 -2535301 -2426077 -2255962 -2200236 -2207396 -2200609 -2132787 -1891575 -1709436 -1719672 -1636327 -1644348
16332 -1644348 -1512194 -1469358 -1565769 -1477779 -1218433 -992954 -990023 -1033711 -1013525 -964935 -902308
16321 -902308 -878458 -880813 -593092 -342475 -260243 -309070 -364508 -207599 -101819 -259421 -207738
16310 -207738 87108 367446 299018 324580 150576 333771 567762 650129 548524 707816
$$ packed form
16383e904529l8965J30737K50297L05505J06602j2074n9907N4275J3801J30579
16373e023679L8453K17384J77368J85296q0722j03716N1363J29526q095J47767
16363d269055J20033K28505K46762O0910j34613j8682J01180J12572J1119J79373
16353c361896J92686J83765j8490l7914m961J15490K2452J51315J21932J00320
16343b535301J09224J70115N5726p160O787O7822K41212J82139j0236Q3345q021
16332a644348J32154M2836r6411Q7990K59346K25479K931m3688K0186M8590O2627
16321i02308K3850k355K87721K50617Q2232m8827n5438J56909J05780j57602N1683
16310b07738K94846K80338o8428K5562j74004J83195K33991Q2367j01605J59292
$$ plain form
16300 707816 901214 952150 758528 592603 814864 1174044 1161998 1094380 1204176 1579414
16290 1579414 1698615 1496760 1225437 1314626 1722750 1845636 1753720 1746933 1900684 2143105
16280 2143105 1997393 1750974 1923052 2387092 2589913 2394271 2185817 2339700 2464625
16271 2464625 2414252 2339373 2432895 2856521 3193735 3023302 2742395 2726107 2974147 3038533
16261 3038533 2842600 2782153 3156026 3724688 3612334 3111798 3004600 3380263 3582912 3435285
16251 3435285 3396235 3753748 4125803 4049469 3549176 3343264 3619718 4056146 4152671 4088555
16241 4088555 4147075 4447714 4380024 3998606 3828077 4140117 4538885 4627143 4550739 4486217
16231 4486217 4711241 4745605 4555355 4312984 4625062 4945815 5084484 4729569 4705124 4822436
$$ packed form
16300G07816J93398N0936j93622j65925K22261L59180j2046o7618J09796L75238
16290A579414J19201k01855k71323Q9189M08124J22886r1916o787J53751K42421
16280B143105j45712k46419J72078M64040K02821j95642k08454J53883J24925
16271B464625n0373p4879R3522M23626L37214j70433k80907j6288K48040O4386
16261C038533j95933o0447L73873N68662j12354n00536j07198L75663K02649j47627
16251C435285l9050L57513L72055p6334n00293k05912K76454M36428R6525o4116
16241D088555N8520L00639o7690l81418j70529L12040L98768Q8258p6404o4522
16231D486217K25024L4364j90250k42371L12078L20753J38669l54915k4445J17312
$$ plain form
16221 4822436 4912892 4807992 4646470 4892688 5188754 5442030 5329673 5136993 5121758 5244413
16211 5244413 5060877 4923321 5102072 5591004 5892125 5643243 5267310 5327433 5420533 5506559
16201 5506559 5381467 5425733 5855749 6049194 5853881 5668929 5475711 5667558 5756206 5825531
16191 5825531 5847505 5963853 6168625 6101342 5757878 5666203 5824169 6088455 6084394 6138026
16181 6138026 6199106 6293034 6113596 5934089 5925780 6267255 6347212 6313527 6353011 6397659 6414915
16170 6414915 6501502 6423356 6346272 6478148 6689353 6593640 6444852 6335327 6337268 6368335 6427466
$$ packed form
16221D822436R0456j04900j61522K46218K96066K53276j12357j92680j5235J22655
16211E244413j83536j37556J78751M88932L01121k48882l75933O0123R3100Q6026
16201E506559j25092M4266M30016J93445j95313j84952j93218J91847Q8648O9325
16191E825531K1974J16348K04772o7283l43464r1675J57966K64286m061N3632
16181F138026O1080R3928j79438j79507q309L41475P9957l3685L9484M4648J7256
16170F414915Q6587p8146p7084J31876K11205r5713j48788j09525J941L1067N9131
$$ [...]
##END NTUPLES=NMR SPECTRUM
##END=
