##TITLE=1H_CA-9181-54
 CDCl3
 8 sc, 
 4.8.2023
##JCAMPDX= 6.0         $$ Bruker NMR JCAMP-DX V2.0
##DATA TYPE= NMR SPECTRUM
##DATA CLASS= NTUPLES
##ORIGIN= UXNMR, Bruker Analytische Messtechnik GmbH
##OWNER= root
$$ XWIN-NMR		Version 3.5
$$ Fri Aug  4 13:43:57 2023 Russian Standard Time (UT+4h)  she@DPX200
##.OBSERVE FREQUENCY= 200.13135
##.OBSERVE NUCLEUS= ^1H
##.ACQUISITION MODE= SIMULTANEOUS
##.ACQUISITION SCHEME= undefined
##.AVERAGES= 8
##.DIGITISER RES= 18
##SPECTROMETER/DATA SYSTEM= spect
##.PULSE SEQUENCE= zg30
##.SOLVENT NAME= CDCl3
##.SHIFT REFERENCE= (INTERNAL, CDCl3, 0, 15.7293)
##AUDIT TRAIL= $$ (NUMBER, WHEN, WHO, WHERE, WHAT)
$$ ##TITLE= Audit trail, XWIN-NMR		Version 3.5
$$ ##JCAMPDX= 5.01
$$ ##ORIGIN= Bruker BioSpin GmbH
$$ ##OWNER= she
$$ F:/spectra/data/she/nmr/H-F/1/pdata/1/auditp.txt
$$ ##AUDIT TRAIL=  $$ (NUMBER, WHEN, WHO, WHERE, WHAT)
(   1,<2023-08-04 13:42:42.48 +0400>,<she>,<DPX200>,
      <created by zg, POWCHK disabled, PULCHK disabled
       configuration hash MD5:
       00 E9 B6 7A A2 85 ED C7 34 08 36 98 17 FE 4E 26
       data hash MD5: 16K
       22 87 76 52 6F 9B 8A 75 50 C6 F7 D1 31 86 5F D4>)
(   2,<2023-08-04 13:42:44.73 +0400>,<she>,<DPX200>,
      <Start of raw data processing
       efp BC_mod = 2 LB = 0.24 FT_mod = 6 PKNL = 1 PHC0 = -21056.58 PHC1 = 29.05272 SI = 16K 
       data hash MD5: 16K
       D9 6D BE A4 FB E8 36 B7 E7 7B 51 18 D3 90 C3 C5>)
(   3,<2023-08-04 13:43:02.78 +0400>,<she>,<DPX200>,
      <pk PHC0 = 11.09126 PHC1 = -12.2 
       data hash MD5: 16K
       9C 62 EE 00 04 07 AF 46 7A 87 23 E3 43 05 8B 97>)
(   4,<2023-08-04 13:43:07.07 +0400>,<she>,<DPX200>,
      <abs ABSG = 5 
       data hash MD5: 16K
       E7 A3 0A 62 FA 8E 8C 36 1B 64 0A 49 2E 64 0D 6C>)
$$ ##END=
$$ 
$$ hash MD5
$$ 60 E8 ED 2C 4C 66 03 C6 49 E4 9F 6B 5A 07 A1 C4
##$RELAX= 
##$RELAX= 
##$RELAX= 
##$RELAX= 
##$RELAX= 
##$RELAX= 
$$ Bruker specific parameters
$$ --------------------------
##$DU= <F:/spectra>
##$EXPNO= 1
##$NAME= <H-F>
##$PROCNO= 1
##$TYPE= <nmr>
##$USER= <she>
##$AMP= (0..31)
100 100 100 100 100 100 100 100 100 100 100 100 100 100 100 100 100 100 
100 100 100 100 100 100 100 100 100 100 100 100 100 100 
##$AQSEQ= 0
##$AQ_mod= 1
##$AUNM= <au_zg>
##$AUTOPOS= <>
##$BF1= 200.13
##$BF2= 200.13
##$BF3= 200.13
##$BF4= 200.13
##$BF5= 200.13
##$BF6= 200.13
##$BF7= 200.13
##$BF8= 200.13
##$BYTORDA= 1
##$CFDGTYP= 0
##$CFRGTYP= 5
##$CHEMSTR= <none>
##$CNST= (0..31)
1 1 145 1 1 1 1 1 1 1 1 1 1 1 1 1 1 1 1 1 1 1 1 1 1 1 1 1 1 1 1 1 
##$CPDPRG= <>
##$CPDPRG1= <>
##$CPDPRG2= <>
##$CPDPRG3= <>
##$CPDPRG4= <mlev>
##$CPDPRG5= <mlev>
##$CPDPRG6= <mlev>
##$CPDPRG7= <mlev>
##$CPDPRG8= <mlev>
##$CPDPRGB= <>
##$CPDPRGT= <>
##$D= (0..31)
0 1.2 0 0 0 0 0 0 0 0.06 0 0.03 0 0 0 0 0.0002 0 0 0 0 0 0 0 0 0 0 0 0 
0 0 0 
##$DATE= 1691142162
##$DBL= (0..7)
120 120 120 120 120 120 120 120 
##$DBP= (0..7)
150 150 150 150 150 150 150 150 
##$DBP07= 0
##$DBPNAM0= <>
##$DBPNAM1= <>
##$DBPNAM2= <>
##$DBPNAM3= <>
##$DBPNAM4= <>
$$ [...]
##$SUBNAM3= <"">
##$SUBNAM4= <"">
##$SUBNAM5= <"">
##$SUBNAM6= <"">
##$SUBNAM7= <"">
##$SUBNAM8= <"">
##$SUBNAM9= <"">
##$SW= 18.05172834244
##$SWIBOX= (0..15)
0 0 2 0 0 0 0 0 0 0 0 0 0 0 0 0 
##$SW_h= 3612.71676300578
##$TD= 16384
##$TD0= 1
##$TE= 0
##$TE2= 300
##$TE3= 300
##$TEG= 300
##$TL= (0..7)
0 120 120 120 120 120 120 120 
##$TP= (0..7)
150 150 150 150 150 150 150 150 
##$TP07= 0
##$TPNAME0= <>
##$TPNAME1= <>
##$TPNAME2= <>
##$TPNAME3= <>
##$TPNAME4= <>
##$TPNAME5= <>
##$TPNAME6= <>
##$TPNAME7= <>
##$TPOAL= (0..7)
0.5 0.5 0.5 0.5 0.5 0.5 0.5 0.5 
##$TPOFFS= (0..7)
0 0 0 0 0 0 0 0 
##$TUNHIN= 0
##$TUNHOUT= 0
##$TUNXOUT= 0
##$USERA1= <user>
##$USERA2= <user>
##$USERA3= <user>
##$USERA4= <user>
##$USERA5= <user>
##$V9= 5
##$VALIST= <valist>
##$VCLIST= <CCCCCCCCCCCCCCC>
##$VD= 0
##$VDLIST= <DDDDDDDDDDDDDDD>
##$VPLIST= <PPPPPPPPPPPPPPP>
##$VTLIST= <TTTTTTTTTTTTTTT>
##$WBST= 1024
##$WBSW= 4
##$XGAIN= (0..3)
0 0 0 0 
##$XL= 0
##$YL= 0
##$YMAX_a= 165817
##$YMIN_a= -152427
##$ZGOPTNS= <>
##$ZL1= 120
##$ZL2= 120
##$ZL3= 120
##$ZL4= 120
##$ABSF1= 15.72926
##$ABSF2= -2.322589
##$ABSG= 5
##$ABSL= 3
##$ALPHA= 0
##$AQORDER= 0
##$ASSFAC= 0
##$ASSFACI= 0
##$ASSFACX= 0
##$ASSWID= 0
##$AUNMP= <proc_1d>
##$AZFE= 0.1
##$AZFW= 0.1
##$BCFW= 0
##$BC_mod= 2
##$BYTORDP= 0
##$COROFFS= 0
##$CY= -3
##$DATMOD= 1
##$DC= 0
##$DFILT= <>
##$DTYPP= 0
##$F1P= 0
##$F2P= 0
##$FCOR= 1
##$FTSIZE= 16384
##$FT_mod= 6
##$GAMMA= 0
##$GB= 0
##$INTBC= 1
##$INTSCL= 3.70164e-10
##$ISEN= 128
##$LB= 0.24
##$LEV0= 0
##$LPBIN= 0
##$MAXI= 10000
##$MC2= 0
##$MEAN= 0
##$ME_mod= 0
##$MI= 1.114404
##$NCOEF= 0
##$NC_proc= -9
##$NLEV= 6
##$NOISF1= 3.799351
##$NOISF2= 2.8
##$NSP= 0
##$NTH_PI= 0
##$NZP= 0
##$OFFSET= 15.72926
##$PC= 1
##$PHC0= -21045.49
##$PHC1= 16.85272
##$PH_mod= 1
##$PKNL= yes
##$PPARMOD= 0
##$PSCAL= 0
##$PSIGN= 0
##$REVERSE= no
##$SF= 200.130008461292
##$SI= 16384
##$SIGF1= 3
##$SIGF2= 2
##$SINO= 5.538805
##$SIOLD= 16384
##$SREGLST= <1H.CDCl3>
##$SSB= 0
##$STSI= 16384
##$STSR= 0
##$SW_p= 3612.71676300578
##$SYMM= 0
##$S_DEV= 0
##$TDeff= 16384
##$TDoff= 0
##$TI= <>
##$TILT= no
##$TM1= 0
##$TM2= 0
##$TOPLEV= 0
##$USERP1= <user>
##$USERP2= <user>
##$USERP3= <user>
##$USERP4= <user>
##$USERP5= <user>
##$WDW= 1
##$XDIM= 16384
##$YMAX_p= 330360209
##$YMIN_p= -3681386
$$ End of Bruker specific parameters
$$ ---------------------------------
##NTUPLES= NMR SPECTRUM
##VAR_NAME=  FREQUENCY,     SPECTRUM/REAL,   SPECTRUM/IMAG
##SYMBOL=    X,             R,               I
##VAR_TYPE=  INDEPENDENT,   DEPENDENT,       DEPENDENT
##VAR_FORM=  AFFN,          ASDF,            ASDF
##VAR_DIM=   16384,         16384,           16384
##UNITS=     HZ,            ARBITRARY UNITS, ARBITRARY UNITS
##FACTOR=    0.220516191357247, 1,           1
##FIRST=     3147.89702587589, 0,            0
##LAST=      -464.819737129889, 0,           0
##MIN=       -464.819737129889, -3681386,    0
##MAX=       3147.89702587589, 330360209,    0
$$ Real data points
##PAGE= N=1
##DATA TABLE= (X++(R..R)), XYDATA
$$ [...]
9121 494906 179181 23303 553281 941649 232134 188664 -240686 330163 363837 22654
9111 22654 -35560 66577 -24465 262096 534668 798421 835953 132872 -115226 -403989
9101 -403989 -266711 135298 472368 1062483 718047 896179 931281 851479 544546 354006
9091 354006 612650 965931 643768 167439 376895 380001 381191 430458 335351 288641 203295
9080 203295 741970 1223788 588318 549194 660603 285799 -223923 855449 631344 -191324
9070 -191324 179530 459935 507114 591706 452703 250954 265082 276769 522479 482123 -1843
9059 -1843 -480611 -266408 329677 679906 304160 161865 442997 653638 319009 371878
9049 371878 439835 -185304 300278 181493 303292 673789 242614 16095 -196456 -5657
9039 -5657 -443951 632700 941164 206270 365383 222333 392403 -65182 102619 237814
9029 237814 809204 993025 914081 578052 280326 409008 -148548 288232 514612 385295
9019 385295 924360 796110 417543 48012 701132 1295030 1289238 849808 885708 989303
9009 989303 655411 532649 760816 409656 1283500 1919254 1514507 1316112 672107 834705
8999 834705 1284927 689452 299125 254848 144711 300017 164387 387995 857382 852096
8989 852096 994245 1128859 603217 181069 1076731 1433246 1302932 1470397 1240744 1005383
8979 1005383 748240 717770 1179157 1267929 1048064 744586 1303985 1526646 1427414 1416433
8969 1416433 1052415 1334592 1309805 1690249 1884693 1619055 1570100 1453005 1724833 1810801
8959 1810801 1241654 1211663 1434887 1559093 1923325 1606704 417592 408337 910311 1562595
8949 1562595 1586230 1476911 1989043 2221766 2124718 1621701 1743664 1694232 1062502 1562236
8939 1562236 1811443 2266261 2004186 1519638 1385206 1899564 1611554 1637302 1314808 1343272
8929 1343272 1804664 1625485 1425024 1860281 2029976 2199338 2115622 1810853 1990359 2175191
8919 2175191 2579485 3450545 3133849 2776395 2663300 1621104 1966509 2177524 2187470 2231756
8909 2231756 3111098 2624010 2632369 2749916 2475497 2643462 2795616 2765224 2824268 3452970
8899 3452970 3436802 3025675 3203738 3078545 2977429 2654567 2741786 2641228 2935649 3375424
8889 3375424 3779938 3987645 3588645 4006134 4036509 3995896 3659110 3706477 3481072 4013092
8879 4013092 3948610 3730769 3868163 3703975 3597805 3392699 3420810 3608383 4084482 4284062
8869 4284062 4150411 4239195 4767355 4269262 4257216 4851211 4623432 4059142 4853863 5066764
8859 5066764 4939219 5540322 5714844 4971519 5281786 5807832 5300819 5030615 4756910 5607939
8849 5607939 6183405 6052113 6370444 6854008 7097444 6609415 6400563 7124815 7637656 7557168
8839 7557168 7680970 8420490 8273160 8361640 8648956 8519934 8554041 8737316 8579497 8666553
8829 8666553 8799028 9444590 10338826 10070976 9551990 9557397 9344574 9904788 10764682 10920593
8819 10920593 11355081 11308703 11570097 12326235 12253129 12397618 13590659 13755899 13768808 14022809
8809 14022809 14301488 14005072 13925430 14167573 14472838 14230154 14880776 15606772 15415920 15279113
8799 15279113 15241665 14891934 15590416 16005613 15646115 15394045 15361502 15979578 16229820 16533510
8789 16533510 17216175 17346957 17255556 17221941 17359998 17996321 17735363 18230768 18504893 18864437
8779 18864437 19004567 18978734 19487796 20050631 20839365 21523866 21777348 22031209 22891619 23230509
8769 23230509 23343133 23300783 23817497 25483665 26253511 26431030 26446298 27435615 28090264 28560096
8759 28560096 29605354 30696049 31667738 32516369 33745439 34934487 34760779 35297626 36132469
8750 36132469 37371080 38639068 39254832 40830823 41865653 43197444 44154752 45710404
8742 45710404 47540822 49062011 51140798 53843223 56833304 59536260 63052603 66427442
8734 66427442 70282935 74646967 79982939 85640605 92076023 97637489 101776968 106439505
8726 106439505 110308906 112475955 113386362 113426773 112998415 111528048 109602299 108187933 106481653
8717 106481653 103714073 101132032 99115399 97515866 95558987 93501845 92250189 92172630
8709 92172630 93373626 96043739 100088576 105062901 111745815 121246942 133017582 147166372
8701 147166372 161445714 173386973 179936109 171344278 151981499 133872619 120658654
8694 120658654 112041201 106592147 103433649 101571799 98938257 95717227 91367322 87412362
8686 87412362 83047589 79024212 74933405 71199686 67634516 64355268 62041542 59704975
8678 59704975 58163766 56882880 55638856 54797498 54353160 53290837 52124871 51910933 50529096
8669 50529096 50160819 50295138 50834956 50651207 50595042 52112391 53149191 53837924 55593110
8660 55593110 57655742 60179520 62025704 63786225 66392527 68422280 70264660 71532532
8652 71532532 72095817 72462125 72116518 71263571 69689963 67883573 65935328 62928383 59665603
8643 59665603 56086886 53296588 50342390 47702159 46065751 43479180 40395047 39300764
8635 39300764 38067994 36679937 35457351 35020942 33552067 32445587 31766033 31381152 30600542
8626 30600542 28943399 28384051 28488141 28110203 28134248 27112584 26217461 25922624 26125599
8617 26125599 26819093 26889433 26532337 26182074 25849362 24929447 25112844 24608637 24256967 24556597
8607 24556597 24035822 22994641 22692397 21848912 21616352 21323698 21149753 20971994 20505847
8598 20505847 20474616 20283968 20625151 20458701 20168701 19825405 19574230 19383495 18867006 18299535
8588 18299535 18830154 19251620 18001847 17998993 18453611 18256771 18456268 18363587 18810833 18787411
8578 18787411 18875542 19472618 19530153 20129584 20669975 20536548 21006397 21132016 20772447 20882044
8568 20882044 20970355 20836310 20810646 21574934 21784830 22112705 23262939 24216464 25258955
8559 25258955 25724700 27443912 28528018 29453356 31097400 32958717 34874024 36808232
8551 36808232 38376294 38691469 38954722 39459408 38884316 37401371 36373174 34841267 32075152
8542 32075152 29894420 28506285 28172722 26807375 25418196 25426645 25411307 23995788 23771327
8533 23771327 24554453 24406794 23838246 23958565 24539243 25282782 26478453 26756593 27980066
8524 27980066 30174584 31798015 33596400 35149472 36388353 38649873 40716226 42755887
8516 42755887 44366382 47032722 49351646 51127270 52594283 53368469 52323199 49838461
8508 49838461 46373301 41893542 38211454 35095712 32153763 29818488 27656932 25455412
8500 25455412 24177731 22978197 21533614 20269033 18981876 18689179 17735388 17049068 16642045
8491 16642045 15548281 15277296 15987390 15830063 14927955 14305117 14286948 14243044 13895062 13629290
8481 13629290 14002976 13901257 13529446 13117939 13141157 13114001 13193956 13336931 13609819 13308610
8471 13308610 12934343 12830085 12808665 13082687 13395985 12850703 12780556 13013450 13318668 13953677
8461 13953677 14324417 14126805 13958840 13845153 13976546 14648812 14411173 14352094 14047291 14184621
8451 14184621 14606422 14826529 15008685 15018425 15279223 15346285 16302006 16242060 15868321 16622312
8441 16622312 17073790 17447957 17207707 17568824 18410795 18906384 18752231 19487660 20109130
8432 20109130 20757296 20829623 21342000 22653436 23393307 24409581 25358066 26340666 27680371
8423 27680371 28711085 30000869 31677551 32950042 35343970 37534835 38663314 40927875
8415 40927875 43249630 46276878 48768544 50853457 53146463 55066002 57021910 58394088
8407 58394088 58844724 58661288 58481116 57740109 57259698 55559488 53326340 51509437 49678626
8398 49678626 47882592 45369989 43258919 40915561 39249775 38063444 37636862 37104261
8390 37104261 37439543 37654712 37361423 37504937 37820693 37651202 38070231 38524760 40222314
8381 40222314 40793076 41073794 42343855 43677508 44827511 46262524 47831820 49022834
8373 49022834 50130032 50535498 51730787 52345804 52135022 52064513 51158522 50408671 50049931
8364 50049931 49338783 48648994 47167441 45952597 44196887 42515785 41094481 39686475
8356 39686475 39328965 38871494 38123536 38031449 38545277 39665604 40577217 42392052 42759828
8347 42759828 43306912 45397269 46900595 46245192 45754260 45467796 45614645 44420602 43453926
8338 43453926 42949589 41271352 40015108 38100537 35960417 33835484 32299507 31105574
8330 31105574 29841350 28777639 27962940 27165680 26128851 24794992 24292258 24704657 25084401
8321 25084401 24591478 23910869 23527925 23870251 23986320 24228090 24653060 24840601 25702758
8312 25702758 26587370 27756750 28365629 28130836 29100168 29779410 30034432 29134811 28326496
8303 28326496 28335676 27237369 26125488 25262399 23839297 22806489 21470053 19582779 18108669
8294 18108669 16397817 15246065 14012209 13830629 12933734 12222131 11650602 11028186 11040321
8285 11040321 10238425 10052484 9184595 8704707 8614102 8878501 9412673 8495073 8099225 8238128
8275 8238128 8362424 8082371 7853133 6868621 6216829 6829358 7706956 7329742 6825792 6422056
8265 6422056 6545466 6544898 6367827 5880060 5445097 5586661 5341358 5359995 4967954 5025636
8255 5025636 4332570 4324783 3979298 4197070 4626599 4199723 3997281 4019362 4717386 4124642
8245 4124642 3566062 3263944 3480435 4326988 3806549 3517744 3715780 3641063 3903893 3630359
8235 3630359 3910520 4456626 4489529 4498261 4005243 4527029 4470740 3858669 3410980 3476668
8225 3476668 3386889 2826045 3399551 4012087 3928485 3641474 3208866 2609385 1904777 1968356
8215 1968356 2380432 1773044 1979678 2195026 2368884 2481872 2658753 2095350 2086005 2322081
8205 2322081 1662464 1610263 1627493 1837283 1760637 1621795 2179883 2236516 2473845 2075074
8195 2075074 1864728 1921065 2935109 3566601 1517358 787597 856511 1172389 807345 1254181
8185 1254181 1745497 1602481 1539754 1818630 1536196 1369335 1671773 1292800 897432 1225285
8175 1225285 1364918 1689120 1642627 834113 777032 1015889 489465 503842 534972 895332
8165 895332 1602435 1457839 772941 614796 682687 -90497 -35441 144308 474028 360613
8155 360613 302746 965396 820553 1042920 774074 1240375 1388661 674254 837240 918650
8145 918650 266923 144848 349328 -80411 522080 810649 828959 681151 -359782 -33809
8135 -33809 458070 716503 766892 38734 344026 791019 49301 436683 512025 802876
8125 802876 896527 585578 806378 43237 -49978 12218 994447 1061465 -27581 -168595
8115 -168595 203230 519037 238295 44507 966344 946682 778766 243878 470568 175718
8105 175718 119104 -162185 82336 707810 375291 -329766 -661017 188441 461564 264201
8095 264201 -58198 397299 585290 637117 472463 31593 353687 706941 150409 -363301
8085 -363301 -678652 -77326 -192607 -384312 -304083 41378 177585 266813 -153156 -125140
8075 -125140 345488 274580 607895 348333 -30080 -238247 -88177 -544259 -388481 -6261
8065 -6261 31857 -255712 -45142 -248624 30830 22328 19621 146695 465193 687021 464448
8054 464448 616327 940346 922609 299710 132175 64580 39384 -265963 -167054 -691723
8044 -691723 203110 -35383 -115946 439305 793279 23276 -974139 -58109 376911 241179
8034 241179 93833 -140946 -383961 522643 205385 51799 -274046 6844 161002 714883
8024 714883 504357 675871 100692 -399568 -387536 -369713 172236 970691 462106 -246014
8014 -246014 148018 -129241 -33992 -204613 -123521 -187790 -455266 448905 191931 -372867
8004 -372867 -436250 -578479 121184 534476 414513 595999 284979 801614 708542 -38626
7994 -38626 28048 132537 280010 -256171 -331339 -789081 -392448 -834160 -39106 -226803
7984 -226803 -585328 -346366 74633 28951 326217 -493283 -332990 325622 75360 886606
7974 886606 985577 378779 5274 -339267 195444 -633631 -523638 -95387 -362738 -390708
7964 -390708 -806893 -17040 6567 -191592 -419197 -332731 -279752 -337568 262968 229478 -460741
7953 -460741 -945977 -328533 -291922 112205 -695426 -732013 -267874 86417 -234554 -97733
7943 -97733 46110 354776 368899 402550 209261 -299541 -510105 -417938 -63891 -404676
7933 -404676 -332788 -394254 -442222 -453225 -70800 79407 478833 -29223 295861 -376684
7923 -376684 -301497 -221920 -271392 -440837 -445819 -731684 -220357 -229560 -118701 -489979 -16829
7912 -16829 -198645 4385 -92113 231059 -617406 -805528 -907903 -1499127 -889836 -541374
7902 -541374 -461171 -706063 -487667 -636486 -534844 -432435 311253 -280299 -972540 -803155
7892 -803155 17767 683894 457613 -216 42796 245790 -198511 221968 -142457 -159885
7882 -159885 -39597 293512 47429 -802928 -546422 49994 -346653 -670256 -453607 -262636
7872 -262636 49567 10626 -169898 267758 -95085 -551885 -11540 -6576 260576 211077
7862 211077 293566 -12366 -300470 -301792 303374 256419 -260444 -587603 -713362 -844877
7852 -844877 -368306 -79084 -290028 -476305 -287627 -1084809 -1152450 -1086873 -1227115 -931984
7842 -931984 -896882 -673514 19603 -2772 270994 215345 324482 -188878 -63051 -622900
7832 -622900 -969142 -827561 67088 176151 -288323 -598115 -733339 -986649 -133559 417019
7822 417019 71173 -200794 59047 211235 -443603 -769061 -1013711 -1043657 -1371494 -1179456
7812 -1179456 -1364469 -1080108 -651931 -1387931 -556841 2039784 820729 553208 166144
7803 166144 448027 698447 291976 353047 641277 63433 -520872 490840 675698 324781
7793 324781 265887 323941 -156389 135652 344045 512421 767486 336061 25070 165876
7783 165876 241527 331090 -79361 -623010 -589156 -386015 156653 379187 48729 -169364
7773 -169364 213900 -88330 -378467 -292233 -22892 39557 376978 648506 745610 1256379
7763 1256379 715513 232987 -148749 147480 929175 382109 550353 623873 302332 35628
7753 35628 -229445 -633255 -389972 -212070 -127042 422895 333523 477994 895177 928970
7743 928970 494551 616983 764980 47760 -202114 -136022 -321431 -323032 -664 -157122
7733 -157122 -528375 -605769 -101600 42641 257623 562534 553167 103864 -304893 684265
7723 684265 319182 -2971 28725 -239645 122042 -593246 -387537 -224537 -380717 117793
7713 117793 -556279 -485107 -149697 496396 197182 193797 228330 -983977 -801376 166809
7703 166809 530421 213805 524827 237271 247823 549543 95271 163145 -53825 -171315
7693 -171315 -316773 -131312 410984 720931 326493 32660 120576 323089 539565 88302
7683 88302 -251678 479324 215833 156593 70849 76292 191705 94534 408949 839467 1177750
7672 1177750 960074 790705 166668 292801 -9192 -735210 -1456976 -466416 85237 -12760
7662 -12760 181982 359171 -228604 -351997 641366 657303 312048 943882 592053 -277863
7652 -277863 75334 371156 758738 449951 205487 343257 229643 -135219 181825 817286
7642 817286 1010310 773169 1358083 895802 916267 832505 804722 524966 570122 440007
7632 440007 596982 642943 541616 1132465 859567 1323771 659345 531454 578978 1114091
7622 1114091 721227 352525 404275 105120 511167 -20240 379142 188690 587847 610986
7612 610986 580338 328284 17010 197235 161642 759631 368539 384984 361030 516081
7602 516081 298404 183933 213602 -9146 8433 -23792 459310 189339 431241 928009
7592 928009 844626 155622 454622 314261 -23421 681249 506900 483151 15493 426632
7582 426632 807611 1088525 345297 1065462 1564037 1749570 1666429 390963 253394 452089
7572 452089 872298 676304 678287 793870 724473 338819 602258 734955 901799 700209
7562 700209 1080078 1356319 752577 904136 565053 793588 1053144 1347659 892452 678072
7552 678072 1244683 708336 1016815 1045679 1307109 1353707 -20804 191041 1121478 1108368
7542 1108368 820334 658435 784496 1244623 854939 929592 1006325 1662228 1515751 1105641
7532 1105641 1059040 673754 471401 691539 1159433 1518862 1724361 1860992 2305140 2101277
7522 2101277 1671057 1327358 1470845 1976241 1084357 546842 840519 920156 800222 915112
7512 915112 971648 834025 665275 171934 925458 1713449 1553375 1310571 1695793 1350634
7502 1350634 1406293 1679458 1867941 1530051 1248068 1358235 1357453 1212569 860992 509281
7492 509281 1433298 1515686 1513827 1831619 1612413 2101453 1412575 994487 1544165 1696812
7482 1696812 1862903 1642282 1803439 1808592 2299015 1799085 1170702 1310265 1329518 1972226
7472 1972226 1940628 1621421 1465014 1924050 1679780 1522168 1741190 2051962 1384065 1188631
7462 1188631 1281124 1550960 1682609 1362063 1686513 1576117 1631738 2096628 1436168 1442218
7452 1442218 1675455 2265025 2406288 2087066 1972418 2430120 2135628 1520036 2061399 2402778
7442 2402778 2255240 2089347 2072144 2124692 1993744 1719329 2478104 1792519 1920305 1682857
7432 1682857 1947576 1627690 1706657 1382925 1599627 1920624 1892403 1862708 1767668 1941702
7422 1941702 2449165 2031042 1738328 2064208 2154032 1737533 2060158 2078185 1252692 1720094
7412 1720094 1523608 1923590 2165076 1847397 2071766 2127402 2306903 3040204 2673621 1971784
7402 1971784 1769788 2044081 1923092 1833102 1836738 1892733 2040611 2865828 2601675 2390948
7392 2390948 2307906 2576229 2877108 2852659 2442878 2053345 2198017 2362680 1810035 1934974
7382 1934974 1258036 1890707 2371000 2658632 2475135 2173212 2958696 2788353 2680492 3012170
7372 3012170 3503204 3397795 3235532 2703443 2581993 3285618 3329842 3228791 3022378 3211317
7362 3211317 3266961 2359259 2689001 3424026 3218760 3262030 3336063 3285762 3419407 3139894
7352 3139894 2341676 3079416 3600111 3435799 3886803 3418863 3926461 4266077 3958795 3443302
7342 3443302 3899616 3814766 4409826 4259877 3327025 3089894 3439314 4116146 3637188 3436707
7332 3436707 4131322 4176634 4506051 4796271 4334809 4325604 3833406 3640730 3793151 3795567
7322 3795567 4091284 4460972 4010124 4325491 4360180 4291874 4457345 4019296 4722383 4558756
7312 4558756 4692699 5137769 4427001 3998837 3337761 2723176 3031508 3210824 3057378 3389684
7302 3389684 3362598 3500934 3580570 3723736 4038596 4087398 3822362 4039101 3810613 4126235
7292 4126235 4447007 4501396 4364094 4232370 4259928 3760365 3261363 3337617 3416801 3578377
7282 3578377 4246905 3689446 3729850 4476977 4284779 4693754 5091486 4390776 3912917 3612585
7272 3612585 4423300 4388981 4227703 3549584 3748457 4306306 4393984 4285043 4153971 3778753
7262 3778753 4535532 4372815 4124159 4524712 4037333 4117240 4363247 4720120 4936629 4408101
7252 4408101 3990346 3788581 3980539 3695240 3707567 4178096 3993665 4044200 4057226 3561038
7242 3561038 3723705 4393505 4280159 4266598 4474488 4650472 4330447 4401695 4603025 4680502
7232 4680502 4640116 4962189 4380763 4203705 4384469 4186406 5032011 4975090 5212500 5379807
7222 5379807 4737628 5408508 5190815 5206960 5297475 5118153 4508252 5158268 5330273 5455921
7212 5455921 5086767 5670070 5702278 5007137 5858766 6194315 6180563 5465116 5298010 5205375
7202 5205375 5167896 5690654 5735859 5644236 6032644 6075277 6025036 5614727 5175334 5737243
7192 5737243 5283149 5249728 5579533 5769796 5689260 6301657 5848012 5248980 5708501 5597570
7182 5597570 5798539 5731552 6047908 6145418 5955379 5714961 5878583 6334455 6597891 6354581
7172 6354581 6562685 6673843 6371040 6226187 6250542 6268631 6151322 6457134 6744211 6621614
7162 6621614 7205366 6633557 6515313 6360714 6377874 5900901 6249551 6737616 6961457 7172616
7152 7172616 7174129 7237351 7047046 7089898 7255622 7150990 6810652 7302639 7586636 6759908
7142 6759908 6657843 7801271 7461193 7033161 7194925 7231195 7691491 7799583 7362694 7804082
7132 7804082 7239616 7365048 7799122 7702471 7292758 7177180 7674975 7924524 8259371 8040121
7122 8040121 7789179 7807066 7972115 8011421 8633929 8497689 8729006 8727128 8703411 8648946 8292333
7111 8292333 8139832 8798161 9939630 9789783 9148433 8533780 8666574 9060044 9605416
7102 9605416 9535979 8963924 8961209 9128632 8698360 9415604 9186806 8689737 8752983 8153209
7092 8153209 7914645 8783552 9315571 8543569 8934579 9091929 9506658 9873223 9358059 9003684
7082 9003684 9638615 9706352 10159697 10206259 9482391 9420263 9002577 9231494 9923398 9231903
7072 9231903 9561440 10357762 10546553 10610925 10130402 10305189 9995463 10318756 10174219 9888640
7062 9888640 10167817 9900627 9719840 10184297 9896233 9802699 9849306 9663384 9723989 9336141
7052 9336141 9883199 10122448 10769534 11406972 10964402 11749950 11439501 11022930 11166185 11283542
7042 11283542 11115538 10710982 10459372 10520169 10621028 11318597 12127699 11564458 11433430 11176855
7032 11176855 11794937 11502418 11179688 11377566 11677557 11462590 11613028 11945559 11209791
7023 11209791 11141117 11015621 11206309 11255599 12230806 12079971 11974429 11642923 11712542 11605015
7013 11605015 11330607 11456466 11933611 12155558 12368247 11644482 11781441 12432963 11788365
7004 11788365 12224492 12031315 11937003 11632770 11534339 11509000 12035174 12345851 12346534 12456825
6994 12456825 12077042 11908137 12645043 13461116 13792956 13539273 13307935 13121179 13191900 12711581
6984 12711581 11896993 12592081 13087806 13388849 13447026 13504319 13348189 13456514 13246664 12503636
6974 12503636 13136851 13144344 13512712 13489686 13461753 13081769 12893788 13437744 13811508 13624835
6964 13624835 13645102 13812800 13871320 14340264 14489493 14134914 13722317 14125475 14233609 14091501
6954 14091501 14245677 14117203 14002134 14230938 14170853 13752968 13941771 14725319 14345527 14345899
6944 14345899 14445247 13888826 13825919 14449813 14647301 14199416 14496914 14238592 14465467 15463973
6934 15463973 15585600 14476408 14512711 15191404 15399969 15248717 15120645 15296985 15512067
6925 15512067 15569317 14949612 14625485 15087365 15404626 15353169 15754834 16094877 15637557 15747992
6915 15747992 15758387 15448883 16006802 16347291 16111115 15775710 16525536 16277247 16007452 16126878
6905 16126878 15815681 16066452 16253941 16657056 16421372 15860535 16015040 16522702 16524819 17066495
6895 17066495 17109648 17140814 17020399 16891549 16802660 16661776 16401616 16980747 17474010 17068376
6885 17068376 17257349 17180354 17121482 16955725 17058843 16962075 17128949 17218842 17646290 17811028
6875 17811028 17455704 17540529 17641679 17093949 17505769 17439118 17385080 17371732 17900476 17370037
6865 17370037 16520952 17336284 17584745 17678159 17806079 17392046 17679879 17474393 17723294 17618945
6855 17618945 17686360 18562144 18096252 17465103 17726117 17671451 17678238 17722538 17353736 17970658
6845 17970658 17713370 17138450 18031727 18313690 18179323 19147442 19246170 18915021 18746185 18065536
6835 18065536 17829126 18353073 18129424 18093406 18341610 18208927 17897023 18040532 18352736 18481630
6825 18481630 18013133 18249299 18661767 18620755 18530051 18764957 19111373 18669503 18073850 18257313
6815 18257313 19142517 19320830 19134825 19362192 18510929 18713885 19387570 19472151 19082304 19088383
6805 19088383 18972725 18838465 18409859 18264908 18630622 18978767 19086714 18932749 19222991
6796 19222991 19220082 19032243 18928751 19566345 19283549 19316893 20045200 20446338 19694384 19005052
6786 19005052 19661500 19615356 19475035 19213990 18715528 18837236 18888279 19850784 19761212 20040183
6776 20040183 19727080 19213029 19073751 19245439 20115138 19338043 18413632 18593414 19060563
6767 19060563 19713472 18876836 18868976 18760473 18272650 18424467 18469431 19099562 19069011 18692083
6757 18692083 19128218 18905682 18811778 19271532 18853316 18779761 18667240 18292050 18278683 19079386
6747 19079386 19570852 19463400 19654304 19469808 18939337 18979620 18810830 19116719 19094085 19115054
6737 19115054 18924124 19253959 19500656 19529340 19015468 19130144 19275614 19359117 19259375 19103269
6727 19103269 19270726 19291214 18746180 18589893 19137157 18333886 18463280 18798815 18719740 18467508
6717 18467508 18983362 18890468 18770160 19067866 18696150 18552060 17982024 18037749 18281240 18388174
6707 18388174 17999611 18576884 18358060 18012141 18285983 18458942 18200398 17816690 18024520
6698 18024520 17318053 17692983 18054974 17938597 18133258 18031942 17900538 17568039 18097423
6689 18097423 17902687 17237480 17138349 17668700 17647249 17224926 17445698 17411925 17384377 17379442
6679 17379442 18006542 17715251 16987919 17000173 17321059 17321742 17192786 17063379 16974440 16840768
6669 16840768 16665080 17405996 16985780 16886341 17319967 17135317 16646325 16541873 16880487 16835878
6659 16835878 16484275 15963266 16714982 17225685 16747190 16212859 16369944 16037118 16298529
6650 16298529 16124983 16512035 16934458 15982009 15905331 16624087 16102943 16243716 16187998 16087657
6640 16087657 15881731 15973994 15943921 14992353 15314320 15671400 16166614 16758961 16130285 16537492
6630 16537492 16426661 15513318 15518084 16071100 16314627 16259419 16349037 15852629 16008480 15968090
6620 15968090 15641845 15288349 14628104 14909405 15080055 14190489 14786395 14869244 15124080 15852692
6610 15852692 16216929 15746226 14704595 14680838 14346451 14401072 14765095 14400515 14445168 14644475
6600 14644475 14693387 14957714 14548562 14495090 14974337 15348515 14923900 14206028 14050787 15130342
6590 15130342 14715664 14776584 15139965 15201022 15664837 14839566 14315868 14132991 14334115 14366803
6580 14366803 14532758 14116927 14509147 14866710 13969728 14159935 14964735 14399509 14620141
6571 14620141 14335056 13877480 13484114 14378423 14255723 14079966 13926711 14021937 13862807 13894607
6561 13894607 14495775 14188354 14380460 13850566 13634628 13994999 14068455 13779979 13833130 13185501
6551 13185501 13434284 13749341 13355658 12951741 13128689 13673450 14112304 14860380 14410850
6542 14410850 13824724 14016822 13426357 12915684 13081651 13238841 13689057 13954149 13951103 13786473
6532 13786473 13460889 13901096 13283516 13506847 13782751 13673952 13374457 13429695 13776182 13549190
6522 13549190 13144256 13236635 12831158 12690398 13302320 13514496 13807008 13715194 13767956 13909114
6512 13909114 14004132 14771888 14554451 14202696 14090124 13571660 14028722 14205606 14391635 14032372
6502 14032372 14087040 13677233 13373776 14092119 14250746 14391167 14441535 14454793 14521267 14451108
6492 14451108 14329203 14574611 14884184 15185958 15571724 15408431 15786953 16163056 16004726
6483 16004726 15916357 15892755 15699649 16563588 16468423 16220861 17307718 17417675 17124733 17111820
6473 17111820 17342821 18115636 17709412 17702228 17316518 17314897 17881946 17581448 18032608 18358350
6463 18358350 17804017 17890953 18343628 18242345 18986537 18778072 18104575 18107778 18570333 18929016
6453 18929016 19443364 19581207 19924834 20120493 19862621 20333703 20470429 20767699 21359242
6444 21359242 21621196 22309385 22227743 22313264 22811777 23745616 24207310 23498937 23523336 23948965
6434 23948965 24102982 24783301 25591928 26264043 26666907 27094079 27837855 27811083 28796470 29731197
6424 29731197 30771228 32057556 33338480 34278629 35067768 36771032 38111662 40202903
6416 40202903 42365382 44234555 46670372 48506781 50396099 53012273 56002644 58855263
6408 58855263 61246776 64253138 67450463 71063372 74537090 77298014 81480076 86246545
6400 86246545 91167798 95231236 99169026 102828197 105664057 106790308 105212528 103145180
6392 103145180 99042347 94542193 89007651 83191877 78092094 73329270 69756119 66293235
6384 66293235 63154133 60425664 57743286 55080619 52767094 51300137 49747837 47823602
6376 47823602 45437848 43451982 41974769 40213534 38913511 37349382 36200481 34224943
6368 34224943 32952485 31772275 30829184 30124833 29681904 29142781 28198294 27877077 26708943
6359 26708943 25825500 25325190 24908120 23946433 23054592 22546828 21623983 20829791 20921807 21048548
6349 21048548 20466141 19743420 19134966 18257157 17702032 17302912 16479349 16011079 15917609 15176532
6339 15176532 15357497 15288443 14938410 14852532 14837880 14765167 14350873 13624343 13418365 12976376
6329 12976376 12636158 12719876 12786010 13102835 12917813 12284011 11739133 11720052 11036560 11353217
6319 11353217 11480811 10628895 10973839 10515957 10154345 9968621 9975233 9926033 10445273 9950370
6309 9950370 9666318 9449818 9248015 9295872 9046748 9359010 9647770 9271460 8856919 8135891
6299 8135891 7759707 8729267 8825202 8510124 7711933 8429273 8837931 8733874 8195898 7788476
6289 7788476 7520433 7655896 7683390 7647147 8392846 7687888 7236852 7505118 7283438 7076509
6279 7076509 7413278 7682795 7373064 7491874 7179784 6815402 7228242 7597254 7914691 8098790
6269 8098790 7392213 7280441 7561875 7338817 6755675 6374188 6265851 6540230 7004857 7305732
6259 7305732 6699460 7442232 7709169 7167866 7638676 7744633 7044967 6844469 6032059 5842566
6249 5842566 6624451 6921863 6689827 6973189 6554336 6731516 6335451 6502436 6711027 6817580
6239 6817580 6972416 6643176 6323742 7026555 7035222 6977840 7429083 6778599 6896582 6421566
6229 6421566 6703933 6858611 6963944 6334682 6224682 6151036 6399343 5832179 5499754 6195356
6219 6195356 6679930 6407233 6377593 6641053 6430916 6410984 6505969 6479683 6542313 6879860
6209 6879860 6778108 6761571 6785492 6566351 6164645 6339007 6754568 6363028 6540040 6657131
6199 6657131 7350019 7126245 7031323 7247315 7463584 7651447 6656715 7065259 7032641 6901211
6189 6901211 7320637 7554372 7383807 7361202 7498034 7597918 7658638 7989752 8502065 9021094
6179 9021094 8741546 8404261 8594251 8298312 8173620 8319210 9507551 9436368 9423924 9396716
6169 9396716 9726414 9448741 9664233 9839639 9538158 10062357 10323275 10203895 11284391
6160 11284391 10854218 10200233 10812511 11183110 11223444 11223007 10876586 11416710 11823207 12289989
6150 12289989 12595557 12582204 13090237 12734006 12592909 13287559 13050400 13189170 13629759 13477949
6140 13477949 13463177 13682868 14424778 14337121 15166765 15599206 15238351 15847205 16191553 16742723
6130 16742723 17206313 17379154 17560925 17121845 16989117 17630922 18505634 18831879 19137640
6121 19137640 19135205 19051914 18881309 19107940 19540916 19552172 19211140 18601008 19172307 19957580
6111 19957580 19683043 19508900 19758487 19514645 19035760 19051509 19457719 20042096 19582353 19828505
6101 19828505 19824764 19721264 19566433 19528563 19292109 18889588 18913143 18915577 18733075 18624104
6091 18624104 18461176 18248834 18049122 18480538 18528946 18099834 18088033 18218124 17886821 16978872
6081 16978872 16855963 17073820 17061792 16842772 16419431 17125031 17088040 16319793 15254283 15415912
6071 15415912 15249111 14874142 14912182 14568821 14063428 14522292 14099866 13951169 13871229 14611440
6061 14611440 14210039 13069806 13110973 13021630 12733637 12119116 11775513 12130707 11694149 11130630
6051 11130630 11685406 11525914 11338166 10670209 10658656 10480431 10195471 10674276 10376240 10161310
6041 10161310 10063516 9381982 9589127 9533467 9443165 8734437 8312964 8863572 8525561 7800359
6031 7800359 8386496 8403449 7996206 8121407 8017554 8565836 8627623 7700669 7247641 7229914
6021 7229914 8036268 8011204 7553145 7418848 7244822 6606614 6262719 6498868 6485800 5958289
6011 5958289 6849690 7223348 6799772 6663510 6230372 6739437 7566123 7682504 7444411 7187668
6001 7187668 6406349 6830846 6773495 6589432 6571918 6608931 6809942 6885499 6797006 6660921
5991 6660921 6539851 6234755 6634244 7319369 6884410 6689356 6572438 6240196 7358160
5982 7358160 6878287 6884719 7309911 7286894 6935987 6857558 6482168 7000581 6984741 6939090 6953159
5971 6953159 6767988 6796225 6378136 6213865 6287298 6617901 6219408 6015062 6256692 6681306
5961 6681306 6458670 6498482 7251329 7341706 7284710 6836271 7328112 7996423 7586417 7226094
5951 7226094 7947008 7914033 7665792 7504958 7420901 6963035 7750956 7677841 7384332 7346048
5941 7346048 6953792 7258794 7236793 7757080 7657623 7589232 7715013 7827825 7481488 8032301
5931 8032301 8077886 8328963 8659080 8313947 8356173 8348485 9207528 9060174 8678664 8447293
5921 8447293 8735799 8922950 8944344 9392604 9009747 9091980 10124439 10503264 10354160 10518867
5911 10518867 10488944 10207859 10234475 10564191 10468178 10999084 11342807 11980363 12108023 12460364
5901 12460364 13816742 14601169 14763613 15334947 15766464 16098465 15112821 14780204 14726971
5892 14726971 14750518 14499640 14705385 13914480 13746406 14006141 14036463 15020417 15155640 15405862
5882 15405862 15147330 15025682 15684564 16077885 16785202 17208735 17264887 17997979 18258502 19173825
5872 19173825 20383229 21068161 22154321 23084536 25390985 27608929 30022789 30800595 31571461
5863 31571461 32022340 29925627 27801614 26351574 25552789 24322673 23239826 23369164 22835306
5854 22835306 22736377 22861203 22535991 22019765 22869074 23484532 22871197 22651957 23001169 22837628
5844 22837628 22831704 24196543 24723632 25292039 26524901 27517950 28513493 29539254 30943849
5835 30943849 32637410 34425955 37059024 38606725 39618571 39652387 38227938 36781025
5827 36781025 36002789 34945843 34884553 34226149 34618106 34818047 34519978 34873369 35531186
5818 35531186 35651953 36475227 36782546 37127347 38003327 38812516 39653761 40351263 41749997
5809 41749997 43448103 44713191 45876259 48039619 50139696 51793703 53583180 56101252
5801 56101252 58306894 61093624 63075383 65189641 66365922 67451957 68981199 70324671
5793 70324671 71449277 73083532 74697300 75990359 78186370 79939253 81856679 84623426
5785 84623426 87517656 90209892 94256182 96805440 98635721 100492223 101132332 99987517
5777 99987517 98423759 95840025 92407574 88460596 83276880 78677468 74925096 70574383
5769 70574383 66728340 62737082 58218860 54874811 52066791 49715775 46925487 43514663
5761 43514663 40918917 39538890 37839465 35581591 34210275 32653583 31500532 30410866
5753 30410866 29934307 29220049 27726587 26704186 25514795 24885802 24001067 23347734 22866391
5744 22866391 21772608 21365360 21247184 20678551 19738463 19599027 19090904 18188521 17645408
5735 17645408 17657695 17259005 16775484 16106238 15741474 15948916 15133224 14832260 14395261 14013138
5725 14013138 13952084 13626944 12615223 13265218 13060330 11938035 11657273 12294366 12569957
5716 12569957 11913364 10783650 11093774 11666010 11206539 11397852 11320052 11212925 11086315
5707 11086315 11137182 10682672 10175626 9687508 9993451 10369454 10459714 10408278 9818793 9808863
5697 9808863 11052328 10466984 9884597 10011864 9412685 8962263 9003813 9475755 9103586 8986306
5687 8986306 8704427 8799174 9103843 8468366 8699386 9513982 9273680 8727872 8187111 8239065
5677 8239065 8265659 8427885 8242051 7826809 8035847 8434641 8274783 8192412 8656938 8246024
5667 8246024 8507402 9205609 9563729 9848441 8983850 8235629 8219838 8922961 8962546 8751540
5657 8751540 9159468 9611932 8631728 8326573 8586138 8491561 8553385 8625341 8945489 8929867
5647 8929867 8819997 9319482 9120753 8443755 8196984 8583305 8909519 8826858 8669999 8639700
5637 8639700 8654369 9053733 8962111 9275745 9155108 8777198 8244526 8456315 8861198 8651045
5627 8651045 8739057 8542038 8880597 8656739 9149162 9220643 9181728 8400242 8776572 8920975
5617 8920975 8974536 8552300 8177198 8574309 8849336 8882265 9255861 9549072 9289335 9401480
5607 9401480 8858641 9180251 9456885 9805780 9381453 9575166 9843721 9844768 9793631 9898558
5597 9898558 10364825 10013873 10234226 11068466 10486485 10808274 10474136 10549916 10696573 10361494
5587 10361494 10245630 10571107 11054523 10920909 11524443 11507132 11302572 11226256 11022294 10799606
5577 10799606 10741850 10822570 10977817 10786053 11519471 10865314 11296127 11617308 11235720 11453922
5567 11453922 11663838 11775953 12074492 12039194 11784191 11519298 11837547 11858757 12201652 12046049
5557 12046049 12129429 12085269 12600697 13209425 13475910 13446875 13403625 14459169 14501042 14994676
5547 14994676 15112059 15092938 15393386 14658636 14189379 14551835 14336319 14164339 13138062
5538 13138062 12877534 13239273 12775745 12484869 12034206 11593150 11527430 11567183 11175256 10491959
5528 10491959 10036097 9871460 9948674 10204089 9723824 9351228 8950615 9094206 9754529 8737182
5518 8737182 9095267 8933974 8898754 8641615 8468159 8592052 8238125 8451693 8588682 8535451
5508 8535451 8702500 9025824 8531207 8349754 8171527 8142290 7789531 7608362 7607496 7393970
5498 7393970 7586901 7908968 8090046 7941756 7281527 8162810 8034716 7967780 8304598 8136046
5488 8136046 7650368 7968664 7723836 7359394 7922812 8203736 7851674 7033816 7261542 7807572
5478 7807572 8482067 8527933 8763334 8249263 8066013 8143374 8392585 8334265 7823316 8013565
5468 8013565 8144024 7374766 7191837 6761265 7419285 7320245 6580985 6525776 6695183 7462359
5458 7462359 7505510 6911670 6677225 7361398 7058862 7359721 7549559 7376693 7799795 8173495
5448 8173495 7451845 6681509 6854554 7011545 7125259 6930220 6643944 6788759 7458005 7639890
5438 7639890 7795526 7593404 7300304 7523491 7161148 6915465 6433568 6336475 6656018 6923470
5428 6923470 7155815 7404367 6978372 7001279 7328596 6974126 7276081 6650510 5942708 7123643
5418 7123643 7180385 6750921 6739512 6156171 6784339 6111744 6046239 6156615 6167017 5604869
5408 5604869 5287124 5703718 6785554 6564013 5830112 6204556 5796534 5981119 6304025
5399 6304025 5977495 5324229 5588965 5504486 5009030 4975672 5485886 5817944 5174356 4945671
5389 4945671 5460851 5771971 5653126 5399472 5187084 4633633 5145275 5446795 5098075 5311666
5379 5311666 4702261 5262350 5077213 4841156 5287779 5875123 5394420 5357166 5633131 5326690
5369 5326690 5246142 5410033 5141711 4903122 5431666 5703204 6379150 5944040 5830588 5115686
5359 5115686 5008931 5047844 4683269 5067613 5343703 5869992 5358701 4499003 4927907 4603352
5349 4603352 4590007 5049635 4706567 4904253 4805344 5299901 5521844 5880454 6393802 5500880
5339 5500880 5299531 5578590 5425567 4895491 5700309 5904705 5616703 5817040 5581700 4806938
5329 4806938 5321333 5359416 5528514 5575979 5483819 5571581 6124436 5945898 6460232 6149253
5319 6149253 5728135 5713611 5936332 5806506 5518588 5563640 5286342 5308646 5355255 4792188
5309 4792188 5075273 5126405 5498604 5264122 4977126 4411046 4328699 5492882 5414189 5811022
5299 5811022 5170542 5183060 5740728 6178960 5565199 5306667 5171623 5121903 5083863 5253857
5289 5253857 5524283 6166481 6272265 6204176 6068061 5852350 5648311 5530572 5036835 4653126
5279 4653126 5273930 5228246 4811560 5832525 5903221 5860466 6166994 6004952 6071630 5966070
5269 5966070 6306080 6703328 5879342 6118771 6418700 6509048 6588713 6530513 5814757 6037081
5259 6037081 6830634 7132325 6570535 6505289 6832287 6081297 6060763 5885268 5906348 5897553
5249 5897553 6000101 5749721 5892455 6170628 5600139 5430662 5916290 6558992 6779418 5823505
5239 5823505 5689930 6104106 5964693 5865339 6252564 6194204 5752446 5373624 6457938 6500468
5229 6500468 6422544 6461113 6330392 6320184 6579251 6739011 6507939 6707468 6932300 7326128
5219 7326128 6545424 6461425 6442947 6862228 6692983 7211692 7318333 7173242 6758531 6893232
5209 6893232 6919140 6712583 6620025 6605904 6906765 6496687 6651463 6789854 7167907 7543715
5199 7543715 7404195 6832579 6416363 7256523 7378806 6982466 7032204 7212247 7245713 7009621
5189 7009621 7049646 7942325 8013887 7820202 7991353 8069901 8251038 7789398 7753468 7647218
5179 7647218 8144673 8262181 7946297 7943161 8236461 8282471 7899330 7318093 8238448 8345703
5169 8345703 8659824 9303447 8744291 8830986 9114820 9432271 9423344 9082913 8779464 8433407
5159 8433407 8402800 8769092 8814194 9772285 9383532 9154433 9319554 9259259 9880103 9716504
5149 9716504 9537258 9900145 10284598 11047612 10787853 10701386 11148261 10788659 11415946 11029496
5139 11029496 11220357 10987115 11541475 11690704 11242699 11315478 11222158 10676371 11175347 12018310
5129 12018310 12168719 11736561 11869509 12893883 12822368 12532897 12081071 11887645 12311526
5120 12311526 11827823 12073717 12289437 12534965 12996941 12535870 13189171 12409922 12302940
5111 12302940 13261061 13458507 13380970 12807170 12816783 12485116 11904315 11840292 12126369 11627501
5101 11627501 11404245 11294925 11029243 10400637 10535892 10480141 9928635 9767142 9283055 9935339
5091 9935339 10234471 10608713 10231009 9842592 9257884 8613577 8750358 9144243 9399157 9424839
5081 9424839 8682825 8350805 7972849 8506859 8510196 7978516 8273472 8099832 8609427 7967102
5071 7967102 7693294 7697392 7790565 7905165 7848195 8023116 7890036 7249268 7361424 7697387
5061 7697387 7733268 8102317 7702453 7557363 7304078 7619462 8217325 8080188 7959335 7322649
5051 7322649 7479176 8622689 9049275 8942714 8876769 9143415 8966202 9054873 9286584 9168392
5041 9168392 9005626 9174383 9631827 9959785 9878907 9755794 9413897 9057964 9221637 9619389
5031 9619389 9058231 9091704 8712650 9150177 9441222 9296276 8999127 8601015 8657590 8501234
5021 8501234 9296965 9139609 8890321 9365466 9253348 8953491 8692004 9186189 9296226 9094853
5011 9094853 10190783 9719271 9956791 9088489 9423928 10449363 10623451 10463491 11135172
5002 11135172 11931717 11535800 11584498 11053267 11583713 11392870 11543779 11960531 11705468 12462447
4992 12462447 12667054 12135762 12071103 11977278 12190282 12340537 13003644 12936565 12505245 12921478
4982 12921478 13484427 13686244 14056021 14093530 14814838 15120063 15912686 16267136 16638639 16727159
4972 16727159 17807511 18495982 17956888 18789555 19265700 19469112 19560762 20421187 21510970
4963 21510970 22154770 22431423 22161267 22278532 22283201 22624772 23086292 22312450 23163017 23326145
4953 23326145 22521860 22909665 23967417 23948335 24047869 24224448 24254651 24220078 23716472 23994869
4943 23994869 23948450 23919413 23909263 23226559 22750332 22238415 22391281 22221747 21944793 21980859
4933 21980859 22140606 22322809 22220276 22474263 22079634 21492227 22718510 22859442 23137897
4924 23137897 23608085 23666556 24033878 24744791 25041889 25611204 26271683 27255554 27557897 28210515
4914 28210515 28265238 28271545 28511287 28580679 28756773 29230994 29986745 30202294 30195655 29937738
4904 29937738 30045283 29925846 30439895 30638393 30393095 30267187 30205249 30381302 30268199 30107421
4894 30107421 29656883 29677861 29890837 29597439 29943320 29011919 28016618 27653299 27809966 27759868
4884 27759868 27524609 27239972 27028734 26318013 25680831 25576954 25344588 25161969 25854948
4875 25854948 24845892 24740753 24984126 24979395 25164460 24285863 23974093 23910624 24183362 23450242
4865 23450242 23683456 23893366 23078123 23377313 23064274 23109875 23179674 22868537 22349116 22559604
4855 22559604 23063301 22925519 23125198 23682017 23494820 23701122 23898490 23671178 23674770 23608300
4845 23608300 23504331 23876234 23736321 23202516 23243615 23556786 24276612 24888383 25025300 25084575
4835 25084575 25103295 25291478 25169159 24910119 24709715 25064525 25515245 24970526 25433188 26458135
4825 26458135 26890204 26536640 26455157 26824681 27316720 27484441 27605969 27833284 28432393 28672014
4815 28672014 29445463 29438229 30000129 30054071 29846784 30038384 30439239 30911186 30752337 30589728
4805 30589728 31442656 32247606 32346415 32784556 32312559 33103388 34106549 34585910 34978617
4796 34978617 34852995 35167492 36137483 35823047 36675189 37681201 38061544 38506263 39193763
4787 39193763 39896980 40577663 41517623 42499294 43406754 44128117 44664035 45350325 46276026
4778 46276026 46793402 47008214 47739840 49356602 50604124 51673253 52358372 54188296 55671067
4769 55671067 57132797 58591434 59734603 60964086 62220772 63853328 65295540 66023886
4761 66023886 67447920 67993749 68271765 69086753 69761625 69838778 69898296 70377428 70365593 70719340
4751 70719340 70870856 71555318 72198899 73171304 73779743 73876144 75742716 77090190 78273277
4742 78273277 79538484 81064368 83597494 85878143 87572337 89965346 91941514 93065070
4734 93065070 93550913 93244456 93271483 92854043 92531234 91166553 89559850 88886886 86846441
4725 86846441 85158141 84233729 83177364 82812075 82766587 82381236 81701409 82726610 82902664
4716 82902664 82995370 83212664 83622289 84966720 85889616 86966327 88054038 88858209 89755750
4707 89755750 91026456 91163812 90916537 90732678 90869928 90823625 89640891 88984946 88017653
4698 88017653 87273231 86375752 85844798 84763644 83597692 83394882 82326701 81206655 80844944
4689 80844944 80947152 80588547 80003332 79919148 79477317 79332610 79229382 79764235 80466458 80445013
4679 80445013 80062174 80320819 80648352 80713289 80847341 81880792 81928655 82758097 84035999
4670 84035999 84653522 85794937 86566414 88129165 88881350 88809349 89898066 91143297 91648882
4661 91648882 92111967 91375303 91267504 91845623 91524821 91127629 90798760 90396962 90316286 90384469
4651 90384469 90220847 90395505 90420817 90439295 91190334 91629225 92053969 92066472 91552119 91347707
4641 91347707 92175210 92140577 92137510 92596500 93182621 93106702 93200258 93382331 93905216 94819730
4631 94819730 95958922 96608154 97433192 98472081 98519865 99288780 100516892 101284156 102862353
4622 102862353 103906296 104395280 105264398 105781192 106548068 106721475 105484751 105338356 105186294
4613 105186294 104318415 103873442 103963094 103033966 101975218 101258534 99736661 99092197 98607576
4604 98607576 97702530 96961910 97010110 96600233 95971643 94976225 94474336 93902949 93835279 94187965
4594 94187965 93983191 94039283 94117378 93617304 92804330 92875027 93666821 94146032 93710054 93698977
4584 93698977 94093673 94469039 95063612 95240819 95783287 96114804 96606141 97133295 98188468
4575 98188468 99188162 99557263 100706387 101919521 102227514 103022709 102911151 102692131 101872652
4566 101872652 101437482 101135847 99792254 100041538 100261226 99964423 100389392 100660933 101519621
4557 101519621 102136134 103153273 104555360 106206381 107565309 108601092 109739799 110573677
4549 110573677 112945261 114347896 116533947 118584465 120886877 123456739 126806413 130329066
4541 130329066 134350329 138394641 141998426 145387620 147534978 147955839 147725032 147175190
4533 147175190 144928867 144010200 142977081 141622166 140648442 139115760 138361702 137647438 137415907
4524 137415907 137049547 136316284 136034750 135160048 135106478 135314671 134842003 134995439 135538213
4515 135538213 135514377 135680264 136587339 138780809 141166064 143780337 146680418 150374181 154002624
4506 154002624 156920087 158894169 159584917 158074721 156325081 153451211 150006416 147118269
4498 147118269 143679320 140495688 137466180 134976363 132564914 130364507 128131355 125464392
4490 125464392 122771492 120460224 118866194 117647965 116036545 114293844 112777840 111232822
4482 111232822 110515959 110624461 109946893 110188346 110526105 111258688 111806773 112361520 113368993
4473 113368993 112959110 110610731 107778274 105054039 102151724 99589986 96826945 94191134
4465 94191134 92447892 90490173 87943180 86074770 85030741 82942164 81293957 80413854
4457 80413854 78939018 77497775 76093099 75331771 74881961 74383032 73394076 72476069 71664310
4448 71664310 71557854 70936960 69835181 69449875 69224242 68541010 67769555 67069181 66787823
4439 66787823 66572847 66290994 66512783 66640629 66183247 65942902 66048114 66177325 66006310
4430 66006310 65898131 66592596 66938009 66675079 66596756 66411795 67121384 68113291 68706738 68279118
4420 68279118 67879910 68430148 69045262 69325758 68961430 69094989 69587545 70049860 70295902
4411 70295902 70267810 70658096 71457097 71989615 72811424 73727343 74536282 76146349 76986296
4402 76986296 77759002 79420370 79884995 81207843 82662510 84449242 86377025 87470550
4394 87470550 88669684 89241042 90557553 92125858 92668690 93546398 94192288 95289466 95993291
4385 95993291 96775985 96621463 96363768 97132334 97340734 97084252 97369139 97540553 97309670
4376 97309670 97367451 98204527 98818404 98639665 99035769 99503766 99815568 101014862 101275787
4367 101275787 101541664 101381415 101475868 102215212 103181227 102981747 103347163 104061713 103581128
4358 103581128 104148335 105291208 106509198 107139029 107696180 108257887 109151618 109600012 109888329
4349 109888329 110345547 110266377 110222308 111009174 110822797 110591929 110611415 110809868 110913105 111650784
4339 111650784 111916069 112271456 112981301 113900796 113905778 113878063 113989581 114904044 115848575 116479509
4329 116479509 116201587 116500122 118079844 118716174 120064569 121024147 121617033 122259360 123578082
4320 123578082 124993969 125909135 127166110 127994805 128713369 129543162 130110752 131771010 133261657
4311 133261657 134599455 136076029 137584154 139704067 142321572 145778517 149496450 153461593
4303 153461593 156817674 160606899 164261515 168159054 171792318 174819955 178995068 183749241
4295 183749241 189059099 194979729 202301660 211660504 221441295 233167370 247121281 262948070
4287 262948070 278895453 294353604 310097773 321633399 328309706 330360209 326606144
4280 326606144 319263374 309221849 296328358 282783226 270427737 259205749 249002792
4273 249002792 240136792 232668576 225783537 219989013 214684677 209966998 205910224 201779123
4265 201779123 198046710 195138200 192661826 189768104 187507654 185044836 183102460 181775800
4257 181775800 181040395 181462532 182435020 185025308 189347625 194820782 200998988 207617112
4249 207617112 215315021 222831682 229226063 234084835 235609851 234013389 229042626 221198008
4241 221198008 211394759 200064540 188909026 177393903 166460967 156866552 149035287
4234 149035287 141410123 135131695 128730019 123324604 119156928 114215551 110560553 107123380
4226 107123380 103769564 101345863 98852159 97478032 95723271 93803002 91835668 90828525
4218 90828525 90061336 88340887 87702944 87200020 86248899 85469437 85004502 83973421 82796273
4209 82796273 81621470 81591698 80523704 79172709 78123280 76996828 75488661 74173479
4201 74173479 73155083 71435641 70219469 69295964 68643164 68081088 67212029 66057385 65650109
4192 65650109 65418026 64830077 64881735 64465653 63575926 63298136 62867663 62590642 62019802 61535001
4182 61535001 61674926 61503357 61008207 61465794 61339434 60924849 60150344 58886117 58531500
4173 58531500 58394227 57802679 56945190 55394888 54483280 53952964 53207975 53187567 52420713
4164 52420713 52545337 53035156 52909245 52292617 52128780 52470101 52507278 53260102 53028891 52247188
4154 52247188 52179591 51396993 50414397 50171918 49013213 49201822 48436763 47218041 46963200
4145 46963200 46826652 46300180 45836102 46452701 46607054 45888934 45336322 45652987 45835313
4136 45835313 45646598 45650400 45985751 46358377 47276394 47346213 47803173 48026456 48318570 48345634
4126 48345634 48632906 48765807 48820964 48562110 47742037 47629174 47730754 47874681 48182153 47703882
4116 47703882 47708480 47190045 46713294 47224037 47537627 47484483 47698606 47552029 47484969 48279432
4106 48279432 48310590 47694536 48236356 48873469 49038455 48724091 48976662 49094641 49726513 50012256
4096 50012256 50140332 50716388 50547993 50733293 50529901 50369746 50969334 50225408 50064539
4087 50064539 49870174 49749635 49428562 49052021 48550657 48822100 48669773 48382651 48233491
4078 48233491 47887103 47703043 47261332 47586676 47183072 47047185 47241082 47894503 48139745
4069 48139745 47986295 47856826 47437093 47611207 47933510 47430537 47655999 47322560 47362941 47116907
4059 47116907 47123467 47713498 48002920 47987290 48232211 47825546 48116465 48282830 48390443 48064450
4049 48064450 48322649 48474425 47919825 48821370 49181967 49218671 49070176 49196822 49641267 48867417
4039 48867417 49470707 50172742 50450530 50522022 51090315 51093738 51252640 51888115 52445708 52746442
4029 52746442 52424641 51751637 51933086 52305932 52575091 52840211 52596639 52711170 52741195 52278940
4019 52278940 52264843 52675223 52468866 52318751 51847830 51548298 51358553 50912654 50302947 49739820
4009 49739820 49446090 48720410 48636535 47913329 46636365 46684054 46167546 45842315 45693930 44505254
3999 44505254 44788315 44132636 43154117 42478104 42226664 42017575 40827390 40187530 40144084
3990 40144084 39763440 39087320 37680027 36928821 36575997 36276571 36158411 35265752 35229166
3981 35229166 34876144 34662805 34429389 34371793 35174406 35639448 37220506 39609930 41157398
3972 41157398 44659799 48583036 54378785 61071761 67826921 74228522 78951438 78019127
3964 78019127 71331268 61671274 52925747 46325674 41500838 38218276 35434005 33615833
3956 33615833 31541607 29461158 28166331 26195909 25627314 24559907 23664524 22824318 22401389
3947 22401389 21397677 20718110 20158483 19523320 19229345 18271711 17453209 17176931 17375520
3938 17375520 16910796 17203379 17078473 16311525 15791625 15476330 14992545 15163599 15323709
3929 15323709 15150479 14709309 14506397 13923676 13708277 14106795 13758402 13834471 13721968 13652884
3919 13652884 14217846 13909808 13389200 13138596 12942576 12451885 12190523 12188513 11743565 11700021
3909 11700021 11851710 11148527 11534692 11567000 11206608 10547688 10567633 10463889 10430297 10941335
3899 10941335 10478514 10795344 11089745 10683788 10782048 10217272 10150733 10908427 11218818 11147659
3889 11147659 10857234 10144159 10617435 10295235 10450816 10851832 10853563 10758685 10784633 10636681
3879 10636681 9913686 10634530 10399209 10568934 10669203 10999620 9876158 9475154 9884489
3870 9884489 10359726 10445367 10519115 10720256 10682902 10470480 10448116 10279561 10178771 10948274
3860 10948274 10641048 10689720 10641503 10329129 10439713 10768013 10160971 9993295 10820147 10617702
3850 10617702 10850304 11020676 10405058 10565346 10847768 10820007 10393376 10425039 10678920 10752555
3840 10752555 10817087 11408853 11705551 11353952 11062286 11461390 11623958 12607769 12216705 12328837
3830 12328837 12601501 13046648 13576514 13235376 12558742 13084175 13762470 14033795 14293967
3821 14293967 14008173 14659617 14500702 13577465 13940287 14474468 14869902 14784257 15221886 15147127
3811 15147127 16132267 16106610 15716842 16174865 15515648 15553732 16165895 16224622 16125788 16898933
3801 16898933 16301861 16611193 16772652 16685889 17249183 17551310 17486054 17209379 17087595 17791327
3791 17791327 18173023 18543404 18351561 18338285 18588622 18441608 18605161 19613957 19331126
3782 19331126 19310481 19448427 19617561 19948539 20367256 20885349 20876470 20908198 20911151 21012025
3772 21012025 21216956 21531623 21680087 21701566 21873259 22064099 21754714 21427307 21472311 22104601
3762 22104601 22815282 22895870 23133355 23299877 23229131 24013541 24411853 23803388 23582691 24051342
3752 24051342 24074972 23824053 24832690 25182388 25810300 26037562 26001762 25463324 25834675 26051671
3742 26051671 26117439 26540177 26724273 26809830 27439674 27868976 27608218 27244914 27801100 28520835
3732 28520835 29270722 29304757 29099531 29442035 29457489 29726650 29853775 30187717 30287658 30184058
3722 30184058 30163037 31051049 31309592 31307571 31712391 32132842 32054850 32108515 32209226 32481462
3712 32481462 32906860 33471192 33490321 33347736 33876833 34383179 35057817 34618853 34691684 34633786
3702 34633786 34320571 34608159 34610490 35308692 35326534 35298898 34955475 34993083 35025017 35242711
3692 35242711 35836588 36208345 36142353 36129327 35840620 36289484 36317899 36588629 37074151 37054724
3682 37054724 37651666 38012659 38266160 38825265 38594885 38880339 38875992 39554678 40314490 40713674
3672 40713674 40827655 41238450 41856008 42551079 43344737 44275586 44529603 45105700 44973575
3663 44973575 46262406 47667855 48883805 50631265 50882816 51045582 52164029 53081063 54068437
3654 54068437 55119655 56032492 56436122 56857055 57423372 58493511 59397044 59933550 60803836
3645 60803836 60272144 61239300 61824372 62494400 61902295 62443536 62948457 63305225 64018540
3636 64018540 64360991 65193723 65005733 64973839 65388956 64873162 64602893 64938452 64010719 63638733
3626 63638733 64139856 63438085 63344926 62631313 62655022 62360964 62102749 61734287 61176521 60600342
3616 60600342 60088498 60055577 59105640 58083956 56870567 56239198 56397824 55883455 55230898
3607 55230898 54732616 53843396 52335598 51999562 52094768 51696897 50922055 50725055 50238431
3598 50238431 49930670 50296739 49763115 49273701 49510407 48852755 48300044 48270769 47942815 48362711
3588 48362711 48220326 48638766 49325007 49147432 49555522 50078317 49520853 49449781 49800334 49288885
3578 49288885 50023456 50253483 49631924 50494164 50824113 50661456 51243102 51321907 51633023 52241380
3568 52241380 52276622 52581905 52533815 52882724 52611941 52472849 53096006 53518735 54097415 54481703
3558 54481703 54101680 54933927 55402451 55793368 55470632 55469612 55855424 56142550 56637669 56674130
3548 56674130 56708520 56984112 57184512 57480945 56509127 57047868 58532526 58376423 58551857
3539 58551857 58404776 59173109 59409841 58760499 59073586 59210120 59989909 60825399 61343480
3530 61343480 61787150 61498743 61785503 62505915 63126069 63527590 64496664 64995055 65640816
3521 65640816 66895421 67557672 67615451 67998334 69165638 70505043 70766056 71972992 73033227
3512 73033227 73355129 73451266 73501388 74739240 75251477 74666311 75353108 76154807 76457424 76098931
3502 76098931 75442064 75591659 75886680 75939490 75891521 75821752 75780809 75404821 75516528 75656928
3492 75656928 75308524 75358119 75396337 75338177 75428458 75361577 76047116 76175072 76075636 77192047
3482 77192047 77431544 77297237 78068067 79156551 80175441 81101298 81205373 81774213 83323083
3473 83323083 84438107 85375543 86850004 87471553 89045991 90540842 92139060 93684975
3465 93684975 94660462 95650611 97058888 98327774 99179845 100420232 101605206 102429484 102811580
3456 102811580 102371328 102567171 101949683 102016467 102211101 102202991 102302021 102151099 101769733 101223333
3446 101223333 101050887 101058764 101430916 101606151 102237884 102067879 102540277 103638533 104431664
3437 104431664 105918849 106752376 107364183 108991441 110018340 110972815 112887868 114465760
3429 114465760 115443464 116749588 116863439 117689977 118281957 117993181 116687528 115637638 114372500
3420 114372500 112571074 111158804 109046817 106845998 104887373 103147863 101599220 99626428
3412 99626428 98233898 97130279 95411457 93537525 92343755 91987509 91186124 89627192
3404 89627192 89115937 88321941 87965486 87743907 87387717 87235717 86685569 86243948 85890775
3395 85890775 85548671 85157135 84770738 83776912 83091740 82538126 81399898 80284487 78521326
3386 78521326 77107781 76740739 75770968 74643299 73401002 72793600 72506011 72158864 71267067
3377 71267067 70588992 69547486 69328360 68884080 68586256 67757540 67398434 67336898 67521823
3368 67521823 67813327 67801366 68398032 68205817 68024692 68418016 69244942 69703150 69195898 69784652
3358 69784652 70297316 70654858 71362312 71688303 73421305 74508769 74565544 75232626 75908911
3349 75908911 76239363 77358324 78743348 80107108 81411501 82390027 82859713 84299537 85115652
3340 85115652 86462775 87948305 89246639 90122744 91548418 92590276 93735380 94595709
3332 94595709 96197387 97608891 98785567 100025480 101676129 102871761 103839779 105939585
3324 105939585 107466967 109334133 111180270 112517495 113577033 115393938 116950512 118850639
3316 118850639 120581783 121841936 123459848 126374017 128667182 130216437 131924955 134160701
3308 134160701 136312080 137740209 138795659 140358916 142203556 143372963 144440947 146133190
3300 146133190 147927580 149443895 150688027 152348465 153799593 155187650 156293304 157764960
3292 157764960 159369912 160855447 161866008 163770551 166024710 168105986 170294827 172937883
3284 172937883 175199470 177000214 177998410 176458217 175121168 173318548 172912844 173596168
3276 173596168 173226692 173808381 175003431 175169336 176054114 177496127 178830585 181017069 182464150
3267 182464150 183251976 184255027 186145626 188264508 190805972 193165079 196081449 198174113
3259 198174113 201013622 203549275 206843794 209935827 213384255 218106968 223471803 228528889
3251 228528889 232879396 235613012 234375425 231441350 228660396 226336006 225328057 224756615
3243 224756615 223545241 223076191 223173857 223714760 223594588 223777786 224080548 225366803 226193738
3234 226193738 227928406 230402060 233036019 235870036 238234351 240850871 243860849 246173531
3226 246173531 248799178 251514208 253605501 255443081 258084925 259832198 261224196 262201851
3218 262201851 262230772 261001544 257668605 253930816 250326219 246638218 243415891 240473057
3210 240473057 238136513 235119910 232000938 228391635 224584079 221084521 217558756 214677207
3202 214677207 211678220 208875198 206862126 204615219 203062393 201884020 201086518 201671857
3194 201671857 202445550 202638266 202992531 202835502 200355573 196478957 191588930 186015699 180944585
3185 180944585 176588645 172891802 169204818 166419674 164131711 162595647 160621702 159526857
3177 159526857 159418896 159240792 158907548 159451433 161372345 163413436 165357055 167543173 171974181
3168 171974181 176425665 180177971 184443464 189696521 194673260 200314503 206958330 214072674
3160 214072674 220148201 224637754 226002646 223006430 215312431 205747829 197034604 189408754
3152 189408754 181984485 176423038 171606971 166403151 162386489 160058275 156635362 153780505
3144 153780505 150645972 148959211 147350011 146583146 145710528 144911614 145286374 145584841 146642842
3135 146642842 147526482 149185739 151121115 152543728 154292019 156603436 158632826 160117993
3127 160117993 161150391 161960227 161236110 159726313 156017746 151654076 146903134 143221866
3119 143221866 140381326 137043866 133888831 131040245 128296054 125532271 123197004 121581284
3111 121581284 119164904 117797723 116422496 114586584 112489658 111370472 110726809 108897790
3103 108897790 106897468 106323216 105489459 105453972 104777862 103464217 102881374 102326593 101162986
3094 101162986 100294358 100699446 100071143 100244899 99662419 98617302 98146910 97478968 96959926
3085 96959926 96908185 96139288 96390428 96417511 96542048 96502745 95660996 96414098 96878699 96906188
3075 96906188 97205086 96933081 97485593 98151937 98234753 99193498 99998098 100434421 101265908 101610806
3065 101610806 101780908 101899570 101957248 101421348 100393912 99290930 98917166 98174308 97067387
3056 97067387 96222565 94754139 94045728 93102639 92209961 90443163 89350048 88688731 87851913
3047 87851913 87409797 87086587 86714387 86265042 85870578 85810989 85855215 86074458 85923640 85964741
3037 85964741 86422638 86320631 86078115 85535726 85652200 84969709 84128543 82985709 81628819
3028 81628819 79908119 78854608 78313865 77550576 75851942 74061813 72998472 71335623
3020 71335623 70142118 69170497 68038105 67049654 66131630 64985022 64111758 62958462 62212173
3011 62212173 61715121 61500357 61459216 60751703 60414894 60156650 60120871 60607984 60069230 60365116
3001 60365116 60535424 59911412 59822052 59994938 60219349 59939549 60327735 60614732 60936749 60900858
2991 60900858 60829234 60741053 61015422 62092371 62210690 62469851 63166085 63244933 63814475 64344517
2981 64344517 64678707 65112252 65529089 65267103 65666095 65943530 65946597 66386905 66328518 67503316
2971 67503316 67652623 67470320 67402034 67678727 68136239 68635191 69308783 69574550 70244398 70928451
2961 70928451 71909380 73076403 74194749 74985450 76028318 77248721 78258259 79486746
2953 79486746 80664448 81960779 82447629 83184263 84142706 85136561 85955888 86709015 88385177
2944 88385177 89351142 90936774 92559972 94025079 95323938 97644013 99782733 101676195
2936 101676195 104014612 106487574 109021709 111074695 114183193 117334461 120561282 123993936
2928 123993936 127484864 131490662 135625476 140573526 145366306 150408005 156396422 162382337
2920 162382337 169264947 175031796 180536008 186229792 191884707 197282803 201679483 206105453
2912 206105453 210423923 214577805 218637831 221944134 224101195 226460489 228548793 231217228
2904 231217228 234005516 237395024 241651034 245508740 250671676 257058706 262739425 268859151
2896 268859151 274363443 278172772 281576911 284940570 287555126 289354028 291061976 292652806
2888 292652806 295351203 297830276 301075757 304337531 306376129 308881093 310031026 311031574
2880 311031574 312673226 313484953 313538328 314305680 315802439 316199983 317657709 319263839 320392006
2871 320392006 322159859 323351952 324070298 325281394 325918584 325867950 326624130 326388558 324511491
2862 324511491 322541548 320714514 317731196 313472500 309116675 304861157 299696918 294208940
2854 294208940 288998495 282850961 276124235 269151668 262230538 254324712 246918501 239460225
2846 239460225 232932035 226951250 221251204 215865134 211064189 206653272 203094530 199698841
2838 199698841 196400290 194351225 192133575 190293682 188989269 188298340 188515114 189008906
2830 189008906 189456255 191285418 192931130 195855116 199918172 204945056 210626125 215622287
2822 215622287 222102420 230036232 238968966 248170500 257846255 268000776 277331889 285961778
2814 285961778 292378850 296033509 297974961 296425502 292564896 285567399 276394353 265661552
2806 265661552 252834303 240024828 225908331 213402427 201740499 190087597 179989960
2799 179989960 170183061 161290117 153385231 146546345 140449745 134504092 129021786 124403092
2791 124403092 120540497 116963662 113368644 110189496 107256185 104522898 101828003 99310926
2783 99310926 96529269 93174517 91134344 88041139 85606774 83309564 80744359 77457123
2775 77457123 74955747 73000368 70657271 68264816 66539264 64634135 62775638 61537707
2767 61537707 60036812 58149327 57182268 55546425 54136796 52961956 51898640 50922637
2759 50922637 49230033 48279970 48032284 46888295 45322784 44629568 44119222 43776166 42819225
2750 42819225 41680695 41442023 41656685 40527421 39502883 38864564 38137359 37864963 36828441
2741 36828441 36573129 36558154 35717834 34703657 34670359 34943699 33367479 32892541 32988665 32898059
2731 32898059 32356105 32472221 30927487 30008225 29788995 29348032 28738734 28545616 28168976
2722 28168976 28187822 28294949 27612395 27433244 26434176 25304645 25738798 25327466 25033425
2713 25033425 25040085 24833993 23696122 23222832 22750816 22352519 22873642 22906823 22638906 22639962
2703 22639962 22712344 22355428 22310093 22064383 21500675 21195489 21187996 21024257 20959782 21083268
2693 21083268 21254623 21203093 20709929 20241867 19534092 18968306 18739439 18720550 18335564 18421897
2683 18421897 19102637 18676476 17794720 16666677 16700081 17110956 17083290 17082649 17401244 17295739
2673 17295739 16802521 16423869 16619436 16859097 16725012 16223411 16529166 16651303 17317709
2664 17317709 16651941 15675622 15718450 15202919 15086416 15201466 14865550 15312091 14828367 14604579
2654 14604579 14098387 13695827 14046500 14132479 14237427 13893587 13284109 13741209 13833334 13230018
2644 13230018 13106264 12271066 12106861 12690053 12782601 12400396 12756489 12336045 12763466 12802227
2634 12802227 13105816 13182872 12474199 12988827 12618616 12286022 12723980 12828079 12196513 11583483
2624 11583483 11986139 11978131 11816782 12170141 11971788 11433028 10850461 11094366 11338373 10926874
2614 10926874 10756498 10595795 11285048 10875235 11180305 11209580 10400816 10381917 10894549 11109341
2604 11109341 10942444 10491267 10535492 10995294 10882140 10435773 10147462 10411550 10413047 9885723
2594 9885723 10096792 10523924 10565214 10404247 10753929 10424782 9571631 10365145 9819992 9735938
2584 9735938 9983047 9956539 9277849 9783192 9928277 9285326 9200891 9438160 9316975 8721705
2574 8721705 8364959 8426610 8430550 9117293 8973269 8717456 8548574 8649306 8435824 8727605
2564 8727605 9005948 8796691 8858448 8655004 9085683 8298636 8345914 8032597 8196145 8866373
2554 8866373 8458739 8265593 7791473 8048371 8436460 9082957 8486660 7530620 8023330 7718594
2544 7718594 7027818 6490445 7502652 7587483 7642593 7714367 7098941 6778424 6784978 6797366
2534 6797366 7268591 7602014 7495464 7725849 7412195 7240759 7675733 7592347 7540487 7601622
2524 7601622 7486215 7314124 7355564 7670775 7073491 6563190 6627369 6914934 7107169 7072005
2514 7072005 6475517 6413153 6617333 6531813 6231363 6306611 5818843 6105047 6044021 5844046
2504 5844046 6098180 5905965 5830608 5989739 6288458 6315334 6249138 6008302 6046382 6073719
2494 6073719 5837089 5556072 6177394 5510953 5144525 5366379 4844026 5241578 5641477 5297214
2484 5297214 5159371 4920921 5112183 5904869 5896027 5111550 4569460 4809522 5517784 5045765
2474 5045765 5070043 5381052 5455844 4614905 5143363 5626464 5142502 4519529 4224702 4404689
2464 4404689 4913227 4560453 4292115 4384308 4661210 4022665 3934185 3865939 3811438 4372774
2454 4372774 4029857 4672061 4628581 4392052 4323647 4118899 3996703 4109730 3983088 4282351
2444 4282351 4077178 4483586 4698968 4573510 4314352 4271160 4646010 4260521 4045058 3954892
2434 3954892 4472450 4341199 3386363 3721077 3921348 3432280 3838406 3131571 3436407 4271607
2424 4271607 4315344 3181192 3474982 3169840 2971301 3748272 3435138 3610605 3735330 3805446
2414 3805446 3958838 4476434 4603665 4766715 3871590 3723312 3789128 3322910 3286950 3524064
2404 3524064 3483052 3616275 3458125 3463459 3450916 3803137 3591530 3876654 3832389 3272457
2394 3272457 2819053 2482558 2681227 3027886 3048479 3358145 3492528 3771948 3612800 3946505
2384 3946505 3993262 3856761 3466057 3495938 3187062 3530868 3953853 4299487 3834698 3895010
2374 3895010 4301141 4066743 3719033 3312954 3884359 3872370 3789561 4187101 3934304 3379856
2364 3379856 3662103 4039477 3498492 3245193 2669679 2433449 3058249 2821148 2846036 3595833
2354 3595833 3010566 2569663 3348145 3235493 3026137 2748357 3103256 3232900 3151174 3271620
2344 3271620 2741597 2864338 3340248 3539230 3599582 3865217 3546049 3107071 3510440 3855864
2334 3855864 4191138 3655864 3671613 3403026 2744268 2615405 2928749 2743972 2370254 2382511
2324 2382511 2663602 2097152 2592501 3080585 3101708 3105461 2987200 2889360 3294168 2531946
2314 2531946 2332158 2898262 3034984 2644938 2386237 1925569 2688982 3334531 3498475 3329967
2304 3329967 3225739 3341607 2961082 3196148 3200281 3133401 3182672 3047674 2493434 2757146
2294 2757146 3307231 3122212 2613425 2630435 3214511 2913317 3011483 2432580 2478658 2856460
2284 2856460 2661071 2578849 2769463 2916530 3031787 2977858 2797544 2263526 2351111 2514556
2274 2514556 2558655 2823527 2612154 2640768 2743599 2890494 2349945 2519846 2653575 3303238
2264 3303238 3273811 2552604 2676313 2256044 2681845 3241549 3118005 3256954 3397540 3027856
2254 3027856 2492324 3054754 2804800 2886340 2375920 1849410 2486828 2728865 3286652 3008687
2244 3008687 2300349 2556265 3181072 4034972 3372100 3290874 3364645 2861895 2193998 2395208
2234 2395208 2767223 3022997 3069474 2914196 2444405 2785516 2854886 3024331 3039485 3055032
2224 3055032 3311008 3364723 3943088 3486729 3366335 3552947 3509270 3415430 2586512 2265257
2214 2265257 2550644 2826147 3923728 4221508 4057050 4083796 3402317 3083656 3515813 3111956
2204 3111956 3418148 3208448 3240875 3752006 3475850 3694193 3759819 3739480 4075163 4039630
2194 4039630 4634754 5041698 5152953 5193045 5150608 4777455 4891629 5237348 5396852 5268816
2184 5268816 5312583 5585354 5173281 5871887 5797062 5975158 6378996 6652693 6277221 6442309
2174 6442309 6571437 6505727 6849602 7144412 7271481 7730877 7436061 7319336 8249866 8012832
2164 8012832 7677140 7713362 7919530 8678858 8798311 9028876 8368126 8411680 8914737 9609339
2154 9609339 9741324 10472291 10640147 10239691 10316107 11045900 11405098 11386860 12126921 12680578
2144 12680578 12632451 12745845 13355576 14104341 14422224 14873979 15868623 16122356 16461419 16759685
2134 16759685 17922279 18937489 20127099 21117833 22417391 23115480 25142810 26787745
2126 26787745 27575564 29332369 32065889 34192788 35591954 36918808 38984622 41555334
2118 41555334 45571603 50802918 57341205 65722370 77073833 90878975 107789596 128555894
2110 128555894 152003895 174085700 193282333 195794290 172062903 139291519 113543907
2103 113543907 94326179 80141912 69940608 62370796 56227888 50794775 46599080 42809970
2095 42809970 40073308 37616871 35307428 33255097 30391999 27768619 25162866 23565777
2087 23565777 22491446 20922128 19905400 19549676 18523526 18059603 17518522 16367516 16089810
2078 16089810 15252358 15099514 14692675 14428625 13477762 12247694 11564406 11826448 11847021
2069 11847021 11425970 11053013 10514993 9910716 9811027 9677366 9198218 8922923 8665819 8586858
2059 8586858 8593101 8477472 8212117 7486818 6957746 7009095 7441979 7294952 6604944 6906081
2049 6906081 6740114 6995734 7319279 6564545 5761695 5714346 5884592 5748905 6096095 5805439
2039 5805439 6021235 4734643 4564199 4797748 5114255 4673804 4167823 4507313 4311715
2030 4311715 4417205 5054085 5049361 4822335 4817498 4872685 3951716 3792281 4218466 3914718
2020 3914718 3802283 3628582 3778499 3717404 3841682 4398343 4291816 3227292 2998161 2731494
2010 2731494 3027380 3599209 3575352 3515129 3807960 3678457 3531464 2811409 3208904 2822102
2000 2822102 2713340 2700880 3161066 3394389 2624297 2267438 2023689 2228811 2632629 3026857
1990 3026857 2783027 3190502 3214555 3127438 3258309 3102741 2951371 2837679 2713848 2633060
1980 2633060 2810161 2334344 2167292 2366344 2527852 2347017 2275075 2255161 2611292 2767301
1970 2767301 2922755 3038130 2118984 2827970 2955350 2097339 2186474 2666613 2444572 2622508
1960 2622508 2296326 1959097 2062765 1758604 1809374 1782184 1986987 2640941 2387877 2526294
1950 2526294 1747603 1906919 2269975 1742121 2298842 2122822 1879037 2301051 1678071 1399875
1940 1399875 1103060 1350149 1822690 2076308 1663503 1469189 2140979 1843783 1733203 1712385
1930 1712385 2266371 1810002 2024574 2209984 2389738 2239552 2738208 2080005 1033284
1921 1033284 1615831 1960870 1791871 2074705 1788722 1704731 1972193 1180795 1198499 1374282
1911 1374282 1599035 933515 1375929 1970739 1745118 2209703 1881136 1360419 1405181 1357326
1901 1357326 1354271 1592602 1382370 1316747 1746111 1564582 1366154 1634368 1521310 1385662
1891 1385662 1264066 1261910 1043832 1117162 1942610 1398359 1464386 1357659 1229507 1717907
1881 1717907 1955611 1799149 1463849 1351413 1787057 1133514 1420291 1479697 463152 799138
1871 799138 1220450 1588216 1182547 876281 1101766 1214748 1307439 1469829 1282929 1081133
1861 1081133 1021373 1472969 1550077 2158434 1745739 1757780 1738556 1359579 1402937 1655792
1851 1655792 2153960 1687490 1146281 1522338 1819532 1927069 2156151 2241011 2394960 2434112
1841 2434112 2420243 3415346 3170661 2571117 2199156 2340961 1898197 1962715 1905266 1599558
1831 1599558 1216471 952705 1066405 892272 855451 785963 871096 1224492 1746821 702453
1821 702453 384864 522151 1001135 1204179 949461 532188 442902 631457 1223555 1302791
1811 1302791 1730393 1257326 821354 1358320 1588457 1532098 743297 1055007 1487892 647616
1801 647616 1238850 1565544 1379011 1768569 1976681 1330444 1511643 982135 907114 1358467
1791 1358467 890376 1039610 717279 970802 738511 699510 858619 535030 696604 1253081
1781 1253081 1051758 283868 151695 887925 1188654 1392552 674912 1180883 927565 363194
1771 363194 539399 358824 390657 1109654 1135266 1021733 755334 1389933 2151538 1568677
1761 1568677 1226526 922666 1459951 783588 356143 751444 1582767 1053233 1337865 842106
1751 842106 632269 597193 787018 1297850 1108755 878897 805839 548606 631630 424638
1741 424638 533789 891351 625150 688858 293660 710178 412403 308693 812439 1518833
1731 1518833 2024378 1552133 1226472 679348 -191636 102269 538121 740609 269869 713231
1721 713231 1312524 898961 938949 1152561 1660440 490593 -134603 183284 1056845 1144123
1711 1144123 563553 736143 672322 889633 518698 621018 681524 989670 980703 899464
1701 899464 918134 197016 -102979 119858 509921 599891 999729 614253 408737 581283
1691 581283 870061 861494 905941 565430 1148713 1011805 354823 -138107 -120263 561156
1681 561156 15014 207495 347030 621386 183139 340796 138561 447192 696954 -45882
1671 -45882 20590 320994 474366 613220 720011 606149 697629 791899 185434 -78211
1661 -78211 275709 -186769 83979 -289444 -439580 303853 810378 683887 192824 393198
1651 393198 309818 370506 368471 261185 199168 625964 356535 104164 -496018 410615 622332
1640 622332 401053 259695 152460 402708 1077689 1232186 748054 538842 731336 676655
1630 676655 408333 608526 371216 -132492 -294912 -93750 397849 404071 67927 334445
1620 334445 1151207 748319 98869 312764 460286 355907 -41205 113029 37137 747317
1610 747317 1037166 538055 -30714 417570 374728 193073 508517 807606 1281661 1060913
1600 1060913 743295 752779 687571 507279 61072 178762 194120 -171877 379742 654265
1590 654265 639110 389029 209299 566371 984661 1347086 1277008 480721 206258 711289
1580 711289 626871 -228497 628020 902423 879526 1019002 710007 615691 995403 700050
1570 700050 335918 708729 447699 32722 -235608 -191274 -83544 301676 45830 45599
1560 45599 78943 1035734 510875 322985 176309 8280 305017 919764 776518 560505
1550 560505 996220 993415 740132 385603 17604 -159821 606875 1011007 549211 -40699
1540 -40699 73489 -76638 -784333 -252445 -67969 407146 511808 339132 -249790 -478140
1530 -478140 -335540 265401 785698 1016043 1224196 566516 -279562 119358 267520 301247
1520 301247 955772 64221 -185411 -196161 -255749 48827 51238 121392 131644 -36102 -458968
1509 -458968 176223 527759 542670 465573 741504 175843 -58184 252401 270475 327424
1499 327424 157341 484784 66845 370517 661252 495265 223997 -282340 -503453 -622640
1489 -622640 -420833 259776 338553 458072 475623 374719 211983 -122291 103059 510595
1479 510595 535326 633829 398526 43893 451133 1159966 357252 418121 873600 966689
1469 966689 531186 755235 401398 -240986 -242513 654665 253991 143249 504167 523194
1459 523194 -124710 -48067 -371008 76233 440773 330967 874648 1140157 411246 -33235
1449 -33235 156269 35345 525860 653853 134474 372493 800763 490042 -146769 -190443
1439 -190443 10705 572743 460380 226315 40524 -101850 -448215 -328489 255078 -248089
1429 -248089 -472193 -576928 -287495 408978 270247 -284162 87179 424817 312436 393153
1419 393153 202912 -301399 353739 439853 443525 599434 1048943 929578 1024732 105977
1409 105977 -314202 127509 438715 334902 299600 467983 -34166 -214827 609944 -304884
1399 -304884 347627 310139 954365 965429 -220898 -196255 -117676 -309056 -8058 410519
1389 410519 683919 265636 -457094 152055 -8857 351014 516508 104627 102026 239645
1379 239645 521051 731811 626727 741176 925122 554101 -172257 66140 -807837 -449009
1369 -449009 -289674 -829022 -300255 -189298 400986 591309 699345 218985 -130618 -170358
1359 -170358 -269889 -278921 424648 541147 220500 235436 484387 106476 -335650 -342751 -193874
1348 -193874 431398 863540 530283 -60969 198255 195575 718077 1080896 165875 275431
1338 275431 440491 696257 670834 614879 102503 173073 862336 1267414 1123624 853732
1328 853732 742124 382686 213856 298192 764838 1141598 442607 -366702 -56906 70561
1318 70561 375262 404671 -29916 -190120 -76407 -757232 -96774 591598 479632 293808
1308 293808 1076587 768223 140095 -242343 -406826 -447549 -31199 224093 34539 -61317
1298 -61317 -517666 -642457 144553 322334 260297 202896 -285489 747381 361783 59980
1288 59980 159747 -769680 -255565 -287561 245706 40596 336083 -232326 -80620 -121826
1278 -121826 -410826 -297479 -370877 -327910 -333617 -251219 -33914 318391 220492 726476 124469
1267 124469 -399306 -4327 807797 858464 160583 -257509 -149368 328015 -286072 -343904
1257 -343904 63361 -320760 -55199 -389384 -778714 -527652 295147 528912 391399 374385
1247 374385 378266 279645 100489 347986 242678 16194 184894 153605 517377 966214
1237 966214 745407 670873 1461205 741295 210184 676354 322256 336732 -184384 -614050
1227 -614050 84839 -48737 -460018 32479 -262358 -585480 62687 120424 82540 -104183
1217 -104183 22321 -229987 -429655 -1011953 -585593 -386717 -253824 14717 271236 -181731
1207 -181731 -709938 -501880 403134 460457 128312 192938 364781 486334 210771 213925
1197 213925 712705 590747 283836 -11818 -104643 46745 26204 -523067 -563562 42858
1187 42858 95590 -45209 -402076 -678291 -562156 -858811 -1219100 -482632 -151774 325392
1177 325392 -271430 6969 232496 -236736 179216 667021 789189 723654 774195 95770
1167 95770 1038728 1184687 389066 -9086 -235979 -245961 186868 589934 403018 85994
1157 85994 -222378 212401 -22525 -277440 -729090 173786 716538 497200 91963 441601
1147 441601 169730 -427671 236405 700623 52047 -217374 -531003 -47822 257399 19754
1137 19754 136244 16549 -433090 -378183 -501203 -485927 388285 59364 -246418 -113650
1127 -113650 114696 190425 -222671 -147799 16802 170522 210886 -201836 -253157 -327929 -200189
1116 -200189 -397493 -436142 190373 126445 -38650 307546 617564 509397 -347457 -466426
1106 -466426 -342112 154986 194937 199256 -112023 -307490 -541471 -523219 -1263157 -1269963 -800083
1095 -800083 -538569 -430063 -92336 235110 155311 -143521 -329557 -367551 -401859 41505
1085 41505 -324531 136854 -250188 434410 416471 95119 -283455 -391593 -1065686 -106814
1075 -106814 442413 -5591 152224 -22586 -308132 -297731 131540 286180 534508 294307
1065 294307 -147217 -462838 -280289 74101 158322 424369 531680 872245 889280 134157
1055 134157 -41435 39687 390861 -188533 148955 -331421 -836787 -389728 -293190 -247840
1045 -247840 -198457 177699 457561 234761 -98641 -274143 -614887 -120038 -75906 285400
1035 285400 30839 41531 -348627 -898453 -725036 -680428 -400851 -357552 169695 -465651
1025 -465651 -380718 572822 759014 79052 23190 -114673 -504741 -390101 -591505 -224127
1015 -224127 -238371 36436 990 189673 365212 -80239 239691 -153119 357989 108295
1005 108295 110473 151736 645867 -59753 -122017 183386 76895 -34128 359117 -289585
995 -289585 -684737 -645033 325873 558795 -467017 -58209 188468 114176 272005 314996
985 314996 388066 737425 121405 561174 308205 -82942 -184397 -248661 -290504 -392508
975 -392508 -312161 -22581 78368 418996 -297361 -162855 -218787 -358463 -683579 -557970
965 -557970 578138 794020 -7674 -44702 489818 705794 599810 646694 -298830 -847513
955 -847513 -571438 -16809 648804 -289586 -473580 -380585 -660462 -353097 33407 -3035
945 -3035 -252742 -575095 319391 127260 111824 295082 55418 -424229 186884 -221936
935 -221936 -269969 13881 -539536 -911075 -363655 -172957 -328680 -461639 -1025279 -782967
925 -782967 -55294 48837 -591846 -290842 -58629 425262 204223 641040 448686 -19148
915 -19148 -522527 -136303 462757 264649 -242767 -49765 240680 -488802 -457804 -198486
905 -198486 -139232 -222050 -241799 401681 679804 691903 565116 449401 505734 18140 -573841
894 -573841 -69466 27298 -559231 -497031 -150500 -322120 -552028 -38876 120803 226963
884 226963 174227 -319982 159940 -188886 -769453 -188595 -105615 18005 347521 391163
874 391163 138738 -429384 -381255 -161980 247565 -464745 -672668 -680592 -568053 104505
864 104505 133711 -283008 -405685 -12908 -622258 -579912 -518438 -1007585 122365 556985
854 556985 250805 259296 146167 120922 817416 168771 -205232 -435862 -553818 -449208
844 -449208 -188551 -203435 -439105 -550929 -1077772 -988858 -723010 -226416 -494854 -569309
834 -569309 -483460 189261 376415 -312460 150384 451981 346916 -206618 -464457 352450
824 352450 410554 73917 -228758 -69059 -119187 -509273 -415917 -111274 -271102 -289926 -476042
813 -476042 -596936 -438332 202063 -355891 -518310 -37046 1498 -325772 -280610 128481
803 128481 -273371 -160704 -158453 -643416 -446558 -192190 138653 196835 574643 326341
793 326341 -10266 -168411 229601 704602 603205 -58710 -315055 -760697 -987101 -1297215
783 -1297215 -1103745 -1127937 -588253 211133 50526 301258 401970 -163735 -322768 -478618
773 -478618 -10742 -132433 -62503 -166057 287073 218814 72572 -492351 -610779 -387406
763 -387406 -848478 -76340 -254335 -390897 -391459 -12417 35779 260497 -10824 -213016 -255154
752 -255154 -450441 -123655 -221760 -956837 -977158 -322147 108220 29059 -71823 -272597
742 -272597 -725416 -627889 -273766 244680 549943 -533806 -1010176 -158509 48961 -11509
732 -11509 235960 -305467 108079 223494 -95833 -275592 -186038 11337 -286953 -95274
722 -95274 125899 -756451 2253 -91462 -56852 -327511 -432784 -591502 200123 617829
712 617829 544493 6339 66786 380081 -242751 -230409 166169 638468 -475396 -185674
702 -185674 -708448 -728589 -764133 -1455189 -911061 -167333 -304200 -189539 -252297 -538599
692 -538599 -319130 441678 -368079 -461996 314918 117107 372398 -98810 82581 -248136
682 -248136 -461279 -697434 8635 169885 -216844 -662700 -735605 -84734 358249 562970
672 562970 481698 -58930 -137509 174610 -576318 -551499 -67245 -94021 36286 327398 -202124
661 -202124 -473162 -79710 -316449 -70717 -324120 -322087 1005972 515763 203830 -133827
651 -133827 -130298 194784 52881 206028 -338783 80852 256347 160148 205252 -28811 70353
640 70353 -479548 -293651 -125629 -82099 296912 194074 26387 41961 162217 -356654
630 -356654 619393 438189 225263 162729 -31237 112622 165486 211844 -12831 144835
620 144835 38392 -293676 -93025 -338739 -474213 -515662 -881357 -440165 -623734 -206408
610 -206408 -443784 -201788 -545003 -808608 -382276 -545168 -734487 -583551 -152499 196882
600 196882 -52011 -265980 -330211 -4815 -505359 -13565 382252 323479 405275 142973
590 142973 -491825 -274148 -138266 -173726 -486656 -179142 324358 580194 816986 152098
580 152098 186278 -111600 -212163 -352476 -159816 -308910 -227390 -746679 -734450 -62285
570 -62285 -273437 -547777 -865497 -1150586 -1161935 -744066 -408097 -574040 -106109 -214367
560 -214367 -594232 187906 286997 -133868 -44194 157734 29126 -556528 -367864 75030
550 75030 -525899 208448 24252 203894 -250331 10773 766642 764732 -150792 -429389
540 -429389 -280912 -389957 -497165 -303546 -47205 240416 679831 -6274 -991882 -907313
530 -907313 -244663 -297209 198608 319402 -93404 -287804 22356 -90664 -347955 -357888
520 -357888 -350932 -483517 -488519 -352859 -437511 -169696 360707 244997 -310835 -503450 -107110
509 -107110 -141895 -385639 21229 -154013 -501837 -403910 -710782 -537007 -277578 -137091
499 -137091 -60458 113765 -107636 155352 391568 41213 15789 206384 -163354 -457351
489 -457351 -920458 -226921 13764 491097 550754 -8924 -37725 -274387 -138516 -214226
479 -214226 -704866 -438590 31665 -69458 -439344 -725741 -641306 -355672 -750629 -112382
469 -112382 415205 237073 -108966 -153105 -508874 200555 482734 711587 834767 934458
459 934458 401415 321227 1133 -245542 -281742 -639433 -517064 -68746 -202796 -40155
449 -40155 -324031 -388018 -353367 293376 478567 495484 672643 -319470 -642804 -604318 -155166
438 -155166 -57979 -11562 583511 1010410 487156 440799 79142 -43439 453627 -125070
428 -125070 -314269 -293070 -48599 427188 -448208 -47928 -620017 -309823 -413686 -680430
418 -680430 -16348 295300 398709 -355055 -694645 -112683 -423741 347565 434802 153891
408 153891 -34799 553951 -61142 -592208 -111706 -249620 -243729 39347 -200328 -478511
398 -478511 -320915 -423253 -896262 -509597 -119322 -133721 -1005848 -434462 199474 -225295
388 -225295 -253141 -50469 543587 919375 -53788 159679 -137448 -516783 -311048 -164335
378 -164335 311635 1018567 225762 -462955 -863362 -1068757 -488525 -1300435 -1074714 -748747
368 -748747 -66365 -264159 -1008904 -1050332 -309682 -296685 -435587 -37910 12330 -193749
358 -193749 -379331 -394030 -359261 270569 691980 795657 641870 197359 353061 225925
348 225925 -304982 -187779 425600 -195024 -127192 -178795 -376892 -441807 -707340 -894767
338 -894767 -467320 -119788 -270248 -837317 -1205738 -941907 -874726 -508466 -148549 186894
328 186894 -102734 62831 -2735 -431512 -24673 322219 353532 -141713 -209132 -235570 -165454
317 -165454 -266901 -140240 -474944 -92532 164589 -88552 135411 118406 84108 -504339
307 -504339 -492682 -653039 -368083 -337323 -178494 156956 -510763 -620223 -808652 -1085622
297 -1085622 -1395517 -1132053 -936274 -994603 -621845 -239747 -21866 382466 771326 763696
287 763696 373466 -91510 -218062 533272 299919 -35678 -238311 -308208 -374431 -114549
277 -114549 -757 223953 423167 385423 -115683 -321470 -555518 -302680 52544 -230341
267 -230341 -89952 -51973 263133 393253 292564 194555 -604780 -1091664 -437994 -111606
257 -111606 -153541 110972 287105 -419318 -537434 -293810 98928 201175 135210 829097
247 829097 290281 337225 190011 -339795 -399039 -779894 -879987 -828545 -797999 -212790 -507507
236 -507507 -633920 163686 -16317 -344276 12640 -123973 -448971 99783 161536 -17286
226 -17286 25740 -329055 -348466 -307491 -335080 258150 -56750 65326 394616 532010 88596
215 88596 112152 142620 755295 258546 -56649 -86028 -82642 38395 -309785 -995689 -1262713
204 -1262713 -872595 -462650 -310737 -43114 102331 214662 -294833 -182487 168225 242190
194 242190 399684 -6419 24645 -262059 -459699 -907912 -760212 -499806 -277867 -67075
184 -67075 -260844 -573824 -380685 -912666 -696824 -176277 -121819 -129790 -644732 -289281 706908
173 706908 343051 -569772 -515097 -519694 -364322 -61247 364082 476654 215253 446987
163 446987 1025324 -229135 -272196 -539764 -378483 -472703 -729476 -199938 -562466 -516044
153 -516044 -165727 69582 250954 -24586 -315456 -623459 -725905 -648826 -775313 -710194
143 -710194 -718670 -188246 199851 197190 -18181 -1056 -425787 -239729 -237647 103642 -274099
132 -274099 -364704 -601084 -286683 -272115 -384927 176677 502928 338526 -181544 66723
122 66723 -102601 -243251 -279646 -33158 -62308 -19017 478194 552175 892828 596415 50675
111 50675 -102112 -306394 -136654 72190 -144312 -630804 -625195 -81904 -34434 -281810 -325856
100 -325856 -609445 -601368 -539346 -311020 -271096 -535457 -725898 -509016 103456 -199536 -52609
89 -52609 551418 279022 -85409 -571481 -513349 -37171 -399461 -789873 -343633 -342263 64121
78 64121 -444221 -466287 -380446 -403521 302825 286423 97879 -89394 46661 -342226 -183902
67 -183902 345410 217527 -173406 -489081 -678518 -405983 48297 208940 176340 -42291
57 -42291 136775 -192606 -358929 34250 31998 -49366 -121878 91887 271249 468073 245843
46 245843 -245113 -223569 89650 -133671 13783 41893 97346 -159863 -509588 -800563 149676
35 149676 -106117 -273976 -65248 -122890 221545 331216 483484 636652 392788 18994
25 18994 -275092 -192266 250203 165864 -167266 -529084 -132460 -502952 -444307 -179236 -490866
14 -490866 -222376 -405178 -282459 110682 205530 63264 -198123 349047 -243783 -541797
4 -541797 -716862 -352202 -400731 -397943
0 -397943
$$ Imaginary data points
##PAGE= N=2
##DATA TABLE= (X++(I..I)), XYDATA
16383 -6687977 -6988713 -7042511 -6672525 -6745685 -6654226 -6270768 -5958468 -5968219 -5900557 -6130174
16373 -6130174 -5720276 -6024338 -6091521 -5839078 -5849465 -5313029 -5260614 -5048998 -5022837 -5336740
16363 -5336740 -5470921 -5180722 -4918024 -4705545 -4383898 -4390351 -4312619 -4183278 -4261632 -4091222
16353 -4091222 -3487991 -3559130 -3889528 -3812755 -3203372 -3321926 -3234752 -2994619 -2690124 -2591295
16343 -2591295 -2682095 -3002986 -3461949 -2889873 -2665210 -2211527 -2184398 -2025629 -1820864 -2035575
16333 -2035575 -1642876 -1383054 -1887276 -2344428 -2181988 -1629045 -1266163 -1430878 -1340635 -1028784
16323 -1028784 -941912 -1249821 -1358633 -1037191 -1012402 -605100 -185131 -367570 -291663 -526114
16313 -526114 -706798 -242079 -56472 297416 73841 11207 283706 163199 247868 527232
16303 527232 816813 1060673 899049 1157480 1609499 906799 770045 816184 1014409 1235511
16293 1235511 1525860 1658178 1620732 1416145 1871135 1873612 2011790 2348194 2486904 2453808
16283 2453808 1842440 1791268 2374330 2987181 2844158 2743535 2377308 2358900 2880162 3369368
16273 3369368 3394555 3392460 3240784 3116877 3208360 3481950 3560783 3619480 3751200 3744076 3767487
16262 3767487 3882184 3210045 3667001 3960399 3957930 4126965 4252253 4432738 3997959 4231314
16252 4231314 4553188 4897971 4468201 4284082 4181184 4686597 4961817 4406321 4378154 4951675
16242 4951675 5150479 4768287 5084531 4860198 4527039 4572160 4885577 4397870 4107696 5155299
16232 5155299 5742152 5815464 5853494 5862480 5832769 5786274 5391953 5429863 5536142 5800335 5993973
16221 5993973 6236419 5461802 5558606 5975725 5918002 5839131 6473636 6309597 6276985 6572232
16211 6572232 6276459 6713430 6597010 6461093 6275855 6203220 6214853 6363715 6330322 7131915
16201 7131915 6623800 6924477 7432948 7517133 7736999 7692701 7337505 6603515 6541389 6448126
16191 6448126 6926937 6784150 6816637 6950181 7217059 7661465 7596392 7259458 6631440 6893598
16181 6893598 7148795 7086870 7272440 7110947 7083338 7181391 7066595 6764452 6791351 7217374
16171 7217374 7418434 7502020 7365352 7636272 8030371 7588158 7546388 7820152 7522357 7605193
16161 7605193 7639469 8034277 7868701 7883674 7841607 7811314 7795250 7990288 7710263 7803944
16151 7803944 8097950 8408077 8518219 8024185 8482441 8779999 8855992 8661942 8714742 8665904
16141 8665904 8726222 8364237 8432808 8315765 8308845 8432773 8417869 8301228 7648766 7497984
16131 7497984 7996902 8130218 8189880 8376892 8488088 8591781 8626480 8447233 8675125 8407011
16121 8407011 7900451 8067954 8392240 8163616 8373895 8289921 8476051 9043537 8875987 8986291
16111 8986291 8506017 8652486 8810040 8479270 8668404 8705643 8681387 8533681 8852214 8729343
16101 8729343 9332349 9191221 8608243 8683338 9090420 9150517 9040985 8825654 8987785 8730478
16091 8730478 8720221 8500331 8383602 8926299 8366769 8214364 8534638 9166629 8859271 9247043
16081 9247043 9428516 8642833 8488445 8435042 8200721 7644476 7944517 8875704 8768097 8760249
16071 8760249 8895333 8888824 9105435 9131909 8958455 9021377 8748452 8965594 9235364 9622395
16061 9622395 9118317 9123252 8849651 8412926 8346778 8432747 8760825 9714863 9388433 9040950
16051 9040950 9541440 9288375 9095140 9266327 9346718 9320995 9284995 9527610 8702794 9064431
16041 9064431 9315348 9157907 8875502 9251888 9282629 9109653 9208486 9344148 8635849 8230825
16031 8230825 8784523 8438315 8565399 8134262 8579805 9134903 8986164 8930390 9038779 8930571
16021 8930571 8693837 8354963 9151947 8817853 8677780 9485273 9268500 9090409 9262218
16012 9262218 8662062 8898808 8793430 8830154 8896545 8982950 9168560 8779863 9128233 9507256
16002 9507256 9043925 8966147 8841761 8371818 8093649 8069036 8929443 9433485 9502499 8858716
15992 8858716 8348868 8866657 9242407 8728268 8981298 9641230 9524895 9261994 9047423
15983 9047423 8853292 8845819 8434812 8375701 8673926 8996168 9880122 9809545 9015594 8206444
15973 8206444 8556408 8975288 9234991 8819864 9039541 8686016 8856417 8727446 8959921
15964 8959921 8420969 8292257 8875125 9393150 9594399 9366941 9146236 9238702 9069931 8895121
15954 8895121 8527739 8462648 9012827 8660559 8882035 9352724 9500487 9219836 9592228 9596626
15944 9596626 9593597 9039326 8537375 8745777 9397739 9390560 9271616 8552425 8741142 9565800
15934 9565800 9514435 9218009 9141881 8836997 8448145 8600169 8561409 9438254 9885108 9330458
15924 9330458 8902589 9044648 9320997 8731022 8675413 8608645 8038109 8709306 8752158 9571463
15914 9571463 9973658 9349808 9059586 9711368 9337511 9212088 8828486 8772295 9445088 9017611
15904 9017611 9179598 8332793 8791671 8568721 8796769 9154258 9575957 9288816 8802293
15895 8802293 8878989 9015581 8535867 9135211 9297297 9352650 9472270 9133894 9069963 9389802
15885 9389802 9132766 9043828 9872765 9299408 8366882 8397473 8900174 9403084 9594728 9001348
15875 9001348 9383346 9446022 9408636 9086507 9588546 9376185 9405707 9622961 9211560 9039027
15865 9039027 9156208 9452657 9594168 8818941 8443813 9073158 9318856 9558301 8817794
15856 8817794 8964291 8835404 9122912 9042580 8933520 9458458 9535684 9115244 9348087 9533887
$$ [...]
##END NTUPLES=NMR SPECTRUM
##END=
