##TITLE=1H_CA-9181-53
 CDCl3
 8 sc, 
 4.8.2023
##JCAMPDX= 6.0         $$ Bruker NMR JCAMP-DX V2.0
##DATA TYPE= NMR SPECTRUM
##DATA CLASS= NTUPLES
##ORIGIN= UXNMR, Bruker Analytische Messtechnik GmbH
##OWNER= root
$$ XWIN-NMR		Version 3.5
$$ Fri Aug  4 13:48:55 2023 Russian Standard Time (UT+4h)  she@DPX200
##.OBSERVE FREQUENCY= 200.13135
##.OBSERVE NUCLEUS= ^1H
##.ACQUISITION MODE= SIMULTANEOUS
##.ACQUISITION SCHEME= undefined
##.AVERAGES= 8
##.DIGITISER RES= 18
##SPECTROMETER/DATA SYSTEM= spect
##.PULSE SEQUENCE= zg30
##.SOLVENT NAME= CDCl3
##.SHIFT REFERENCE= (INTERNAL, CDCl3, 0, 15.7326)
##AUDIT TRAIL= $$ (NUMBER, WHEN, WHO, WHERE, WHAT)
$$ ##TITLE= Audit trail, XWIN-NMR		Version 3.5
$$ ##JCAMPDX= 5.01
$$ ##ORIGIN= Bruker BioSpin GmbH
$$ ##OWNER= she
$$ F:/spectra/data/she/nmr/H-F/1/pdata/1/auditp.txt
$$ ##AUDIT TRAIL=  $$ (NUMBER, WHEN, WHO, WHERE, WHAT)
(   1,<2023-08-04 13:47:36.78 +0400>,<she>,<DPX200>,
      <created by zg, POWCHK disabled, PULCHK disabled
       configuration hash MD5:
       00 E9 B6 7A A2 85 ED C7 34 08 36 98 17 FE 4E 26
       data hash MD5: 16K
       B7 BB A8 47 AB 2B 7D 6B 46 06 DE F5 D1 88 45 21>)
(   2,<2023-08-04 13:47:39.25 +0400>,<she>,<DPX200>,
      <Start of raw data processing
       efp BC_mod = 2 LB = 0.24 FT_mod = 6 PKNL = 1 PHC0 = -21045.49 PHC1 = 16.85272 SI = 16K 
       data hash MD5: 16K
       BB F1 67 C8 2D 81 F4 98 50 5C 93 00 33 56 7C 4E>)
(   3,<2023-08-04 13:48:02.90 +0400>,<she>,<DPX200>,
      <pk PHC0 = 4.981108 PHC1 = -9.400001 
       data hash MD5: 16K
       E8 64 1E CA 40 3D 65 F1 A4 F9 F6 B6 52 A0 FE 06>)
(   4,<2023-08-04 13:48:07.07 +0400>,<she>,<DPX200>,
      <abs ABSG = 5 
       data hash MD5: 16K
       04 D5 8F 5D C7 AC D3 0C 67 A3 BC 09 8C 66 34 F3>)
$$ ##END=
$$ 
$$ hash MD5
$$ 19 6C 3B 97 61 C0 F1 F1 3E FD 27 40 C0 1F F7 5C
##$RELAX= 
##$RELAX= 
##$RELAX= 
##$RELAX= 
##$RELAX= 
##$RELAX= 
$$ Bruker specific parameters
$$ --------------------------
##$DU= <F:/spectra>
##$EXPNO= 1
##$NAME= <H-F>
##$PROCNO= 1
##$TYPE= <nmr>
##$USER= <she>
##$AMP= (0..31)
100 100 100 100 100 100 100 100 100 100 100 100 100 100 100 100 100 100 
100 100 100 100 100 100 100 100 100 100 100 100 100 100 
##$AQSEQ= 0
##$AQ_mod= 1
##$AUNM= <au_zg>
##$AUTOPOS= <>
##$BF1= 200.13
##$BF2= 200.13
##$BF3= 200.13
##$BF4= 200.13
##$BF5= 200.13
##$BF6= 200.13
##$BF7= 200.13
##$BF8= 200.13
##$BYTORDA= 1
##$CFDGTYP= 0
##$CFRGTYP= 5
##$CHEMSTR= <none>
##$CNST= (0..31)
1 1 145 1 1 1 1 1 1 1 1 1 1 1 1 1 1 1 1 1 1 1 1 1 1 1 1 1 1 1 1 1 
##$CPDPRG= <>
##$CPDPRG1= <>
##$CPDPRG2= <>
##$CPDPRG3= <>
##$CPDPRG4= <mlev>
##$CPDPRG5= <mlev>
##$CPDPRG6= <mlev>
##$CPDPRG7= <mlev>
##$CPDPRG8= <mlev>
##$CPDPRGB= <>
##$CPDPRGT= <>
##$D= (0..31)
0 1.2 0 0 0 0 0 0 0 0.06 0 0.03 0 0 0 0 0.0002 0 0 0 0 0 0 0 0 0 0 0 0 
0 0 0 
##$DATE= 1691142456
##$DBL= (0..7)
120 120 120 120 120 120 120 120 
##$DBP= (0..7)
150 150 150 150 150 150 150 150 
##$DBP07= 0
##$DBPNAM0= <>
##$DBPNAM1= <>
##$DBPNAM2= <>
##$DBPNAM3= <>
##$DBPNAM4= <>
$$ [...]
##$SUBNAM3= <"">
##$SUBNAM4= <"">
##$SUBNAM5= <"">
##$SUBNAM6= <"">
##$SUBNAM7= <"">
##$SUBNAM8= <"">
##$SUBNAM9= <"">
##$SW= 18.05172834244
##$SWIBOX= (0..15)
0 0 2 0 0 0 0 0 0 0 0 0 0 0 0 0 
##$SW_h= 3612.71676300578
##$TD= 16384
##$TD0= 1
##$TE= 0
##$TE2= 300
##$TE3= 300
##$TEG= 300
##$TL= (0..7)
0 120 120 120 120 120 120 120 
##$TP= (0..7)
150 150 150 150 150 150 150 150 
##$TP07= 0
##$TPNAME0= <>
##$TPNAME1= <>
##$TPNAME2= <>
##$TPNAME3= <>
##$TPNAME4= <>
##$TPNAME5= <>
##$TPNAME6= <>
##$TPNAME7= <>
##$TPOAL= (0..7)
0.5 0.5 0.5 0.5 0.5 0.5 0.5 0.5 
##$TPOFFS= (0..7)
0 0 0 0 0 0 0 0 
##$TUNHIN= 0
##$TUNHOUT= 0
##$TUNXOUT= 0
##$USERA1= <user>
##$USERA2= <user>
##$USERA3= <user>
##$USERA4= <user>
##$USERA5= <user>
##$V9= 5
##$VALIST= <valist>
##$VCLIST= <CCCCCCCCCCCCCCC>
##$VD= 0
##$VDLIST= <DDDDDDDDDDDDDDD>
##$VPLIST= <PPPPPPPPPPPPPPP>
##$VTLIST= <TTTTTTTTTTTTTTT>
##$WBST= 1024
##$WBSW= 4
##$XGAIN= (0..3)
0 0 0 0 
##$XL= 0
##$YL= 0
##$YMAX_a= 221501
##$YMIN_a= -188119
##$ZGOPTNS= <>
##$ZL1= 120
##$ZL2= 120
##$ZL3= 120
##$ZL4= 120
##$ABSF1= 15.72926
##$ABSF2= -2.322589
##$ABSG= 5
##$ABSL= 3
##$ALPHA= 0
##$AQORDER= 0
##$ASSFAC= 0
##$ASSFACI= 0
##$ASSFACX= 0
##$ASSWID= 0
##$AUNMP= <proc_1d>
##$AZFE= 0.1
##$AZFW= 0.1
##$BCFW= 0
##$BC_mod= 2
##$BYTORDP= 0
##$COROFFS= 0
##$CY= -3
##$DATMOD= 1
##$DC= 0
##$DFILT= <>
##$DTYPP= 0
##$F1P= 0
##$F2P= 0
##$FCOR= 1
##$FTSIZE= 16384
##$FT_mod= 6
##$GAMMA= 0
##$GB= 0
##$INTBC= 1
##$INTSCL= 3.70164e-10
##$ISEN= 128
##$LB= 0.24
##$LEV0= 0
##$LPBIN= 0
##$MAXI= 10000
##$MC2= 0
##$MEAN= 0
##$ME_mod= 0
##$MI= 1.114404
##$NCOEF= 0
##$NC_proc= -8
##$NLEV= 6
##$NOISF1= 3.799351
##$NOISF2= 2.8
##$NSP= 0
##$NTH_PI= 0
##$NZP= 0
##$OFFSET= 15.73257
##$PC= 1
##$PHC0= -21040.51
##$PHC1= 7.45272
##$PH_mod= 1
##$PKNL= yes
##$PPARMOD= 0
##$PSCAL= 0
##$PSIGN= 0
##$REVERSE= no
##$SF= 200.130007799806
##$SI= 16384
##$SIGF1= 3
##$SIGF2= 2
##$SINO= 5.538805
##$SIOLD= 16384
##$SREGLST= <1H.CDCl3>
##$SSB= 0
##$STSI= 16384
##$STSR= 0
##$SW_p= 3612.71676300578
##$SYMM= 0
##$S_DEV= 0
##$TDeff= 16384
##$TDoff= 0
##$TI= <>
##$TILT= no
##$TM1= 0
##$TM2= 0
##$TOPLEV= 0
##$USERP1= <user>
##$USERP2= <user>
##$USERP3= <user>
##$USERP4= <user>
##$USERP5= <user>
##$WDW= 1
##$XDIM= 16384
##$YMAX_p= 371398951
##$YMIN_p= -1909600
$$ End of Bruker specific parameters
$$ ---------------------------------
##NTUPLES= NMR SPECTRUM
##VAR_NAME=  FREQUENCY,     SPECTRUM/REAL,   SPECTRUM/IMAG
##SYMBOL=    X,             R,               I
##VAR_TYPE=  INDEPENDENT,   DEPENDENT,       DEPENDENT
##VAR_FORM=  AFFN,          ASDF,            ASDF
##VAR_DIM=   16384,         16384,           16384
##UNITS=     HZ,            ARBITRARY UNITS, ARBITRARY UNITS
##FACTOR=    0.220516191357247, 1,           1
##FIRST=     3148.55929567509, 0,            0
##LAST=      -464.157467330692, 0,           0
##MIN=       -464.157467330692, -1909600,    0
##MAX=       3148.55929567509, 371398951,    0
$$ Real data points
##PAGE= N=1
##DATA TABLE= (X++(R..R)), XYDATA
$$ [...]
5595A7185902K87480L01196k52845j32333L97921l19181k59065l65018J54171
5586A6998228k82636k99569L56976J77674J02070O8473K77175M82389R0440K12621
5576A8183841L45217J47703j5213o8439M94619k07472k02895J69793O12433k92237
5566A9167350j74851j96778L3056l17342J04349J78745j58719O6394J59075M159
5556A8865438J45388K1023N6786k70842M7446N45635O4108M04656J28413L56194
5546B0364245j41586k05048L80275K78680J1701Q5970K20280O3355k03823K6861
5536B0880910L8256J80324q9880N93709J62632J96871l9763K14904J92950j05647
5526B2225266L3013k40151N50539L86574j54529K66921M7226j71469p3232j96345
$$ y = [17185902, 17473382, 17774578, 17521733, 17389400, 17787321, 17468140, 17209075, 16844057, 16998228, 16715592, 16416023, 16772999, 16950673, 17052743, 17121216, 17398391, 17880780, 17971220, 18183841, 18529058, 18676761, 18661548, 18593109, 19087728, 18880256, 18677361, 18847154, 19459587, 19167350, 18992499, 18795721, 18828777, 18511435, 18615784, 18794529, 18635810, 18702204, 18861279, 18865438, 19010826, 19031849, 19088635, 18817793, 18865239, 19410874, 19474982, 19879638, 20008051, 20364245, 20222659, 20017611, 20397886, 20676566, 20688267, 20774237, 20994517, 21057872, 20854049, 20880910, 20919166, 21099490, 21009610, 21603319, 21765951, 21962822, 21923059, 22137963, 22330913, 22225266, 22258279, 22018128, 22568667, 22955241, 22800712, 23067633, 23114859, 22943390, 22870158, 22673813]
5516B2673813K17423l1771J78655j55180j30381l91645K4166K05841J7304J77459
5506B2785684K66366P8167j00378J8942J68819k26667o7764N6970j73519M40039
5496B3246659n2225K24071K9581k1269k78375l59987L43797j41121l52800l08969
5486B2329362k8357j3459J44760q0773J60968K11370l17465p1940L34105k66210
5476B2402361j95610n3177J74949J8099j29827j25489L21508j2585k26958P1556
5466B2244827L28261P952M86225R8355n23187N2080K02961K74282k74372P7889
5456B2975273l50035q2462k69833j0530M8213K10972l15295j02587o09305K28258
5446B1722669m350n61815j99761O6948L50363m35920r1517J00609j41885L66760
$$ y = [22673813, 22891236, 22859465, 23038120, 22882940, 22752559, 22360914, 22385080, 22590921, 22608225, 22785684, 23052050, 23130217, 23029839, 23048781, 23217600, 22990933, 22923169, 22980139, 22806620, 23246659, 23194434, 23418505, 23448086, 23426817, 23148442, 22788455, 23132252, 22991131, 22638331, 22329362, 22301005, 22287546, 22432306, 22351533, 22512501, 22723871, 22406406, 22334466, 22668571, 22402361, 22206751, 22153574, 22328523, 22346622, 22216795, 22091306, 22412814, 22400229, 22173271, 22244827, 22573088, 22581040, 23067265, 23165620, 22642433, 22694513, 22897474, 23171756, 22897384, 22975273, 22625238, 22542776, 22272943, 22262413, 22310626, 22521598, 22206303, 22103716, 21494411, 21722669, 21718319, 21156504, 20956743, 21023691, 21374054, 20938134, 20846617, 20947226, 20805341, 21172101]
5436B1172101j06859k9269k41781j25919P24168J49818K8308O7311L5530K72821
5426B1946229q5328K66866N36108k12447j68086J11560p171j50748k58206k01254
5416B1777523P6885n9825K52100p4315k05702l70103J66121L87260j30496P0398
5406B1889846k84619K34830K62826J12600Q48789J27094J19820K13926L64885
5397B3889997L2672K7516K10631M69873N75468P8104k10569J76534P27214L8644
5387B6016084l53301K47366m44148j95076j61940q7006J89567m26201m4826P7050
5377B4817569O1825L02700j29068O6917R1872J6010K25361J0308J80088r9157
5367B5544425J50447N38007O07142Q16813K89214K90969N65289N96947K33279
$$ y = [21172101, 21065242, 21035973, 20794192, 20668273, 21392441, 21542259, 21570567, 21637878, 21673408, 21946229, 21860901, 22127767, 22663875, 22451428, 22283342, 22394902, 22387731, 22236983, 21978777, 21777523, 21854408, 21794583, 22046683, 21972368, 21766666, 21396563, 21562684, 21949944, 21819448, 21889846, 21605227, 21840057, 22102883, 22215483, 23064272, 23191366, 23311186, 23525112, 23889997, 23922669, 23950185, 24160816, 24630689, 25206157, 25284261, 25073692, 25250226, 25977440, 26016084, 25662783, 25910149, 25466001, 25270925, 25108985, 25021979, 25211546, 24785345, 24740519, 24817569, 24879394, 25182094, 25053026, 25119943, 25211815, 25227825, 25453186, 25463494, 25643582, 25544425, 25694872, 26232879, 26840021, 27656834, 27946048, 28237017, 28802306, 29399253, 29632532]
5358B9632532Q17173L2878L52499P18225O56370Q84011R78643J430897J033352
5349C6536580J055040O44242K25103n92685k54727j8035L77974L89038k2929m15358
5339C7924243q66644j353902j201332j014243q03273R2095Q2543l14482K92958
5330C2837963L64263N93840P29195L73555P18354k16160p95250k60130n82222
5321C3763408n65791l02653J10596P25575N47013M02224k51884j80150m02043
5312C3846295j224212j288926r76225j124642q59643m15025k10187k14455l09796
5303B7223184j34116r9717l56029j47219L28113l91207j10537q6225n1868J88494
5293B6362873L14848K67841k56857k11632j09987m96117o1192K38829k19994r7553
$$ y = [29632532, 30449705, 30482583, 30835082, 31553307, 32209677, 33093688, 34072331, 35503228, 36536580, 37591620, 38235862, 38460965, 37868280, 37613553, 37595518, 37973492, 38362530, 38339601, 37924243, 37057599, 35703697, 34502365, 33488122, 32684849, 32776944, 32859487, 32545005, 32837963, 33202226, 33796066, 34525261, 34898816, 35617170, 35401010, 34605760, 34345630, 33763408, 33197617, 32894964, 33005560, 33731135, 34278148, 34680372, 34428488, 34248338, 33846295, 32622083, 31333157, 30356932, 29232290, 28372647, 27957622, 27747435, 27532980, 27223184, 27089068, 26989351, 26633322, 26486103, 26814216, 26423009, 26312472, 26226247, 26174379, 26362873, 26677721, 26945562, 26688705, 26477073, 26367086, 25870969, 25809777, 26048606, 25828612, 25731059]
5283B5731059j18002p2697j9465M6407K43654p41160m1466q0068N23601J25305
5273B5597168l33657M48109j19484O1351M25052M92477N11983j56209l43522J9979
5263B6603247L3779O3598p26591j59003L83560K39118N3241K73955n4232J23875
5253B6834547j08744j78259J29565r7702L87437j50499p1673K02061J2664O14640
5243B7574037J07408j94315j21091j19101J4607J2442J64885M36257m4168n2727
5233B7778234K80743L24730J20245j76017O1464M83729O12590j54929J13346k3786
5223B9420349o4785J72142R5840m7213M4275j93534J57680J76536J24368K31225
5213C0116883Q6755K0597J5746K8994l33172N0575j80633k96609l36376j55620
$$ y = [25731059, 25613057, 25540360, 25520895, 25567302, 25810956, 25069796, 25028330, 24948262, 25471863, 25597168, 25263511, 25711620, 25592136, 25653487, 26078539, 26571016, 27082999, 26926790, 26583268, 26603247, 26637026, 26700624, 25974033, 25815030, 26198590, 26437708, 26490949, 26764904, 26710672, 26834547, 26725803, 26547544, 26677109, 26579407, 26966844, 26816345, 26744672, 26946733, 26959397, 27574037, 27681445, 27487130, 27366039, 27246938, 27261545, 27273987, 27438872, 27875129, 27830961, 27778234, 28058977, 28383707, 28503952, 28327935, 28389399, 28873128, 29485718, 29330789, 29444135, 29420349, 29355564, 29527706, 29623546, 29576333, 29620608, 29427074, 29584754, 29761290, 29885658, 30116883, 30203638, 30224235, 30239981, 30268975, 29935803, 29986378, 29805745, 29509136, 29172760, 29017140]
5203B9017140J85773O3454j3122q6710J5905L62742r9649L19349K67522j27057
5193B9905347m82690L56922N21856M92281M83839K09918K50040J57484K01553
5184C2096550q26151J28282j88798j90445J05168l24106P55975j45288k47572
5175C1163615K4908j00943K51725L79014l9434j7157R22487N82854N52427O57198
5165C4376694R73496N94388O89654K92170M91411Q82362M26480L42057N2162k94113
5155C8826761j12195o52561p46638l88730m73470K83601q5321j22688l4049J99912
5145C6694622j2291L2508N30169M7858l87587K7641Q21003M40995P39902Q87219
5135C9822039N76123J440301J634844P86980P64151M05916N76427L1039o30486
$$ y = [29017140, 29202913, 29266367, 29253245, 29166535, 29182440, 29545182, 29445533, 29764882, 30032404, 29905347, 29422657, 29779579, 30301435, 30793716, 31277555, 31487473, 31737513, 31894997, 32096550, 31270399, 31398681, 31209883, 31019438, 31124606, 30800500, 31556475, 31411187, 31163615, 31188523, 31087580, 31339305, 31718319, 31678885, 31661728, 32584215, 33167069, 33719496, 34376694, 35350190, 35944578, 36634232, 36926402, 37417813, 38300175, 38726655, 39068712, 39120874, 38826761, 38714566, 38062005, 37315367, 36926637, 36453167, 36736768, 36651447, 36528759, 36494710, 36694622, 36682331, 36714839, 37245008, 37292866, 36905279, 36932920, 37753923, 38194918, 38934820, 39822039, 40398162, 41838463, 43473307, 44260287, 45024438, 45430354, 46006781, 46037820, 45407334]
5126D5407334r92261q11774l39382n43060l96560n53639m69256l40633k98851
5117D0661918n54360p32559q31047p20673j413067j107413j182341q93072r84677
5108C2242709j108642p02228m71043j104309l54328n50964p23792o48066j010803
5099B5568534o49180n52768k40184l81784m16516k95536k87673l43896l80730
5090B2020267m91520j54073l21771k57789m16291k83451j07653J14202J6306k23221
5080A9895006m10265k7537q5631J37318n6469k36774j22316J0638r0316l84969
5070A8628685J23674K29674Q1050O2008K81100m77861K34465k77254P0834J31311
5060A9087686l28529m46754k61392k09849m02706J28475O395M14093l71086k14023
$$ y = [45407334, 44415073, 43603299, 43263917, 42720857, 42324297, 41770658, 41301402, 40960769, 40661918, 40107558, 39374999, 38543952, 37823279, 36410212, 35302799, 34120458, 33227386, 32242709, 31134067, 30431839, 29960796, 28856487, 28502159, 27951195, 27227403, 26579337, 25568534, 24919354, 24366586, 24126402, 23744618, 23328102, 23032566, 22744893, 22400997, 22020267, 21528747, 21374674, 21052903, 20795114, 20378823, 20095372, 19987719, 20101921, 20118227, 19895006, 19484741, 19457204, 19371573, 19508891, 19452422, 19215648, 19093332, 19103970, 19013654, 18628685, 18752359, 18982033, 19063083, 19125091, 19406191, 18928330, 19162795, 18885541, 18956375, 19087686, 18759157, 18312403, 18051011, 17841162, 17438456, 17566931, 17573326, 17987419, 17616333, 17402310]
5050A7402310j2934K8720j70017k87752j5492j82666r9608n5770k75035m136l90728
5039A5936892n12271K40339m60730m28665K44055k05030j95065j74400L00865
5030A4745990k8906J0322J72126j279o69794n09235N8282n3257k7223K02346k92284
5019A3607088j80291L28403J6844j37938k37802K05513N27314n80117R9315M18630
5009A4066959l45000j25989j28219j37259k83468J06519L14727N3644j61013k51397
4999A3109504l7951j19271K59233j75677l48525j5134l87024J52343K73077j58436
4989A2552139J89008J59621k11704m7845r0781j26J5085J00515k64654K8474R8772
4978A2528504k74322K88473m45498o9860M08987k03071M24365k76419J65784j22024
$$ y = [17402310, 17389376, 17418096, 17248079, 16960327, 16944835, 16762169, 16662561, 16606791, 16331756, 16327620, 15936892, 15424621, 15664960, 15204230, 14775565, 15019620, 14814590, 14619525, 14445125, 14745990, 14717084, 14727406, 14899532, 14898253, 14228459, 13719224, 13777506, 13724249, 13697026, 13899372, 13607088, 13426797, 13755200, 13772044, 13634106, 13396304, 13601817, 14129131, 13549014, 13648329, 14066959, 13721959, 13595970, 13467751, 13330492, 13047024, 13153543, 13468270, 13521914, 13360901, 13109504, 13071553, 12952282, 13211515, 13035838, 12687313, 12672179, 12285155, 12437498, 12710575, 12552139, 12741147, 12900768, 12689064, 12641219, 12550438, 12550312, 12565397, 12665912, 12401258, 12429732, 12528504, 12254182, 12542655, 12097157, 12027297, 12436284, 12233213, 12657578, 12381159, 12546943, 12424919]
4968A2424919l15185m2019P5108O8295j89888j23784j69624L43345J67308j22696
4958A2115779K07921J78807l3709j31830o40989P2907J83482j18975P7486k92369
4948A1618510n5190M01052K59941r1462m9890K24953l14351l82167M48479j83290
4938A1876585q8283O0508M5761J17603M05956L30407J631m16917l5785j50095
4928A2147371J17335j35098J06480o9057k85557K85340n6140J98317J1519k31293
4918A2089217J58711J91242K0626j58921k12568P18735j15308l85711o2992j36656
4908A2106375m04434M36516O5974K07715K75487q2592k60534L3635M52796l5666
4898A2795272J34267m65160K04270J79053j95776N22034N3869J22415j15543N3967
$$ y = [12424919, 12109734, 12067715, 12142823, 12211118, 12021230, 11897446, 11727822, 12071167, 12238475, 12115779, 12323700, 12502507, 12468798, 12336968, 11695979, 11768886, 11952368, 11833393, 11910879, 11618510, 11563320, 11964372, 12224313, 12132851, 12082961, 12307914, 11993563, 11611396, 12059875, 11876585, 11788302, 11848810, 11894571, 12012174, 12418130, 12748537, 12750168, 12333251, 12297466, 12147371, 12264706, 12129608, 12236088, 12167031, 11881474, 12166814, 12110674, 12308991, 12320510, 12089217, 12247928, 12439170, 12459796, 12300875, 12088307, 12807042, 12691734, 12306023, 12243031, 12106375, 11701941, 12138457, 12204431, 12412146, 12687633, 12605041, 12344507, 12378142, 12830938, 12795272, 12929539, 12464379, 12668649, 12847702, 12651926, 13173960, 13227829, 13350244, 13234701, 13288668]
4888A3288668n3026K20094j08369J40853k14290L5711L99340Q8437N15656n43959
4878A3769115l35591J0815J91607k16518L33071O42217m02583m50039J69892j36784
4868A3575202K98646j12165J97518P7012l9947L5817k17259N13412M66751n4570
4858A4740417J74130r3208K87454j88968K2655P1348j71478j18779N3921O73045
4848A5450537j57103K71569j2659k01670m2878K00845J25894J58128r3849l84344
4838A5314470L23416k28228K35820J83612j56263P63791j66769o6330K11906L31566
4828A6746991J80516K30884M3587J41316M22763K38989Q6694K18083l3111J93044
4818A8469756M94253O5648L41880K11204r6344N60479K22205k17410R8836K13406
$$ y = [13288668, 13235642, 13455736, 13347367, 13488220, 13273930, 13309641, 13708981, 13797418, 14313074, 13769115, 13433524, 13444339, 13635946, 13419428, 13752499, 14394716, 13992133, 13542094, 13711986, 13575202, 13873848, 13761683, 13959201, 14036213, 13996266, 14032083, 13814824, 14328236, 14794987, 14740417, 14914547, 14821339, 15108793, 14919825, 14942480, 15013828, 14842350, 14723571, 14777492, 15450537, 15293434, 15565003, 15552344, 15350674, 15307796, 15508641, 15634535, 15792663, 15698814, 15314470, 15637886, 15409658, 15645478, 15829090, 15672827, 16436618, 16269849, 16203519, 16415425, 16746991, 16927507, 17158391, 17201978, 17343294, 17766057, 18005046, 18091740, 18309823, 18276712, 18469756, 18964009, 19029657, 19371537, 19582741, 19486397, 20046876, 20269081, 20051671, 20150507, 20363913]
4808B0363913P83342j36342J17078Q28208K01754L07248J85377j00741Q59191
4799B3409028M18477R37273R58139Q12407R45680o7297P52710J099388M39463
4790B9705268Q94484R29591l3162Q4535N33441K7118l28656j98759k0609R7339
4780C1690590l99668K36015K63871O29947O26040P92227O12158Q43656J161288
4771C6456124Q71617L82720P63253R46385J259584J472923J563683J954799J477128
4762D7148216J546890J052690M73237J89732m22761j258488j774737j611454j730666
4753D3612659j881127j224316j558939j155638q21186j33438O1160j37927k32179
4744C6529069m40474p2285J80202K10995J47096O1498K64240Q38562M52664l1186
$$ y = [20363913, 21147255, 21010913, 21127991, 21956199, 22157953, 22465201, 22650578, 22549837, 23409028, 23827505, 24764778, 25722917, 26535324, 27481004, 27413707, 28166417, 29265805, 29705268, 30599752, 31529343, 31496181, 31580716, 32114157, 32141275, 31812619, 31613860, 31593251, 31690590, 31290922, 31526937, 31790808, 32420755, 33046795, 33839022, 34451180, 35294836, 36456124, 37327741, 37710461, 38473714, 39420099, 40679683, 42152606, 43716289, 45671088, 47148216, 48695106, 49747796, 50221033, 50410765, 49988004, 48729516, 46954779, 45343325, 43612659, 41731532, 40507216, 38948277, 37792639, 36971453, 36838015, 36899175, 36761248, 36529069, 36088595, 36016310, 36196512, 36407507, 36554603, 36616101, 36880341, 37718903, 38171567, 38140381]
4734C8140381K21648K72958k12613j06588n12332p81775q44146p37236o30553
4725C4809744n77537j75578k68627K54954K73675K84506J19091j24779o80282
4716C3915167p67999l88635m80806o48525K18845P8816r2205L13488k85299L72829
4706C2235676k31280l29042P64698M56532k9637K17545q43013o65614q2238n00152
4696C0993475q11193q3529k638p54584K7936l2782p13672j53473n50808m53414
4686B7465318k86894k77310j0771l97761k76633J5949J19009k17362J66810m59733
4676B5840622N3475k9322j21454J4066L42453J05870p0190J41612K55451J43976
4666B6676559J28945K86389M81025o5078J27973N43618K05677K58421N56911J80759
$$ y = [38140381, 38362029, 38634987, 38422374, 38315786, 37803454, 37021679, 36177533, 35440297, 34809744, 34232207, 34056629, 33788002, 34042956, 34316631, 34601137, 34720228, 34595449, 33915167, 33147168, 32758533, 32277727, 31629202, 31848047, 31926863, 31834658, 32148146, 31862847, 32235676, 32004396, 31675354, 32440052, 32896584, 32866947, 33084492, 32241479, 31575865, 31493627, 30993475, 30182282, 30098753, 30096115, 29341531, 29369467, 29336685, 28623013, 28469540, 27918732, 27465318, 27178424, 26901114, 26890343, 26492582, 26215949, 26231898, 26350907, 26133545, 26300355, 25840622, 25894097, 25864775, 25743321, 25757387, 26099840, 26205710, 26135520, 26277132, 26532583, 26676559, 26805504, 27091893, 27572918, 27507840, 27635813, 28179431, 28385108, 28643529, 29200440, 29381199]
4656B9381199L44571P50631J13012L22502J56065M63345M70005K27869K69636
4647C2498835L54246P25755j3075K96941J80068n1599m4390M20466M73151j42866
4637C4697532m290M15681N25605O16808J5529K74928Q08964J73034P36177Q34894
4627C9094862O46987J53427P83079Q16927Q96235O29777O74817R93143M68654
4618D5157908M37249M57655K98891o2347R5526J73815K77049M48845q272k26672
4608D7049647k23938j03476J44644J66468Q9112J95548O09249L65606O74369O14815
4598D9582044N16796J016660J003669J367480J556211J826916J664294J721263
4590F0255333J852201J620321J554057Q32960K36124K31111l44996p22131j649494
$$ y = [29381199, 29725770, 30476401, 30589413, 30911915, 31067980, 31531325, 32001330, 32229199, 32498835, 32853081, 33578836, 33565761, 33862702, 34042770, 33991171, 33946781, 34367247, 34840398, 34697532, 34693242, 35108923, 35634528, 36251336, 36266865, 36541793, 37350757, 37523791, 38259968, 39094862, 39741849, 39895276, 40678355, 41495282, 42391517, 43021294, 43696111, 44689254, 45157908, 45595157, 46052812, 46351703, 46289356, 46384882, 46558697, 46835746, 47284591, 47276319, 47049647, 46825709, 46722233, 46866877, 47033345, 47122457, 47318005, 47927254, 48292860, 48967229, 49582044, 50098840, 51115500, 52119169, 53486649, 55042860, 56869776, 58534070, 60255333, 62107534, 63727855, 65281912, 66114872, 66350996, 66582107, 66237111, 65514980, 63865486]
4581F3865486j201169j195093j018877r37098p30707r09811n01776n41883Q3223
4572E6912295J09468K57312R32415P14700O35246N01452P17203N09412R87596
4563F2277099J494067J020742R60992J444911J217619K031729J682003J551462
4555G3680624J749391K273315K539971K435344K356380K168132Q82494l82131
4547H7703520j713639k791919k949486k826162j306438j477014o14649o5062J35098
4538G4094249M38723R77432R16311Q07555J312318J023928J151431O82880j14668
4529H1290159J29749M7951p94141m94018j85299O452L12721N68515J305404J296913
4519H3484406J168277J455732O21169l410j438673k625399l313156k240920k437730
$$ y = [63865486, 62664317, 61469224, 60450347, 59513249, 58782542, 57872731, 57370955, 56829072, 56912295, 57021763, 57279075, 58211490, 58926190, 59561436, 60062888, 60780091, 61289503, 62277099, 63771166, 64791908, 65752900, 67197811, 68415430, 70447159, 72129162, 73680624, 75430015, 77703330, 80243301, 82678645, 85035025, 87203157, 88085651, 87703520, 85989881, 83197962, 80248476, 77422314, 76115876, 74638862, 74024213, 73959151, 74094249, 74532972, 75510404, 76426715, 77234270, 78546588, 79570516, 80721947, 81404827, 81290159, 81419908, 81467859, 80673718, 80179700, 79994401, 80000853, 80313574, 80882089, 82187493, 83484406, 84652683, 86108415, 86729584, 86726174, 85287501, 82662102, 79348946, 77108026, 74670296]
4510G4670296j875456j799286j769935j131137j111041q47734j172157q28388
4502F4135162n42877k73908k75407O1173m96265l36658j87660k02626n49559j163508
4492F0167867j035928p01040q16625n54307n31297j067218l90794k89140l84282
4483E4397236j040235j239380j299733j556100j330483j041451j221730q45973
4475D4822151p72761p38091l20226p60044n79022m31625j85611j31928j02310
4466D0800533K5288j41637L24008j58303l60579m80564o43001n02913o78488n48689
4456C7635655o79990n53411l64361m33928m29420l29314j19436j87131M0244J03424
4446C4682332j28758j73601J13732J68723K24871J84250K38234L22691K07700
$$ y = [74670296, 72794840, 70995554, 69225619, 68094482, 66983441, 66135707, 64963550, 64135162, 63592285, 63318377, 63042970, 63104143, 62607878, 62271220, 62083560, 61880934, 61331375, 60167867, 59131939, 58430899, 57614274, 57059967, 56528670, 55461452, 55070658, 54781518, 54397236, 53357001, 52117621, 50817888, 49261788, 47931305, 46889854, 45668124, 44822151, 44049390, 43311299, 42991073, 42231029, 41652007, 41220382, 41034771, 40902843, 40800533, 40825821, 40684184, 41008192, 40849889, 40489310, 40008746, 39365745, 38862832, 38184344, 37635655, 36955665, 36402254, 36037893, 35603965, 35174545, 34845231, 34725795, 34538664, 34578908, 34682332, 34553574, 34379973, 34493705, 34662428, 34887299, 35071549, 35309783, 35632474, 35840174]
4437C5840174O86544L96430j22380R3090k28371P9240J2495r7632M78359L28076
4427C7466025j86368m79908j74239M46800j90685k25166N61713M24790j53977
4418C7488985M22185K43457n0171M59223J59943N65532N10241J39811P56516M38841
4408D1134563L29964M92019L14125N91126N08011K12501k59161j59722k59073
4399D2904353n91942n17211m20844n01015J26779j60475k3596L6837k01562L51752
4389D1003076K98778J98837P54742R45712O68021J19992N36066m7466j88566K61789
4379D4550981L36803R3855j76557M1194N20401M62007J96555L76943M86094L55080
4369D7243356L57579j30666k46654l27136n34309J20822L06864Q0579J04120O74322
$$ y = [35840174, 36526718, 36923148, 36800768, 36893858, 36665487, 36744727, 36757222, 36659590, 37137949, 37466025, 37279657, 36799749, 36625510, 37072310, 36881625, 36656459, 37218172, 37642962, 37488985, 37911170, 38154627, 38104456, 38563679, 38723622, 39289154, 39799395, 39939206, 40695722, 41134563, 41464527, 41956546, 42270671, 42861797, 43369808, 43582309, 43323148, 43163426, 42904353, 42312411, 41795200, 41374356, 40873341, 41000120, 40839645, 40816049, 40852886, 40651324, 41003076, 41301854, 41500691, 42255433, 43201145, 43869166, 43989158, 44525224, 44477758, 44289192, 44550981, 44887784, 44981639, 44805082, 44846276, 45366677, 45828684, 46025239, 46402182, 46888276, 47243356, 47600935, 47470269, 47223615, 46896479, 46362170, 46482992, 46789856, 46870435, 46974555, 47648877]
4359D7648877R12471J237610J210553J005249J357985J225336R99754J047639
4351E6645474R19317O3378Q6953r7772j867o12770o88642o91625o34576K75095
4341E5262965K11214M79252N78267M55044M89942K95139O20743N75915L97362
4332E9365843L21375o7786j5529L34691J75377L65948O63434Q82109J584881J092189
4322F4702532J062420J203918J625599J600278J593916R75119N19808R84901K26856
4313G4495347M46615M05427M4183J30667R4994K5163j54014K0686J86123k0193
4303G5674998n17794J36331R7689o09127l70181J51694J39589j80654R15742J591724
4293G7030011J112343J288930J773557J417904K088913K726924L012037L584454
$$ y = [47648877, 48561348, 49798958, 51009511, 52014760, 53372745, 54598081, 55597835, 56645474, 57564791, 57628169, 57715122, 57617350, 57615483, 57002713, 56314071, 55622446, 54987870, 55262965, 55474179, 55953431, 56531698, 56986742, 57476684, 57771823, 58392566, 58968481, 59365843, 59687218, 59619432, 59603903, 59938594, 60113971, 60479919, 61143353, 62025462, 63610343, 64702532, 65764952, 66968870, 68594469, 70194747, 71788663, 72763782, 73283590, 74268491, 74495347, 74941962, 75347389, 75391572, 75522239, 75617233, 75642396, 75488382, 75509068, 75695191, 75674998, 75157204, 75293535, 75391224, 74782097, 74411916, 74563610, 74703199, 74522545, 75438287, 77030011, 78142354, 79431284, 81204841, 82622745, 84711658, 87438582, 90450619, 94035073]
4285I4035073M341785N778437O368392O895109P128104P477056O192989L600097
4277A41817042L52952j964654m784399p040136q268215q489402q144533o430135
4269I7048520n084680l774235k878632j741346j284818j220544n48040J70879
4261H0687104Q57859J138384J869832K372120K692843L567925N050870N396077
4253A03633014N416075N970595N689636L949036J469888j806498l385551n755067
4245A15181128p784138q789180q689491p161092o843857n021196m092199m323077
4237F2476898l183062k262550k261995j982776j962732j382415j570711j323325
4229D6547332j225059j239744p41717n81091o00616k50285J24637n20654j48249
$$ y = [94035073, 98376858, 104155295, 110523687, 117418796, 124546900, 132023956, 138216945, 141817042, 142169994, 140205340, 135420941, 128380805, 120112590, 111623188, 103478655, 97048520, 91963840, 88189605, 85310973, 83569627, 82284809, 81064265, 80516225, 80687104, 81544963, 82683347, 84553179, 86925299, 89618142, 93186067, 98236937, 103633014, 109049089, 115019684, 120709320, 124658356, 126128244, 124321746, 120936195, 115181128, 107396990, 98607810, 89918319, 82757227, 75913370, 70892174, 66799975, 62476898, 59293836, 57031286, 54769291, 52786515, 50823783, 49441368, 47870657, 46547332, 45322273, 44082529, 43340812, 42759721, 42159105, 41908820, 42033457, 41512803, 41364554]
4220D1364554j63954o33264j195000m82481q55686j180414p13391p04157j281483
4211C4154724l72827o99687n28232l98355m28517J62035n55746j62463k99340
4202C0871592k75248j75893k66829o26043m38341j95457l62910j32618j50222
4193B8248031n02684n13382j90906l57337O9417Q5534j35993r7587o1624k00285
4183B6343184M0273N47877l6350K33909j29534l98523L37914O9641R9866N16549
4173B7624806M2409j13550L8832l37842J02314L52820k196R2476P2567K67020
4163B8139656K82837M3811l2235L83666J70032L9314L32093K14362J06455l18615
4153B9361376J23490l11797r2724L6411L24543n3492Q1875P2038K04749J41417
$$ y = [41364554, 41200600, 40567336, 39372336, 38889855, 38034169, 36853755, 36140364, 35436207, 34154724, 33781897, 33082210, 32553978, 32155623, 31727106, 31889141, 31333395, 31170932, 30871592, 30596344, 30420451, 30153622, 29527579, 29089238, 28893781, 28530871, 28398253, 28248031, 27745347, 27231965, 27041059, 26683722, 26753139, 26838673, 26702680, 26605093, 26543469, 26343184, 26383457, 26931334, 26894984, 27128893, 26999359, 26600836, 26938750, 27008391, 27108257, 27624806, 27667215, 27553665, 27592497, 27254655, 27356969, 27709789, 27707593, 27800069, 27872636, 28139656, 28422493, 28466304, 28434069, 28817735, 28987767, 29027081, 29359174, 29573536, 29679991, 29361376, 29484866, 29173069, 29080345, 29116756, 29441299, 29387807, 29469682, 29541720, 29746469, 29887886]
4143B9887886P41088K84960p6898O68333J33871J38881j89541l81870l16011q1419
4133C0809280L51995r3107N63868L68841K83569L46649j1136M18291N11236K30823
4123C3780309J12317k43524j04293M57977l75993k14950M63287L99633O6747R91304
4113C5332814K79287Q96007N24637K66337J18838J6911J59249j54751J04524L45934
4103C7889787K54216m8884L57040J72270N64205O79841L30823Q13299J65494k75263
4093D0902828k59827k16616k58512p86530J17986K12283o9312L2926L12320P5931
4083D0063477j31913O48703K13435J69553r7665m31469j34588l50111m80226j79170
4073C9290026n36922j89487J64352n9373p296k02468l41803Q889q6784k06035
$$ y = [29887886, 30628974, 30913934, 30837036, 31505369, 31639240, 31778121, 31588580, 31206710, 30890699, 30809280, 31161275, 31068168, 31632036, 32000877, 32284446, 32631095, 32619959, 33038250, 33549486, 33780309, 33892626, 33649102, 33544809, 34002786, 33626793, 33411843, 33875130, 34274763, 34341510, 35332814, 35612101, 36508108, 37032745, 37299082, 37417920, 37434831, 37594080, 37439329, 37543853, 37889787, 38144003, 38095119, 38452159, 38624429, 39188634, 39868475, 40199298, 41012597, 41178091, 40902828, 40643001, 40426385, 40167873, 39381343, 39499329, 39711612, 39642300, 39675226, 39987546, 40063477, 39931564, 40580267, 40793702, 40963255, 40865590, 40434121, 40299533, 39949422, 39469196, 39290026, 38753104, 38563617, 38727969, 38668596, 38661300, 38458832, 38117029, 38125918, 38039134, 37833099]
4063C7833099n74036O8788Q8370l3044O7468m97255q61866n01994k31709p7531
4053C5280290o02760l12822j39586O4355n9637L1105L1236l83697l24876o18982
4043C2964626k48982j115702n23682m63999k72472q2574o8720m03163q18138o25328
4033B8341866L90515l99150n71268j92838o19247l21605k29878o03189o50798
4024B5144408l31421q6146q0642k97189l13811j75643o6659m88675j114L67141
4014B3670249J63233j81755j16652n32633k64127O48475J05129j60812k88782
4005B3042325m22165p12371o37218j28702o6151j81294R0467J93896K55888N9077
3995B1493752J69188j43592K87426r5470K38061K72132N16171P6997K82619P04640
$$ y = [37833099, 37259063, 37327851, 37416221, 37383177, 37450645, 36953390, 36091524, 35589530, 35357821, 35280290, 34677530, 34364708, 34225122, 34289477, 34229840, 34260945, 34292181, 33908484, 33583608, 32964626, 32715644, 31599942, 31076260, 30612261, 30339789, 30257215, 30188495, 29785332, 28967194, 28341866, 28732381, 28333231, 27761963, 27569125, 26949878, 26628273, 26398395, 25795206, 25144408, 24812987, 24726841, 24646199, 24349010, 24035199, 23859556, 23792897, 23304222, 23303108, 23670249, 23833482, 23651727, 23535075, 23002442, 22738315, 23386790, 23491919, 23331107, 23042325, 22620160, 21907789, 21270571, 21141869, 21075718, 20894424, 20984891, 21178787, 21434675, 21493752, 21662940, 21519348, 21806774, 21711304, 21949365, 22221497, 22737668, 22814665, 23097284, 23801924]
3985B3801924L72682O55975N68396Q97875N18569J261265J033684R58834J392220
3976C1461424J796514K153473K863976L463475M444166N480061P121223Q888897
3968F7673209J1818558J5141435J6697019J6054374P728765q798384k0827969
3961A05487007k1493631j6030168j1959113p593064n534954m384657l756662k629244
3953C2105514j936204k125266j615066j464562j316619j191643r89323j159257
3945B0307574p96219m28047m39964o68262m07686j9525m46847p21604o50455k09993
3935A5518972m94494o99745j40078n88265M68l67914l65105J38624J29802p27624
3925A2404641m47477l25291M4421l00945m05549m2845k7719o0693r3123n19226
$$ y = [23801924, 24174606, 24830581, 25398977, 26296852, 26815421, 28076686, 29110370, 30069204, 31461424, 33257938, 35411411, 38275387, 41738862, 46183028, 51663089, 58784312, 67673209, 79491767, 94633202, 111330221, 127384595, 135113360, 126314976, 105487007, 83993376, 67963208, 56004095, 48411031, 42876077, 38491420, 34734758, 32105514, 30169310, 28044044, 26428978, 24964416, 23647797, 22456154, 21466831, 20307574, 19511355, 19083308, 18643344, 17975082, 17567396, 17547871, 17101024, 16379420, 15728965, 15518972, 15024478, 14324733, 14184655, 13596390, 13596858, 13228944, 12863839, 13002463, 13132265, 12404641, 11957164, 11631873, 11676294, 11375349, 10969800, 10926955, 10899236, 10838543, 10745420, 10226194]
3915A0226194K85785l57686m27028k95888o18493K39962p3811J6973j17519J31192
3905I009681k59168r5278K25830j84708j14952k9965j0778l80026n51810J44406
3895G753232K88107j38043K90424j4313p5999O0125j21672k33168p7221k07528
3885G523944j48851L18927j32308M7783n26190J53504M60986k18492K2516k96962
3875G204857O0582p9661N5400L85232N8645p1395k58934Q7816j57336m63826J8869
3864F840249l30715M253n9237n9753j4282N3833J63052r2306Q4848K33005n9605
3853F763342m58801o4208J82540Q2187j81557M5669J47260J39449o7372M9925
3843F638434l7713j47946k6462p8170M56546M82835k94865j29056J00035K05150
$$ y = [10226194, 10511979, 10154293, 9727265, 9431377, 8812884, 9052846, 8979035, 8996008, 8878489, 9009681, 8750513, 8655235, 8881065, 8696357, 8581405, 8551440, 8540662, 8160636, 7608826, 7753232, 8041339, 7903296, 8193720, 8179407, 8103408, 8163533, 8041861, 7808693, 7731472, 7523944, 7375093, 7694020, 7561712, 7609495, 7083305, 7236809, 7697795, 7479303, 7501819, 7204857, 7265439, 7185778, 7241178, 7626410, 7685055, 7613660, 7354726, 7442542, 7285206, 6821380, 6840249, 6509534, 6513787, 6454550, 6394797, 6380515, 6434348, 6597400, 6505094, 6589942, 6822947, 6763342, 6304541, 6240333, 6422873, 6505060, 6323503, 6369172, 6516432, 6655881, 6588509, 6638434, 6600721, 6452775, 6426313, 6348143, 6804689, 7287524, 6992659, 6863603, 6963638, 7168788]
3833G168788j41283N984p279j53526l09308L2671J97849l183j12041J33386j10767
3822F701291P24036P0823l55960N7383M52087k69489k81572K24274l8243J80330
3812G464960o1164L45453j19483n2271O9882M69234J49505k17510J47334K58567
3802H454507k8183j57815L4198K39408J74768K57568J43531l46430J83946o1348
3792H894150K36133O19771J36569m72255l7310K39321J27965M92466K31889l38479
3782A0130220j62426M25607N9949J33236q9363J6951L08201L16791N0201M3021
3772A1232388L0000j68809l14319M86305K73895L51559k8032J37588J97698J87758
3762A2386031j79786M5475K90636j76799M28957K27527m4023J12535P66514J67512
$$ y = [7168788, 7027505, 7033489, 7026210, 6872684, 6563376, 6596047, 6793896, 6790713, 6678672, 6812058, 6701291, 7425327, 7496150, 7140190, 7197573, 7649660, 7380171, 7098599, 7322873, 7284630, 7464960, 7403796, 7749249, 7629766, 7577495, 7647377, 8116611, 8266116, 8048606, 8195940, 8454507, 8426324, 8268509, 8302707, 8542115, 8716883, 8974451, 9117982, 8771552, 8955498, 8894150, 9130283, 9750054, 9886623, 9414368, 9377058, 9616379, 9744344, 10236810, 10468699, 10130220, 9967794, 10393401, 10453350, 10586586, 10497223, 10514174, 10822375, 11139166, 11189367, 11232388, 11262388, 11093579, 10779260, 11265565, 11539460, 11891019, 11862987, 12000575, 12198273, 12386031, 12206245, 12251720, 12542356, 12365557, 12794514, 13022041, 12978018, 13090553, 13857067, 14024579]
3752A4024579K31231j25387L00556J42455j07955K00309N91707L95665p3960M22601
3742A6001801J40724L03649K77786J26784N42904N67317L05389P15388L69097
3733A9350839L96079M27001P59907O88359K49320K79255J263635R66275L09352
3724B4690022N23708O29943M26779J078912K71772L31936J99747J28134P15182
3715B8996135P03J47859K66799j58778J40937j32333k88255L942l05961j99401
3705B8471647o70j83925j40951n12218k92974m26898n71334j12306l85763k00456
3695B5644152m77164p80969o54913k48730m30522j67227m77798K03686Q3425N0816
3685B2744756j06747L35325J31961K54654O02928K05421N48551M80678K14250
$$ y = [14024579, 14255810, 14130423, 14430979, 14573434, 14465479, 14665788, 15257495, 15653160, 15579200, 16001801, 16142525, 16446174, 16723960, 16850744, 17393648, 17960965, 18266354, 18981742, 19350839, 19746918, 20173919, 20933826, 21622185, 21871505, 22150760, 23414395, 24380670, 24690022, 25213730, 25843673, 26270452, 27349364, 27621136, 27953072, 28152819, 28280953, 28996135, 28996838, 29144697, 29411496, 29252718, 29393655, 29261322, 28973067, 28977009, 28671048, 28471647, 28470977, 28287052, 28146101, 27633883, 27340909, 26914011, 26342677, 26230371, 25844608, 25644152, 25166988, 24386019, 23731106, 23482376, 23051854, 22884627, 22406829, 22610515, 22693940, 22744756, 22638009, 22973334, 23105295, 23359949, 23962877, 24168298, 24716849, 25197527, 25411777]
3676B5411777M43513J105991J001050L84126N23947K28476Q96502M74564J98505
3667C0668451O08749N76804O20139N40209Q82192L75699L30535o574L6026N10438
3657C5142668J19168J28849K84022P04449R0027L73063M88535M3123M95575N08767
3647C8378246L20980L8881j89016m96534m22893j69555l44046m54597k61208k53462
3637C6146796n66388k3564k94775l76270K48847j59916J08730M85121K88026N53283
3627C6409890K10746l84417o05393j35635K13403J63721K35790R8744j27147J66142
3617C6245844L73747l7560J25526k51997q4099k5279N62636k28218j94127L5651
3607C6522124k56058k71715L20661q5673l36944M65109k25023n15051r5796l11379
$$ y = [25411777, 25855290, 26961281, 27962331, 28346457, 28870404, 29098880, 29995382, 30469946, 30668451, 31277200, 31854004, 32474143, 33014352, 33896544, 34272243, 34602778, 34596204, 34632230, 35142668, 35261836, 35390685, 35674707, 36379156, 36469183, 36842246, 37330781, 37373904, 37869479, 38378246, 38699226, 38738107, 38549091, 38052557, 37629664, 37460109, 37116063, 36661466, 36400258, 36146796, 35580408, 35556844, 35262069, 34885799, 35134646, 34974730, 35083460, 35568581, 35856607, 36409890, 36620636, 36236219, 35630826, 35495191, 35708594, 35872315, 36108105, 36206849, 36079702, 36245844, 36619591, 36582031, 36707557, 36455560, 36371461, 36346182, 36908818, 36680600, 36486473, 36522124, 36266066, 35994351, 36315012, 36229339, 35892395, 36357504, 36132481, 35617430, 35521634, 35210255]
3597C5210255m19746l12017k44691n51691k71342j96157n8092K62493n45440n97655
3587C2275917r5170l65834k70338J08116L10887o79009l75372L23491J67824j49547
3577C1250965j54398j86025J40191J7639k2514o2649p2356n1596k35160J7082
3567C0641179n9586n4528j20016L40314L57537M56323m2253o2869L67439O73715
3557C2497255M62473K94587L48822O13640L95993O24419N63563N42265Q38190
3548C7181207P53969M68450N82364R80808L58982R14811J022205O56442J032739
3539D3951977J094290J082219O46574M45850P19381J053087J345803L43468N40070
3530E1222719R89321M93828R11975J151593O76765J224005J361205J012931J439238
$$ y = [35210255, 34790509, 34478492, 34233801, 33682110, 33410768, 33214611, 33156519, 33419012, 32873572, 32275917, 32180747, 31814913, 31544575, 31652691, 31963578, 31284569, 30909197, 31232688, 31400512, 31250965, 31096567, 30910542, 31050733, 31068372, 31045858, 30983209, 30910853, 30859257, 30624097, 30641179, 30581593, 30527065, 30407049, 30747363, 31104900, 31561223, 31518970, 31456101, 31823540, 32497255, 32959728, 33254315, 33603137, 34216777, 34612770, 35237189, 35800752, 36343017, 37181207, 37935176, 38403626, 38985990, 39966798, 40325780, 41240591, 42262796, 42919238, 43951977, 45046267, 46128486, 46775060, 47220910, 47940291, 48993378, 50339181, 50682649, 51222719, 52212040, 52705868, 53617843, 54769436, 55446201, 56670206, 58031411, 59044342, 60483580]
3521F0483580J245618J364533J283759K098993J505211J485324J358350J303415
3513G2128783J347433J289335J105674P57432J93220J78691J37773M86308M18330
3504G8042979K57979K240K16618L80035R15649J005936N58136M66327M43293J255914
3494H3545106J072028P06253Q42336N73150k0793Q86782N16477k04446n1487M4145
3484H7909551l97012N819n65118p02653m92131o43501p03602q69677m20098n76380
3474H2545198k17406K6751m0571J291616J005764J453446J546343J121742J131788
3465H9864671J525635J347556N26143M46327k0821p01736q06134j333890j893984
3456H8953767k049923j896090k198766k242506k170169j440880j536757j013302
$$ y = [60483580, 61729198, 63093731, 64377490, 66476483, 67981694, 69467018, 70825368, 72128783, 73476216, 74765551, 75871225, 76628657, 76821877, 77000568, 77138341, 77624649, 78042979, 78300958, 78303198, 78519816, 78899851, 79815500, 80821436, 81379572, 81845899, 82289192, 83545106, 84617134, 85323387, 86165723, 86738873, 86718080, 87604862, 88121339, 87916893, 87865406, 87909551, 87512539, 87518358, 86953240, 86250587, 85758456, 85114955, 84411353, 83541676, 83121578, 82545198, 82327792, 82354543, 82313972, 83605588, 84611352, 86064798, 87611141, 88732883, 89864671, 91390306, 92737862, 93264005, 93710332, 93689511, 92987775, 92181641, 90847751, 88953767, 86903844, 85007754, 82808988, 80566482, 78396313, 76955433, 75418676, 74405374]
3448G4405374l31178q42545k83348n42676o9044O2700K58190J33560k00132O2116
3438G2653017p9931O8864J7030k51243l79103M0221j78883o23483m14855r32258
3428F9919376k97820l41739n44426n72638K1615k86044q3243j0445Q6209R7617
3418F7988462Q2874k62412L47027n6769L5712K15251P8569k80151l90618k83228
3408F7474717o94031p15013r82259p64253o02989r61529j003074p10150r60538
3399F0080881o334k69724q21564q88362m98946k57788l68500k23681l3765j00205
3389E6612012J19423q4930l2521j57035o5982J74062m7623k33347Q6630q1820
3379E6288869O37174q0355M68326P8189k6786j27864N90248N1600K6132P78390
$$ y = [74405374, 74074196, 73231651, 72948303, 72405627, 72336583, 72399283, 72657473, 72791033, 72590901, 72653017, 72573086, 72641950, 72658980, 72407737, 72028634, 72068855, 71889972, 71266489, 70851634, 69919376, 69621556, 69279817, 68735391, 68162753, 68184368, 67898324, 67815081, 67804636, 67890845, 67988462, 68071336, 67808924, 68155951, 68099182, 68134894, 68350145, 68428714, 68148563, 67757945, 67474717, 66780686, 66065673, 65083414, 64319161, 63716172, 62754643, 61751569, 61041419, 60080881, 60074547, 59804823, 58983259, 58094897, 57595951, 57338163, 56969663, 56745982, 56712217, 56612012, 56731435, 56646505, 56613984, 56456949, 56390967, 56565029, 56517406, 56284059, 56370689, 56288869, 56926043, 56845688, 57314014, 57392203, 57365417, 57237553, 57827801, 57879401, 57905533, 58683923]
3369E8683923P1251L41977K64123P59084J51367L91650J028925M61839P09282
3360F2863421O10717P52967Q38695R82778J310022J030391R61196J587786J413145
3351G2351118J435030J475920J869512K248920K208404J959815K026930L174342
3343H8749991K210125L168151L601752L698058L338578L571252L855245L470197
3335A15663349L339986L214291K816839K999508K518664K474057K283958J766132
3327A37076784K666531K661443K639804K946158L300654L480778K948666K817899
3319A60538717K125069J379457J565403J655411J745391J680869J252271K230998
3311A74173586K445003K335491K700059L258745M244766M485985M155274M970683
$$ y = [58683923, 58755174, 59097151, 59361274, 60120358, 60271725, 60663375, 61692300, 62154139, 62863421, 63474138, 64227105, 65065800, 66048578, 67358600, 68388991, 69350187, 70937973, 72351118, 73786148, 75262068, 77131580, 79380500, 81588904, 83548719, 85575649, 88749991, 90960116, 94128267, 97730019, 101428077, 104766655, 108337907, 112193152, 115663349, 119003335, 122217626, 125034465, 128033973, 130552637, 133026694, 135310652, 137076784, 139743315, 142404758, 145044562, 147990720, 151291374, 154772152, 157720818, 160538717, 162663786, 164043243, 165608646, 167264057, 169009448, 170690317, 171942588, 174173586, 176618589, 178954080, 181654139, 184912884, 189157650, 193643635, 197798909, 202769592]
3303B02769592N063482M321218M701323M366167L668403K946197J891879J144760
3295B30873021J183747M5118r36656j556118j618644k089579j919574r25798j062516
3286B21993001n34118K63282J311393J345384R03260j16761n342540r361182r254730
3277B01206989q292056o339269n218047n446581n012137l720121l261288k778928
3269A61138562j992360j297237j577140j171490m26347m5517K20392L02573k28990
3260A54922446O62012J928195J450548J615851K324690K645291L715992N293148
3252A74558173O481935P505087Q021733O489060j336900r910021j2668227j0120173
3244A69020667p173295o104694n553713m588898l583666l514830k960243l175286
$$ y = [202769592, 207833074, 212154292, 216855615, 221221782, 224890185, 227836382, 229728261, 230873021, 232056768, 232101886, 231165230, 229609112, 227990468, 225900889, 223981315, 223055517, 221993001, 221458883, 221722165, 223033558, 224378942, 225282202, 225165441, 219822901, 210461719, 201206989, 192914933, 186575664, 181357617, 175911036, 170898899, 167178778, 163917490, 161138562, 159146202, 157848965, 156271825, 155100335, 154673988, 154628471, 154848863, 155151436, 154922446, 155584458, 157512653, 158963201, 160579052, 162903742, 165549033, 169265025, 174558173, 181040108, 188545195, 196566928, 203055988, 201719088, 191809067, 179140840, 169020667, 161847372, 155742678, 150188965, 145600067, 142016401, 138501571, 135541328, 132366042]
3236A32366042l138676k787216l117015k959634k727223k905779k566394k021169
3228A10142936j529994j736768j423941p18089p43267o53760J86612Q22070J649825
3219A05995624K667906L071511L786412J523040l607824o103146n466205m309810
3211I7557508l022023k224410j925554j276762o63795k98740l90974J23301M94273
3202H8372824Q48142P39249J518575K225707J756329J709823O29974j88079j385481
3193I6227063j920962k231697j769924j501367o73212M20228J28622L80596R31767
3184H9991114O00499Q70896P60759O68241O51070J530089J568046Q14236R06417
3175I8361367J182024J396100J189910J661257L181990L237896L427932M267985
$$ y = [132366042, 129227366, 126440150, 123323135, 120363501, 117636278, 114730499, 112164105, 110142936, 108612942, 106876174, 105452233, 104734144, 103990877, 103337117, 103523729, 104345799, 105995624, 108663530, 111735041, 115521453, 117044493, 113436669, 107333523, 101867318, 97557508, 94535485, 92311075, 90385521, 89108759, 88444964, 88146224, 87755250, 87878551, 88372824, 89220966, 89960215, 91478790, 93704497, 95460826, 97170649, 97800623, 97612544, 96227063, 94306101, 92074404, 90304480, 88803113, 88129901, 88550129, 88678751, 89059347, 89991114, 90591613, 91462509, 92223268, 92891509, 93542579, 95072668, 96640714, 97454950, 98361367, 99543391, 100939491, 102129401, 103790658, 106972648, 110210544, 113638476, 117906461]
3167A17906461N095989N612731O262499M865926K360009j184011l822600m045729
3159A33051275l308383k741617j965208j716850j130473q67777j707970j115380
3151A18497617j968097k455125j744969j743099k110694k494991k139496j788755
3143A02052391j531210j135737r66635q03961L11493O67163J068872J350485J659425
3134A02672286J986174K215288K054215J460296M05236j447801j743927k508409
3126A05093358k419380k225313k116069j573184j910697k355247k313547k765678
3118H7414243k209380k027672k120940k898763k402882k003554k206067j798893
3110F9746092j453766j563603j027501j004882j042707p66994o11832o52714m89878
$$ y = [117906461, 123002450, 128615181, 134877680, 139743606, 142103615, 140919604, 137097004, 133051275, 129742892, 127001275, 125036067, 123319217, 122188744, 121320967, 119612997, 118497617, 116529520, 114074395, 112329426, 110586327, 108475633, 105980642, 103841146, 102052391, 100521181, 99385444, 98418809, 97614848, 97926341, 98593504, 99662376, 101012861, 102672286, 104658460, 106873748, 108927963, 110388259, 110793495, 109345694, 107601767, 105093358, 102673978, 100448665, 98332596, 96759412, 94848715, 92493468, 90179921, 87414243, 85204863, 83177191, 81056251, 78157488, 75754606, 73751052, 71544985, 69746092, 68292326, 66728723, 65701222, 64696340, 63653633, 62886639, 62274807, 61622093, 61132215]
3101F1132215o11311m77556q23641o31797l14446n04210n64029q11769p80759
3092E5612697l06279q20778r09831m05588n0767j62371p92468j097820n01305
3083E0565490l15424p08950q25314j86642k84605k01755m92222k83967N4510Q1320
3073D7402441p29284j30758m49527p21991k68647o72347m72071p58810q72138
3064D2326868r37902p40699j007684o34479n62133n10316r53300m91839l76964
3055C6111552o03872n54541n74031n27689l85883j28841r6372l32710p06381l60872
3045C1840360L44374L6472Q1228o8242N5001K31922K51980k34857j93580k26239
3035C2118419o07255m71266L60987K18267j9432k40198J87348J1947J51050L75189
$$ y = [61132215, 60520904, 60043348, 59219707, 58587910, 58273464, 57769254, 57205225, 56393456, 55612697, 55306418, 54485640, 53575809, 53170221, 53119454, 52957083, 52164615, 51066795, 50565490, 50250066, 49541116, 48715802, 48529160, 48244555, 48042800, 47550578, 47266611, 47321121, 47402441, 46673157, 46542399, 46092872, 45370881, 45102234, 44429887, 43957816, 43199006, 42326868, 41388966, 40648267, 39640583, 39006104, 38443971, 37933655, 36980355, 36488516, 36111552, 35507680, 34953139, 34379108, 33851419, 33465536, 33336695, 33240323, 32907613, 32201232, 31840360, 32184734, 32221206, 32302434, 32234192, 32289193, 32521115, 32773095, 32538238, 32344658, 32118419, 31511164, 31039898, 31400885, 31619152, 31599720, 31359522, 31546870, 31558817, 31709867, 32085056]
3025C2085056K87209j43704M32857N11826r8116L22203L77664N66707L59959J85377
3015C4887038O12316O08590M09416M85611O33312M20122K41790J90075J82629
3006C8670899P44217l07330k80080J7535m8623K0816M00053O0027j17503N06874
2996C9666885N48642N67879J255781R30695L95424J333969J149447J359880J559561
2987D8768163K107523J934611K012810J545008J273420N68914M04684n31529o84434
2978E7399170p21042o83640l44000l2239o05089o15719L46551J49950J98625Q22173
2968E5914740J010019M60104J034881R58027J031401J039726J651487J687249
2960F4787634K333439K158449K777114K786170L464761L940774M040281M451742
$$ y = [32085056, 32372265, 32228561, 32661418, 33173244, 33075128, 33397331, 33774995, 34341702, 34701661, 34887038, 35499354, 36107944, 36517360, 37002971, 37636283, 38056405, 38298195, 38488270, 38670899, 39415116, 39107786, 38827706, 38845241, 38796618, 38817434, 39217487, 39277514, 39160011, 39666885, 40215527, 40783406, 42039187, 42969882, 43365306, 44699275, 45848722, 47208602, 48768163, 50875686, 52810297, 54823107, 56368115, 57641535, 58210449, 58615133, 58083604, 57399170, 56678128, 55994488, 55650488, 55618249, 55013160, 54397441, 54743992, 54893942, 55092567, 55914740, 56924759, 57384863, 58419744, 59377771, 60409172, 61448898, 63100385, 64787634, 67121073, 69279522, 72056636, 74842806, 78307567, 82248341, 86288622, 90740364]
2952I0740364L947223L395131J572027l42082j787974j938881k353101j796188
2944I1436519q27739j17064j60946K27083L96109J033348J647439K243613K443760
2935I8322122K461866K497300K573974L276098L752559M765216M613317N113288
2927A27375740N843002O711648Q032104R104613R794594J0929175J1731261J2730934
2919B02253071J2335496J0439140Q182987M247103n14335n025465q778463r118422
2911B14021112q160428o039185l220162j237995Q27607K381985L045834M791336
2903B06410104O320669P663983R272341J1784346J3746825J6471105J9207357
2896B90876730K0714993K1397408J9675474J3834382M899964m329630j2360821
$$ y = [90740364, 94687587, 98082718, 99654745, 99312663, 97524689, 95585808, 93232707, 91436519, 90608780, 90491716, 90330770, 90557853, 90953962, 91987310, 93634749, 95878362, 98322122, 100783988, 103281288, 105855262, 109131360, 112883919, 117649135, 122262452, 127375740, 133218742, 139930390, 147962494, 157067107, 166861701, 177790876, 189522137, 202253071, 214588567, 225027707, 233210694, 237457797, 236943462, 231917997, 223139534, 214021112, 205860684, 199821499, 196601337, 195363342, 196190949, 198572934, 201618768, 206410104, 212730773, 220394756, 229667097, 241451443, 255198268, 271669373, 290876730, 311591723, 332989131, 352664605, 366498987, 371398951, 367069321, 354708500]
2889C54708500j6144171j7031186j5201501j1917378q632547n325856j672921
2882B78782940L42330L461395N899299O323860M863954L50086o290941j1975446
2874B81757477j4584223j4011279j1084353q795238o567571m998280m150160l427892
2866B14138481l573535m270827m472748n610566o522825o881650p137923q023681
2858A67644726p387851q020992p274186p005285o989127o645698o541901n767697
2850A12011989n153671n176229m723703m953897m661023l954619l620746l273758
2842G6494343l052819k837914k790365l036084k576491k233751k172080k058764
2834E5736075k203024j336428j673520j896578j500700j002596j685732r52733
$$ y = [354708500, 338564329, 321533143, 306331642, 294414264, 285781717, 280455861, 278782940, 279125270, 282586665, 288485964, 294809824, 299673778, 300023864, 293732923, 281757477, 267173254, 253161975, 242077622, 233282384, 226714813, 221716533, 217566373, 214138481, 210564946, 206294119, 201821371, 196210805, 189687980, 182806330, 175668407, 167644726, 160256875, 152235883, 144961697, 137956412, 130967285, 124321587, 117779686, 112011989, 106858318, 101682089, 96958386, 92004489, 87343466, 83388847, 79768101, 76494343, 73441524, 70603610, 67813245, 64777161, 62200670, 59966919, 57794839, 55736075, 53533051, 52196623, 50523103, 48626525, 47125825, 46123229, 44437497, 43484764]
2826D3484764j490389j093632r30280j490210j452101o87502m87152o22429j346868
2817C3884201j031532k91475n85909j221784q54764q0326k70296q25816q31163
2808B7891136k65264q27569j234417l47970j52015m13379n60908j77043r53440
2799B2959131k25485p03637l25303l07420l76354m49485q1148l16115j95311l05956
2789A9672917p36956j48987K891k34368m17489k67845n18931k77087k19845l0919
2779A6823381k61874k70361l8497j77717K08799j76588J27067o47101o11486k73327
2769A4702296p35699k67400k62316J54190k15940l33694l41361J02388l49695
2760A2452769p34516j4379P8613o17871K64946j72741K34120k05394k47523J08268
$$ y = [43484764, 41994375, 40900743, 39970463, 38480253, 37028152, 36340650, 35853498, 35231069, 33884201, 32852669, 32561194, 31975285, 30753501, 29898737, 29818411, 29548115, 28722299, 27891136, 27625872, 26798303, 25563886, 25215916, 25063901, 24650522, 24089614, 23912571, 22959131, 22733646, 22030009, 21704706, 21397286, 21020932, 20571447, 20490299, 20174184, 19978873, 19672917, 18935961, 18786974, 18789865, 18555497, 18138008, 17870163, 17351232, 17074145, 16854300, 16823381, 16561507, 16291146, 16252649, 16074932, 16283731, 16107143, 16234210, 15587109, 14975623, 14702296, 13966597, 13699197, 13436881, 13591071, 13375131, 13041437, 12700076, 12802464, 12452769, 11718253, 11703874, 11782487, 11164616, 11429562, 11256821, 11490941, 11285547, 11038024, 11146292]
2750A1146292l11853q16920J36513L6019n0681M04852q1707k81458J45159n91055
2740I735161j38336K10887J69433m24268o2796K81014l4738n24474k52217l007
2730H956659J36944j89743l01597R106r4631J5940k96660j43494K3559j91606
2720G924477k81784Q4659k14462J62569r3237L9236k41577j96771M7360j23224
2710G107246q4885j75634K95716K64722n77360J69795o0371j79571J87832M9656
2700F997146l76151o83191l11945J2062K15892M9626J08695J95313L7140n0761
2690F193826j36471j96882O921n8236K54778m81121j13797k56973M54708k57683
2680E409070m75127l39894l43898J89543O6785K45304K72800l29385J68497M2633
$$ y = [11146292, 10834439, 10017519, 10154032, 10190051, 10139370, 10544222, 10462515, 10181057, 10326216, 9735161, 9596825, 9807712, 9977145, 9552877, 9490081, 9771095, 9736357, 9211883, 8959666, 8956659, 9093603, 8903860, 8602263, 8611369, 8516738, 8532678, 8236018, 8092524, 8116083, 7924477, 7642693, 7727352, 7512890, 7675459, 7582222, 7621458, 7379881, 7183110, 7230470, 7107246, 7022361, 6846727, 7142443, 7407165, 6829805, 6999600, 6939229, 6759658, 6947490, 6997146, 6620995, 5937804, 5625859, 5637921, 5853813, 5903439, 6012134, 6207447, 6244587, 6193826, 6057355, 5860473, 5867394, 5809158, 6063936, 5582815, 5469018, 5212045, 5666753, 5409070, 4933943, 4594049, 4250151, 4439694, 4506479, 4751783, 5024583, 4695198, 4863695, 4906328]
2670D906328k78450M34688l72114K89555r9144l69653k8374j50773l94400M29478
2660D367141L77053K57846n84680K7687R7858k9222j23694j85787m04250p1512
2650C728440M31401K07118n31355m0807J31961L02780K88323j17648M7102K77390
2640D724705k3483j74519P901m26761L35614j06736j89504m3866k86870O84004
2630D500485Q178j27976m2070K34233j38926j34158K12075l28953k08821j7862
2620C956205M09603j98976Q6790Q5316M11188O2340m95505K54574M45548O8032
2610E085115n15441l57580N70949J03349r0838j88058J3558m02348o21766K23051
2600C819991L34102r802l35836K93394M55699N5823j81070o4706J43778k62261
$$ y = [4906328, 4627878, 5062566, 4690452, 4980007, 4880863, 4511210, 4482836, 4332063, 3937663, 4367141, 4744194, 5002040, 4417360, 4445047, 4542905, 4513683, 4389989, 4204202, 3799952, 3728440, 4159841, 4366959, 3835604, 3794797, 3926758, 4229538, 4517861, 4400213, 4447315, 4724705, 4701222, 4526703, 4534604, 4107843, 4443457, 4336721, 4147217, 4103351, 3816481, 4500485, 4508663, 4380687, 4338617, 4572850, 4433924, 4299766, 4511841, 4182888, 3974067, 3956205, 4365808, 4166832, 4253622, 4338938, 4750126, 4812466, 4316961, 4571535, 5017083, 5085115, 4569674, 4212094, 4783043, 4886392, 4795554, 4607496, 4621054, 4218706, 3596940, 3819991, 4154093, 4144291, 3808455, 4101849, 4557548, 4613371, 4432301, 4367595, 4511373, 4249112]
2590D249112l15425j60247J98982q6889n02886J13219M4763o7863L61151j19168
2580C714749j05611j38448j98506m88163M3643J12556j35015J91897P8895j84803
2570B891194m1022k20792j21900L85156k31307J6825l4764j32316L21730J74743
2560C007547l98298r0585O939J21455J81421l15359k3986k08547l63324L56076
2550B273339M01729j69260k39565j57703L6862J58600Q075J52392K35978J76117
2540B876564k26864l45034j73345m75489K01538o2596M708K97125K17787R3747
2530B408141j81051L9677K6228k03708m3332k1429j71548O0574K48993R6734j19307
2519B139972R1709L71005m82310l52962K09016N7759J41375k59550m30005j52358
$$ y = [4249112, 3933687, 3773440, 3972422, 3885533, 3382647, 3495866, 3540629, 3472766, 3833917, 3714749, 3609138, 3470690, 3272184, 2784021, 2827664, 2940220, 2805205, 2997102, 3075997, 2891194, 2850172, 2629380, 2507480, 2892636, 2661329, 2678154, 2643390, 2511074, 2832804, 3007547, 2609249, 2518664, 2525603, 2647058, 2828479, 2513120, 2489134, 2280587, 1917263, 2273339, 2675068, 2505808, 2266243, 2108540, 2145402, 2304002, 2312077, 2464469, 2700447, 2876564, 2649700, 2304666, 2131321, 1655832, 1857370, 1794774, 1799482, 2096607, 2314394, 2408141, 2227090, 2266767, 2292995, 2089287, 2045955, 2024526, 1852978, 1913552, 2162545, 2259279, 2139972, 2231681, 2602686, 2120376, 1767414, 1976430, 2034189, 2175564, 1916014, 1486009, 1333651]
2509A333651L30521L42040K8782n07302K66484L27601m09338O5912J75017k40915
2499A712453k27407L79796J78877l56564k10288K74584M0776J49252J36589j94811
2489A883257k23822k56087J28221J10391j25577J13961K82526k82061k2088k01134
2479A407587J32102J28791j80328j11848n3223n39426L03650K43302j57031M18598
2469A592174O4722J31355K70989n53026j42578k33681L69005O44433n32853q7658
2459A522882l52181q8981K3500K07213K23597k48361n9633J6037k2702k6981k44045
2448I50345j53928K00398N78958k86634k07436J83393J55977n08402k07140M99422
2438A204953j13043J5385J86267p4598k13533J44863K53859L30530j55022Q5911
$$ y = [1333651, 1664172, 2006212, 2034994, 1527692, 1794176, 2121777, 1712439, 1778351, 1953368, 1712453, 1485046, 1864842, 2043719, 1687155, 1476867, 1751451, 1792227, 1941479, 2078068, 1883257, 1659435, 1403348, 1531569, 1641960, 1516383, 1630344, 1912870, 1630809, 1608721, 1407587, 1539689, 1668480, 1488152, 1376304, 1323081, 783655, 1087305, 1330607, 1173576, 1592174, 1656896, 1788251, 2059240, 1506214, 1363636, 1129955, 1498960, 2143393, 1610540, 1522882, 1170701, 1081720, 1105220, 1312433, 1536030, 1287669, 1228036, 1244073, 1221371, 1194390, 950345, 796417, 996815, 1575773, 1289139, 1081703, 1265096, 1421073, 912671, 705531, 1204953, 1091910, 1107295, 1293562, 1218964, 1005431, 1150294, 1404153, 1734683, 1579661, 1665572]
2428A665572k29789l93385K15860J19272J46569l62014J95848L1759m45667K2603
2418I66628j28299n3302J58964n4005j57864k80997L14612L66932j06760j39056
2408H86853j68038J06650J86952L8732j95950L38022k50248L47873L63893j02284
2398A552455J8188n11720P5723Q2751j1665j78593J676L33033l7684p8065j66326
2387A079773J87553M5203J6941l26525k43600K86415J88245j2778k67398j17593
2377H36236K43585J84863j36143K63110m7823J86893j92463k55493j73424j65545
2367G43796J42891L78489k16910k92883J68823Q6674J14853J7476k08385L3159
2357I67983l6387K61607k19930m2375k6819J9711k50997l57158J21611J37684
$$ y = [1665572, 1435783, 1042398, 1258258, 1377530, 1524099, 1162085, 1357933, 1389692, 944025, 966628, 838329, 785027, 943991, 889986, 732122, 451125, 765737, 1132669, 1025909, 886853, 718815, 825465, 1012417, 1051149, 855199, 1193221, 942973, 1290846, 1654739, 1552455, 1570643, 1058923, 1134646, 1217397, 1205732, 1027139, 1028815, 1361848, 1324164, 1246099, 1079773, 1267326, 1312529, 1329470, 1002945, 759345, 1045760, 1234005, 1221227, 953829, 836236, 1079821, 1264684, 1128541, 1391651, 1343828, 1530721, 1338258, 1082765, 909341, 743796, 886687, 1265176, 1048266, 755383, 924206, 1010880, 1125733, 1143209, 934824, 967983, 931596, 1193203, 973273, 930898, 904079, 923790, 672793, 315635, 437246, 574930]
2347E74930Q4143K23311K07549J66825k56350m12309J8858J28633K44403j06207
2337H73786j23476j00163k26003N88900j11217l1669K65924o6006p2991R6559
2327A093644L3660N8725M52833m45206K72544l14925j03323k77901M31486P4917
2317A276454j77926N0153J07366J7116l58812J45905N3882m182r5293j13293j95009
2306G06361K4018L68599J87472j76443l84403O92831Q9885J36478k68314O319
2296A382803k64109m83832M04831J79603m29430k68345K77812L199J74119K29838
2286A206489k13245j84810J15619L28461n16079J8895J41476J19982k32005j00821
2276F83962L62363J63467j256k11235K01101J8759k77387l80096M45063M2450
$$ y = [574930, 659073, 882384, 1089933, 1256758, 1000408, 588099, 606957, 735590, 979993, 873786, 750310, 650147, 424144, 1013044, 901827, 870158, 1136082, 1070076, 997085, 1093644, 1127304, 1186029, 1638862, 1193656, 1466200, 1151275, 1047952, 770051, 1201537, 1276454, 1098528, 1148681, 1256047, 1273163, 914351, 1060256, 1114138, 1109956, 1014663, 901370, 706361, 730379, 1098978, 1286450, 1110007, 725604, 1418435, 1508320, 1644798, 1376484, 1382803, 1118694, 634862, 1039693, 1219296, 789866, 521521, 799333, 802532, 976651, 1206489, 993244, 808434, 924053, 1252514, 736435, 755330, 896806, 1016788, 784783, 683962, 1046325, 1209792, 1208536, 997301, 1198402, 1217161, 939774, 559678, 1004741, 1047191]
2266A047191o0508j52759J41130K54338m11357m71811N28994n008K06267l98351
2256F78126M5783N22546P1090k34001K1961j85586J14280m7234J54153J65123
2246A306241j73243J09792K10584l61816Q7760P4938M8779J5820j5679k16518
2236A086658J1946L8262J56596j08773k61303J56908J78736n2702J62733r727
2226A359334l26R9159k16010N0559k52125L18991m4881k7861O5690p3312K74566
2215A553784j63445L3795O5971J4969J84640j87629k23628J41427J74125J58812
2205A752821K56627l66032r3435L71370K73883r18888q7321J84027j24032M88913
2195A737933P8332j0889j9484k6897M27008j91110j39926j37784M78587J83797
$$ y = [1047191, 986683, 833924, 975054, 1229392, 818035, 346224, 875218, 870210, 1076477, 678126, 723909, 1246455, 1317545, 1083544, 1105505, 919919, 1034199, 986965, 1141118, 1306241, 1132998, 1242790, 1453374, 1091558, 1179318, 1254256, 1303035, 1318855, 1303176, 1086658, 1098604, 1136866, 1293462, 1184689, 923386, 1080294, 1259030, 1206328, 1369061, 1359334, 1359008, 1458167, 1242157, 1292716, 1040591, 1359582, 1314701, 1286840, 1352530, 1279218, 1553784, 1390339, 1424134, 1490105, 1505074, 1689714, 1502085, 1278457, 1419884, 1594009, 1752821, 2009448, 1643416, 1549981, 1921351, 2195234, 1276346, 1189025, 1373052, 1249020, 1737933, 1816265, 1805376, 1785892, 1758995, 2186003, 1994893, 1854967, 1717183, 2195770, 2379567]
2185B379567Q9850J57716o0666N93860k79321o51284M19146j47194K76295k51814
2175B526155k26437Q8239L08461n293l11022K03517J98793M18824L4376k43860
2165B991753L86099l01488q2824Q7412M72659m33093K2022M83899M92998L82203
2155D501640k47584K5601r0479L54988K21844Q4517l1097R980K66281J12514L56852
2144E565057j6010K08501M65346K7568K73444J39164K17932j72295K77622L28884
2134G315213K54568M01216O62633P6411M13392L67499O1952L65126P73568K28328
2124A0919906R08988J257039J219626J252072J100423M71644M94750R49393J424660
2115A9998501K234578L316699L270380M343667N217989P013271Q677853J1268363
$$ y = [2379567, 2469417, 2627133, 2566467, 3160327, 2881006, 2229722, 2648868, 2501674, 2777969, 2526155, 2299718, 2387957, 2696418, 2691125, 2380103, 2583620, 2782413, 3201237, 3235613, 2991753, 3377852, 3076364, 2993540, 3080952, 3553611, 3120518, 3142540, 3626439, 4119437, 4501640, 4254056, 4279657, 4189178, 4544166, 4766010, 4850527, 4819430, 4829410, 5095691, 5208205, 5565057, 5549047, 5757548, 6222894, 6250462, 6523906, 6663070, 6881002, 6708707, 6986329, 7315213, 7569781, 7970997, 8633630, 8710041, 9123433, 9490932, 9552884, 9918010, 10691578, 10919906, 11828894, 13085933, 14305559, 15557631, 16658054, 17129698, 17624448, 18573841, 19998501, 22233079, 25549778, 28820158, 33163825, 38381814, 45395085, 54072938, 65341301]
2107F5341301J1942563J2827275N089684j1685490j7634243j5372611j0387530
2100D0120949o493937m776330m126376l246767k284197j674848j124301j563711
2092A4830482j010331n69517m75255r22992j396083p93165l91800m25887l1014
2083H814438m83579p46277m57773k77932o52576j22969l89971l91338m63734j76807
2073D651482j59810J76496m70598m58255L28133m38564O8362k83303Q6086j70655
2063C329374k49136m59726k28966L20661M6308K79944L17731k64243m34615j45711
2053B511621j42284n32532M86288K35826j26675l09797k24024j0235K54566l05237
2043A837517p8104L4297Q1567J25722k61636K38926L7651K7847J99863o63654
$$ y = [65341301, 77283864, 90111139, 95200823, 83515333, 65881090, 50508479, 40120949, 33627012, 28850682, 24724306, 21477539, 19193342, 17518494, 16394193, 14830482, 13820151, 13250634, 12775379, 11852387, 10456304, 9663139, 9271339, 8845452, 8814438, 8330859, 7584582, 7126809, 6848877, 6196301, 6073332, 5683361, 5292023, 4828289, 4651482, 4491672, 4668168, 4197570, 3739315, 4067448, 3628884, 3697246, 3413943, 3500029, 3329374, 3080238, 2620512, 2391546, 2712207, 2758515, 3038459, 3356190, 3091947, 2657332, 2511621, 2369337, 1836805, 2323093, 2558919, 2432244, 2122447, 1898423, 1888188, 2142754, 1837517, 1759413, 1793710, 1875277, 2000999, 1739363, 1978289, 2015940, 2043787, 2243650, 1579996]
2033A579996k9511m51013o4834L0441L24468M8238k46941l80715P3893M33227
2023A317249l1577l82748K97920K35404j42829k46062k54973P9984K80049L95613
2013A548030k53878m40821K78053p561J15771k92864m98391K39503M38029K01307
2003A327178k74492L657j00016K2660o9084k63543J79557l5376q0395l88679j01880
1992B19587J18392q3975K54288J64646J29591j82686l8530R3317N9453j82303
1982E51780J99752k68830K12106M1698j28198J40231j11035m3997r2112L72921
1972H74316P1155j75709j4527j09716R8133m58392K6032l17167L72760L42270
1962G09155Q9682Q4168j17273l46541J4498J27274j61034j19956J3093J01483
$$ y = [1579996, 1550485, 1099472, 1034638, 1065079, 1389547, 1437785, 1190844, 810129, 884022, 1317249, 1285672, 902924, 1200844, 1436248, 1293419, 1047357, 792384, 872368, 1152417, 1548030, 1294152, 853331, 1131384, 1123823, 1239594, 946730, 448339, 687842, 1125871, 1327178, 1052686, 1056343, 956327, 978987, 909903, 646360, 825917, 790541, 710146, 321467, 219587, 337979, 254004, 508292, 672938, 802529, 619843, 581313, 674630, 734083, 551780, 751532, 482702, 694808, 736506, 608308, 748539, 637504, 593507, 501395, 874316, 945471, 769762, 755235, 645519, 743652, 285260, 311292, -5875, 366885, 709155, 798837, 883005, 765732, 419191, 433689, 560963, 399929, 279973, 293066, 394549]
1952C94549l2644q7468L12535L8765j05998l04439L47059R4857J23039j20549
1942F59706k52106O2109K99220K55717l70721L56213K5170j79766N250l53j79711
1931F80728J60734m07840l90305M71223j40611k52551L72440J06636o81950p0826
1921a52322N89948M06154j51316j61101R9310k20418J69484J57320l71045K09480
1911E75494j70072M5303l5414Q905J64823J4678L2645j17558M420l77164J17845
1900B63905R9109K45588k9070R939n6134l87172O2850O17475j65289j98158J08077
1889E71120k67393o0670j09461K16785J93637j773k83172j72150J43079j5464
1879B14538Q4999k95484J92111R6697J52382J03964K87221o76153m5581N1682
$$ y = [394549, 361905, 274437, 586972, 625737, 519739, 215300, 562359, 657216, 780255, 659706, 407600, 469709, 768929, 1024646, 653925, 1010138, 1035308, 855542, 860792, 860439, 680728, 841462, 433622, 43317, 514540, 373929, 121378, 493818, 600454, -81496, -152322, 437626, 843780, 692464, 531363, 630673, 410255, 579739, 737059, 366014, 575494, 405422, 450725, 415311, 424216, 589039, 603717, 636362, 518804, 523224, 146060, 263905, 363014, 608602, 579532, 589471, 533337, 146165, 209015, 826490, 661201, 463043, 571120, 303727, 243057, 133596, 350381, 544018, 542245, 259073, 86923, 230002, 214538, 299537, 4053, 196164, 292861, 445243, 549207, 836428, 160275, 114694, 166376]
1869A66376j69392M54955o4185j23241K23079J39885k78154k46609J4874R5387
1859B12975m1445N33156j51568k96889j52397j52640L8732N18397J2781l84756
1849A36346k50628N59263N49911l60675o4158o8435K27638n6977J5055n4334K90836
1838I23842k87827m883Q6364j46441P069J02009J510k78223j28897j09869K55111
1827D19765j91393K42409K91152l61355O6411K8099l60584p1281N5164J52522
1817B70909K44903m23223K38032R5231j97895O009m48316n5547R1737J95987L07980
1806C25807k65758N22254J34594j85978j38043j66832N90048m72995M2883J66072
1796E52052K01557p7215m50678L31861n4811k53632j19753K68711j3909k30332
$$ y = [166376, -3016, 451939, 387754, 264513, 487592, 627477, 349323, 102714, 117588, 212975, 171530, 704686, 553118, 256229, 103832, -48808, -10076, 508321, 521102, 136346, -114282, 444981, 994892, 634217, 570059, 501624, 729262, 672285, 687340, 633006, 923842, 636015, 631132, 717496, 571055, 578124, 680133, 681643, 403420, 274523, 164654, 419765, 228372, 470781, 761933, 400578, 466989, 495088, 134504, 63223, 118387, 270909, 515812, 92589, 330621, 425852, 227957, 233966, -214350, -269897, -178160, 17827, 325807, 60049, 582303, 716897, 530919, 392876, 226044, 816092, 343097, 385980, 552052, 753609, 676394, 225716, 557577, 502766, 249134, 129381, 398092, 384183, 153851]
1786A53851j72823N3757L29392M22190m8899m29016N015K40166k92624m13670
1776a52661L02839j54847K46648j63917l33601K3980O18171P3239j90344p9193
1766A90314k02448l53431J64768J12025j25908J23914J82926J07555O3451K7306
1756B90472n20341l1551J63079J12151J86852m18250K98153N8177l87113L62883
1746A14512J61829l42046K37892l2364k67593n07386N31674N99431r9560r0127
1736C06262l87524J61521j7694j28151J14509L77059P3359J54607k38077l91345
1726B4526J49037K59244l03562j95481R8671J0988K6842l22696R2368R4125n36418
1715f02356K18499N02214M9444J74436j48502l45255K13191k32771j62727K45409
$$ y = [153851, -18972, 34785, 364177, 786367, 737468, 308452, 313467, 553633, 261009, -152661, 150178, -4669, 241979, 78062, -255539, -231559, 386612, 459851, 269507, 190314, -12134, -365565, -200797, -88772, -214680, -90766, 92160, 199715, 263166, 290472, -229869, -261420, -98341, 13810, 200662, -217588, 80565, 138742, -248371, 114512, 276341, -65705, 172187, 139823, -127770, -635156, -103482, 495949, 396389, 306262, -81262, 80259, 62565, -65586, 48923, 425982, 499341, 653948, 415871, 24526, 173563, 432807, 129245, -66236, 32435, 43423, 70265, -252431, -160063, -65938, -602356, -383857, 118357, 167801, 342237, 193735, -151520, 61671, -171100, -333827, -88418]
1705h8418J39062J20869K92555l82110J4026P3700K52640M4728l19915j02908
1695D4229P3568m56535k7742J36411J99271P6469K0308O30459m14140q9127L6925
1684B30096k46782J26327n3943R7406J03021P5748r0377J19557M8678Q4733J02290
1673E96754j87925J21238l36599j84347J73304j31918k39754n5611K82788R6899
1663A34829j4249m07891J91622K99965L78715m00969k20105N65013l86730L0695
1653A70895L9224m17312R5974M36465m06161k00711M65776M68485k76221K1311
1643C97725k68202K33028J19087k74208m26775r565r0139K05872j32580O09400
1633C63643L13049J05380m40617l99728L79144J67159J83134j84533m54510J85869
$$ y = [-88418, 50644, 171513, 464068, 81958, 95984, 169684, 422324, 467052, 147137, 44229, 117797, -338738, -366480, -230069, -30798, 45671, 65979, 696438, 282298, 193171, 230096, -16686, 109641, 55698, 153104, 256125, 331873, 241496, 361053, 409731, 494464, 596754, 408829, 530067, 193468, 9121, 182425, 50507, -189247, -244858, 37930, 134829, 120580, -287311, -95689, 204276, 582991, 182022, -38083, 526930, 140200, 170895, 210119, -207193, -111219, 325246, -80915, -281626, 184150, 652635, 376414, 397725, 129523, 362551, 481638, 207430, -219345, -228910, -319049, -113177, -245757, 363643, 676692, 782072, 341455, -58273, 320871, 488030, 671164, 486631, 32121, 217990]
1623B17990m4036n0344N38451k70635l10678J49603M54891j01737p17118k21154
1613c54767L64305N6203J98956j47718m15790j40072M47901L42194m24830j66
1603g3784L76250j34119K33995j70266K07285k76854l31736l8226L85392K9218
1593B07155n93754L44927K57426k91310K04691J58902q762m70609M51421J57409
1583D17496j19087j03810K72224k27799O4006j90557r8267n1200L98419M5004
1573D06429n3535O5746n60591Q3368K25193R63j10555L4930m9184J18799k20129
1562e8566J6309p6548L73675J55713l87562n5109J34319k32935r8118J46675j04003
1551a86150J04995K12485j46977k3514Q9002j76k01221p9471M2635J78978N25003
$$ y = [217990, 173954, 123610, 662061, 391426, 80748, 230351, 685242, 583505, -133613, -354767, 9538, 65741, 264697, 116979, -298811, -438883, 9018, 351212, -73618, -73784, 302466, 168347, 402342, 232076, 439361, 162507, -169229, -207455, 177937, 207155, -386599, -41672, 215754, -75556, 129135, 288037, 279275, -191334, 260087, 417496, 298409, 194599, 466823, 239024, 303030, 112473, 14206, -36994, 361425, 406429, 352894, 418640, -141951, -58583, 166610, 167573, 57018, 91948, 42764, 161563, -58566, -42257, -118805, 254870, 410583, 23021, -32088, 102231, -130704, -228822, -82147, -186150, -81155, 131330, -15647, -39161, 49841, 49665, -151556, -231027, -188392, -9414, 515589]
1540E15589L3041n65329N2714J38128k56351J48759L04175k19651Q1103M1348
1530B73526O3502L52537m66348k80180p8903M073M26552q3517k55287q2324M62659
1519C36290Q2816J77090J1357l19300m51452J85339k61846J41781J03739o0315
1509e4501k7616K32201J83938m731l11816k8764k08076K38360L3640l1731P9941
1498A00845k2418L83170N1286K71251l55875j82175k13922j98492n584j99539
1488c71453K57415j25547K80197K77658j61102L2356k27565k76449J41184J33017
1478d0289l59658L55507J29913L1391N1694m9601p3364j27760L32873j78943j34347
1467f2584L96757N1433r4912k81398j39386R9933J51970q1297J16391J85376J34316
$$ y = [515589, 548630, -16699, 36015, 174143, -82208, 66551, 370726, 151075, 232178, 273526, 337028, 689565, 223217, -56963, -135866, -131793, 294759, 211242, -44045, -126369, 336290, 419106, 596196, 607553, 288253, -163199, 22140, -239706, -97925, 5814, -54501, -82117, 150084, 334022, 329291, 17475, -11289, -219365, 18995, 52635, 20904, 100845, 78427, 461597, 512883, 784134, 428259, 246084, 32162, -166330, -171914, -371453, -114038, -239585, 40612, 318270, 157168, 189524, -38041, -314490, -173306, -40289, -399947, -44440, 85473, 116864, 168558, 118957, 45593, -82167, 250706, 71763, -62584, 334173, 385606, 290694, 9296, -130090, -30157, 121813, 40516, 156907, 342283, 476599]
1456D76599k51062o5834K41554J04402n09822k37309J97344P1245K66368M887
1446B98372l07728n28M40656n3887n30001J1758q9892l8081J55412J97932j01673
1435a7660K8901n0047m14843K21949K50464k47532M26772k61704N8775k13030
1425b17955O4521O1055k84689O2320J60347M20070r4299l66866k9398K37227r2569
1414h0236l6347K73465j99999n28305K11282M99303N3943k10586K0024p9381J53762
1403G6925n30515j75404N33296j23756N1352L50330N914p9512j61362J11630J64560
1392B23458j63810n249k12327L7508j28470J9627L59198R2899j06643l574n6040
1381E6577n6148n2671k85279M31585J14075j82634j24784j27791K54481N0912
$$ y = [476599, 225537, 159703, 401257, 505659, -4163, -241472, -44128, 27117, 293485, 298372, -9356, -9884, 430772, 376885, -153116, -141358, -231250, -269331, -113919, 84013, -17660, 11241, -38806, -453649, -231700, 18764, -228768, 198004, -63700, -4925, -217955, -153434, -92379, -377068, -314748, -154401, 265669, 171370, -195496, -224894, 12333, -80236, -116583, 156882, -43117, -571422, -360140, 139163, 193106, -17480, 2544, -76837, 76925, -453590, -628994, -95698, -219454, -168102, 182228, 188142, 108630, -52732, 58898, 223458, 59648, 54399, -157928, -120420, -248890, -229263, 129935, 222834, 116191, 112617, 56577, 429, -52242, -337521, 94064, 208139, 25505, -99279, -227070, 27411, 78323]
1371G8323M8125Q3216r5497l58707K25488J67786J06950J59604o89986J00932
1361a73766r7118K89125l12731o00381N9637N71059k557M1317l8839J5260N626
1350b43368L9498j31304k5370N80902J6394m5939m5783p6701j74858J05518K98973
1339B97962J78035n79907p6286M17877M6371r2934k56731j57242J64566L84313
1329C26024o54623R9714K5295k31114P24790K60477l02604l24428L72673l64972
1319f8768k08686j62049j42196K76201N04759k53133p8368k10342j5632J36177
1309b22037M29215K60339n10048J8825J18157k51716j02415K91299P7701J40286
1299B49606N3639j16002n497l72990k40492L58086K15544J40120j95947n1227
$$ y = [78323, 126448, 209664, 114167, -244540, -19052, 148734, 255684, 415288, -274698, -173766, -270884, 18241, -294490, -894871, -835234, -264175, -266732, -225415, -264254, -248994, -243368, -203870, -335174, -360544, 220358, 236752, 190813, 145030, 68329, -106529, -1011, 297962, 475997, -103910, -180196, 237681, 284052, 191118, -65613, -222855, -58289, 326024, -328599, -228885, -203590, -434704, 290086, 550563, 247959, -76469, 296204, -68768, -277454, -439503, -581699, -305498, 199261, -53872, -132240, -342582, -358214, -222037, 207178, 467517, -42531, -23706, 94451, -157265, -259680, 31619, 109320, 249606, 303245, 187243, 181746, -191244, -431736, -73650, 141894, 282014, 86067, 34840]
1289C4840j28484l65946K80691P3999N12065K67548m09388j49120J08080k27811
1279c526N6483l9277k27541L97763M7204k9051l55125O4096M30300n603M4369
1268C80092P0227J67080l21385l21173J35604j82470L89630K31185j29890m77290
1258e8390l24505j87648O9634J36464K48151K26533k06734J54966J6721J86648
1248B61840J85230o54988k56063K10771M42112r3477l4886j52800N7600J40082
1238A05421j83530K00224O7337K1642j9519L7501k18636K55140j72420K8581P7822
1227A99563l50506K70006J912k7102K92556m94701L8076M85256l3727j61086K1490
1216B41737l05035R7128R7670k54617J27797L4905J33706o1612M3124j49410L91339
$$ y = [34840, -93644, -459590, -178899, -104900, 407165, 674713, 265325, 116205, 224285, -3526, 52957, 13680, -213861, 183902, 231106, 202055, -153070, -88974, 341326, 335723, 380092, 450319, 617399, 296014, -25159, 110445, -72025, 317605, 548790, 418900, -58390, -382895, -570543, -500909, -364445, -116294, 110239, -96495, 58471, 75192, 261840, 447070, -207918, -463981, -253210, 188902, 95425, 60539, -92261, -34661, 105421, -78109, 122115, 189452, 211094, 191575, 229076, 10440, 265580, 93160, 121741, 199563, -150943, 119063, 120975, 93873, 386429, -108272, -70196, 415060, 381333, 220247, 241737, -63298, 33830, 131500, -123117, 4680, 39585, 173291, 111679, 154803, 5393, 396732]
1205C96732K8643J40683k03759L43481j58382k57069k29866k17517K1534K6098
1195a09422l43525K07718N29409J52231p1068j39300l9887r2250J37764J8377
1185B50047J02549n9565k12864k24067m7242l8040L18407j1033J00916K16639
1175C95747k30466J6145J4883J24852L53574l48506N6743m17441O759k92860L78624
1164E8054J68347r659k40939m09272J84445L37197l39851J36304L44317K70280
1154D99223k76859n38420j92081N0721r5538j2288J44949M33474k34041R3044
1144a27816K61830j2408r7818l11579J83239j5478J24639J56724l26388R2244
1134g2811J09642k98344O32375q2688j31421O4726j03257j09821p23459K37553
$$ y = [396732, 425375, 566058, 362299, 705780, 547398, 290329, 60463, -157054, -135520, -109422, -452947, -245229, 284180, 436411, 365343, 226043, 186156, 93906, 231670, 250047, 352596, 293031, 80167, -143900, -191142, -229182, 89225, 78192, 179108, 395747, 165281, 181426, 196309, 321161, 674735, 326229, 382972, -34469, -27710, -320570, 58054, 226401, 216742, -24197, -433469, -249024, 88173, -251678, -115374, 228943, 499223, 222364, -316056, -508137, -457416, -552954, -565242, -420293, 13181, -220860, -127816, 134014, 121606, 23788, -287791, -104552, -120030, 4609, 161333, -165055, -72811, 36831, -261513, 370862, 288174, 156753, 221479, 118222, 8401, -715058, -477505]
1124d77505N79316j17334J33799j67738l37775K85921K3262k93364J11776J83699
1114g5943N11667l79282l39604J30097N6885K20334J33410j0240j16303k09191
1104g8170J43101k24709p8452k19234L90605J52878n6630K01550r7872k40888
1094a07821L39586k69830k75810l35172N70489N87797j96507m34001j7183J20128
1084a8324p9991p4200j86491K30443j00986L66659M37114k20937l35873k42593
1074b25179J22694J34544l66752M474j29447M8306J42520n6431j27099O7906J13149
1063b71315J84040K98185l60394k73866L85436m20680Q7040n44j90320q7963p7533
1052g27914J26806J0179K85008k82941j44533N58921J59369Q6898j57297p4787
$$ y = [-477505, 101811, -15523, 118276, -49462, -387237, -101316, -78054, -371418, -259642, -75943, 435724, 56442, -283162, -153065, -96180, 124154, 257564, 247324, 131021, -78170, 64931, -159778, -238230, -457464, -66859, 86019, 29389, 230939, 133067, -107821, 231765, -38065, -313875, -649047, -78558, 509239, 312732, -121269, -138452, -18324, -98315, -172515, -359006, -128563, -229549, 137110, 574224, 353287, 17414, -225179, -102485, 32059, -334693, -330219, -459666, -411360, -268840, -325271, -452370, -384464, -271315, -87275, 210910, -149484, -423350, -37914, -458594, -371554, -372098, -562418, -650381, -727914, -601108, -590929, -305921, -588862, -733395, -174474, -15105, 71793, -85504, -160291]
1042a60291k50940j7851L15846J11139J7828q8066K87233k63810l22663P8252
1032b93323M21905M3445J43331k45694j93983J83469M0183n05862O18004M61560
1022F73035k89241j23665j23065o17088l6956J6584N8608N71869j05222M41806
1012D66665K9344j72544k13078k30976o6205N57047j18048n6429J61728j52747
1002B04757j3686j3934L7177J66188J15341M7828k29683k34238l59694L30912
992E0968l32878l78192J07114r9755M32229K13966K22250J30141J02093l94456
982E3480L275J40174R3014K03510l41887k35956N86971k4674j11868K618m67140
971i8483j49626K02448J11109q5805k33974j02314K45476K11307N9288j52040
$$ y = [-160291, -411231, -429082, -113236, -2097, 15731, -72335, 214898, -48912, -371575, -293323, 128582, 172027, 315358, 69664, -124319, 59150, 99333, -406529, 211475, 673035, 383794, 260129, 137064, -480024, -516980, -500396, -441788, 130081, 24859, 466665, 496009, 323465, 110387, -120589, -186794, 370253, 252205, 195776, 357504, 204757, 191071, 177137, 214314, 380502, 495843, 543671, 313988, 79750, -279944, 50968, -281910, -660102, -552988, -652743, -220514, -6548, 215702, 345843, 447936, 53480, 56755, 196929, 289943, 493453, 151566, -84390, 502581, 477907, 366039, 368657, -98483, -248109, -45661, 65448, -20357, -254331, -356645, -111169, 100138, 159426, 7386]
961G386L2987j96785J27508l00898l0782j65918K22372L66372L85605l06720l64751
950b23624p6706o8773J20873J43867M83383M39661m05436l97639k43492k35279
940d63165L02707J07289N0998K27585k52553M4469N8667p9089j67753j48175M09939
929I0919j94437m8584K73591N3961l11476J266N1412n4179l8372J21151l224r2988
917a50960j03189K57654o2916J30397j19020j87452K43227L7396K4996j16420
907d6287p5245J14894m2972j3062k10840j90822K42437L10821q8215K5920j52479
896a25850p2337O0741L28563l8249P2139K72217K26684p78565k37308M5709R7299
885a48957K12580j30104L06198q8785l45478R0124P9184l000n9435j72524j20400
$$ y = [7386, 40373, -156412, -28904, -329802, -360584, -526502, -304130, 62242, 447847, 141127, -223624, -300330, -369103, -248230, -104363, 379020, 818681, 413245, 15606, -227886, -463165, -160458, -53169, -2171, 225414, -27139, 17330, 75997, -3092, -170845, -319020, 90919, -103518, -152102, 121489, 175450, -136026, -134760, -83348, -137527, -175899, -54748, -57972, -150960, -254149, 3505, -59411, 70986, -48034, -235486, 7741, 45137, 70133, -46287, -121532, -6638, -49610, -62672, -273512, -464334, -221897, 88924, 709, 26629, -125850, -198187, -137446, 191117, 152868, 225007, 497224, 723908, -54657, -291965, -246256, -148957, 63623, -66481, 239717, 150932, -194546, -104422, -25238, -28238, -87673, -260197, -380597]
874c80597K7417J00613N6301L9096O937L3797O2009L03191j80190j18345J40138
863I0367J73549J30157j87913m74774K65729Q6036j57662r4937j99269O4819J55882
852a48016K53580M51955k01971j57517j33214l21969J42214L73320k96710J91039
842A52711k50260N0065j29115j5798N30524j20232l79782l19838M72916Q5930
832G7121n78966k59699O42366J58674k92408L65146N53203j97078n6038o46477
822b34156k32616K28359K7697K93611j68182J0779q9426M50405j15027l62096
812a90652m8830K33588k37991j65294j5338n8062K01829K52921K93573K0758l7431
801B49071k2621l29665k37248J4740j14926L21803K67407K59848k77363K05022
$$ y = [-380597, -353180, -252567, -196266, -157170, -150233, -116436, -54427, 248764, 68574, -49771, 90367, 263916, 394073, 206160, -268614, -2885, 83151, -74511, -169448, -368717, -303898, -148016, 105564, 557519, 355548, 198031, 64817, -257152, -114938, 258382, -38328, 152711, -97549, -47484, -176599, -192397, 338127, 217895, -161887, -481725, -8809, 77121, -501845, -761544, -119178, 39496, -252912, 112234, 665437, 468359, 412321, -234156, -466772, -238413, -210716, 82895, -85287, -74508, -163934, 286471, 171444, -190652, -239482, -5894, -243885, -409179, -424517, -482579, -280750, -27829, 265744, 286502, 249071, 226450, -103215, -340463, -325723, -440649, -118846, 148561, 408409, 131046, 336068]
791C36068r9020l20536L4379L31614m5590l41830K599L00158J57507j58638J13905
780C10616m68176j34137J55253K08072M9897k89385L17995k72062j85787J24543
770a83171K82622J82435L5677q3230m7390J57178p03667J0319J55075k33800M3446
759c84506J90874j17100L93321j09071r1782J31861l84649j84548M86233K70925
749B01558O3982K46599k77077j36186k49957L20480J25082p465n11189m5653j15986
738c85812j23239K76715K83836J28377J46177P1327k39652J4110r9508j02557
728c0226l4065J74214l08846p6417J90545P2290M6927P4309L0189j16855k34577
717b12512j11747M04338J08359r3851n83014K03120J16879L35760k43347J16786
$$ y = [336068, 237048, -83488, -49109, 282505, 236915, -104915, -102316, 197842, 355349, 196711, 310616, -157560, -291697, -136444, 71628, 121525, -167860, 150135, -121927, -307714, -183171, 99451, 281886, 317563, 234333, 186943, 344121, -359546, -349227, -194152, -427952, -384506, -193632, -310732, 82589, -26482, -118264, 13597, -371052, -555600, -69367, 201558, 265540, 512139, 235062, 98876, -151081, 169399, 294481, 287016, -224173, -269826, -385812, -509051, -232336, 51500, 179877, 326054, 397381, 157729, 171839, 72331, -30226, -64291, 109923, -198923, -275340, -84795, -12505, 34422, 108731, 138920, 22065, -212512, -324259, 80079, 188438, 94587, -488427, -285307, -168428, 167332, -76015, 40771]
707D0771O7514l4229m71972q0283K61212r1691M03338J35843L8802n37752J25687
696a42760K55466j31895P0656J2261j87291J20771J09127M24245k69878j26586
686A34116j04819M23485q3364L5210l31441j80199J55973N5559l97360K20380
676g2460j35963r0614J52516j24255k29843K9716L45155K70367l72281m43867
666f71529M19327J1228Q821L09975J25773l18260p1070o5465J1164R9352O45677
655E04993m08944j60439M75806j387k03594l98324M30777k70742n02245K20816
645c13283q7949P9850q9760J11638J72588k22099J84792M54292N2266p316l59388
634b4369k08513J55349J44557N5746l00527m58742j5474K56114K26472R1968l3516
$$ y = [40771, 108285, 74056, -397916, -478199, -216987, -308678, 94660, 230503, 269305, -268447, -142760, 112706, -19189, 51467, 63728, -123563, -2792, 106335, 530580, 260702, 134116, 29297, 452782, 369418, 404628, 73187, -107012, 48961, 104520, -292840, -72460, -208423, -299037, -146521, -270776, -500619, -470903, -125748, 144619, -227662, -671529, -252202, -240974, -232153, 77822, 203595, -114665, -185735, -251200, -240036, -140684, 504993, 96049, -64390, 411416, 410029, 206435, -191889, 238888, -31854, -534099, -313283, -401232, -321382, -411142, -299504, -126916, -349015, -164223, 290069, 342335, 335019, -24369, -232882, -77533, 67024, 122770, -177757, -636499, -651973, -395859, -169387, -77419, -110935]
623a10935K36714m01448L30372k18920r0037K24199J77009j60810j59754l6246
613b09856K07910k7190l2543K76706k66086j47645L85987P0600k83201j21467
603a46785l58060o785r4316L90439K71079n89972J14083J33942J03548K56160
593G3333j4819j57848m94077L48992N1817p1818n6431m2078o3795K09018J40858
582g6848K1495Q491L71712l73844N7217K36630l2490n0645K5007n14256J07238
571b20293K52078K57962l45187l22073O376J34664l125J6543k78862Q4882J10166
560c06869p7412m12677J34312K41364l1040M4028K80090l40553l66563L13848
550e21472M91915M0566K02035j46565l835J58024l10072O1645j30737j3828J69172
$$ y = [-110935, 125779, -275669, 54703, -164217, -254254, -30055, 146954, -13856, -173610, -209856, -1946, -29136, -61679, 215027, -51059, -198704, 187283, 257883, -25318, -146785, -504845, -511630, -605946, -215507, 55572, -534400, -420317, -286375, -182827, 73333, 58514, -99334, -593411, -244419, -192602, -264420, -320851, -362929, -426724, -217706, -76848, -55353, -46862, 324850, -48994, 8223, 244853, 212363, 161718, 186725, -327531, -220293, 31785, 289747, -55440, -377513, -371137, -236473, -239598, -223055, -501917, -417035, -306869, -384281, -796958, -662646, -421282, -452322, -408294, -128204, -468757, -835320, -521472, -29557, 11009, 213044, 66479, 62644, 220668, -89404, -27759, -158496, -172324, -3152]
539c152J23132k08345N29065k36549p90577L29357N54962K00545o28109Q4679
529d4992J41023q24205o854L13188N25105J30014l21685j01820N15902n13037
519a87361j20824J65095J99269k41107j78291L05008L27912r4322k23051l48442
509c96114L0741J56544J26479j10280J17695l82138R4352k33968M38608J05923
499e2158K84425r1284J4542k7599l98640l02213N40714m76060m8083M44373l78364
488d90347k14027Q9496N0437L92837k08713K10758K92932j28776r4450m799k54202
477c58854J68659M16098J13817l79627n21644j22305n3979K97241J51341K47982
467d1271n1658J31174J93321O0574o06114L29035j10189N2112l00223R8979Q2790
$$ y = [-3152, 119980, -88365, 440700, 204151, -586426, -257069, 297893, 498438, -129671, -44992, 96031, -728174, -735028, -421840, 103265, 233279, -88406, -190226, 325676, -187361, -308185, -143090, 56179, -184928, -363219, -58211, 269701, 175379, -47672, -396114, -365373, -208829, -82350, -192630, -74935, -457073, -362721, -596689, -158081, -52158, 232267, 140983, 155525, 127926, -270714, -572927, -32213, -508273, -556356, -111983, -490347, -704374, -614878, -564441, -171604, -380317, -169559, 123373, -5403, -99853, -104652, -358854, -190195, 225903, 339720, -39907, -561551, -683856, -737835, -440594, -289253, -41271, -92929, 38245, 231566, 292140, -313974, 15061, -95128, -43016, -343239, -244260, -161470]
456a61470l31821M27268K30617l54795k44777k66646N9644q4193M31194r1295
446c86274J38344r5778j01734l53859J15305J24756L59438M43210n23827K9556
436b50863l87555j10416J32576J62079K46589o57778j2550L83664L46707k07316
426c54863j0080M62074L01403p7112j84636k45771J13656K03059Q8710j76102
416A20338l22305J03394k60914q7894L31640R5655l59121J02613p5129m53154
406h04877K43349J48288J76422k71932k25932J6544J71778j53883J75440j53754
396f78557J44956P4854K65541K49035m7653k29549N1584k14021j97543L85131
386a96222j37177l44042L53599L06756o70424M8189N58985J86607k78139j27049
$$ y = [-161470, -493291, -66023, 164594, -190201, -434978, -701624, -641980, -726173, -294979, -386274, -247930, -343708, -445442, -799301, -683996, -559240, -199802, 243408, -280419, -250863, -638418, -748834, -616258, -454179, -207590, -865368, -877918, -494254, -147547, -354863, -364943, 97131, 398534, 321422, 136786, -108985, 4671, 207730, 296440, 120338, -201967, -98573, -359487, -447381, -115741, -20086, -379207, -276594, -351723, -804877, -561528, -413240, -236818, -508750, -734682, -718138, -546360, -700243, -524803, -678557, -533601, -458747, -193206, 55829, 8176, -221373, -169789, -383810, -581353, -196222, -333399, -677441, -323842, -17086, -687510, -639321, -80336, 106271, -171868, -298917]
376b98917j54949M2103j54103j69767J96181L34909l63758r2316L22321k66706
366f05002L2705P8477j2741N24174k08408j77216j25482j53177L66251J73738
356a06681o4787K28375l26806l09248j50531j92535K57067J86350J12675j26634
346d92755K9239j88888l95657K76356L44719P7717j57613p1190k28422J76412
336f30082L09716L64749j75253l83627j50325K10727j34011J4306m9277K32481
326c90596K99075P919k5770k22031j39070J48564K86222j29008l13285K21292
316b56688l06010j4063K21283J48408J80489k62952j65612R130K1252P2145j53811
305e06429j90744n9562M5855M5143j10466j46598p514Q9561M36589l8544m90282
$$ y = [-298917, -453866, -411763, -565866, -735633, -539452, -204543, -568301, -660617, -338296, -605002, -572297, -493820, -506561, 17613, -190795, -368011, -493493, -646670, -280419, -106681, -171468, 56907, -269899, -579147, -729678, -922213, -665146, -478796, -366121, -492755, -463516, -652404, -1048061, -771705, -426986, -349269, -506882, -578072, -806494, -630082, -320366, 44383, -130870, -514497, -664822, -454095, -588106, -573800, -623077, -390596, -91521, -83602, -109372, -331403, -470473, -321909, -35687, -164695, -477980, -256688, -562698, -576761, -355478, -207070, -26581, -289533, -455145, -446015, -424763, -352618, -506429, -697173, -756735, -710880, -665737, -776203, -922801, -930315, -840754, -404165, -442709, -932991]
294i32991J7082J39126P2127J04850o7219k678K97214l5478j28220j39690L5996
283f39881o2648n1288K25153M07469k28231k79154O0857l017J35133j6561J27138
272c25030j66055m84292o9199M09090J60024j17182J80453O6975j56683J55010
262c46889K21014q2070K0036r3605Q4711J01356k08956q5197K8779j8949l90293
251g70063K24443J35000m65591J77496N58452q655k48415p8295o8112J560M3009
240d99171j05926R8032J24870P7394J91451l37431J78797J69714K5766n80091
230f56595j61609N5725K45219J38863m42543K70208R9377J191J19397r3475p3023
219d97265l04799j28958m5275J38423J83681J82817J57123j43552k33667R5484
$$ y = [-932991, -915909, -776783, -704656, -599806, -667025, -669703, -372489, -407967, -536187, -675877, -639881, -702529, -753817, -528664, -121195, -349426, -628580, -567723, -570740, -435607, -452168, -325030, -491085, -975377, -1044576, -635486, -475462, -592644, -412191, -345216, -501899, -346889, -125875, -207945, -187909, -281514, -196803, -95447, -304403, -389600, -360821, -379770, -770063, -545620, -410620, -876211, -698715, -140263, -148918, -397333, -475628, -543740, -542180, -499171, -605097, -507065, -382195, -304801, -113350, -450781, -271984, -102270, -76504, -656595, -818204, -762479, -517260, -378397, -820940, -550732, -451355, -450164, -330767, -424242, -497265, -802064, -931022, -976297, -837874, -654193, -471376, -314253, -457805, -691472, -595988]
209e95988J29597j68986j93130L02735k89708o6284M15404J36894L9396k32700
199e22770l91269j71673K61471M99252R156k2587J0384m0590l95303r0205O378
188h47756J697J59589J29268q5553r9793j69436q7387K34106J41685N8488K0853
177e44239k56044k75587j84415P14883O01597j88779m39219k6802p7489K35551
167d40543k54697k69413K09248J69873J70500n4649K26476j89170m19034L20792
157e30617J26576J15645J59512l43703N32387l48142l50598J11292L8349K37539
147b51760K15262J9261p1594j07781l68173k55724K4386J13381J83447J84500
137c14795K2637k72065J26971j05353q575j53362k89093J12968N40989l53364
$$ y = [-595988, -466391, -635377, -828507, -525772, -815480, -881764, -466360, -329466, -290070, -522770, -914039, -1085712, -824241, -324989, -315833, -338420, -328036, -368626, -763929, -854134, -847756, -846059, -686470, -557202, -642755, -742548, -911984, -999371, -765265, -623580, -565092, -544239, -800283, -1075870, -1260285, -545402, 56195, -132584, -571803, -598605, -676094, -440543, -695240, -964653, -755405, -585532, -415032, -469681, -243205, -432375, -851409, -530617, -404041, -288396, -128884, -472587, 59800, -288342, -638940, -527648, -489299, -251760, -36498, -17237, -88831, -196612, -564785, -820509, -796123, -682742, -499295, -314795, -292158, -564223, -437252, -542605, -551180, -704542, -993635, -880667, -339678, -693042]
127f93042K25700j0989K8142o5621n0427k5995R703P9578l51240j23515K81109
116f96597k09034J77730J54865J92345l87078l10504L24677J17725q9535j711
106g27117j30233L3258J59488J02549l55026K31990M099N8552J33573j37932K04581
95d22218k2798J2457J09908j33759k47433J62043j52269J02913R2831J4071L1791
84d52463n1757o3228o4527j24685K3599j07424j953K77657K35758p4543k50730
73f54296l9822J02569l9654J46064j32880J9100l24014J94898J65442L11052l67516
62f19057L50j68678J32438j828o8629K33759j61856o9885j60392M0350j11533
51i54961K23464K9855J0387j5251L0958J61313J61591J3442l54308k57966j61629
$$ y = [-693042, -467342, -478331, -450189, -515810, -566237, -592232, -582529, -502951, -854191, -977706, -696597, -905631, -727901, -573036, -380691, -767769, -1078273, -753596, -635871, -725406, -727117, -857350, -824092, -664604, -562055, -917081, -685091, -680992, -622440, -488867, -626799, -422218, -445016, -432559, -322651, -456410, -703843, -541800, -694069, -591156, -498325, -484254, -452463, -504220, -567448, -631975, -756660, -733061, -840485, -842438, -564781, -329023, -403566, -654296, -694118, -591549, -631203, -485139, -618019, -598919, -922933, -728035, -562593, -251541, -619057, -618707, -787385, -654947, -656775, -725404, -491645, -653501, -723386, -883778, -843428, -954961, -731497, -701642, -691255, -706506, -675548, -514235, -352644, -339202, -693510, -951476, -1113105]
40a113105l36L2009L24330J66749j914k2595J73937j82125l9921P8072K3193l60551
28i22257j13597L63651O9002k0726N5031J2720j69647m765k9753L39559j64404
17e85186j51035J58619k68323K33998j8474j29749K88587O4298j35895p4442K46498
6c71104j24364k68783m4601j20886Q8767K91106
0e49865
$$ y = [-1113105, -1113441, -1081432, -757102, -590353, -592267, -614862, -440925, -623050, -662971, -584899, -561706, -922257, -1035854, -672203, -603201, -623927, -568896, -556176, -725823, -730588, -760341, -420782, -585186, -736221, -577602, -845925, -611927, -630401, -760150, -471563, -407265, -543160, -617602, -371104, -495468, -764251, -808852, -929738, -840971, -549865]
$$ Imaginary data points
##PAGE= N=2
##DATA TABLE= (X++(I..I)), XYDATA
16383d469674L7099r7397N4236R0939J25024Q2044K56868J44852j52365j55261
16373d083635k2190K83621J60595Q0679J51807K40676k6429P0858P5426M9693
$$ y = [-4469674, -4432575, -4529972, -4475736, -4384797, -4259773, -4177729, -3920861, -3776009, -3928374, -4083635, -4105825, -3822204, -3661609, -3580930, -3429123, -3188447, -3214876, -3144018, -3068592, -3018899]
$$ [...]
##END NTUPLES=NMR SPECTRUM
##END=
