##TITLE=1H_CA-9181-44
 CDCl3
 8 sc, 
 3.8.2023
##JCAMPDX= 6.0         $$ Bruker NMR JCAMP-DX V2.0
##DATA TYPE= NMR SPECTRUM
##DATA CLASS= NTUPLES
##ORIGIN= UXNMR, Bruker Analytische Messtechnik GmbH
##OWNER= root
$$ XWIN-NMR		Version 3.5
$$ Thu Aug  3 13:42:34 2023 Russian Standard Time (UT+4h)  she@DPX200
##.OBSERVE FREQUENCY= 200.13135
##.OBSERVE NUCLEUS= ^1H
##.ACQUISITION MODE= SIMULTANEOUS
##.ACQUISITION SCHEME= undefined
##.AVERAGES= 8
##.DIGITISER RES= 18
##SPECTROMETER/DATA SYSTEM= spect
##.PULSE SEQUENCE= zg30
##.SOLVENT NAME= CDCl3
##.SHIFT REFERENCE= (INTERNAL, CDCl3, 0, 15.7315)
##AUDIT TRAIL= $$ (NUMBER, WHEN, WHO, WHERE, WHAT)
$$ ##TITLE= Audit trail, XWIN-NMR		Version 3.5
$$ ##JCAMPDX= 5.01
$$ ##ORIGIN= Bruker BioSpin GmbH
$$ ##OWNER= she
$$ F:/spectra/data/she/nmr/H-F/1/pdata/1/auditp.txt
$$ ##AUDIT TRAIL=  $$ (NUMBER, WHEN, WHO, WHERE, WHAT)
(   1,<2023-08-03 13:41:24.09 +0400>,<she>,<DPX200>,
      <created by zg, POWCHK disabled, PULCHK disabled
       configuration hash MD5:
       00 E9 B6 7A A2 85 ED C7 34 08 36 98 17 FE 4E 26
       data hash MD5: 16K
       DF F3 4F E2 A8 0B CA 78 81 31 52 65 FB 65 03 BF>)
(   2,<2023-08-03 13:41:26.39 +0400>,<she>,<DPX200>,
      <Start of raw data processing
       efp BC_mod = 2 LB = 0.24 FT_mod = 6 PKNL = 1 PHC0 = -21038.17 PHC1 = 10.85272 SI = 16K 
       data hash MD5: 16K
       73 AF BD 26 D6 B4 C5 E3 6F 02 49 35 1C 76 A1 B1>)
(   3,<2023-08-03 13:41:44.89 +0400>,<she>,<DPX200>,
      <pk PHC0 = -6.382444 PHC1 = 0.3999999 
       data hash MD5: 16K
       67 1C 88 CD 34 18 86 49 65 2A 3F 5F FF 1E AC 45>)
(   4,<2023-08-03 13:41:48.85 +0400>,<she>,<DPX200>,
      <abs ABSG = 5 
       data hash MD5: 16K
       78 EA 47 4E EA D6 1B 36 A8 C4 FF 3F 37 04 0C 4C>)
$$ ##END=
$$ 
$$ hash MD5
$$ 6D 08 4D BB 89 19 6F 56 7C EB E4 7A AB DD 00 E3
##$RELAX= 
##$RELAX= 
##$RELAX= 
##$RELAX= 
##$RELAX= 
##$RELAX= 
$$ Bruker specific parameters
$$ --------------------------
##$DU= <F:/spectra>
##$EXPNO= 1
##$NAME= <H-F>
##$PROCNO= 1
##$TYPE= <nmr>
##$USER= <she>
##$AMP= (0..31)
100 100 100 100 100 100 100 100 100 100 100 100 100 100 100 100 100 100 
100 100 100 100 100 100 100 100 100 100 100 100 100 100 
##$AQSEQ= 0
##$AQ_mod= 1
##$AUNM= <au_zg>
##$AUTOPOS= <>
##$BF1= 200.13
##$BF2= 200.13
##$BF3= 200.13
##$BF4= 200.13
##$BF5= 200.13
##$BF6= 200.13
##$BF7= 200.13
##$BF8= 200.13
##$BYTORDA= 1
##$CFDGTYP= 0
##$CFRGTYP= 5
##$CHEMSTR= <none>
##$CNST= (0..31)
1 1 145 1 1 1 1 1 1 1 1 1 1 1 1 1 1 1 1 1 1 1 1 1 1 1 1 1 1 1 1 1 
##$CPDPRG= <>
##$CPDPRG1= <>
##$CPDPRG2= <>
##$CPDPRG3= <>
##$CPDPRG4= <mlev>
##$CPDPRG5= <mlev>
##$CPDPRG6= <mlev>
##$CPDPRG7= <mlev>
##$CPDPRG8= <mlev>
##$CPDPRGB= <>
##$CPDPRGT= <>
##$D= (0..31)
0 1.2 0 0 0 0 0 0 0 0.06 0 0.03 0 0 0 0 0.0002 0 0 0 0 0 0 0 0 0 0 0 0 
0 0 0 
##$DATE= 1691055683
##$DBL= (0..7)
120 120 120 120 120 120 120 120 
##$DBP= (0..7)
150 150 150 150 150 150 150 150 
##$DBP07= 0
##$DBPNAM0= <>
##$DBPNAM1= <>
##$DBPNAM2= <>
##$DBPNAM3= <>
##$DBPNAM4= <>
$$ [...]
##$SUBNAM3= <"">
##$SUBNAM4= <"">
##$SUBNAM5= <"">
##$SUBNAM6= <"">
##$SUBNAM7= <"">
##$SUBNAM8= <"">
##$SUBNAM9= <"">
##$SW= 18.05172834244
##$SWIBOX= (0..15)
0 0 2 0 0 0 0 0 0 0 0 0 0 0 0 0 
##$SW_h= 3612.71676300578
##$TD= 16384
##$TD0= 1
##$TE= 0
##$TE2= 300
##$TE3= 300
##$TEG= 300
##$TL= (0..7)
0 120 120 120 120 120 120 120 
##$TP= (0..7)
150 150 150 150 150 150 150 150 
##$TP07= 0
##$TPNAME0= <>
##$TPNAME1= <>
##$TPNAME2= <>
##$TPNAME3= <>
##$TPNAME4= <>
##$TPNAME5= <>
##$TPNAME6= <>
##$TPNAME7= <>
##$TPOAL= (0..7)
0.5 0.5 0.5 0.5 0.5 0.5 0.5 0.5 
##$TPOFFS= (0..7)
0 0 0 0 0 0 0 0 
##$TUNHIN= 0
##$TUNHOUT= 0
##$TUNXOUT= 0
##$USERA1= <user>
##$USERA2= <user>
##$USERA3= <user>
##$USERA4= <user>
##$USERA5= <user>
##$V9= 5
##$VALIST= <valist>
##$VCLIST= <CCCCCCCCCCCCCCC>
##$VD= 0
##$VDLIST= <DDDDDDDDDDDDDDD>
##$VPLIST= <PPPPPPPPPPPPPPP>
##$VTLIST= <TTTTTTTTTTTTTTT>
##$WBST= 1024
##$WBSW= 4
##$XGAIN= (0..3)
0 0 0 0 
##$XL= 0
##$YL= 0
##$YMAX_a= 353820
##$YMIN_a= -316595
##$ZGOPTNS= <>
##$ZL1= 120
##$ZL2= 120
##$ZL3= 120
##$ZL4= 120
##$ABSF1= 15.78546
##$ABSF2= -2.266391
##$ABSG= 5
##$ABSL= 3
##$ALPHA= 0
##$AQORDER= 0
##$ASSFAC= 0
##$ASSFACI= 0
##$ASSFACX= 0
##$ASSWID= 0
##$AUNMP= <proc_1d>
##$AZFE= 0.1
##$AZFW= 0.1
##$BCFW= 0
##$BC_mod= 2
##$BYTORDP= 0
##$COROFFS= 0
##$CY= -3
##$DATMOD= 1
##$DC= 0
##$DFILT= <>
##$DTYPP= 0
##$F1P= 0
##$F2P= 0
##$FCOR= 1
##$FTSIZE= 16384
##$FT_mod= 6
##$GAMMA= 0
##$GB= 0
##$INTBC= 1
##$INTSCL= 3.70164e-10
##$ISEN= 128
##$LB= 0.24
##$LEV0= 0
##$LPBIN= 0
##$MAXI= 10000
##$MC2= 0
##$MEAN= 0
##$ME_mod= 0
##$MI= 1.114404
##$NCOEF= 0
##$NC_proc= -7
##$NLEV= 6
##$NOISF1= 3.799351
##$NOISF2= 2.8
##$NSP= 0
##$NTH_PI= 0
##$NZP= 0
##$OFFSET= 15.73146
##$PC= 1
##$PHC0= -21044.55
##$PHC1= 11.25272
##$PH_mod= 1
##$PKNL= yes
##$PPARMOD= 0
##$PSCAL= 0
##$PSIGN= 0
##$REVERSE= no
##$SF= 200.130008021134
##$SI= 16384
##$SIGF1= 3
##$SIGF2= 2
##$SINO= 5.538805
##$SIOLD= 16384
##$SREGLST= <1H.CDCl3>
##$SSB= 0
##$STSI= 16384
##$STSR= 0
##$SW_p= 3612.71676300578
##$SYMM= 0
##$S_DEV= 0
##$TDeff= 16384
##$TDoff= 0
##$TI= <>
##$TILT= no
##$TM1= 0
##$TM2= 0
##$TOPLEV= 0
##$USERP1= <user>
##$USERP2= <user>
##$USERP3= <user>
##$USERP4= <user>
##$USERP5= <user>
##$WDW= 1
##$XDIM= 16384
##$YMAX_p= 265608924
##$YMIN_p= -495275
$$ End of Bruker specific parameters
$$ ---------------------------------
##NTUPLES= NMR SPECTRUM
##VAR_NAME=  FREQUENCY,     SPECTRUM/REAL,   SPECTRUM/IMAG
##SYMBOL=    X,             R,               I
##VAR_TYPE=  INDEPENDENT,   DEPENDENT,       DEPENDENT
##VAR_FORM=  AFFN,          ASDF,            ASDF
##VAR_DIM=   16384,         16384,           16384
##UNITS=     HZ,            ARBITRARY UNITS, ARBITRARY UNITS
##FACTOR=    0.220516191357247, 1,           1
##FIRST=     3148.33713945738, 0,            0
##LAST=      -464.379623548396, 0,           0
##MIN=       -464.379623548396, -495275,     0
##MAX=       3148.33713945738, 265608924,    0
$$ Real data points
##PAGE= N=1
##DATA TABLE= (X++(R..R)), XYDATA
$$ [...]
7766 -236814 -244924 -237401 -126381 -162011 -226758 -313296 -246365 -147720 -13366 57868 -95540
7755 -95540 -131782 28513 -120722 -152687 -203715 -173267 -80800 -273151 -290318 -180413 -191944
7744 -191944 -192151 -242127 -152665 -220968 -94386 22432 58731 -31556 -168032 -203911 -262901
7733 -262901 -277921 -302986 -235120 -198954 -100100 -152550 23412 -14311 -75300 -88106 -53746
7722 -53746 -120971 -253508 -245705 -299208 -253624 -199231 -134069 -99581 -79273 -294581 -204755 -221472
7710 -221472 -395477 -285692 -168440 -97072 -133556 -175686 -144354 -58007 -104970 -77347 -5150
7699 -5150 -148671 -115914 -195608 -213320 -228738 -39032 125650 -24410 -17853 -21950 117092
7688 117092 12260 -46423 -53227 -84414 -17344 -135682 -110364 -107938 -181533 -294929 -78954
7677 -78954 -180713 -140546 -207714 -199204 -163220 -51424 96093 35594 -25576 -133942 19397
7666 19397 -35447 -154731 -121136 -148646 -152227 -109073 -65040 -178265 -125720 86451 86466 -102089
7654 -102089 -184620 118372 259870 74764 -148361 -60261 78828 33934 -63987 -42596 -108762
7643 -108762 -121850 -34149 -146344 -79229 -33449 -119684 -35270 -24575 17665 70510 122909
7632 122909 127224 302115 123267 -80864 -102715 -83061 50443 209504 219167 11980 -149232
7621 -149232 -128953 -182009 -67826 -28431 -104445 -36082 -44158 -170453 -173080 -92666 -281672
7610 -281672 -238953 -121685 79497 138287 103247 162104 60751 -97522 -274240 -231183 -101469
7599 -101469 -67329 -86462 -168348 -233766 -117856 -160590 -146290 -178050 -112068 -33144 -58341
7588 -58341 -105901 -50615 -35601 -27494 -96234 -216825 -178030 -74076 94931 48416 30972
7577 30972 2569 25999 47593 -3062 33235 57547 -13248 27828 61675 -250 36800 4408
7565 4408 3912 -17606 -36199 -87986 -215166 -134547 16233 -53416 -44475 -78758 -60048 27224
7553 27224 -29998 -130402 -143837 -113479 -142803 -117648 -179979 -229055 -103583 -60933 88858
7542 88858 -75397 -206769 114699 47153 -34770 -22212 131012 130660 101354 103316 -31999
7531 -31999 -113837 -122827 -128881 -117068 -163137 -164450 -85282 -150960 -205215 -76663 33329 -67757
7519 -67757 -45498 -34304 -51625 78923 -47893 -252287 -228793 -238883 -205397 -50625 93724
7508 93724 109781 36843 -48377 -30029 40825 -14544 143879 47678 -23158 70617 111880 104882
7496 104882 86445 128686 126639 62340 129188 -127060 -91960 -30658 188789 171862 141239
7485 141239 77192 32554 -53078 -228113 -136974 -7902 -24627 -110045 -107426 -21912 26682
7474 26682 97349 35239 -57920 69537 -13697 22943 120007 154933 72061 43163 -155103
7463 -155103 -126002 21032 97465 146722 65879 67521 133244 29373 -92400 -162519 -81368
7452 -81368 -50329 8091 -83377 -59252 88949 210790 69891 -42265 75616 103644 -18020
7441 -18020 -64068 -26250 134023 127138 27157 -115293 22127 185939 155852 105101 244972
7430 244972 180895 14097 -59580 -43528 -63367 -2 150880 172471 -127524 -146491 25110
7419 25110 -36490 -51244 148039 171405 210231 187758 -60727 9419 88523 124751 84878
7408 84878 65839 181253 199243 38782 29265 34985 72181 235422 306792 68807 124056
7397 124056 195023 58050 -22747 83678 78500 78257 65065 -11107 132993 260504 214560
7386 214560 173496 238607 112056 62668 55894 9523 138610 -15564 10711 29723 58701
7375 58701 189679 278561 196079 145367 215358 142514 217812 311405 418577 385619 324694
7364 324694 169281 -98481 -38683 -4503 55711 127275 145930 159029 136524 124043 58340
7353 58340 44899 -13075 -17602 80304 88872 87780 87621 147091 233986 251299 141502 321927
7341 321927 241821 172105 240467 267136 202472 139098 252414 83397 128733 186171 172032
7330 172032 269316 205225 39661 211962 205029 86368 153277 119045 166463 261606 136790
7319 136790 3735 145980 188598 182041 195228 182757 232098 339943 355829 230003 118732
7308 118732 108946 171385 195919 258868 269771 165195 209322 152013 192092 229452 280462 231064
7296 231064 112608 157074 156593 124314 118712 276572 232324 134144 278381 492847 525969
7285 525969 399189 401431 376336 363499 287336 210619 324436 260251 100241 85413 63223
7274 63223 116043 194773 252359 237017 151121 184568 210312 126082 116454 147439 192050 327916
7262 327916 223070 290077 305213 203104 479344 411217 289430 328550 184899 264219 288565
7251 288565 169376 6854 -11316 182000 349810 424314 397169 341208 411789 333507 290783
7240 290783 309822 303748 351768 436085 305825 356875 412019 554562 542299 396954 266662
7229 266662 450742 367862 265285 451402 318693 264100 308857 246418 307073 427803 368499
7218 368499 406393 467967 352272 337696 393570 409060 311274 472597 450792 408933 375233
7207 375233 371544 495188 431386 348511 325337 420537 393980 382763 262505 377111 421124
7196 421124 362342 544000 712750 627295 458515 477656 446361 349263 415773 500701 490561
7185 490561 592137 551703 420306 509674 422495 557417 505360 435277 526219 413108 311754
7174 311754 410990 298106 473131 436538 350291 386468 591111 601946 534643 468235 600354
7163 600354 735279 720176 673605 641197 667367 601160 615147 685445 788799 795856 860353
7152 860353 698690 574927 609330 607160 744174 745273 793439 729551 640399 496450 414638
7141 414638 607376 617378 749565 863074 726525 516794 546748 511279 582900 632103 556364
7130 556364 573604 468807 434802 654760 605059 635565 668401 568766 548805 597409 708670
7119 708670 583308 433222 630534 825281 701914 631677 536606 695319 891338 766153
7109 766153 474725 490732 547080 533679 514317 643839 674132 552496 715946 799071 752546
7098 752546 688033 706322 620077 641311 706338 633673 534121 591691 727741 889169 906168
7087 906168 832782 689994 528629 645068 609952 648122 805897 758725 893895 783062
7077 783062 757580 787991 765728 889573 936205 930401 1080699 997082 1041776 1020314 975642
7066 975642 928509 847549 978858 986176 900903 842236 755827 876634 784640 757200 813032
7055 813032 772511 935905 916357 685679 629336 650682 822017 884342 808105 765524 900429
7044 900429 942310 836454 743780 795138 852654 1040626 996155 819220 814276 915350 911613
7033 911613 894407 845185 779819 854610 839331 1040031 992890 1026897 970876 917421 921685 944507
7021 944507 862884 837337 855720 759116 745398 934039 808851 772265 873802 875590 956264
7010 956264 981793 1073354 1036830 993155 1058207 961017 853708 902944 927186 1010829 888712
6999 888712 918561 999483 992990 1103757 1013317 1143165 1077759 1016775 1001287 1113334 1116529
6988 1116529 1183933 1047846 1055207 1034882 1224358 1163180 1021165 1136226 1229663 1193933 1080724
6977 1080724 1164724 1257140 1219437 1284336 1185858 1026254 1029125 1075610 1191971 1226547 1221173
6966 1221173 1201974 1149170 1096144 1128133 1157015 1250002 1127289 1129402 1095263 1112301 1088522
6955 1088522 1130826 1207343 1286824 1214026 1198543 1182585 1274664 1295680 1296683 1342266 1260702 1200549
6943 1200549 1221311 1360501 1421798 1329872 1306482 1379920 1402260 1293623 1177660 1338717 1384116
6932 1384116 1458359 1468676 1473272 1483873 1331424 1239698 1237105 1255704 1250074 1360614 1350036 1372567
6920 1372567 1399294 1471968 1477303 1460724 1498168 1545192 1460564 1549975 1459374 1415600 1557661
6909 1557661 1665226 1680925 1562482 1584997 1701236 1656748 1596945 1616070 1685973 1656398 1776027
6898 1776027 1798369 1743932 1859819 1837375 1806259 1802722 1891613 1872589 1813708 1929888 1947273
6887 1947273 2132859 2207001 2189508 2105812 2170021 2233235 2218862 2196681 2199259 2243378 2175836
6876 2175836 2174821 2110477 2101566 2227348 2209068 2083724 2084937 2089622 2120690 2064040 2029674 1965704
6864 1965704 1958599 1988803 1997856 1911184 1793456 1822211 2010141 1830389 1859594 1855830 2000701
6853 2000701 1786973 1762936 1905791 1991529 2102903 1979858 1952343 2021070 2067462 2194620
6843 2194620 2167372 2096946 2272365 2116296 1911705 1853658 1921855 2071835 2182670 2043414
6833 2043414 1985526 2059782 2065546 1993756 2237475 2155076 2068023 2116563 2233491 2289351 2088311
6822 2088311 2152052 2169454 2180399 2168146 2259335 2103812 2276888 2438927 2457867 2319034 2237604
6811 2237604 2359941 2334091 2400572 2376759 2422143 2478878 2617429 2613649 2547165 2582200 2591078
6800 2591078 2588404 2712469 2973360 2783813 2704781 2884242 2715762 2749256 2761013 2991517
6790 2991517 3048290 2989024 3038324 3040888 3012530 3047045 2989637 3003174 2922219 2909046 2997263 2865479
6778 2865479 2806855 2855207 2839165 2966958 3113258 2979163 3179550 3346003 3341077 3197784
6768 3197784 3101461 3172598 3187530 3136653 3143697 3242333 3145598 3153531 3272515 3295387 3217372 3180394
6756 3180394 3330429 3166611 3214516 3350132 3238992 3381989 3563371 3356606 3336466 3425724
6746 3425724 3496276 3491014 3415748 3484545 3571195 3633027 3646247 3768236 3712802 3810005 3722680
6735 3722680 3709631 3733340 3796372 3871428 3920438 3904248 3924362 3874976 3985219 4040801 3911916
6724 3911916 3888716 3839439 3950171 3845940 3901991 3901039 3912189 3994552 4094007 4201794 4224278
6713 4224278 4195501 4274164 4339737 4388798 4416231 4393329 4479958 4452850 4415193 4386344 4300500
6702 4300500 4436232 4409435 4530653 4494353 4432742 4634092 4824581 4800204 4674161 4782808
6692 4782808 4640582 4594182 4710812 4759286 4765410 4883065 4947510 4765579 4774619 4954485 5057726
6681 5057726 5092258 5103226 5122942 5214618 5086027 5171057 5277396 5210397 5214379 5224435 5457769
6670 5457769 5364635 5314255 5479716 5556911 5530635 5700666 5616764 5649293 5905368 5799375 5888828
6659 5888828 5993772 6013037 6037825 5912077 5884701 6047014 6159336 6168176 6264544 6334465 6469275
6648 6469275 6305796 6415758 6348631 6404709 6498376 6530304 6622235 6853417 6976332 6896994 6895428
6637 6895428 6863875 7000312 7150393 7312972 7130461 7227802 7480790 7537549 7535063 7565203 7560965
6626 7560965 7783448 7876983 7956327 7955506 7883697 7889666 8189624 8129202 8186424 8209283 8361823
6615 8361823 8367127 8414701 8580100 8670678 8712292 8747783 8872708 8947516 8959322 9168057 9198496
6604 9198496 9258756 9428311 9479244 9565787 9786080 10140195 10031870 9964704 9931357 9914820 10132598
6593 10132598 10355765 10302456 10384261 10658521 10832169 10915605 10913456 10999816 11411409 11473716 11347490
6582 11347490 11308052 11544761 11512991 11636113 11740833 11871556 12143629 12185211 12352604 12449381
6572 12449381 12627959 12644177 12651305 12890792 13081164 13349298 13521754 13564907 13656929 13738977
6562 13738977 13761906 14075004 14209159 14357975 14549687 14738753 14927915 14990250 15066540 15203065
6552 15203065 15343734 15496796 15738913 15894989 16029575 16265204 16366050 16646263 16966274
6543 16966274 17084098 17390774 17674135 17550778 17725004 17968829 18212800 18522183 18686764
6534 18686764 18922420 19155103 19422864 19545786 19561672 19833258 20128107 20495575 20723398 20803173
6524 20803173 21121003 21366445 21450117 21774362 22065671 22392662 22572314 22875678 23173892 23413115
6514 23413115 23678914 24024755 24327573 24469951 24859735 25219599 25598517 25968408 26354265
6505 26354265 26662639 26879379 27146865 27577417 27752033 28042446 28404352 28747961 28968914
6496 28968914 29296293 29743339 30238528 30508621 30856800 31388296 31606765 31742511 32334225
6487 32334225 32738682 33134560 33587453 33959980 34216396 34760768 34990115 35428549 35909999
6478 35909999 36409040 36886346 37264131 37540492 37996708 38458073 38745519 39182188 39667607
6469 39667607 40268923 40673314 41152756 41515912 41954393 42597013 43070087 43446069 43826949
6460 43826949 44116889 44499663 44908617 45454281 45979558 46327901 46568934 46842950 47193765
6451 47193765 47563705 47800631 47949388 48238650 48724745 49076991 49420796 49637503 49879152
6442 49879152 50224830 50280676 50498866 50889260 51143323 51314949 51466533 51558625 51970296 52146183
6432 52146183 52199461 52637547 52815298 53044792 53008472 53261510 53311271 53456816 53670362 53872239
6422 53872239 53987821 53972803 54035010 54106296 54384942 54527237 54609039 54676165 54869585 55110753
6412 55110753 55239125 55253897 55326800 55458274 55721181 55991179 56131930 56372020 56722623 56934010
6402 56934010 57251687 57595269 58062980 58693450 59115475 59613701 60260139 60677864 61266229
6393 61266229 61889857 62315349 62783372 63247841 64010540 64934363 65878683 66698921 67439558
6384 67439558 67883297 67680717 66788880 65604451 64073194 62093827 60046842 57939323 55830717
6375 55830717 53998456 52404417 51087277 49661705 48568876 47302422 46284785 45561526
6367 45561526 44840544 44019291 43127073 42235742 41353680 40532915 39795084 38985267 38195697
6358 38195697 37437846 36736282 36136778 35486238 34681465 34078997 33546645 32956074 32523432
6349 32523432 32079171 31575248 31079142 30621422 29976239 29533867 29069697 28744024 28304709
6340 28304709 27970498 27626232 27116025 26700141 26437922 25962247 25561944 25131652 24858839
6331 24858839 24346948 24136360 23913546 23582548 23207935 23073429 22776813 22445927 22069459
6322 22069459 21735650 21498143 21306190 21065136 20728149 20543197 20373086 20138775 19778209
6313 19778209 19317082 19165582 19108324 18970843 18703332 18485396 18327279 17974373 17710607 17501999
6303 17501999 17462846 17406182 17239342 16983871 16793259 16391314 16176697 15984700 15877955 15683913
6293 15683913 15602760 15390386 15361324 15298229 15109727 14739906 14748802 14657387 14489649 14465789 14312636
6282 14312636 14081590 13880200 13826225 13689493 13559505 13395102 13248792 13126601 13027803 13059448
6272 13059448 12973998 12630442 12463622 12542180 12450576 12263430 12302219 12305515 12048316 11869713
6262 11869713 11732970 11591718 11466916 11433148 11546330 11355347 11191140 11281794 11312669 11252189
6252 11252189 11213022 11071254 11102462 11082769 10971942 10997657 10950036 10763915 10830416 10985657
6242 10985657 10953208 10926633 10963525 10699314 10703535 10763888 10816457 10819124 10877922 10821873 10772437
6231 10772437 11029599 10931133 10675253 10785358 10868421 10824537 10916881 10965348 10782345 10743294
6221 10743294 10791947 10832055 10666597 10657734 10670279 10572087 10593174 10703956 10611998 10476207 10416838
6210 10416838 10254322 10321303 10278472 10303922 10123576 10020940 10055870 9952634 9763046 9683561
6200 9683561 9774817 9701386 9515955 9338106 9101406 9032519 9068550 9027643 8841232 8630585
6190 8630585 8600661 8598801 8530425 8470497 8447416 8415016 8245875 8357001 8367555 8306824 8359387
6179 8359387 8536412 8599170 8651025 8592358 8477126 8408183 8451185 8402059 8378490 8218976 8025008
6168 8025008 8009119 7883165 7822413 7816579 7542429 7247052 7179569 7070121 7045070 6985193 7082404
6157 7082404 7018392 6954892 6986866 6928253 6832942 6966210 6871414 6625421 6812779 6760190 6800910
6146 6800910 6914388 6746517 6848164 6875062 6547672 6412576 6305589 5957931 5890229 5959148
6136 5959148 5870259 5772867 5782362 5770976 5502119 5468035 5460434 5367851 5317581 5348593 5393346 5423738
6124 5423738 5396966 5159894 5046929 4949258 4931885 4894186 4785311 4786226 4826708 4760336 4763926
6113 4763926 4811195 4677040 4718430 4698993 4532670 4601127 4662689 4512076 4405255 4391245 4383774
6102 4383774 4320356 4358867 4241399 4188377 4206845 4280971 4127221 4017316 4105049 4070141 4116681
6091 4116681 3924815 3840631 3895482 3918578 3921651 3956223 3969783 4040256 3999441 4008739 3966763 3995972
6079 3995972 4121447 4049222 3784337 3752342 3789795 3807836 3788279 3927140 3882300 3754080 3869781
6068 3869781 4046337 3903148 3756414 3840556 3922021 3853264 3865010 4023918 4029813 3962623 3906199
6057 3906199 4036270 4030498 4006721 3808761 3757484 3890588 3913831 3986640 4000259 4037451 3975000
6046 3975000 3998942 3912020 3988666 4051456 4036688 4140323 4067314 3957435 3830581 3829831 3907499
6035 3907499 3911905 3994713 4086421 4052415 4060645 4194333 4210576 4177557 4026058 3994470 4244111
6024 4244111 4333440 4514623 4408843 4327856 4446893 4564723 4599012 4548531 4513540 4466014 4700894
6013 4700894 4840961 4749280 4632042 4880606 4835843 4772573 4892080 4894494 4998596 5139367
6003 5139367 5002769 4964468 5103022 5142203 5335326 5388280 5467141 5391443 5544421 5556023 5595806
5992 5595806 5741463 5793992 5814093 5978316 5855296 5933867 6179580 6397872 6368197 6298591
5982 6298591 6591980 6653027 6750371 6727029 6698245 6781587 6784802 6925389 6812595 6815870 6996714
5971 6996714 6914036 6969579 7062238 7121957 7379147 7403254 7397945 7425044 7401815 7554367 7530529
5960 7530529 7568823 7611723 7577084 7676013 7864691 7854279 7823134 7806891 7843920 7820905 7929297
5949 7929297 7894502 7785162 7848339 7845397 7955808 7867477 7780353 7704087 7806945 7801896 7877354
5938 7877354 7972910 7960899 7835548 7955623 7973073 7932284 7952101 7824754 7825400 7728173 7621448
5927 7621448 7743976 7747458 7815653 7842281 7807580 7651614 7578611 7763125 7749527 7684128 7535629
5916 7535629 7503034 7390898 7497271 7408278 7285425 7232676 7410874 7539065 7498011 7483402
5906 7483402 7621579 7395658 7437516 7305448 7364746 7442496 7353401 7491992 7545270 7510055 7495131
5895 7495131 7305088 7404685 7439709 7328240 7375225 7366848 7411491 7413490 7462747 7658038 7538272
5884 7538272 7393556 7666296 7653340 7721006 7769469 7809688 7574259 7628674 7762346 7870084
5874 7870084 7837505 7989418 8298314 8319745 8276038 8475640 8606399 8693750 8789214 8855191 8866359
5863 8866359 8808076 8970568 9184106 9280121 9278140 9231000 9164894 9202912 9297565 9192452 9243027
5852 9243027 9206628 9203333 9305114 9384359 9421835 9360859 9316123 9275897 9249127 9256172 9541779
5841 9541779 9625074 9595610 9634806 9570919 9763773 9858764 9759017 9922180 9976193 10098186 10219618
5830 10219618 10297972 10503137 10640714 10793960 10783792 10988027 11259527 11511228 11821555 12152373
5820 12152373 12359825 12344059 12725347 13129940 13529904 13677600 13913493 14167035 14438352 14909174
5810 14909174 15225051 15580308 16024913 16543765 17036749 17361412 17827768 18344852 18858851
5801 18858851 19489429 19953950 20544317 21259653 21868125 22482747 23082297 23873459 24644540
5792 24644540 25366860 26076471 26767747 27563641 28216351 28809228 29382724 30025991 30710525
5783 30710525 31267026 31843777 32406312 33152888 33639293 33921752 34019937 33796035 33334502 32342336
5773 32342336 31089041 29937867 28721960 27271178 25867722 24387278 23297871 22330335
5765 22330335 21402780 20436001 19465730 18565327 17697591 16949608 16323042 15723372 15204657
5756 15204657 14748501 14246636 13773441 13263225 12782622 12424507 12216251 11697336 11429682
5747 11429682 11183099 10850025 10572054 10420895 10217485 9884490 9625606 9304067 9175150
5738 9175150 9011244 8838424 8680198 8556166 8417989 8128728 7888298 7881751 7809214 7830929
5728 7830929 7700493 7363215 7310152 7101881 6976382 7005901 6833437 6707897 6617596 6512193
5718 6512193 6420581 6327738 6387121 6361844 6243834 6150377 5935320 5916266 5848751 5842902 5783890
5707 5783890 5727411 5632468 5587234 5496488 5531310 5511756 5400869 5378310 5352828 5316225 5291032
5696 5291032 5091982 4992771 5026625 5008507 4970538 4921284 4878466 4728655 4685021 4629967 4414644
5685 4414644 4522313 4634072 4505854 4520806 4483778 4357075 4351774 4289845 4249359 4185262 4209109
5674 4209109 4243390 4288287 4274494 4305091 4328744 4166113 4117394 4128630 4023366 3956798 3952007
5663 3952007 4019109 4041168 4137105 4080507 4022105 4005084 3958443 4128033 4138816 4243912 4090617
5652 4090617 4071418 4136491 4241213 4144015 4142358 4096865 4128432 4046521 3999574 3892992 3969237
5641 3969237 4009052 4099595 4189286 4129089 4011009 4117894 4054161 4162728 4184813 4172181 4168590
5630 4168590 4175344 4254501 4314592 4174160 4178868 4270044 4198730 4312275 4394923 4284908 4198528
5619 4198528 4242970 4205280 4301027 4312541 4229043 4190475 4178745 4223041 4426231 4377429 4287696
5608 4287696 4312952 4390824 4388382 4409988 4424339 4398403 4518480 4583015 4465018 4623948 4656470
5597 4656470 4604514 4545587 4806512 4840250 4859068 4888064 4915508 4818802 4712303 4843241 4977555
5586 4977555 5011689 4942483 4892814 4912804 5077427 5229888 5284177 5386886 5393629 5449918 5553869
5575 5553869 5515859 5561701 5534240 5582292 5772775 5893553 6022774 5967220 5942500 6061164 6241695
5564 6241695 6366987 6363180 6144651 6185967 6376714 6517613 6527587 6471423 6452072 6686072 6826060
5553 6826060 6834156 6838942 6905963 7029653 6931306 7153700 7494301 7606323 7588839 7809802 7854519
5542 7854519 7883540 8058681 8218629 8241041 8120810 8284971 8471132 8648027 8733320 8860857
5532 8860857 9055480 9079551 9179223 9198810 9273721 9440827 9401379 9522940 9550725 9579849 9766674
5521 9766674 10016851 10356654 10560596 10576267 10617807 10818827 11020015 11278747 11396128 11398412
5511 11398412 11560439 11789795 11856453 11885348 12055966 12334639 12553971 12441277 12638768 12937882
5501 12937882 13060915 13305602 13341788 13619207 13901897 14165820 14380767 14507893 14855457 14944359
5491 14944359 15216249 15506610 15796506 16044291 16147219 16630769 16939418 17332519 17817397
5482 17817397 18137534 18657476 19133304 19534438 19995951 20680721 21262787 21884891 22648688
5473 22648688 23462311 24396414 25156534 26319594 27385746 28681402 29962915 31377364 32883679
5464 32883679 34557964 36581436 38819930 41413803 44052803 47052232 50255241 53422082
5456 53422082 56608184 59967925 63403498 66487800 69345951 71505866 72922841 73166836
5448 73166836 72064957 69882157 66837939 63135883 59085352 55040342 51288608 47518122
5440 47518122 44090057 41055682 38380435 35812057 33729111 31790442 30133439 28716083
5432 28716083 27413866 26417809 25542426 24656186 23775576 23001811 22013333 21426325 21028367
5423 21028367 20430513 19804074 19297787 18845038 18340117 17804610 17421149 16977077 16495291
5414 16495291 15982174 15796457 15480360 15056513 14715205 14449000 14235062 14153824 14015192 13914395
5404 13914395 13870116 13781618 13564633 13481232 13538884 13472552 13323489 13212113 13002603 13053961
5394 13053961 12917871 12693046 12540767 12457883 12327138 11992622 11552172 11456722 11278841 10939195
5384 10939195 10637739 10381881 10024331 9836826 9590508 9231902 9081942 9085521 8805389 8461716
5374 8461716 8341589 8402004 8377773 8328733 8295725 8241883 8116843 7830071 7891190 7891736 7859005
5363 7859005 7736894 7655477 7702230 7763865 7878123 7779219 7720942 7755359 7804358 7801310 7762033
5352 7762033 7914273 8069171 7995753 8098076 8304204 8354638 8521709 8560066 8548523 8773635
5342 8773635 8965877 9145679 9299312 9408139 9240034 9350014 9382604 9330580 9351403 9568404
5332 9568404 9758221 9637139 9817217 9754653 9704861 9634429 9654788 9630839 9536233 9474391 9532864
5321 9532864 9688723 9573367 9431583 9626232 9742344 9920406 9869498 9783363 9744137 9701000
5311 9701000 9484921 9508136 9403804 9512270 9456443 9388933 9275639 9287606 9246426 9141363
5301 9141363 8868585 8568967 8342639 8246155 8192745 8189574 8191769 8080442 8027643 8031616 8135302
5290 8135302 8063298 8086389 8114975 8083526 8375039 8528650 8434495 8416583 8573153 8708852 8793711
5279 8793711 8684266 8670327 8854596 8744425 8899725 8864260 8726946 8777214 8941043 8956897
5269 8956897 9230412 9347666 9401257 9515346 9672257 9766184 9805115 9792266 9790616 9797099 9873422
5258 9873422 9790958 9635989 9617820 9586756 9655381 9608426 9464699 9311953 9128354 9114112 9069041
5247 9069041 8882050 8771001 8685076 8554074 8523749 8516082 8449518 8384410 8376957 8216807 8338274
5236 8338274 8467986 8474935 8541909 8643732 8717861 8807052 8838502 8941557 9027714 9235441 9555727
5225 9555727 9625123 9697046 9686939 9715286 9783404 9694639 9700693 9568662 9584079 9623099 9522525
5214 9522525 9368637 9328468 9399822 9278592 9368078 9558620 9606763 9578873 9733847 9836601
5204 9836601 9784388 9942055 10079091 10172793 10189481 10142546 10284584 10385589 10389854 10648211 10595189
5193 10595189 10617426 10712666 10516123 10445850 10315061 10380345 10394401 10230810 10123477 10134288
5183 10134288 10166681 10204013 10216357 10218448 10253202 9989215 10000685 9927522 9798897 9704312 9420219
5172 9420219 9310167 9220422 9152031 8965015 8772442 8676111 8668351 8766910 8794379 8702315 8676304
5161 8676304 8461782 8431495 8474784 8683679 8669982 8689459 8728112 8948548 8931781 9048678 9084598
5150 9084598 9066351 9188168 9268380 9099089 9022108 8994399 8828017 8812204 8762267 8675130 8513117
5139 8513117 8369785 8190065 8026386 7840333 7611428 7677849 7663451 7589101 7613493 7458758
5129 7458758 7434084 7410228 7403997 7258154 7356919 7437526 7484623 7529907 7586133 7575058 7621808
5118 7621808 7640541 7897096 7798294 7898874 8076461 7987327 7963063 8047327 7850691 7626877
5108 7626877 7654121 7564512 7496884 7535777 7532282 7357235 7402763 7353789 7453734 7463960 7328541
5097 7328541 7284646 7332981 7212491 7187037 7247389 7362758 7269740 7176744 7081007 7014062 7047918
5086 7047918 7018619 7003557 6817550 6925194 6858893 6556809 6390790 6363358 6418337 6456556 6455704
5075 6455704 6337661 6438303 6393894 6298310 6121739 6103514 6016869 5981788 6014371 5916047 5940449
5064 5940449 5779955 5794762 5845712 5707232 5720936 5780366 5537887 5343366 5382668 5410753 5447625
5053 5447625 5482540 5369795 5428838 5534962 5509998 5399414 5541145 5393786 5500721 5544540
5043 5544540 5485968 5617194 5505647 5425971 5406536 5315309 5258291 5581307 5591438 5483629 5459499
5032 5459499 5487532 5559757 5482198 5527093 5472740 5557554 5596922 5689831 5636133 5683315 5689545 5645436
5020 5645436 5608717 5669059 5665907 5728753 5773683 5811885 5926207 5915017 5929337 5908728 6045517
5009 6045517 6039567 6103142 6428531 6429584 6277584 6238968 6312234 6594502 6541515 6746308 6806534
4998 6806534 6636634 6831597 6994882 7052912 6968911 7091677 7323431 7206372 7450963 7646923
4988 7646923 7752500 7760813 7958569 8000479 8096238 8091030 8366202 8449971 8593609 8608703 8563130
4977 8563130 8845627 8899440 8975403 8816676 8806638 8919793 8813425 8660847 8559777 8485670
4967 8485670 8455781 8199018 8073144 7992896 7868355 7801765 7700530 7588544 7640698 7578263
4957 7578263 7589225 7605250 7523371 7254180 7273404 7455876 7403632 7179810 7267808 7398707 7386659
4946 7386659 7428516 7490519 7466494 7393486 7444182 7447155 7580358 7675218 7533986 7547770 7702560
4935 7702560 7758343 7929913 7927513 7910460 8034212 8029363 8128513 8227721 8334424 8483808 8600631
4924 8600631 8800940 8759701 8776380 8944704 8955639 9116454 9146315 9215385 9134049 9059503 9175151
4913 9175151 9287104 9385675 9153806 9330688 9428822 9276448 9099832 9159582 9144357 9088942
4903 9088942 9068002 8989367 9060874 8881147 8822326 8838236 8813815 8850710 8849077 8942465 8807066
4892 8807066 8594893 8598529 8747925 9054496 8888853 8808047 8979824 9009371 8961830 9043055 9056707
4881 9056707 9125175 9160078 9418528 9547470 9568794 9574698 9593323 9688342 9719323 9620809 9573039
4870 9573039 9638456 9982473 10077627 10137673 10047030 10098018 10339741 10434455 10730274 10736104 10722196
4859 10722196 10743601 11055858 11086647 11158345 11268193 11408250 11765757 12073382 12315006 12513096
4849 12513096 12647613 12774742 12959679 13247958 13257955 13270508 13375046 13533666 13724763 13912607
4839 13912607 13925847 14194664 14195632 14244097 14492266 14572978 14623749 14724764 14793628 14866808 15060687
4828 15060687 15124188 15184510 15334709 15353630 15283930 15452744 15500654 15507542 15585430 15689872 15719987
4817 15719987 15795168 15855177 15982634 16112080 16297793 16527686 16748297 16889310 16884083 17085462
4807 17085462 17420912 17717693 17905107 18056282 18309396 18588266 18797922 19174262 19523721
4798 19523721 19810593 20167352 20532094 20837782 21152470 21295435 21567113 22016161 22303930
4789 22303930 22535299 22841757 23145609 23360840 23518117 23791616 23986701 24191736 24578510
4780 24578510 24994083 25247732 25507315 25877586 26292785 26688144 26773626 26919270 27192890 27310408
4770 27310408 27393068 27675974 27975032 28283094 28562868 28926287 29081759 29299857 29728961 30219650
4760 30219650 30513155 30851554 31162308 31540307 31977418 32304374 32617885 33307906 33743184
4751 33743184 34115810 34383324 34595074 34999523 35508133 35812257 36148250 36608878 36927702
4742 36927702 37258466 37534421 38076603 38664601 39181095 39721620 40497849 41225622 41905641
4733 41905641 42652914 43385094 44207571 45122665 46244739 47428628 48493556 49818365 50898525
4724 50898525 51838302 52849860 53807666 54515591 55053989 55481440 55768175 56165389 56395726
4715 56395726 56621923 56974975 57464997 58227632 59164824 60134588 61373665 62757178 64244096
4706 64244096 66072001 68264901 70816740 73633401 76874751 80474714 84951228 90081751
4698 90081751 95468528 101358660 107903995 114715628 120992540 127063970 132399964 136476956
4690 136476956 139464493 141232819 141459427 139816545 136420385 131530474 125494573 118902446
4682 118902446 111984676 105136897 98629281 92562088 86722916 81401152 76821081 72477030
4674 72477030 68699581 65261376 62254230 59683626 57472934 55253511 53311566 51544222
4666 51544222 49950707 48429898 47132502 46225230 45187777 44442735 43748436 43106043 42501185
4657 42501185 41945232 41357285 41003518 40680513 40202513 39980565 39743870 39541345 39320808
4648 39320808 39084674 38988246 38960611 38889424 38752018 38702866 38876415 38999213 39179707 39311426
4638 39311426 39605681 39557500 39704435 39967371 40203574 40349746 40434617 40547636 40840056 41053502
4628 41053502 41186015 41496078 41779610 42096130 42399334 42776170 43326723 43870927 44352148
4619 44352148 45031201 45753038 46375336 46949767 47644978 48403984 49105629 49990802 50962757
4610 50962757 52025500 53221862 54305199 55435427 56220995 56486983 56585810 56359424 55832188
4601 55832188 55246113 54778494 54449390 54053495 53770722 53640092 53710364 53931750 54159147 54358896
4591 54358896 54700336 55397219 56265904 57155135 58115193 58990071 60248258 61450104 62865009
4582 62865009 64411288 65961613 67724243 69782303 71985341 74534474 77274813 79906800
4574 79906800 81893974 83045740 82668841 80456478 77204052 73995159 70993470 68768928
4566 68768928 67052522 65797308 64679831 63831973 63245006 62443343 61857627 61332407 61027507
4557 61027507 61038519 60951309 60993168 61318164 61752098 62396005 63291058 64393369 65817149 67493846
4547 67493846 69275632 71736004 74517105 77561030 80727019 84001826 86391111 87659220
4539 87659220 87380889 85258549 82503699 79822065 77716539 76084353 74937525 74300407
4531 74300407 73764250 72947466 71924248 70776423 69395588 67989806 66841688 65715082
4523 65715082 64782585 63915860 63167499 62613945 61934651 61778170 61795372 61954907 62030712 62395584
4513 62395584 62978261 63901200 65097111 66029571 66793155 67217103 67411139 67052354 66496236
4504 66496236 65668037 64970251 64565904 64269331 64119295 63695725 63125189 62171353 60807422
4495 60807422 59068755 57216150 55481699 53866373 52350279 50984064 49953360 48899439
4487 48899439 47920633 47250443 46527913 45977782 45413898 44837063 44427548 44017329 43643118
4478 43643118 43403497 43053494 42804956 42467075 42212917 41953537 41649873 41455684 41389042 41226360
4468 41226360 41083347 40846230 40693510 40219080 39946115 39558953 38933314 38413868 37843652
4459 37843652 37577882 37427107 37459665 37360836 37353608 36898964 35660378 34669155 33847419 33161139
4449 33161139 32889215 32425340 32001442 31628028 31422494 31177948 31074748 31044386 30653742 30350479
4439 30350479 30295842 30134075 30194281 30021021 29879648 29842096 29665687 29754240 29826067 29760866
4429 29760866 29735309 29876756 29745443 29698823 29708642 29513564 29578858 29581569 29427396 29380434 29394182
4418 29394182 29392760 29438410 29295062 29309168 29218467 29313172 29409588 29584058 29729399 29617429 29522140
4407 29522140 29624391 29536414 29601502 29737036 29682927 29787447 29701248 29842256 29934967 29845606
4397 29845606 29757103 29831683 29934177 29998796 30094253 30173055 30258963 30322240 30405156 30641642 30712953
4386 30712953 30753802 30948016 31092534 31196390 31375610 31680951 31990006 32208684 32426653 32841389
4376 32841389 33101376 33299052 33674587 33918287 34182750 34633282 35051781 35189640 35513118
4367 35513118 35769296 36096792 36369655 36663520 37093399 37607910 38048672 38490224 38948297
4358 38948297 39393465 40091979 40627199 41295165 41822528 42300912 42991718 43752960 44466264
4349 44466264 45210925 46065987 46975312 47742773 48533033 49474993 50256172 50834843 51488908
4340 51488908 52274412 52958402 53779141 54634255 55304397 56043918 56936130 57728466 58464141
4331 58464141 59345614 60249494 61292910 62253667 63245680 64315419 65422569 66595668 67739608
4322 67739608 68911661 70165851 71579711 72912422 74440450 75889279 77445506 79326272
4314 79326272 81222281 83359262 85754553 88474743 91390415 94722194 98351033 102478259
4306 102478259 107362826 113296248 120367750 129082753 139556910 151765517 165284074 178701972
4298 178701972 190097388 197713778 201383490 199911766 192771092 181373871 167904855 155154110
4290 155154110 144578604 136612954 131311614 128133470 126806519 127030137 128479281 130409395
4282 130409395 132427831 133765589 134159366 133425157 131294657 128039174 124164961 119978177
4274 119978177 115895427 112203953 108702799 105564518 102753470 100097973 97662478 95478769
4266 95478769 93567485 91822158 90355944 89138383 88079997 87260407 86738460 86373270 86128578
4257 86128578 86312853 86663456 87143509 87695156 88706757 89854297 91397394 93111661 94924826
4248 94924826 96877166 98627059 99928497 99990961 99026283 96918969 93837076 89908873 85514345
4239 85514345 80896827 76567644 72816554 69398960 66349738 63801942 61576904 59522174
4231 59522174 57576671 55810541 54264241 52788141 51496179 50289572 49282406 48218466
4223 48218466 47480538 46707807 45982321 45295509 44536248 43953042 43403973 42973059 42444312
4214 42444312 42112354 41862483 41463561 40922686 40358635 39997586 39741113 39267289 39095676
4205 39095676 38849749 38699743 38463502 38157964 37905060 37623352 37439496 37077702 36659166
4196 36659166 36299284 36016419 35787937 35542251 35208358 34833280 34640945 34684646 34515801 34291731
4186 34291731 34150700 34133634 34130954 34045802 33971014 33557946 33276972 32800211 32280644 31854677
4176 31854677 31405782 31124418 30805133 30663117 30544389 30476912 30468950 30602661 31014990 31258953
4166 31258953 31301656 31587386 31939940 32340041 32935894 33756063 34747255 35734414 36670641 37080123
4156 37080123 36563063 35283293 33731340 32593691 31647983 31083585 30576025 30041275 29835087
4147 29835087 29610781 29288798 29157855 28929919 28468876 28063118 27728320 27465117 27076750
4138 27076750 26880476 26594923 26240339 26111182 25914469 25921191 25917964 25858731 25952082 25809988
4128 25809988 25793635 25641051 25237143 25127541 24984936 24923376 24757424 24746273 24721328 24681976
4118 24681976 24505248 24535031 24413342 24233129 24204591 24401276 24547201 24369446 24380994 24170271
4108 24170271 24114166 23991771 24033107 24298131 24377615 24445067 24610478 24816387 24977208 24968967
4098 24968967 25091620 25294777 25356596 25531649 25708261 26033685 26338367 26711305 26919205 27105781
4088 27105781 27282701 27384787 27600112 27507929 27645360 27807025 27921237 28125256 28323081 28494001
4078 28494001 28772354 29053850 29290594 29643565 29837191 30196041 30528130 30995812 31319214
4069 31319214 31659881 31850742 31939874 32095990 32298663 32428133 32726256 33058437 33138790 33374981
4059 33374981 33615380 33842899 34011109 34273667 34368851 34305601 34239042 34361046 34333748 34135866
4049 34135866 34124047 33945750 33928934 34012741 33922587 33723861 33470924 33317307 33204322 32938847
4039 32938847 32611437 32342363 31962989 31599087 31184133 30965828 30581768 30140756 29617296
4030 29617296 29225012 28753182 28094540 27583846 27331451 26879986 26454977 25837395 25359149
4021 25359149 24974380 24533963 23894103 23426136 22950716 22545922 22132525 21642807 21134596
4012 21134596 20757677 20589152 20146105 19558330 19105232 18699226 18100093 17692454 17352621
4003 17352621 16920861 16281600 15777921 15641085 15441264 15077260 14802302 14499645 14171433
3994 14171433 13944888 13731153 13340916 12918776 12596694 12331413 12240323 12060567 11557783 11285721
3984 11285721 10920058 10747230 10813473 10848216 10681719 10532613 10159548 9954431 9838474 9669434
3974 9669434 9397887 9177775 9166950 9165928 8869369 8733556 8545451 8347783 8348436 8334095 8334165
3963 8334165 8296938 8105951 8071806 8076897 7975525 8076467 7907755 7787419 7714377 7664234 7447374
3952 7447374 7320474 7183486 7065781 6904257 6833078 6615463 6555218 6729525 6645288 6517027
3942 6517027 6459844 6333071 6374557 6238592 6148621 6241567 6063772 6144659 6103720 5931483 5790698
3931 5790698 5713271 5778822 5806438 5738887 5798967 5700609 5613334 5626857 5533258 5525552 5412784
3920 5412784 5310295 5247370 5408320 5459118 5436343 5293191 5240852 5211881 5153652 5276826 5193825
3909 5193825 5127795 5077294 5045224 5023650 5097529 5013741 4982242 4996478 4995650 5074612 5083444 4957215
3897 4957215 4817182 4876402 4800100 4499673 4483597 4511184 4518300 4632385 4758864 4651904 4505098
3886 4505098 4469876 4518547 4469226 4422619 4430087 4430742 4435529 4457851 4556248 4510368 4438174 4292393
3874 4292393 4242091 4403580 4340804 4322315 4281085 4329002 4336009 4250174 4193930 4101724 4176171
3863 4176171 4164190 4253988 4462149 4232945 4054675 4157020 4079382 4063982 4088234 4144963 4196040
3852 4196040 4135562 4098116 3968157 4036020 4190523 4327581 4216135 3962620 3961454 4101374
3842 4101374 4204262 4154926 4224199 4192787 4179433 4091024 4038671 4095338 4056595 4120788 4164977
3831 4164977 4145386 4316800 4199382 4189835 4256109 4202364 4288689 4393071 4400356 4312366 4275500
3820 4275500 4263925 4213190 4165131 4303843 4356703 4388137 4334801 4381298 4484386 4538677 4536595
3809 4536595 4482153 4552220 4631170 4664468 4681718 4641262 4696992 4825135 4958556 4973437 4870045
3798 4870045 4858794 4922880 4980888 4917764 4861471 4908965 5000001 5024146 5120593 5009726 4994688
3787 4994688 5041521 5167488 5379224 5518671 5294977 5269081 5367514 5646427 5631596 5531060
3777 5531060 5643817 5636543 5841286 5936029 5975767 6058186 6138863 6164739 6173014 6291549 6409718
3766 6409718 6643100 6626210 6739563 6688832 6667334 6741838 6992871 6948712 7012871 7130670 7146860
3755 7146860 7372557 7439239 7550572 7572020 7647028 7638060 7748341 7746865 7751177 7922729 8130937
3744 8130937 8381820 8380131 8263955 8470786 8599140 8657790 9025178 9176930 9209158 9258803
3734 9258803 9221177 9387112 9373155 9595860 9832087 10035272 10050359 10157459 10488886 10718060
3724 10718060 10671852 10950643 11189174 11336453 11443781 11528427 11696442 11895227 12188723 12438014
3714 12438014 12546152 12815126 12852696 12868654 12949293 13379276 13578620 13588786 13795114 14074581
3704 14074581 14180273 14439809 14565047 14499161 14810849 14919086 15013525 15193324 15379216 15450823
3694 15450823 15537563 15638845 15747317 15783761 15865038 15948850 16019777 16085004 16157877 16276702 16240579
3683 16240579 16444542 16470920 16554813 16772961 16768751 16852590 16975894 17216999 17259271 17444092
3673 17444092 17492105 17469528 17607963 17549147 17650779 17779132 17825902 17925761 18106491 18448820
3663 18448820 18652701 18790656 18866598 19051906 19233247 19471558 19690303 19859916 20054334 20217390
3653 20217390 20350779 20744582 20955014 21138061 21461405 21885315 22134483 22366659 22591976
3644 22591976 22934441 23373233 23517111 23773391 23972074 24152843 24352558 24626538 24843116
3635 24843116 25043307 25205039 25454702 25515060 25537538 25703427 25930225 26099157 26392559 26532599
3625 26532599 26614323 26997231 27293626 27475854 27659001 27761499 27642975 27858547 28061293 28326402
3615 28326402 28479872 28659878 28737636 28860820 28980588 29052487 29124346 29255836 29511222 29692383
3605 29692383 29680986 29712056 29933008 30210896 30391964 30563282 30726734 30761206 30843235 30837983
3595 30837983 30965005 31070222 31123167 31055624 31307959 31437873 31639260 31753115 31806291 31806388 31933063
3584 31933063 32243437 32226536 32250518 32163871 32114312 32121704 32035196 32023739 31995007 31936933 31861898
3573 31861898 31808693 31714218 31647233 31380450 31104533 31103009 30885211 30660433 30494429 30333542
3563 30333542 29912351 29569165 29373258 29169512 28897461 28825167 28603425 28362952 28131124 27982175
3553 27982175 27894034 27716034 27658994 27651115 27536993 27540552 27399966 27237893 27421782 27591822
3543 27591822 27583737 27737578 27928153 27995925 28305369 28435628 28783297 28955264 29125459 29521979
3533 29521979 29735498 30131561 30416559 30489482 30764139 30968623 31247369 31471114 31639152 32020877
3523 32020877 32218849 32293865 32376622 32701349 32962639 33122999 33324779 33386213 33335991 33415041
3513 33415041 33521275 33475585 33473921 33356993 33427882 33623456 33621322 33621906 33586667 33639679 33692760
3502 33692760 33796453 33940519 34024470 34251875 34438883 34551662 34644866 34971387 35276646 35431621
3492 35431621 35711817 36169144 36562257 37004892 37472607 37956879 38346897 38849471 39202878
3483 39202878 39624727 40081752 40556188 41039610 41472067 41954833 42410049 42661215 42940177
3474 42940177 43230704 43508368 43792327 43908630 44138178 44406029 44733381 44977793 45196619
3465 45196619 45402182 45661648 45979141 46261102 46476104 46705554 47071891 47515435 47880479
3456 47880479 48384066 48798657 49278239 49548552 50056951 50506542 50922276 51509465 51982055
3447 51982055 52503645 52976743 53583564 54010692 54436904 54945596 55460798 55936322 56439237
3438 56439237 56820272 57304440 57897933 58606377 59032099 59466050 60101869 60664008 61192936
3429 61192936 61815319 62345535 62793041 63144823 63495071 63973921 64458140 64993168 65390335
3420 65390335 65875253 66432892 67055070 67640899 68167422 68673321 69247778 69878168 70500394
3411 70500394 71015705 71428567 71813547 72059665 72344577 72491597 72387891 72081874 71954109
3402 71954109 71873791 71668991 71330251 70957371 70714051 70550297 70368991 70242717 70157084 70102765
3392 70102765 69941656 69825075 69651911 69414932 69357330 69162616 69003896 68916366 68793947 68726522
3382 68726522 68619590 68499594 68484994 68387026 68233893 67809935 67311920 66703450 66178162 65247532
3372 65247532 64456644 63899600 63118316 62304367 61489568 60803036 60184275 59647942 59061490
3363 59061490 58489500 58353959 58074339 57786767 57631219 57444179 57333675 57467161 57476112 57374923
3353 57374923 57370133 57410389 57318076 57263278 57387483 57550039 57698650 57752958 57717888 57941640 58304081
3342 58304081 58606814 58981053 59254977 59686974 60241305 60661486 61004421 61630556 62403048
3333 62403048 63245788 64026892 64845775 65770334 66647316 67734545 68728837 69971607 71085821
3324 71085821 72229475 73397130 74720943 76171330 77489794 78892074 80482050 82211412
3316 82211412 83948810 85881484 87549842 89296691 90951316 92661039 94335969 95865608
3308 95865608 97193368 98263692 99205631 100223258 101161941 102224528 103139491 104181463 105083650
3299 105083650 105920242 107156003 108242100 109178334 110311067 111358197 112094523 112650277 113271218
3290 113271218 114084531 114825537 115414271 116234502 117158510 118053359 119041975 119986796 121109288
3281 121109288 122338830 123409457 124387488 125351616 126323927 127091360 128091967 129050311 130044276
3272 130044276 131022828 132180732 133447780 134697105 135940472 137148823 138526581 139913016
3264 139913016 141445672 142975757 144593821 146220821 147885023 149467742 151284901 153593354
3256 153593354 156001448 158667790 161808170 165303735 169394215 173628365 177661898 181005518
3248 181005518 182566026 181688062 178827384 175067787 170973974 167091539 163484183 160396025
3240 160396025 157440718 154734409 152530373 150384832 148334570 146521519 144876312 143171035
3232 143171035 141600036 140197220 138845097 137604105 136758792 136146449 135791287 135689038 136052589
3223 136052589 137238347 139268922 142385394 146591706 151733601 157506970 162928053 166240197
3215 166240197 164484169 157368176 147820333 138365080 130269528 123925449 119011075 115141611
3207 115141611 112059234 109607403 107766353 106123731 104492580 103360089 102244245 101438818
3199 101438818 100956207 100669488 100363602 100311494 100570815 101011202 101597484 102222542 103320005
3190 103320005 104697878 106084215 107996572 110418677 112560984 114076006 114709170 113896039
3182 113896039 111259181 106915972 101880954 97136008 92832692 89392961 86718433 84611081
3174 84611081 83005563 81732920 80855141 80023512 79379549 79129562 79207988 79393863 79748825
3165 79748825 80484938 81397657 82661383 84013029 85614542 87088378 88599018 90075174
3157 90075174 91608553 93120100 94597057 95477252 95172967 93459930 90694929 87795116
3149 87795116 85067159 82768429 81030768 79643560 78610384 77762616 77114619 76589265 76374637
3140 76374637 76085234 75774271 75553590 75222318 74951664 74646947 74540995 74569566 74417932 74577026
3130 74577026 74985024 75201612 75553574 75953052 76497627 77046649 77821381 78559861 78947555
3121 78947555 79244272 78981312 78452758 77646555 76586625 75804014 75154574 74516755 73707018
3112 73707018 73251761 72936206 72458217 72118565 71808309 71352357 70973507 70432398 70140345
3103 70140345 69755875 69285335 68991954 68769225 68310559 67930117 67718818 67450597 67089080
3094 67089080 66599808 66081246 65389932 64648680 63968892 63099812 62259378 61401326 60424226
3085 60424226 59630000 58540433 57680225 56738794 55710684 54803343 53749523 52715385 52025874
3076 52025874 51397825 50465106 49549889 48753347 48194918 47584113 46944182 46247050 45512551
3067 45512551 44837725 44075497 43272496 42512312 41834958 41229212 40513741 39816061 39136890
3058 39136890 38604741 37820736 37164885 36650455 36010460 35385318 34982233 34480339 34077513
3049 34077513 33609295 33119592 32533057 32038621 31493717 31073067 30689955 30307817 29954164
3040 29954164 29670901 29537128 29086337 28814009 28613884 28398520 28232739 28106957 28057269 28062302
3030 28062302 27998703 27942876 27858309 27968452 27818871 27755151 27671831 27704324 27504541 27481586 27298839
3019 27298839 27188022 27129418 27139595 27161475 27080019 26933267 26936726 26950446 26682806 26661758 26727934
3008 26727934 26690428 26566611 26652256 26480849 26303783 26175313 26094841 26193778 26265729 26407342
2998 26407342 26300564 26392414 26487056 26555337 26480169 26648739 26693192 26587331 26774701 26895879
2988 26895879 27016733 27036284 27190324 27314337 27386187 27399906 27618717 27887417 28142848 28449517
2978 28449517 28578749 28787980 29271424 29692665 29981585 30399452 30810635 31041930 31302415
2969 31302415 31706375 32127161 32548040 33120062 33546083 33943596 34454586 34889038 35515753
2960 35515753 36234762 37008518 37532792 38183304 38928846 39583993 40343776 41156769 42007097
2951 42007097 42906399 43766525 44772870 45794727 46851477 47897614 48966931 49953095 51076591
2942 51076591 52406923 53703711 54954588 56149566 57269429 58366781 59681690 61094457
2934 61094457 62763106 64582401 66574490 68710390 70999292 73584569 76351273 79364822
2926 79364822 83001989 87027723 91525067 96568856 102170089 108326272 114897894 121314823
2918 121314823 127289650 131817392 134723621 136012007 136251349 135745242 134972090 134197617 133536373
2909 133536373 132602916 131286597 129995600 128549349 127062210 125571428 124131171 122731215
2901 122731215 121808579 121488574 121867805 122841395 124315083 126252952 128767144 131930601 135361170
2892 135361170 139471142 143813297 148526646 153365232 158119957 162573227 166926511 170991181
2884 170991181 174693103 178443164 182343005 186368371 190696996 195225767 200060420 204993818
2876 204993818 210293994 216340843 223253163 230988504 239338052 248059397 256080104 262381205
2868 262381205 265608924 265602924 262726983 257285676 250240275 242470820 234802363 227390069
2860 227390069 220551549 214764491 209400038 204553524 200130260 196074686 192135184 188493869
2852 188493869 185125706 182022983 179393045 177145851 175333069 173919156 172775705 171546701
2844 171546701 170059296 168110122 165242027 160924216 155359514 148433562 141223694 133807336
2836 133807336 126334246 119299386 112463221 106464650 100710506 95429281 90305241 85724670
2828 85724670 81638174 77796882 74358985 71256478 68237481 65554909 63035945 60832326
2820 60832326 58846260 57000120 55118161 53516134 51870353 50291291 48928319 47637604
2812 47637604 46483564 45388186 44146111 43165157 42174716 41172293 40035673 38973522
2804 38973522 37830133 36761491 35617906 34525284 33504219 32513038 31770638 30905604 30139260
2795 30139260 29235252 28765690 28075737 27464359 26820654 26099650 25654862 25080437 24428148
2786 24428148 24004536 23402709 22891966 22646988 22310405 21932430 21582545 21113592 20708803
2777 20708803 20144703 19929695 19595496 19171134 18880206 18658150 18391250 18101516 17845764
2768 17845764 17558262 17352225 16942927 16689676 16397482 16124669 15875404 15730848 15457830
2759 15457830 15199074 15006281 14958787 14930350 14696523 14626287 14626800 14229467 14104177 13794704
2749 13794704 13618925 13369235 13104954 12999134 12848643 12701908 12397008 12245390 12226389 12122827
2739 12122827 11827676 11545056 11238996 10865820 10842796 10802191 10475172 10266612 10058970 9887609
2729 9887609 9650786 9584728 9531880 9276141 9154600 8946221 8820446 8704739 8616745 8706690
2719 8706690 8417920 8481458 8329790 8265451 8119959 8031622 8079884 7981931 7769801 7556884
2709 7556884 7418520 7470603 7390275 7264607 7350335 7280041 6994256 6876377 6754467 6772286
2699 6772286 6730638 6623290 6435681 6338418 6254214 6325516 6210232 6142955 6151697 6006751 5832608
2688 5832608 5679900 5588866 5667812 5603515 5475337 5409525 5270610 5261952 5134709 4941327 4940645
2677 4940645 5011785 5004840 4951316 4878839 4802397 4609673 4654742 4747412 4736613 4651519 4589332
2666 4589332 4518285 4371863 4389628 4538149 4495220 4295937 4280987 4168261 4171470 4147723 4002407
2655 4002407 3957332 4027664 4154102 4043355 4051999 3801097 3634478 3485111 3622507 3661980
2645 3661980 3747501 3800300 3778704 3838556 3833589 3802928 3760623 3827499 3604977 3680757 3784846
2634 3784846 3793210 3876791 3656881 3635856 3713683 3667980 3721647 3848938 3776769 3830142 3801135
2623 3801135 3739123 3571564 3467370 3414429 3577990 3408474 3369171 3366252 3253273 3208900 3336756
2612 3336756 3513274 3375845 3258452 3079526 3118246 3209467 3209032 3237656 3139406 3231488 3295249
2601 3295249 3454354 3296799 3156474 3129015 3148106 3053003 2997361 3070515 3075692 3127490 2963834
2590 2963834 3176309 3195718 3348909 3242075 3109059 3038420 3048551 3135027 3000962 3033694
2580 3033694 3090503 2980781 3042545 3036924 2944129 2868315 2802696 2774267 2554559 2529969 2665566
2569 2665566 2689350 2737404 2733666 2642932 2661274 2609080 2669790 2736283 2536426 2395624 2349642
2558 2349642 2412404 2356200 2267377 2224140 2190749 2066012 2090041 2192215 2060202 1982879 2022579
2547 2022579 1931648 1940435 1959211 1758979 1800440 1785068 1763739 1775344 1814904 1785054 1565282
2536 1565282 1661476 1679344 1600438 1664988 1573446 1427584 1402498 1519706 1399034 1400109 1469646
2525 1469646 1654040 1659751 1480152 1565985 1628655 1681610 1546686 1457603 1414877 1377814 1501823
2514 1501823 1437185 1309380 1451528 1450295 1311936 1118470 1202586 1215573 1196729 1161042 1337709
2503 1337709 1325551 1349285 1333736 1433808 1270085 1273283 1313038 1135974 1282496 1197329 1198106
2492 1198106 1175447 1113883 1119280 1106700 1157681 1193733 1182461 1175409 1204264 1192474 1023555 1103369
2480 1103369 1102849 1085840 1110165 986436 1041576 1043806 926483 1015162 1046858 962086 983042 1062125
2468 1062125 1142682 1210990 1004767 1064126 1137034 967028 1051998 1101828 1013768 1038278 944384
2457 944384 774576 728747 726600 839692 809187 678563 763436 897127 897459 745445 637662
2446 637662 649748 852131 927549 943916 907553 840489 746605 714632 747909 898160 927343
2435 927343 765653 742607 756457 746412 660706 644274 609330 599656 804112 786466 814650
2424 814650 698724 585758 636111 704047 654985 647119 674171 702345 610491 509062 574370
2413 574370 472812 372939 533034 783937 639873 631086 758169 759134 509248 439988 620818
2402 620818 685605 734044 810612 742337 645460 512790 474001 493237 653556 866871 699392
2391 699392 626181 742635 637921 661779 649341 583245 750623 703924 717396 612149 609418
2380 609418 582754 736500 857974 693666 699592 687428 904988 893633 871475 938957 862610
2369 862610 777369 686688 605540 632452 594370 669222 583963 613375 662174 593872 632323 628545
2357 628545 690383 901817 813047 710114 656836 552437 613801 498938 576306 681802 654809
2346 654809 621201 719173 635971 472063 490485 612174 817125 761396 797186 765564 644513
2335 644513 658102 608279 496902 562568 489010 433328 476163 476431 484551 430999 517483 623562
2323 623562 571946 528530 644641 552987 597786 696387 717427 665602 519799 494415 540705
2312 540705 613389 636830 519865 495817 580800 515244 401866 482294 555444 648202 638418
2301 638418 636039 685743 653853 597379 509662 476565 608235 607643 708239 626809 475961 637019
2289 637019 745109 489568 388532 463329 562318 420297 378419 541542 570549 464318
2279 464318 519552 497324 454279 440309 536239 605464 529591 615310 431208 319521 454428
2268 454428 399694 481988 650917 675634 674519 632134 582088 523611 537850 528628 566018 561037
2256 561037 524451 636248 708603 615515 634021 665900 693333 843901 935101 679002 746120
2245 746120 643084 549805 606485 485014 584187 624713 576952 529261 522267 575852 554219
2234 554219 676521 613772 596218 698868 728814 566091 633745 726431 778868 672482 651106
2223 651106 750784 711749 687954 632588 600398 733190 866955 748688 652493 639342 739474
2212 739474 792178 769261 811483 815725 860631 789270 788839 690413 747023 856576 991946 954579
2200 954579 835404 882735 1040577 1089874 914793 1076248 1121351 1169612 1264310 1250243 1337325
2189 1337325 1185214 1252570 1296033 1323683 1244289 1203368 1308025 1363290 1455470 1427357 1513760
2178 1513760 1581396 1562503 1405270 1447601 1613668 1553307 1578234 1594789 1689096 1596805 1703193
2167 1703193 1804872 1797574 1863217 1918504 2067539 1939065 2034293 2066704 2163909 2227021 2260060
2156 2260060 2199238 2225983 2413508 2538555 2664543 2773415 2645241 2779681 2989331 3132060
2146 3132060 3157451 3244031 3315663 3380266 3616582 3694910 3635094 3824250 4020168 4136600 4405273
2135 4405273 4602697 4696920 4894093 5026127 5334029 5525847 5895575 6000011 6271887 6588857
2125 6588857 7243275 7625729 8242704 8878352 9500762 9934604 10419164 11216043 12100721 13060794
2115 13060794 14386692 16173629 18720343 21693347 25947165 31452466 38580672 45656869
2107 45656869 54588274 58465420 48035341 35993821 27272017 21514750 17715110 14929716
2099 14929716 12679329 11008755 9872877 9019214 8313228 7871042 7421918 7169870 6878455
2090 6878455 6225725 5746910 5282247 4918774 4579409 4430217 4275862 3821788 3490350 3471444
2080 3471444 3146061 2931457 2862216 2673475 2607994 2462226 2486418 2481409 2348034 2121979
2070 2121979 2097184 2081329 1959354 1896042 1815488 1739077 1752698 1652520 1563461 1536446 1442818
2059 1442818 1453368 1376209 1336640 1327184 1330710 1370345 1224962 1143538 1148689 1135007 1018968 1056381
2047 1056381 994595 965650 1046935 920576 834784 895063 1002690 983205 900496 778335 699773
2036 699773 763105 802887 874312 937569 746585 744618 665734 741200 824823 814018 747429 663547
2024 663547 712804 774572 706026 682174 647088 677812 596684 780198 772435 803811 784986 605369
2012 605369 536695 551656 488892 587143 591444 614274 696793 565405 511245 572072 532933 440761
2000 440761 487645 442578 548376 559861 563189 449569 441954 449576 360956 383339 472432 462344
1988 462344 622713 588235 581707 625400 463985 478909 371978 256271 339264 473554 549194
1977 549194 535270 529444 481485 449883 310253 212711 145233 192591 292797 269642 318963
1966 318963 278022 178124 248081 39533 81199 209938 316974 267621 179005 262130 323134
1955 323134 302856 244154 303131 194471 271791 440567 255278 185702 162445 216931 279282
1944 279282 79123 262418 239037 202658 307606 318542 337011 117489 183570 312800 188713
1933 188713 173476 140778 184915 191882 260820 152593 55572 170170 132063 213548 146247
1922 146247 -122680 24512 144774 207302 183256 115988 188733 307026 328363 235711 238152
1911 238152 313155 250683 98584 -64304 84520 128782 38302 50294 81533 186217 255506
1900 255506 296335 376931 387024 263725 167882 97352 196605 161808 170070 152815 152068 258700
1888 258700 298948 380204 212280 139710 162794 44857 149836 283999 340703 212986 144875
1877 144875 142941 214148 206519 188016 55580 -21037 140710 145894 176360 193740 162992 8039
1865 8039 231494 258789 290637 311635 345469 361121 310265 253674 218826 208156 86482 149339
1853 149339 158694 69488 134176 16293 242069 242259 341180 397526 190938 137459 26489
1842 26489 132272 248515 283319 236571 334145 336755 249062 87994 -118120 27721 258231
1831 258231 263816 305699 359794 205894 244047 416122 228581 348128 189753 163781 184677
1820 184677 130225 40461 17432 -22571 135103 117355 103213 25944 -35827 -54297 41700
1809 41700 98097 177779 75545 25555 86331 224510 200575 -69077 125843 112480 54413
1798 54413 153240 200448 185143 262262 244000 279993 299390 156033 119444 -18659 -75815
1787 -75815 45138 198664 43193 161936 82450 -46685 46805 21729 78445 85804 7627
1776 7627 174942 32657 -21527 129703 92091 192100 2525 111787 117264 227331 -17104
1765 -17104 -38469 125468 74498 155934 256134 338307 172810 -5064 -4001 38113 34573
1754 34573 106851 163277 -42196 11955 149816 231126 68181 21826 179215 57695 -235842
1743 -235842 -145158 -206475 -220508 -99104 27334 74300 70999 96465 52950 -16045 -87948
1732 -87948 -38076 -94635 -95206 -59764 8060 7028 56555 159712 214891 129116 101669 140831
1720 140831 77176 -17047 12412 141818 113851 233079 126748 56452 174083 156981 199243
1709 199243 151041 -61948 -19997 11863 107160 96639 -159444 -54903 13000 148035 201713
1698 201713 155409 81396 -71419 58959 18074 70925 77373 155027 199118 41852 136062
1687 136062 77876 101576 71139 118912 17920 79024 114334 179109 209381 16333 150566
1676 150566 76766 85045 156923 141341 2636 25008 147313 -40348 88083 -11765 47945
1665 47945 61064 61963 107677 38273 -70650 19798 -51521 -137336 -3736 150503 33132
1654 33132 -79741 -49853 -38797 -146191 -194344 37651 157164 170559 58272 180045 225357
1643 225357 97223 -98616 -17059 52133 -84535 -62435 49657 37165 -9776 -131150 -246373
1632 -246373 -91738 -37373 51683 185915 58463 171087 182055 101786 75011 95130 10319
1621 10319 -33887 11524 -5207 115089 178329 242384 268816 58562 36352 -20720 -147175
1610 -147175 -15143 167212 87884 -144348 -21718 -94231 -31592 -135433 -115077 -31341 -133079
1599 -133079 -823 110073 95295 37958 -22173 148388 254066 -12174 122449 65418
1589 65418 69684 -9646 -63290 18217 197349 117913 82219 69070 7049 -343 -29434 -76000
1577 -76000 -75094 137248 182555 60994 -58655 96083 92417 -21137 53384 8612 13811 91378
1565 91378 52257 -12611 -7563 -19422 -14577 56525 213177 118607 248394 282405 88085 102399
1553 102399 108232 140135 144653 196978 49739 186267 104250 31049 13847 158322 153597 31426
1541 31426 -88142 40563 76572 18916 36236 9895 -40475 -210480 -23 -146722 -140442
1530 -140442 22885 68804 -1560 -10423 18762 46612 170273 89791 27953 89101 157170
1519 157170 150610 146677 -77871 -125190 -143014 -129926 33388 77654 -85016 -73974 101526
1508 101526 -6860 -40894 -24872 -76416 -58051 104133 -51951 -121157 5056 -24004 -6708
1497 -6708 -10402 -65256 -44302 25352 115322 216453 67517 77446 31502 38146 185232 217298
1485 217298 145477 91255 732 15567 -13507 -53897 -26042 17257 117048 141238 46501 38523
1473 38523 -83923 -73256 98402 78943 -76553 -56570 -90923 144486 188106 68097 169739
1462 169739 200756 284194 84126 152430 310175 235841 106408 -89235 -188443 106783 60181
1451 60181 -48322 65966 58570 -116343 -73396 -105201 -41244 39609 -13321 103940 83974
1440 83974 13598 24812 -118713 41720 62751 -1459 17854 -108373 -45259 -46825 -40330 -129693
1428 -129693 -114837 -13251 -11862 -11230 -5142 50858 32897 -19217 29258 32795 -15117 -116514
1416 -116514 -44080 -34782 -33286 -55396 91987 156716 45431 152436 152133 262435 122278
1405 122278 189267 64297 37548 134010 132150 45654 16810 105808 177376 52902 23410
1394 23410 -110104 -29873 -1334 13716 33127 -79255 -108768 -15613 95816 -75346 -94825
1383 -94825 -106382 -99385 -84460 -11838 -39841 66464 16926 30963 -18693 -48754 74692 153427
1371 153427 123352 -33564 -38072 -43735 -101437 -157061 -62475 -62301 28638 11590 -69461 -56959
1359 -56959 -21970 -25603 -132316 -156321 -111390 35434 -165162 -160678 -198680 -209005 -117459 -78340
1347 -78340 -13086 -174240 -192538 6086 1060 73573 -79063 -58845 -17297 -170298 -69372
1336 -69372 -53311 -94301 -63302 -23760 57609 -57998 30974 33829 125403 88379 -71942 -157959
1324 -157959 -94053 -63734 -172603 -108760 45082 100157 13131 26094 -85273 9554 107956
1313 107956 21151 -52184 -195245 37041 23460 -11664 31530 -132667 38200 24627 -119931
1302 -119931 -26654 10113 -56108 -91701 -49048 -21665 -109040 -28678 62257 -42898 -19362
1291 -19362 -107984 -105437 18199 98499 88998 133754 132389 51235 138569 130005 70889 21442
1279 21442 -138991 -63119 -50838 23542 121092 -11866 8861 94326 199463 157345 150531
1268 150531 10859 35325 -28719 27558 96623 -40765 -151582 -190288 -284384 -49893 135442
1257 135442 151141 -48575 -11970 -76297 110 145691 30073 70607 122518 222643 93119
1246 93119 -48188 -199369 -203394 -206696 -145482 -26561 81336 -79067 -142859 -8205 49189
1235 49189 49529 -83500 43010 -4118 50514 -14885 162437 140305 -54108 -83781 -131369
1224 -131369 -131153 -213666 -9850 -135386 -188879 -110989 136561 96606 10400 -56007 -110260
1213 -110260 -133736 -15990 136408 139882 99603 -17604 70767 -95037 -1854 121611 170357
1202 170357 118606 -9870 49257 112457 15317 -57182 -68983 -68534 -119758 -44155 87483 177399
1190 177399 -21580 64734 40117 32954 34393 21858 -1437 -61582 21598 25029 29738 -31437
1178 -31437 32718 -16918 -3251 -50995 -34030 71595 184409 106336 -110445 -69775 -162327
1167 -162327 -132830 -86721 -152679 -102101 -77247 -78483 -66746 -65519 -58624 5552 3505 -29341
1155 -29341 -86768 -18258 -22936 9761 -2100 -16104 57091 31558 -99775 -56369 -127261 -153489
1143 -153489 -138165 -57482 62720 38250 -74978 -83374 -80743 22354 95575 82336 149937
1132 149937 188160 83555 49887 21452 -48944 -194195 -40735 -54434 -151962 -38846 -44433
1121 -44433 109039 140824 -135 183006 80338 -17003 16425 60013 8250 68431 153420
1110 153420 -31144 -180514 -37204 -194069 -253170 -201473 -133382 -220335 -152558 31141 9587
1099 9587 9404 -102311 -2435 25357 -19165 -31998 39749 -108284 -100374 10863 35578 76958
1087 76958 25847 -64613 -43216 16630 42227 -132554 69064 267186 166677 85836 69617
1076 69617 89137 265784 136653 104438 67327 62625 289511 272207 126333 -56972 29889
1065 29889 -4940 -35972 89646 67646 4204 143534 143495 45707 41626 -21333 -29921 -151552
1053 -151552 6800 143330 169378 134468 84211 -40537 154269 151934 237923 243459 -25033
1042 -25033 -20631 29535 65294 84670 68927 51088 85380 -31814 -4922 132378 112221 113030
1030 113030 127725 90648 -191398 -139534 -137781 -84000 18215 2089 84545 42283 84822
1019 84822 175624 291880 46082 -66947 74152 186129 29866 -5641 -13419 -53786 4643
1008 4643 4511 -24755 -51600 27060 26506 -46234 41334 -15420 -58071 -46225 -80920 -49118 16776
995 16776 -16103 108665 103637 15889 5709 47208 155595 73562 -34647 -37680 18689 -148809
983 -148809 -268268 -180168 -69253 -90583 -53961 -168835 -123809 -8487 42763 159947 -42303
972 -42303 -137360 -33068 -51820 -100708 -57574 24127 15306 -77694 -80975 -158274 -120929 -56851
960 -56851 -32154 -73234 -62772 -22434 -58938 59452 49194 -71910 -41980 6060 73777 88337
948 88337 -100836 -122643 -113862 -135077 80610 104692 127922 182189 155561 82579 2161 75581
936 75581 96730 80264 -64396 -102849 -46651 285 12088 -12512 -51156 60225 124941 50243
924 50243 -14894 153722 29899 26306 -49570 -73788 19756 -27585 128759 31321 -95625
913 -95625 -63871 -210970 -217416 -190439 -267298 -76777 48098 -54706 -32931 13612 -131262
902 -131262 -33582 -112893 -17670 -118546 -132586 -257420 -132784 -98372 -36556 -23900 -126287
891 -126287 -178674 -184269 -26053 -48943 48978 -31565 -55170 -113576 -18254 -105117 -71790 -23909
879 -23909 -186930 -59568 6386 -127861 -187152 -43376 -36516 4213 -91224 -72822 8362
868 8362 13400 -56493 -102448 -22352 -30169 -207586 -169027 -16875 83011 131305 7785 -83708
856 -83708 -104795 12921 -123003 -314532 -242931 -113306 56961 110054 111036 60111 60300 31479
844 31479 12292 20893 -117599 -152619 57688 166594 -70799 -117213 -144958 -286322 -119877
833 -119877 -99253 -102937 -75218 -108249 -166945 -157202 19103 -52631 -74778 -108287 -127178 -163787
821 -163787 -82414 -960 -109570 -116293 31261 -114627 -88905 -60550 38967 131378 87142
810 87142 -215843 -216163 25588 57721 62026 -52466 -247255 -175739 -134860 -162401 84123 1492
798 1492 17440 -4301 -57901 48875 6696 -119467 -8416 14821 -182580 -235648 -101443
787 -101443 58084 13654 -43712 -33251 -19019 -113412 -134675 -309756 -6996 101872 -23054
776 -23054 -36752 37330 -39701 -18053 106742 -5272 10817 11743 -86097 -66896 -45036 -34925
764 -34925 188 -23585 -2041 103616 153241 8804 -88132 -46670 28068 -94299 -63200
753 -63200 -71015 -75822 -11564 36638 95355 74885 119489 68095 27580 83954 28658 -59543
741 -59543 -193232 -74257 10011 -20562 -106754 3083 -47553 -8188 29642 59202 31709
730 31709 -38471 -69220 -130075 9356 897 -50923 -187130 -120088 24213 -15215 -16507 -40511
718 -40511 143198 100728 -22829 96310 53483 59937 153500 115379 70963 122156 116851 13793
706 13793 8630 -115520 -105354 -27934 -63142 -51761 -46766 102548 -24895 -103489 -18049 -6887
694 -6887 79818 -351 97305 100621 34492 135026 -55171 -144552 76331 7141 79717 -57191
682 -57191 65 -38582 -132770 -13916 7105 10268 12865 -40478 -175121 -166717 -54388 44876
670 44876 -88435 -38723 -103003 -170297 -47338 -13123 25318 -14077 44379 -36118 -171871
659 -171871 -131829 -132616 -233435 -216296 -105278 -55620 -32915 -3792 -42217 -162268 -122888 -197455
647 -197455 -162770 -140277 -163985 -73368 71856 -110755 -95133 -82044 -24512 65294 20222
636 20222 -74882 -73092 -84194 11398 -1637 -27033 53392 -64691 9674 -11008 25170 68650
624 68650 -94319 38835 -25350 -19728 36325 13656 66311 44424 485 31732 161056 25267
612 25267 13182 6511 -141127 -221138 -175619 -48539 81803 -92566 -42847 -99974 -206272
601 -206272 -99994 -8100 -12501 6993 -217966 -207575 -32715 -158868 -267516 -179519 -114679
590 -114679 -147114 -144605 -177767 -75062 -127832 -51113 27523 22565 -118869 -258780 -146169
579 -146169 -132785 -176616 -148071 -195774 -128615 -158605 -41726 73793 -40192 -31462 13230
568 13230 -7581 -57676 -149291 13474 -100977 -120354 -126335 -14820 -39882 -64963 152429
557 152429 20019 -118320 -270898 -118709 -162994 -135520 -26255 -96835 -45357 4129 124223
546 124223 22436 -12791 -50955 45754 1759 38985 63793 -58020 29023 86737 -41335
535 -41335 -118392 -60956 -34593 9438 -176820 -107951 -58198 -98470 28972 1093 -42384 -159686
523 -159686 -78552 -136289 -281984 -20970 13069 38475 -86150 -114209 23777 90408 25865
512 25865 -39743 14258 70177 179746 92490 24791 56091 -79186 -27797 -94389 90908
501 90908 -13217 -207729 -257918 -250531 -134610 12611 78438 -73549 120410 42873 42574
490 42574 65194 -171198 -176836 -302596 -204453 -243962 -211560 -168477 -139383 -110924 -18351 76466
478 76466 53930 -84480 -57691 26021 -27515 107085 166834 121812 -30895 -8474 97172
467 97172 61407 74339 -60929 -31774 -19291 14320 14598 106954 144469 84446 -51922 -106832
455 -106832 17455 -39482 -266164 -403133 -244697 -307148 -223783 -1849 77016 23345 14987
444 14987 8439 203527 -25361 -203302 -144316 -104985 -191758 -78804 -26830 43766 -94122
433 -94122 -132131 -90587 -182943 -60946 8985 -96414 -145547 -52288 60066 72169 9102
422 9102 -135019 -87184 -75087 -2055 -113184 -125835 -62329 -123629 -214270 -174280 -111084 -153539
410 -153539 -77337 -50237 -63779 -222640 -91104 -81890 -78740 -73947 -92061 -82234 -69915 35606
398 35606 18376 4772 -56369 -69847 120832 144465 39864 16735 10367 12618 -139931 -289828
386 -289828 -65853 8243 81467 37650 -4781 101811 28778 -186933 -219076 -71753 55212
375 55212 73183 55146 -43124 -87414 -185562 -82727 -72678 -75162 -6634 -118979 -50673 -179440
363 -179440 -290136 -224715 -172929 -79649 -2948 -113996 -145532 -160772 -206628 -70815 -16718
352 -16718 -8839 -13976 9828 -46386 -233297 -113161 -36945 -159721 -26017 12324 -83105 -190043
340 -190043 -82832 16129 30779 198868 90876 16762 -8159 -205001 -254832 -39911 -62838
329 -62838 -29489 -10387 -89040 -32685 -54853 111374 199164 39982 -46280 -14176 -82304 -92590
317 -92590 -82608 -112620 -146288 -85375 -40993 -93596 -121769 24871 1697 -121900 -198403 -160367
305 -160367 -49586 130650 63762 -159272 -177923 -186836 -98808 -124566 -140591 -248299 -283873
294 -283873 -13683 40864 -55346 -61945 -21032 -39272 -8889 -26989 -20538 -62786 -130927 -149735
282 -149735 -83167 -136549 -93949 -7636 -149596 -120589 -233157 -264037 -221094 -93706 3819
271 3819 171286 81162 99908 189614 189688 89475 -42507 -80199 -208 211395 181667 2117
259 2117 112516 135486 32920 -10749 -126260 -108110 -65987 -63089 -87656 -101552 -136830 -299075
247 -299075 -272511 -43487 -4150 -1447 32758 -149793 -93557 36973 -137155 -228056 -97993
236 -97993 -22455 -81193 -120352 -88217 -127726 -155189 -178261 -181607 -186542 -149682 -120362 -49069
224 -49069 -38630 -132124 -33200 -39646 -48813 -27900 17541 5507 -20272 -80854 -70804 -111394
212 -111394 15491 -44625 -228882 -81041 5460 -18033 -9281 -21335 -99756 -61394 56965
201 56965 73777 108962 -65100 -144720 -75411 -106614 -8205 -58984 -95269 -116709 -81291 -64737
189 -64737 -104314 -172986 -149995 -147186 -141158 -81395 -105150 -10043 -79269 -60932 32270 -12526
177 -12526 -92994 -210145 -9374 1547 -194807 -192066 -108209 20959 -22804 12423 -111356
166 -111356 -199828 -200150 -63705 -158077 -121681 -150322 8077 20909 -114040 47871 -87060
155 -87060 -37282 47922 -98502 -53163 12398 -65524 -138155 -20849 -36614 -113010 -100382 -75648
143 -75648 5921 -82439 -146032 -142255 -48454 138182 41723 -108075 -176175 -228199 -186678 -227336
131 -227336 -199065 -85948 27209 -110748 -27794 -76710 -140905 -88050 -127517 5265 25839
120 25839 -73872 -237710 -281712 -140220 -136892 -159415 -274957 -192847 -90170 -167587 -115051
109 -115051 -61695 -83131 -85189 -82678 -10585 -30084 -83237 -116716 -166170 -210745 -15719 -69265
97 -69265 -14615 -7213 -89736 -129844 -47848 -128684 -140203 -31262 -34329 -133265 -190458 -170223
85 -170223 -166967 -50388 12673 57585 -81456 -38296 -81305 -107661 -123497 -86763 -121265 -85586
73 -85586 -114177 -70741 -113705 -65030 -57949 -52926 -116165 -74824 -29283 -125918 -30242 31830 18768
60 18768 31593 191066 147245 7421 -90890 -95117 -152461 -63659 -3173 -48810 -190318 -267421
48 -267421 -124260 -42100 -155448 -176219 -173202 -92996 -76948 -36971 -110015 -45202 -12421 -70430
36 -70430 -97941 -113482 -133274 -136818 -65582 -164613 -139411 -57294 -35967 -29186 -55122 -139444 -90263
23 -90263 -59244 -75227 -40680 20604 -38384 -111417 -13788 -5657 -119377 -51518 -84345 -180814
11 -180814 -272349 -256463 -175414 -190838 -116289 -2137 -20550 -20477 -32206 -208862 -209930
0 -209930
$$ Imaginary data points
##PAGE= N=2
##DATA TABLE= (X++(I..I)), XYDATA
16383 -3542992 -3471120 -3505424 -3425724 -3396337 -3357325 -3277940 -3204604 -3213044 -3155201 -3117200 -3127735
16372 -3127735 -3205836 -3033435 -2918492 -2797006 -2686996 -2730632 -2652108 -2605098 -2490646 -2414697
16362 -2414697 -2459583 -2515859 -2383462 -2227277 -2263667 -2287146 -2134802 -2159721 -2053181 -1983778
16352 -1983778 -2026081 -1908592 -1866495 -1841145 -1819091 -1621782 -1627554 -1610006 -1545213 -1523515 -1361681
16341 -1361681 -1330877 -1405463 -1340264 -1286891 -1239248 -1175476 -1063184 -1027899 -998083 -921447 -959302
16330 -959302 -841291 -815060 -787373 -889783 -841853 -688650 -645349 -559337 -522472 -543488 -538160
16319 -538160 -427634 -333788 -413355 -359507 -237390 -172031 -110013 -73460 -65158 18799 102266
16308 102266 188129 139237 294602 278314 262194 415285 498189 445660 417334 400431 405469
16297 405469 541295 578648 606775 683293 713217 665937 601171 697694 893132 1075560 1039906
16286 1039906 1058489 1013876 1046617 1132121 1115862 1091001 1120169 1164609 1237029 1162288 1166046
16275 1166046 1202886 1300185 1594604 1674815 1575818 1500440 1623118 1777023 1765102 1648146
16265 1648146 1553735 1645282 1721438 1849516 1882602 1882435 1987059 2041656 2039235 2076421 2126353
16254 2126353 2096334 2078555 2181585 2219314 2337806 2379135 2229437 2328834 2339665 2409833 2448506
16243 2448506 2435318 2334097 2358089 2420818 2546707 2504977 2452317 2401155 2623464 2757616
16233 2757616 2724058 2742947 2682802 2659307 2718015 2763811 2894652 2995823 2980991 2880794 3010773
16222 3010773 3146183 3276262 3200307 2989838 3000161 3107405 3006754 3208007 3193629 3173799
16212 3173799 3145629 3313879 3385845 3291089 3227535 3156901 3372139 3338498 3419055 3385569 3478829
16201 3478829 3477890 3478596 3500933 3499579 3465374 3425523 3521442 3527647 3623918 3397741 3455393 3606806
16189 3606806 3540688 3560840 3496780 3680415 3605118 3600133 3693638 3774942 3797763 3760541 3780681
16178 3780681 3833970 3846523 3790856 3755442 3779138 3861881 3790963 3962384 3690627 3606659 3668212
16167 3668212 3800783 3940000 3869974 4033678 4011239 4076442 3889915 3749898 3876059 3988727
16157 3988727 3894166 3938430 4004267 4002697 4024606 4154990 3965969 4022022 4115729 4159997 4195976
16146 4195976 4244605 4370975 4259748 4119942 4160381 4233108 4080418 4225319 4288361 4214655
16136 4214655 4239205 4341601 4500979 4354906 4226856 4297958 4338732 4301037 4326316 4344964
16126 4344964 4429113 4381293 4241219 4220873 4200747 4189556 4372864 4380793 4267821 4495408 4430406
16115 4430406 4276435 4219898 4239620 4471168 4394988 4356552 4345624 4331796 4290822 4221281 4043718
16104 4043718 4312856 4425815 4290929 4271886 4333934 4359549 4349283 4396528 4532739 4541244 4519894
16093 4519894 4555829 4528787 4414365 4272989 4266646 4344357 4543278 4511264 4539554 4435769 4415830
16082 4415830 4394350 4389294 4457215 4634479 4505084 4498597 4406997 4514301 4476670 4505423 4574097
16071 4574097 4544926 4508165 4376062 4416682 4361628 4430075 4443759 4512694 4415512 4424956 4412293
16060 4412293 4416710 4491223 4457896 4498322 4538962 4486480 4498712 4562641 4532794 4542779 4560190 4560759
16048 4560759 4583264 4523040 4426435 4574930 4616707 4464316 4486660 4559271 4481005 4530521 4705533
16037 4705533 4586927 4607436 4671319 4541897 4511907 4582124 4478348 4555255 4708110 4785126
16027 4785126 4644056 4564237 4686262 4704816 4736152 4836632 4876990 4662357 4511564 4558945
16017 4558945 4646869 4520856 4556375 4542119 4515055 4692556 4729622 4655864 4428840 4425331 4468637
16006 4468637 4522373 4515239 4475960 4462556 4543204 4607388 4470192 4629328 4589301 4583581 4625713
15995 4625713 4464593 4374472 4488929 4681666 4684797 4611485 4612446 4539102 4570812 4577859 4566058
15984 4566058 4543945 4581570 4458759 4492281 4540842 4613620 4544993 4427094 4540619 4678404
15974 4678404 4818653 4680709 4511087 4740897 4552253 4481665 4702200 4742349 4702872 4662806
15964 4662806 4510430 4603999 4650192 4576733 4591677 4576961 4598381 4647960 4599050 4496700 4477464
15953 4477464 4568783 4597075 4662489 4697302 4602583 4688654 4493736 4580498 4691661 4699561 4477549
15942 4477549 4395796 4566050 4694363 4776169 4707653 4746513 4849894 4742241 4601927 4615083
15932 4615083 4577679 4584741 4780666 4775409 4755636 4668239 4661673 4494455 4442513 4559073 4591355
15921 4591355 4507637 4519331 4458239 4611455 4607727 4630123 4602842 4594245 4460400 4555970 4541960
15910 4541960 4597711 4548131 4646375 4651184 4707978 4640674 4428044 4583708 4796004 4726108 4632230
15899 4632230 4640993 4526933 4633579 4527568 4558564 4638186 4620511 4584243 4702993 4766974 4783322
15888 4783322 4761687 4812752 4839597 4865888 4772760 4594441 4549459 4632431 4538849 4600584 4614700
15877 4614700 4725936 4713468 4805231 4741859 4516217 4516254 4583892 4695188 4875285 4720250 4638085
15866 4638085 4686828 4629452 4673807 4718908 4683054 4702775 4724014 4858991 4757336 4602504 4643491
15855 4643491 4631134 4591206 4628584 4616249 4634221 4690960 4763792 4786655 4874024 4883159 4854054
15844 4854054 4788678 4790597 4736316 4743457 4773553 4512149 4440418 4526130 4718308 4573057 4628141
15833 4628141 4796307 4806051 4846180 4696899 4669098 4653205 4602880 4557131 4532858 4648974 4677432
15822 4677432 4783149 4854301 4925689 4727573 4592797 4608028 4574175 4692194 4702294 4667596
15812 4667596 4583152 4658565 4608301 4746167 4828731 4861548 4827709 4709014 4599529 4556488 4585113
15801 4585113 4594442 4573057 4641174 4607770 4669735 4726923 4772710 4749758 4689436 4631519 4661569
15790 4661569 4653247 4507805 4658098 4689347 4754307 4671154 4700027 4680051 4622364 4532821 4453805
15779 4453805 4466361 4707257 4796484 4924906 4799546 4653589 4590330 4655936 4733882 4613583
15769 4613583 4651032 4732872 4831607 4764141 4744948 4782896 4752316 4807522 4752414 4773255 4781167
15758 4781167 4694151 4722120 4822229 4929103 4862278 4753732 4639864 4569914 4560105 4534279 4633925
15747 4633925 4771620 4870189 4704439 4711581 4815744 4760804 4760356 4817783 4666343 4589702 4606668
15736 4606668 4559781 4532702 4598620 4637082 4729185 4620849 4587396 4621182 4685788 4632375 4547712
15725 4547712 4679986 4723973 4829334 4705703 4928273 4825975 4622404 4732455 4790248 4669676
15715 4669676 4764667 4687843 4611388 4684860 4782058 4775674 4910227 4808831 4716366 4741740 4641115
15704 4641115 4753988 4789721 4744423 4697541 4593840 4456536 4643230 4612732 4584641 4555737
15694 4555737 4690909 4963389 4978982 4715095 4802316 4852341 4661975 4614055 4508262 4651645
15684 4651645 4917321 4881227 4780434 4677722 4690519 4727524 4774475 4788447 4739419 4905786
15674 4905786 4929282 4867791 4839667 4815806 4754388 4741018 4762035 4720801 4642919 4669018 4706836
15663 4706836 4798960 4788625 4854782 4763833 4691626 4767605 4871659 4973107 4923145 4959203 4846403
15652 4846403 4778546 4786054 4803764 4691773 4678986 4703171 4720401 4758959 4568340 4801875 4807412
15641 4807412 4826149 4796682 4800634 4747325 4621422 4741506 4723739 4760411 4694387 4737780 4762678
15630 4762678 4709481 4715211 4894935 4981566 5068637 4898856 4733523 4684354 4714497 4761475 4713778
15619 4713778 4677021 4613043 4793806 4869341 4904804 4865492 4803742 4867883 4853066 4884149 4928694
15608 4928694 4813689 4794426 4841451 4916468 4919551 4796282 4726637 4794280 4675980 4623127 4713295
15597 4713295 4802217 4871922 4917804 4860986 4734795 4752787 4893210 4814868 4700934 4813199
15587 4813199 4998132 4983285 4919516 4734539 4726271 4881118 4949735 4918793 4805964 4828936 4826342
15576 4826342 4897692 4813073 4701735 4739496 4731708 4636436 4740923 5035203 4881988 4661991
15566 4661991 4866497 4739239 4897812 5001631 4779657 4787825 4944520 4847498 4908401 4820196
15556 4820196 4758605 4857000 4735165 4673112 4738457 4782472 4745639 4674848 4736772 4784630 4973256
15545 4973256 5067215 4922135 4833214 4920355 4856272 4710829 4661211 4890721 4831470 4902336 4875211
15534 4875211 4771023 4766749 4624267 4668829 4801663 4819460 4770796 4757193 4828126 4705323 4657960
15523 4657960 4557252 4513502 4784371 4637200 4765659 4766474 4808441 4805986 4792333 4811654 4935122
15512 4935122 4823214 4905842 4918885 4856749 4779186 4755867 4825788 4887152 4926948 4830497 4749391
15501 4749391 4817266 4850155 4923162 4845508 4627590 4711976 4910768 4907017 4815727 4811657 4884336
15490 4884336 4878498 4821759 4859901 4897157 4836761 4809702 4773426 4873984 4888494 4858948 4979736
15479 4979736 4855735 4900599 4795931 4811664 4712503 4636047 4774501 4657113 4689636 4766474
15469 4766474 4714095 4685809 4834419 4862626 4850232 4845147 4935871 4917450 4922466 4990363 5048086
15458 5048086 4959488 4990500 5127004 4975851 4938088 4911868 4956120 4925391 5017195 4922751 4727054
15447 4727054 4829129 4812792 4801438 4773816 4710522 4722234 4661380 4732567 4922609 5002057 4795809
15436 4795809 4861551 4923345 4771022 4761470 4823065 4804173 4754183 4907764 4993606 5055506 4954175
15425 4954175 4935741 4904568 4897269 4923471 4979675 4943563 5051383 4940311 4901984 4975559 4771255
15414 4771255 4879075 4927347 4819735 4714844 4799536 4796736 4849685 4890518 4983855 4967867 4984206
15403 4984206 4959480 4866740 4800932 4846797 4772907 4839766 4813869 4788993 4760649 4830454 4993599
15392 4993599 5016597 4953653 4785535 4837266 4950054 5101515 5039249 5036844 4897747 4802763 4792122
15381 4792122 4838470 4726291 4775449 4798690 4822655 4789527 4736398 4699258 4666577 4857551 4901694
15370 4901694 5032802 4921517 5040414 5042228 4909894 4934631 4899529 4897895 4863298 4725305 4707709
15359 4707709 4759715 4995577 4920034 4898647 4886195 4878403 4902274 4873333 4804281 4942735 4934639
15348 4934639 4908315 4976061 4924812 4933041 4981465 5075633 5078854 4943450 4690053 4718929 4689155
15337 4689155 4695907 4826870 4927521 4781140 4812337 4869796 4894681 4812221 4743918 4763182 4743023
15326 4743023 4839673 4885697 4908446 4975182 4907021 5073917 5056051 5073230 5040939 4840307 4826192
15315 4826192 4835198 4865713 4884200 4984339 5014379 5008606 5028168 5024584 5056187 4900229 4769794
15304 4769794 4789859 4823009 4967175 4904726 4840171 4996136 4973062 5016702 5002115 4812314 4828129
15293 4828129 4895384 4936222 4979435 4916288 4864533 4772884 4811558 4817633 4916286 4851018 4878522
15282 4878522 4846149 5008823 5093342 4906865 4687204 4726320 4728958 4704097 4814627 4922773
15272 4922773 4943692 4895890 4969331 5066709 4923806 4864933 5025887 4902943 4925966 5024717 5115224
15261 5115224 4989495 5036914 5048399 4944219 5013871 5000685 5025047 4965576 4774529 4832661 4818955
15250 4818955 4753585 4792462 4837085 4869806 4954698 4939045 4932316 5019686 5078010 4982846 4927408
15239 4927408 4751811 4791879 5008556 5009419 4853642 4860868 4847172 4771318 4721634 4629587 4591106
15228 4591106 4827879 4900151 4874469 4960285 4974152 5047825 5094536 5038370 4933307 4879475 5027918
15217 5027918 5079729 5076951 5065602 5035476 4984067 4996240 5004173 4969449 4787102 4732477 4824828
15206 4824828 4988865 5107838 5030886 5032663 5133422 5037200 4897583 4842606 4811861 4938271
15196 4938271 5006593 5036503 4973082 4910902 4992574 4909907 4924317 5028912 4921736 4737938 4804286
15185 4804286 4813120 4857628 4965192 5050647 5098361 4834793 5004568 5062132 4863430 4880152 5018905
15174 5018905 5106862 5104313 5034244 5055153 4941593 4954713 5028899 5104741 4971818 4917038 4925513
15163 4925513 5000321 4922410 4923238 4920042 4887945 5002798 4901890 4853404 5009991 5007297 4806209
15152 4806209 4873976 5001763 5024660 4909586 4903172 4986893 4970713 5036539 4955971 4885338 5014886
15141 5014886 5075270 5121656 5152119 5027407 4982989 5040921 4962772 4964121 4981379 5028056 4865227
15130 4865227 4861920 5014628 4978457 4974328 5024928 4924551 4915909 5023693 5111000 5038730 4906644
15119 4906644 5033435 4908294 4773058 4913898 4967670 5020075 5005011 5069387 5059878 4868005
15109 4868005 4838256 4990241 4953228 5196312 5112009 4905316 4892992 4925595 4862131 4857780 4973160
15098 4973160 5003700 5106550 5008823 5060917 4912604 4914154 4973041 4949425 4969600 4956967 4870233
15087 4870233 5088448 5010508 4946444 4984536 4976734 5033952 5085072 5096888 4989166 4933102 4959584
15076 4959584 5038279 5002530 5072188 5176701 5032199 4954833 4884778 4847092 4961903 5014824 5035818
15065 5035818 5126825 5201957 5086894 5145346 5145260 5053239 5057603 5038290 5019254 5037078 5059716 5178964
15053 5178964 5142580 5048706 5154396 5184159 5101626 4875571 4847960 4934083 5158284 5143514 4949126
15042 4949126 5001708 5152009 5057145 5048657 4952777 5016220 5125330 5085132 5171734 5098549 5033179
15031 5033179 5019461 5072532 4904501 4973507 5131145 5246403 5199187 5152409 5038220 5034820 5174604
15020 5174604 5210672 5136456 5127310 5104817 5095489 5023484 5087682 5197430 5191201 5110047 4998065
15009 4998065 5006683 5020085 5029309 4912494 5027297 5075560 5170421 5164766 4865117 4857224 4974856
14998 4974856 5102594 4897927 4751612 4870605 5087102 5329245 5315987 5122525 5147220 5164904
14988 5164904 5223836 5189455 5223808 5144357 5259771 5242851 5088689 5077527 5173558 5151325 5181565
14977 5181565 5171339 5146536 5227749 5043281 5074103 5146580 5134300 5035156 5137628 5214090 5160046
14966 5160046 5139142 5200876 5105521 5233823 5158497 5149231 5106949 5093543 5071586 5083792 5095492
14955 5095492 5064228 5059063 5010913 5041686 5019458 4940623 4868563 5016739 5013803 4973444 5077564
14944 5077564 5199915 5177970 5156578 5154781 5024536 5038794 5203174 5141090 5060486 5035450 5129081
14933 5129081 5240507 5238092 5139215 5079672 5079601 5103607 5230494 5240890 5171603 5115894 5066866 5161213
14921 5161213 5187586 5137872 5141524 5086899 5109167 5196200 5208504 5020058 5158722 5066033 5040012
14910 5040012 4988142 5069005 5256176 5201086 5175505 5145174 5169181 5157809 5175614 5129097 5131390
14899 5131390 4998393 4925479 4968800 5048402 5149387 5285686 5288875 5258603 5166241 5210609 5256265
14888 5256265 5169669 5274406 5310475 5160740 5089850 5128321 5205495 5233269 5137638 5061495 5018380
14877 5018380 5145440 5128857 5111700 5024804 5119574 5170322 5095964 5101733 5122427 5146248 5202197
14866 5202197 5159122 4968329 4941255 5032017 5130622 5061111 5215809 5219597 5279591 5250943 5096530
14855 5096530 5069883 5122578 5168177 5109702 4933666 5062143 5159551 5049787 5152695 5214416
14845 5214416 5144383 4911963 4879652 4987673 5156175 5239527 5237771 5111816 5141921 5206047 5193843
14834 5193843 5299546 5257152 5231590 5338623 5282867 5212046 5204191 5196470 5232651 5155750 5237093
14823 5237093 5341715 5266883 5157571 5002024 5078301 5041714 5051538 5275542 5327127 5278372 5245471
14812 5245471 5254955 5259955 5243463 5163901 5145299 5113814 5171754 5223362 5267624 5274510 5213580 5221680
14800 5221680 5139372 5136897 5151830 5096571 5128079 5097400 5030011 5085701 5172604 5158146 5196995
14789 5196995 5216498 5108147 5134137 5120984 5110604 5242487 5239234 5250287 5214848 5159897 5227302
14778 5227302 5270930 5200587 5198747 5152545 5121313 5421174 5455967 5274671 5091589 4926798 5041447
14767 5041447 4925071 5051762 4960098 5078126 5282137 5293066 5325915 5259304 5202271 5208288 5112539
14756 5112539 5115414 5165635 5259911 5095183 5151632 5136070 5173827 5301199 5184822 5349263 5402386
14745 5402386 5290337 5194629 5146358 5109602 5180687 5343584 5356008 5227395 5304494 5316578 5431026
14734 5431026 5397329 5363069 5195874 5152883 5262669 5365018 5239672 5203813 5228758 5134399
14724 5134399 5171350 5224100 5248206 5229562 5197890 5313361 5222916 5080865 5189725 5321460
14714 5321460 5264102 5207176 5171848 5392431 5333442 5323476 5279875 5233001 5151803 5198737 5182998
14703 5182998 5233940 5195119 5112243 5067202 5193686 5312692 5156138 5231051 5318417 5325217 5321932
14692 5321932 5285289 5193025 5117734 5132122 5205118 5399678 5410126 5319425 5398853 5314097 5144496
14681 5144496 5091647 5112834 5202300 5300146 5162346 5185927 5237793 5309781 5280419 5270974 5175422
14670 5175422 5127922 5183037 5286504 5324575 5379413 5404788 5381567 5310293 5387129 5411889 5472095
14659 5472095 5336337 5224904 5137637 5332589 5240532 5198041 5349134 5398845 5346894 5343797 5248423
14648 5248423 5113141 5171022 5195938 5165406 5033799 5221854 5239518 5148887 5307094 5413596
14638 5413596 5287923 5233466 5327967 5221784 5323940 5460070 5283298 5175055 5266706 5398932
14628 5398932 5224404 5205106 5285403 5511354 5487764 5419000 5338126 5326433 5301668 5252032 5328893
14617 5328893 5231924 5225333 5355563 5394878 5239245 5233473 5209746 5367905 5328597 5176468 5121996
14606 5121996 5164391 5239372 5118199 5094161 5304830 5365442 5252700 5368516 5379782 5464375
14596 5464375 5518628 5499092 5336348 5373012 5331315 5351682 5258130 5041857 5274158 5313185 5345301
14585 5345301 5376427 5359595 5396543 5414101 5346796 5256518 5282651 5269181 5371032 5255307 5285152
14574 5285152 5300675 5269683 5270023 5426513 5292545 5337947 5318699 5227261 5229720 5339153 5333461
14563 5333461 5280178 5282154 5168750 5303373 5334168 5319398 5219083 5294572 5257813 5282733 5191773
14552 5191773 5274165 5189687 5216921 5332426 5304892 5260203 5252458 5158826 5012621 5213446 5380336
14541 5380336 5323838 5392643 5333544 5268480 5215616 5286259 5393947 5331767 5437986 5506895 5366794
14530 5366794 5307683 5125491 5246637 5244462 5301895 5332887 5418991 5549694 5417353 5433881 5486695
14519 5486695 5555522 5405761 5486117 5564236 5614664 5564687 5490842 5351911 5456815 5406448 5412327
14508 5412327 5390432 5224672 5445246 5563914 5585936 5257229 5161887 5300590 5254820 5281525
14498 5281525 5321559 5357784 5234523 5319269 5287113 5244220 5247309 5139898 5326058 5418031 5452201
14487 5452201 5439050 5425608 5370138 5274453 5362406 5501780 5506342 5376302 5302428 5238266 5312340
14476 5312340 5427280 5552945 5530490 5518626 5490788 5437345 5536584 5511669 5511261 5588526 5591857
14465 5591857 5523056 5437337 5346501 5321550 5280575 5317025 5416468 5444030 5547601 5732368 5478982
14454 5478982 5369106 5410399 5379224 5368929 5424190 5491466 5554765 5661873 5495685 5382633
14444 5382633 5487377 5358391 5383222 5416216 5465438 5492974 5573859 5582274 5491306 5367532 5349734
14433 5349734 5451832 5386317 5435241 5430704 5326914 5281401 5507909 5531220 5480556 5296895 5343947
14422 5343947 5429730 5563023 5493685 5488589 5378198 5323567 5276603 5212238 5207751 5377037 5523802
14411 5523802 5451002 5440062 5192400 5255148 5442231 5374866 5287805 5161115 5200705 5311500
14401 5311500 5477139 5384412 5245884 5330424 5348777 5460730 5594677 5445385 5371186 5420363
14391 5420363 5590767 5492764 5460553 5566515 5421795 5511637 5515716 5381480 5347014 5324107 5414625
14380 5414625 5419100 5336488 5523475 5403182 5250139 5340953 5451284 5503474 5451505 5246061
14370 5246061 5236563 5344907 5529689 5424353 5293028 5430159 5469069 5385207 5629343 5746321
14360 5746321 5623242 5612807 5560557 5405190 5377887 5354125 5185769 5307451 5431169 5378711
14350 5378711 5504110 5588512 5630882 5588285 5514186 5394197 5442259 5603823 5446508 5513401
14340 5513401 5469895 5435130 5370493 5341689 5275875 5241898 5433019 5501016 5524239 5433380 5323459
14329 5323459 5367508 5554654 5447041 5514386 5701800 5800740 5475991 5324052 5415909 5548476
14319 5548476 5595088 5658166 5647278 5519846 5436936 5422509 5547864 5530390 5518614 5574499 5484505
14308 5484505 5369130 5321078 5326263 5555842 5667171 5581310 5450326 5306847 5287447 5547989
14298 5547989 5515541 5313033 5374918 5387491 5589133 5585558 5515523 5474790 5386279 5338968 5505700
14287 5505700 5466204 5369552 5485453 5513326 5520267 5644955 5648933 5450933 5337251 5444246 5578587
14276 5578587 5546271 5541855 5570329 5574163 5483397 5609355 5729781 5550196 5428286 5616513 5592725
14265 5592725 5609896 5591380 5500884 5386800 5429195 5411522 5345788 5351861 5417785 5464590 5333930
14254 5333930 5434112 5525215 5502504 5404844 5332608 5430313 5358965 5375018 5343141 5440936 5663307
14243 5663307 5552951 5448721 5637466 5604810 5625284 5566180 5483501 5375170 5439032 5408343
14233 5408343 5386370 5439861 5518925 5578239 5550907 5488462 5453374 5357337 5446448 5475563 5656324
14222 5656324 5653495 5522388 5497188 5465123 5460313 5483579 5593733 5458998 5484238 5543717 5541576
14211 5541576 5513502 5468927 5439693 5347046 5449113 5541815 5539869 5543101 5576793 5578171 5410862
14200 5410862 5500702 5602834 5645296 5591097 5638054 5584888 5772014 5727639 5483398 5416486 5382497
14189 5382497 5534884 5669403 5547276 5553999 5561755 5612181 5687393 5655183 5624908 5695817 5749271
14178 5749271 5560990 5559733 5493568 5485171 5490139 5515615 5549466 5458970 5589092 5627388 5666025
14167 5666025 5642503 5721761 5809866 5896310 5788255 5596803 5537284 5515675 5463093 5621271 5651841
14156 5651841 5634022 5696373 5648004 5593797 5549301 5561248 5637474 5570897 5631864 5703502 5684335
14145 5684335 5693685 5679970 5537726 5637694 5668897 5622161 5728661 5674613 5625762 5664011 5720416
14134 5720416 5719016 5688368 5534292 5595481 5607457 5519644 5540953 5520974 5420258 5442896 5412479
14123 5412479 5589761 5577785 5600601 5703587 5791601 5786591 5609936 5567343 5671958 5628549 5468686
14112 5468686 5432052 5693145 5697350 5698916 5628929 5477161 5526237 5447722 5564292 5539301 5524126
14101 5524126 5464375 5486726 5555925 5678284 5738251 5646102 5708645 5658688 5554658 5636915 5561068
14090 5561068 5599007 5525806 5511544 5599098 5675280 5735448 5764907 5774105 5852599 5758547 5661073
14079 5661073 5592925 5538225 5570972 5625251 5681733 5622168 5599119 5578393 5704024 5697314 5589872
14068 5589872 5640971 5645802 5446076 5473484 5596266 5712238 5810175 5737298 5701490 5649753 5617728
14057 5617728 5548954 5504339 5429754 5596795 5669760 5585636 5642559 5595442 5695951 5591539 5756416
14046 5756416 5783968 5603840 5707932 5621422 5558748 5608225 5613917 5606962 5470365 5628560 5627009
14035 5627009 5592510 5548795 5656933 5696493 5615264 5786555 5636764 5584751 5604444 5603573 5653422
14024 5653422 5676220 5820336 5775513 5732660 5735056 5627957 5441591 5608852 5573884 5592908 5580255
14013 5580255 5716425 5813682 5822369 5803247 5768146 5757472 5683153 5612783 5580925 5576611 5532024
14002 5532024 5475747 5510473 5703246 5817255 5627085 5613296 5796794 5774400 5789982 5757221
13992 5757221 5747419 5631369 5650729 5655183 5737068 5592035 5752452 5655831 5611661 5629582 5633499
13981 5633499 5671778 5823083 5906616 5728987 5654178 5724358 5789196 5624813 5609850 5728481
13971 5728481 5846719 5719453 5600550 5732553 5800134 5810562 5742203 5724390 5708581 5798123
13961 5798123 5776623 5728938 5770320 5685680 5750061 5819692 5888159 5955456 5887084 5785191 5738369
13950 5738369 5667340 5816781 5731433 5648943 5666048 5664360 5750081 5892853 5937952 5676993 5650044
$$ [...]
##END NTUPLES=NMR SPECTRUM
##END=
