##TITLE=1H_CA-9181-43
 CDCl3
 8 sc, 
 3.8.2023
##JCAMPDX= 6.0         $$ Bruker NMR JCAMP-DX V2.0
##DATA TYPE= NMR SPECTRUM
##DATA CLASS= NTUPLES
##ORIGIN= UXNMR, Bruker Analytische Messtechnik GmbH
##OWNER= root
$$ XWIN-NMR		Version 3.5
$$ Thu Aug  3 13:48:04 2023 Russian Standard Time (UT+4h)  she@DPX200
##.OBSERVE FREQUENCY= 200.13135
##.OBSERVE NUCLEUS= ^1H
##.ACQUISITION MODE= SIMULTANEOUS
##.ACQUISITION SCHEME= undefined
##.AVERAGES= 8
##.DIGITISER RES= 18
##SPECTROMETER/DATA SYSTEM= spect
##.PULSE SEQUENCE= zg30
##.SOLVENT NAME= CDCl3
##.SHIFT REFERENCE= (INTERNAL, CDCl3, 0, 15.7293)
##AUDIT TRAIL= $$ (NUMBER, WHEN, WHO, WHERE, WHAT)
$$ ##TITLE= Audit trail, XWIN-NMR		Version 3.5
$$ ##JCAMPDX= 5.01
$$ ##ORIGIN= Bruker BioSpin GmbH
$$ ##OWNER= she
$$ F:/spectra/data/she/nmr/H-F/1/pdata/1/auditp.txt
$$ ##AUDIT TRAIL=  $$ (NUMBER, WHEN, WHO, WHERE, WHAT)
(   1,<2023-08-03 13:46:51.75 +0400>,<she>,<DPX200>,
      <created by zg, POWCHK disabled, PULCHK disabled
       configuration hash MD5:
       00 E9 B6 7A A2 85 ED C7 34 08 36 98 17 FE 4E 26
       data hash MD5: 16K
       E8 C6 A8 7A D7 B0 13 43 21 DB A6 12 53 43 2C CA>)
(   2,<2023-08-03 13:46:54.60 +0400>,<she>,<DPX200>,
      <Start of raw data processing
       efp BC_mod = 2 LB = 0.24 FT_mod = 6 PKNL = 1 PHC0 = -21044.55 PHC1 = 11.25272 SI = 16K 
       data hash MD5: 16K
       8C CF DC 8D EA 98 06 59 84 FF E8 7E A4 EC 07 D8>)
(   3,<2023-08-03 13:47:13.10 +0400>,<she>,<DPX200>,
      <pk PHC0 = -0.1303239 PHC1 = 0.3999999 
       data hash MD5: 16K
       A2 E3 E0 8D 91 D8 2E 13 E3 16 E0 EE 84 AD DB 99>)
(   4,<2023-08-03 13:47:16.82 +0400>,<she>,<DPX200>,
      <abs ABSG = 5 
       data hash MD5: 16K
       55 19 2E 0C F6 D0 34 1A 08 02 53 26 F6 C2 B5 F6>)
$$ ##END=
$$ 
$$ hash MD5
$$ 33 07 DA C2 B1 2B 80 35 D5 65 64 BD A9 12 63 D4
##$RELAX= 
##$RELAX= 
##$RELAX= 
##$RELAX= 
##$RELAX= 
##$RELAX= 
$$ Bruker specific parameters
$$ --------------------------
##$DU= <F:/spectra>
##$EXPNO= 1
##$NAME= <H-F>
##$PROCNO= 1
##$TYPE= <nmr>
##$USER= <she>
##$AMP= (0..31)
100 100 100 100 100 100 100 100 100 100 100 100 100 100 100 100 100 100 
100 100 100 100 100 100 100 100 100 100 100 100 100 100 
##$AQSEQ= 0
##$AQ_mod= 1
##$AUNM= <au_zg>
##$AUTOPOS= <>
##$BF1= 200.13
##$BF2= 200.13
##$BF3= 200.13
##$BF4= 200.13
##$BF5= 200.13
##$BF6= 200.13
##$BF7= 200.13
##$BF8= 200.13
##$BYTORDA= 1
##$CFDGTYP= 0
##$CFRGTYP= 5
##$CHEMSTR= <none>
##$CNST= (0..31)
1 1 145 1 1 1 1 1 1 1 1 1 1 1 1 1 1 1 1 1 1 1 1 1 1 1 1 1 1 1 1 1 
##$CPDPRG= <>
##$CPDPRG1= <>
##$CPDPRG2= <>
##$CPDPRG3= <>
##$CPDPRG4= <mlev>
##$CPDPRG5= <mlev>
##$CPDPRG6= <mlev>
##$CPDPRG7= <mlev>
##$CPDPRG8= <mlev>
##$CPDPRGB= <>
##$CPDPRGT= <>
##$D= (0..31)
0 1.2 0 0 0 0 0 0 0 0.06 0 0.03 0 0 0 0 0.0002 0 0 0 0 0 0 0 0 0 0 0 0 
0 0 0 
##$DATE= 1691056011
##$DBL= (0..7)
120 120 120 120 120 120 120 120 
##$DBP= (0..7)
150 150 150 150 150 150 150 150 
##$DBP07= 0
##$DBPNAM0= <>
##$DBPNAM1= <>
##$DBPNAM2= <>
##$DBPNAM3= <>
##$DBPNAM4= <>
$$ [...]
##$SUBNAM3= <"">
##$SUBNAM4= <"">
##$SUBNAM5= <"">
##$SUBNAM6= <"">
##$SUBNAM7= <"">
##$SUBNAM8= <"">
##$SUBNAM9= <"">
##$SW= 18.05172834244
##$SWIBOX= (0..15)
0 0 2 0 0 0 0 0 0 0 0 0 0 0 0 0 
##$SW_h= 3612.71676300578
##$TD= 16384
##$TD0= 1
##$TE= 0
##$TE2= 300
##$TE3= 300
##$TEG= 300
##$TL= (0..7)
0 120 120 120 120 120 120 120 
##$TP= (0..7)
150 150 150 150 150 150 150 150 
##$TP07= 0
##$TPNAME0= <>
##$TPNAME1= <>
##$TPNAME2= <>
##$TPNAME3= <>
##$TPNAME4= <>
##$TPNAME5= <>
##$TPNAME6= <>
##$TPNAME7= <>
##$TPOAL= (0..7)
0.5 0.5 0.5 0.5 0.5 0.5 0.5 0.5 
##$TPOFFS= (0..7)
0 0 0 0 0 0 0 0 
##$TUNHIN= 0
##$TUNHOUT= 0
##$TUNXOUT= 0
##$USERA1= <user>
##$USERA2= <user>
##$USERA3= <user>
##$USERA4= <user>
##$USERA5= <user>
##$V9= 5
##$VALIST= <valist>
##$VCLIST= <CCCCCCCCCCCCCCC>
##$VD= 0
##$VDLIST= <DDDDDDDDDDDDDDD>
##$VPLIST= <PPPPPPPPPPPPPPP>
##$VTLIST= <TTTTTTTTTTTTTTT>
##$WBST= 1024
##$WBSW= 4
##$XGAIN= (0..3)
0 0 0 0 
##$XL= 0
##$YL= 0
##$YMAX_a= 125057
##$YMIN_a= -106923
##$ZGOPTNS= <>
##$ZL1= 120
##$ZL2= 120
##$ZL3= 120
##$ZL4= 120
##$ABSF1= 15.73146
##$ABSF2= -2.32039
##$ABSG= 5
##$ABSL= 3
##$ALPHA= 0
##$AQORDER= 0
##$ASSFAC= 0
##$ASSFACI= 0
##$ASSFACX= 0
##$ASSWID= 0
##$AUNMP= <proc_1d>
##$AZFE= 0.1
##$AZFW= 0.1
##$BCFW= 0
##$BC_mod= 2
##$BYTORDP= 0
##$COROFFS= 0
##$CY= -3
##$DATMOD= 1
##$DC= 0
##$DFILT= <>
##$DTYPP= 0
##$F1P= 0
##$F2P= 0
##$FCOR= 1
##$FTSIZE= 16384
##$FT_mod= 6
##$GAMMA= 0
##$GB= 0
##$INTBC= 1
##$INTSCL= 3.70164e-10
##$ISEN= 128
##$LB= 0.24
##$LEV0= 0
##$LPBIN= 0
##$MAXI= 10000
##$MC2= 0
##$MEAN= 0
##$ME_mod= 0
##$MI= 1.114404
##$NCOEF= 0
##$NC_proc= -9
##$NLEV= 6
##$NOISF1= 3.799351
##$NOISF2= 2.8
##$NSP= 0
##$NTH_PI= 0
##$NZP= 0
##$OFFSET= 15.72926
##$PC= 1
##$PHC0= -21044.68
##$PHC1= 11.65272
##$PH_mod= 1
##$PKNL= yes
##$PPARMOD= 0
##$PSCAL= 0
##$PSIGN= 0
##$REVERSE= no
##$SF= 200.13000846127
##$SI= 16384
##$SIGF1= 3
##$SIGF2= 2
##$SINO= 5.538805
##$SIOLD= 16384
##$SREGLST= <1H.CDCl3>
##$SSB= 0
##$STSI= 16384
##$STSR= 0
##$SW_p= 3612.71676300578
##$SYMM= 0
##$S_DEV= 0
##$TDeff= 16384
##$TDoff= 0
##$TI= <>
##$TILT= no
##$TM1= 0
##$TM2= 0
##$TOPLEV= 0
##$USERP1= <user>
##$USERP2= <user>
##$USERP3= <user>
##$USERP4= <user>
##$USERP5= <user>
##$WDW= 1
##$XDIM= 16384
##$YMAX_p= 285348642
##$YMIN_p= -1824018
$$ End of Bruker specific parameters
$$ ---------------------------------
##NTUPLES= NMR SPECTRUM
##VAR_NAME=  FREQUENCY,     SPECTRUM/REAL,   SPECTRUM/IMAG
##SYMBOL=    X,             R,               I
##VAR_TYPE=  INDEPENDENT,   DEPENDENT,       DEPENDENT
##VAR_FORM=  AFFN,          ASDF,            ASDF
##VAR_DIM=   16384,         16384,           16384
##UNITS=     HZ,            ARBITRARY UNITS, ARBITRARY UNITS
##FACTOR=    0.220516191357247, 1,           1
##FIRST=     3147.89702587555, 0,            0
##LAST=      -464.819737130235, 0,           0
##MIN=       -464.819737130235, -1824018,    0
##MAX=       3147.89702587555, 285348642,    0
$$ Real data points
##PAGE= N=1
##DATA TABLE= (X++(R..R)), XYDATA
$$ [...]
7663 -368351 152936 538543 419203 61117 218659 -93670 -539239 -448595 -512390 -730614
7653 -730614 -568030 -346349 -109845 -18309 -10675 -388150 -98355 -58352 219898 -63200
7643 -63200 269435 57768 232340 696476 627871 1221464 1281047 261856 -644994 -44292
7633 -44292 299705 23730 -256100 -283948 -497144 -99294 403642 421284 -229403 -211020
7623 -211020 -196718 -636350 -182665 -21732 -350000 349290 -221950 -261049 56945 110758
7613 110758 19153 -689473 -675223 -311678 -271460 -460151 -566985 -178584 159127 -518789
7603 -518789 167314 436852 -137684 -225662 -556900 -454305 158787 841575 715279 283585
7593 283585 3804 97470 95397 339885 402023 768864 102023 -384110 -69497 -78081 -368635
7582 -368635 -601092 -586826 -401991 -784662 -506745 -237313 -256963 -144214 11057 -269641
7572 -269641 -575089 -138219 -478038 451335 212978 -131865 -447641 55039 403990 -310556
7562 -310556 -272731 -227278 -356029 -452333 -442371 54287 -239246 -209543 -386149 -495398 -278157
7551 -278157 207631 34309 183863 -48703 183273 366456 -435505 -97096 -212690 -92334
7541 -92334 -53501 -101044 -79058 101855 -153938 -696729 -265592 239595 -131398 -65566 499281
7530 499281 71395 485741 315056 302598 316603 11272 -647320 -893500 -844857 -833698
7520 -833698 -1346653 -691045 -493280 -1002837 -864593 -81868 98332 161832 566569 850393
7510 850393 932347 -36528 -484874 -548439 -554739 -306746 517442 148811 -452509 -473100 -513751
7499 -513751 -575379 -184014 456475 432253 184009 1295763 928265 129055 -209511 -195806
7489 -195806 -248329 146554 -8287 -170077 -101613 214409 -287496 -291323 59704 84751 286457
7478 286457 247763 339468 773059 819681 211537 178575 755684 328978 701821 662944 -238491
7467 -238491 -209781 -174698 -557712 -351332 134945 -125601 94706 106177 365637 281638
7457 281638 129752 426445 -1847 207334 601920 587392 685551 440412 749984 451493
7447 451493 413138 334811 -436040 -558319 -764230 -425884 -519239 -767094 -223232 -151890
7437 -151890 -614351 -598966 -424466 -328884 -157936 111820 -563853 -1037491 -873738 -125038
7427 -125038 -125747 129741 573456 535320 100219 420507 124064 -478284 -519220 -270050 -449092
7416 -449092 124289 272203 230465 -81614 58383 487016 -241638 397507 -78021 59129
7406 59129 -371552 -47966 306567 -365140 -534883 -51748 458466 738654 650112 112422
7396 112422 -374369 -290467 158403 647296 463155 -49898 677683 649141 -207574 205798
7386 205798 317733 358460 151211 -296768 -630178 -950641 -805114 -363778 -470981 -456924
7376 -456924 96758 556265 534858 579533 132237 -453697 -839529 -374597 -92310 39057
7366 39057 -496433 56077 294164 16879 -408971 -268898 -343788 261446 100252 19257
7356 19257 573929 339484 42787 102510 -141147 590017 570291 475649 1272402 531824
7346 531824 -98986 -491092 -158727 424605 417484 394946 108770 -319569 165019 -394487
7336 -394487 -43737 908989 815181 470271 236874 738653 858867 388417 446386 408822
7326 408822 -247775 -255447 -502954 -567612 100045 468640 230352 -291186 186958 71022
7316 71022 203388 267067 -331774 -658037 -557727 -326349 -158658 -120183 252818 260569 -98045
7305 -98045 -22335 -6243 127601 595797 526998 994665 1000768 712715 332714 380508 594746
7294 594746 347963 -309174 47057 -20406 169872 -145812 89494 27836 69318 -470952
7284 -470952 -14778 19905 -225271 271369 293239 73826 172843 562193 752807 427627
7274 427627 329170 -128926 202171 -435011 -499455 878735 1008744 1283534 1161097 563348
7264 563348 884089 1094923 795260 569492 287681 528166 96725 293050 333482 -86049
7254 -86049 434311 785452 340157 393216 208246 328075 586474 760437 225197 371754
7244 371754 450432 395256 616680 888639 358910 252468 187177 135084 611234 783941
7234 783941 -340770 205754 130881 -169064 -393780 116006 394848 605115 259298 16622
7224 16622 -27952 92653 872218 851072 655447 562686 199370 98159 92174 -59981 345003
7213 345003 7010 -20824 -224693 135562 -7389 184200 482844 600493 445601 691085
7203 691085 505421 194526 83923 589713 549777 926166 1595172 1223037 955675 270622
7193 270622 424768 99682 -330755 -382099 -518693 -138276 -219695 485574 347266 913241
7183 913241 677432 753955 459574 277596 688632 539927 486693 383684 500428 -514492
7173 -514492 -91931 -17365 242087 357584 583386 276773 482519 591381 705533 416717
7163 416717 838936 1086221 825173 377773 814808 636906 595322 912157 1021266 930023
7153 930023 839265 606031 865613 600029 147104 243441 55516 186908 127927 755786
7143 755786 1308621 1367225 1263661 1157450 474532 396450 623152 816013 452792 472971
7133 472971 366704 849610 1266784 662296 644690 419341 -61044 153014 682372 661508
7123 661508 811738 917970 182398 793592 1162833 790446 651670 732883 918392 979759
7113 979759 601481 749649 1030140 922570 1218760 1739451 1382637 1103564 1335685 1603149
7103 1603149 1452408 1721086 1442724 1497050 1451502 1142228 1541183 1969533 2066771 1415760
7093 1415760 1183853 957248 1099829 903495 874674 1284972 1108550 688267 937807 901484
7083 901484 673849 708894 1134108 522299 191493 783955 1343038 1773812 1650351 1620494
7073 1620494 790369 420858 565865 865654 740268 342362 437565 760609 733992 1202605
7063 1202605 999241 667597 1239618 1388057 1345626 1201594 586528 718503 562602 603782
7053 603782 102746 270631 226491 261763 486763 582042 811345 898458 1151305 1062011 969763
7042 969763 1679749 2052599 1681229 1264676 816599 358838 186399 501507 865617 1454809
7032 1454809 1907154 1202895 775019 621646 1410743 1318690 753293 1306433 874582 567463
7022 567463 813380 1703815 1626915 1864479 1221227 450410 685939 2143307 2586627 1812031
7012 1812031 2055778 2423872 1743422 1394282 1702090 1778653 1859548 2168128 2226021 1742076
7002 1742076 2036672 2077146 1950554 2177221 1471730 1755302 1003687 991753 1008128 488345
6992 488345 751635 1355297 1576990 1173920 1390633 1075375 1350986 1737607 1648034 1619504
6982 1619504 1213031 1289011 1153180 1183203 1245463 976673 1135254 1549534 659599 577932
6972 577932 907897 1722375 1865437 1964477 1586750 1584222 1464504 1074487 1447422 1754868
6962 1754868 1392989 1271087 1297025 1117506 1427653 1486433 1520788 1252828 1674406 1125018
6952 1125018 1185412 629853 1213596 1339155 1074430 1531970 2060034 1788385 1130948 1420009
6942 1420009 1181078 1481458 1344398 1491544 1217391 1360358 1334099 1746485 1759846 1580274
6932 1580274 1267688 1120858 1333286 689545 1226590 1581094 1190687 1095559 1174701 1027671
6922 1027671 1166513 1197688 2121696 1587563 1150554 1568900 1761187 2027668 2431363 1896495
6912 1896495 1611518 1514487 1622737 1300198 1289464 1563699 1328547 1137476 1327581 1507997
6902 1507997 1820244 1930402 1724293 1638767 1594497 1691197 1494502 1289691 1519683 1398053
6892 1398053 1967873 2167077 2091291 2001282 2315577 1991628 1948590 1673498 1518309 2275298
6882 2275298 2093292 2317389 1954563 1947380 1787283 2279683 1619403 1435928 1565670 1354312
6872 1354312 2006855 2051677 2708797 1638850 1202560 2234121 1260959 1519273 1943025
6863 1943025 1950279 1746371 1278674 1419388 1470469 1199997 1538775 2254817 1713265 1422171
6853 1422171 1732382 1224794 1499624 1572332 1772191 2333600 2520029 2523478 2638662 2376211
6843 2376211 2086017 2236022 1927922 1561503 2199560 2066045 1328191 1390562 1276235 1799496
6833 1799496 2284824 1797784 1667866 2074781 1924434 1248655 987803 1682728 1984951 2053912
6823 2053912 1911528 1662068 1337482 2100237 2777254 2641052 2504034 2657953 2480677 1992592
6813 1992592 1989229 1866906 2011171 2074802 2584025 2391090 2590288 2553526 2705550 2671806
6803 2671806 2270930 2614255 2604833 2289721 2545138 2262723 2183505 2121868 1787311 2061909
6793 2061909 2371457 2788912 2336688 2323112 1903490 2127633 1979786 1894551 1868168 2256272
6783 2256272 2182086 1486095 1872380 2094520 1776621 2229002 2348385 2104648 1979417 2009260
6773 2009260 2375232 2300117 2380843 2399373 3065064 2995585 2334358 1813971 1794385 2532126
6763 2532126 2358032 2761362 2714823 2804652 2595576 2982161 2770492 2718570 2445845 1916623
6753 1916623 2639750 2760634 2512838 2188730 1875185 2080070 2602464 2440833 2568853 2308734
6743 2308734 2561527 2983426 2746641 2185689 2738210 2219195 2635070 2517013 2712979 2724391
6733 2724391 2703994 3194313 2943229 2917240 2511573 2537456 2344339 3074922 3274558 3090688
6723 3090688 3107438 1908720 2069547 1984958 2359191 2333596 2566393 2738308 2273906 2483132
6713 2483132 2045688 2469832 3062293 2689135 2634645 2704786 2898228 3172600 2883835 2861546
6703 2861546 2988097 3113078 2825834 2288499 2312294 3020849 3190753 2790130 2754813 2784113
6693 2784113 3218314 3073968 2987797 2875028 2365619 2670463 2903567 2909171 2577138 3188268
6683 3188268 2931792 2928964 2814509 2416352 3169802 3250276 2964338 2892227 2666314 3207565
6673 3207565 2999970 2530350 2839674 2693588 2804722 2762716 3289434 2449081 2479986 2678090
6663 2678090 2460503 2306387 3308974 3626707 2965262 3413820 2998441 2263022 2772473
6654 2772473 2991702 2716408 3065640 3388092 3219753 3519949 3629650 3609359 3443496 2672153
6644 2672153 3269654 3117712 3424470 3314647 2711858 2748498 2854551 2999102 3725840 3833307
6634 3833307 3691848 3301063 3519511 3376990 3405330 3528405 3649172 3686678 3978120 3905073
6624 3905073 3395036 3025113 3453291 3357047 4116035 4316435 3706789 3158150 3189955 3230182
6614 3230182 3456387 3561686 3641664 3790333 3377950 3261617 3977032 3871037 3955671 3482662
6604 3482662 3700476 4427690 4183609 3881887 3814333 3965086 3681585 3104674 3397250 3715652
6594 3715652 3181268 3485068 3844130 4204999 4491288 4609737 4909417 4918618 3839570 4877513
6584 4877513 4780661 4408836 4117081 4213997 4134130 3736945 4005756 3792747 4368370 4590927
6574 4590927 4524524 4602019 4202857 4840798 4862827 4724348 4642617 4464217 4099635 4548872
6564 4548872 3974296 4367710 4519212 5013464 5222827 4879841 4662830 4206422 4522871 4862903
6554 4862903 4950165 4693117 4478207 4294296 4006136 4328410 4411030 4869267 5181009 4839270
6544 4839270 4923264 4474159 4553801 4527967 4963715 5525689 5105225 5472930 6251162 5748493
6534 5748493 5500596 5529008 5556710 5660525 5224923 5221862 5478664 5009496 4920559 5676035
6524 5676035 6137625 6812535 5806824 5024934 5984611 5768155 5796770 6373463 6309796 6696998
6514 6696998 7150438 7283725 6814832 6850956 7475312 7762628 7833871 7689284 7828849 7802452
6504 7802452 7813717 7623637 7101472 6868547 7414935 7432535 7405832 7533584 8065511 7301046
6494 7301046 7631172 8344541 8466519 8743892 9141978 9345631 8609793 8418457 8263259 8475572
6484 8475572 8352233 9063490 9184218 9367408 9389990 8949546 9689709 9955698 9678824 9668230
6474 9668230 10066468 10324086 10444675 10025182 10396141 11430975 11523382 11271010 11436071 11202236
6464 11202236 11173413 11043599 11652043 11668100 11516221 11920494 12107584 12441752 11922751 11848071
6454 11848071 12172093 12062291 12345209 12439403 13185065 13353892 13159673 13703016 14504538 14652459
6444 14652459 13974182 14580889 15671768 15847761 15883147 15428376 15690318 16643871 16995970
6435 16995970 16561577 17120469 17620338 18354688 19471235 19597279 20302620 20839347 21098138
6426 21098138 21827885 23148295 23457272 24448722 25799604 26961008 27675758 28959645 31550665
6417 31550665 32815382 34490824 36433305 38159753 40195222 42472015 44291140 46144825
6409 46144825 48260133 49965130 52434693 54420368 56165272 59161509 61717124 64195978
6401 64195978 67167580 68924072 70984156 71106191 69470789 66985071 62582846 58603674
6393 58603674 54084209 49867789 46250879 43007325 39789824 37535192 35019736 33204531
6385 33204531 31500491 30445613 30099481 28889069 27506819 27694139 26983212 25421724 25354497
6376 25354497 24417704 22637429 21532780 21597551 20919273 20077768 19378656 19261661 18395430
6367 18395430 17900083 16744379 16685836 16960424 16508511 15868775 15245456 15506793 15889774
6358 15889774 15408078 15485716 14776973 14100682 14371364 14539596 14524547 13874219 13361497 13138534
6348 13138534 13502727 13343744 12598288 12577424 12696611 12424507 12419114 12436709 12667258 12501340
6338 12501340 12151809 12297896 12456363 12750894 12642790 12330851 12389738 11921384 11925212 12160012
6328 12160012 11389909 11282193 11417616 11892570 11884867 11856599 11154247 11048152 11632419 11675845
6318 11675845 11823617 11703351 11508318 11637365 11530296 11617343 11021852 10511235 11103015 10703462
6308 10703462 10534765 10861621 10500925 11027445 11267452 11066796 11445370 11530645 11431562 11543022
6298 11543022 11358815 11046295 11700848 11985624 11582604 10975771 11443106 11402711 11379672 11340850
6288 11340850 11465702 11368572 11514763 11171671 11463453 11450885 11483781 11359523 10965078 11762248
6278 11762248 12102507 11596031 11428691 10918149 11028279 11559736 11675334 11638566 11124246 11253992
6268 11253992 11894879 12015949 11634753 11221551 11677193 11679000 12089736 12217068 12167027 12590712
6258 12590712 11829577 11528900 11538710 11976901 12215400 11606237 11626997 12578384 12609168 12470300
6248 12470300 12200687 11872409 11870081 12536138 13567243 13496049 13506197 13518903 12671409 13160825
6238 13160825 12642633 12112413 12480830 13022488 13492744 12854481 12642137 12993362 13160144
6229 13160144 12700288 12496960 13063544 12991027 13011244 12889350 13137564 13490442 13243875 13131568
6219 13131568 13592430 13197974 13444860 13616424 13633825 14044984 13823103 13435053 13443897 13512253
6209 13512253 13733523 13656591 13966209 13855679 14326848 14527656 14512069 14277754 14397699 14872696
6199 14872696 14990333 15077125 14806315 15094924 15422260 15817809 15242930 14966457 14852697 15274389
6189 15274389 15459173 15395604 14817096 15000186 15252363 16262286 15997891 16283225 15766760
6180 15766760 16142976 15781654 15900242 16988219 16557621 16234672 16515272 16666279 16284558
6171 16284558 16060085 16362450 16387135 15608650 15552232 16501722 17309754 17077563 16692670 16627239
6161 16627239 16648249 16331401 16042265 16484617 16439683 16616338 17170016 17211302 17266452 16996597
6151 16996597 17310163 17034943 16987012 17766038 17842243 17474541 17695539 17692419 18017813 17768262
6141 17768262 17259127 17083036 17509400 17446491 17607771 18055975 18030176 18218230 18379918 18537654
6131 18537654 18180660 17992116 18651005 18913347 19078187 18899462 18884138 18610576 18284279 18655446
6121 18655446 18631156 18758304 19244930 18713492 18867162 19500706 19434828 19190577 19015418 18898379
6111 18898379 19172296 19366586 19310797 19236739 19619792 19817343 19746328 20080560 20248901 19909094
6101 19909094 20254008 20683456 19804877 19911003 20287327 20884927 20592415 19563355 19572752 20111412
6091 20111412 20917022 20874121 20822597 20543290 21289662 20895647 20541501 20696559 20776163 20882868
6081 20882868 20750973 21436193 22165364 22138309 22479099 22475084 22391532 22508558 22183913 21989144
6071 21989144 22240979 21896552 21736584 22209322 22789072 22666946 22533839 22607855 22816314 22408532
6061 22408532 22257796 22700875 22771013 23097455 22514262 22302122 22349574 22575003 22587155 22981715
6051 22981715 23052486 22948275 22519283 22303043 22869220 22847766 23221985 23580666 23739726 23429394
6041 23429394 23398562 24200695 24245198 24022454 24036530 23814532 24246794 24183570 24433190 25528467
6031 25528467 25316763 25518809 25230546 25091359 24963699 25204892 25235481 25043971 25097033 25535317
6021 25535317 25261550 25211621 25810380 25879705 26190461 26156210 26816657 27001021 26685248 27340825
6011 27340825 27430128 28245650 27532669 27603656 27363377 27377124 27532770 27628394 28138577 28320498
6001 28320498 28403752 28751587 28547538 28883759 28852718 28756374 29089109 29284738 29545770 29602421
5991 29602421 29665618 29372877 29336888 29595382 29251367 29874092 30990287 30633041 30347312 30377388
5981 30377388 30726705 30272037 29952464 30082746 30119299 30454731 31323126 31070739 30910604 30724980
5971 30724980 30988938 30934423 31049587 31076807 31072159 31001745 30833576 30860472 30570274 30572664 30477724
5960 30477724 30495608 30487597 30623962 30942289 30725151 31116954 31035326 30440215 29854293 29927791
5950 29927791 30432476 29920045 29906733 30577238 30566105 30408299 29542374 29428113 29052735 29224700
5940 29224700 29494329 29036101 28537510 28398468 28223632 27871053 27957121 27760540 28083900 28096205
5930 28096205 27719544 27961144 28086405 27765658 27863251 27951278 28072197 27581874 27299391 27241808
5920 27241808 27028845 26521059 26583790 26790349 26699564 26843960 26600343 26968362 27193915 26730032
5910 26730032 25886846 26288219 26364297 26028793 26535782 26081784 25607269 25928727 26026432 25940908
5900 25940908 25899031 25362058 24746282 25561644 25324223 25505695 25782974 25703690 25460276 24969110
5890 24969110 25501805 25696699 25551661 25415330 25117362 25643880 25729199 26039125 25951039 25773864
5880 25773864 25573565 25747741 26519318 26412849 26232317 26064589 25424972 25696367 26425936
5871 26425936 26612026 26338455 26789416 26547758 25827387 26053221 26191599 25890219 25604542
5862 25604542 26446122 26199235 25755016 25385178 25289553 25637997 25745923 25251684 24987742 25289126
5852 25289126 25700954 26014969 26665205 26630382 26147445 25754159 26239818 26029790 26244573 26843068
5842 26843068 26669410 26356063 26980348 27073298 27121920 27310535 28042870 28399050 28716777 29167332
5832 29167332 29369903 29146135 30006311 30119453 30434401 31102617 31457765 32031554 32593139
5823 32593139 32721681 32950459 33546844 33462446 33147313 33908236 35069196 35490004 36996631
5814 36996631 37780414 38166930 39339657 39606317 40618081 41967561 42581689 43726945 44609880
5805 44609880 45725019 47348054 49304056 50917893 52433072 53523759 55185989 57344259
5797 57344259 59303184 61603042 63536819 64926570 66727556 68219791 69644376 71206456
5789 71206456 72478543 74538122 75515454 76368554 77575087 77382001 75722541 73221225 70720723
5780 70720723 67742796 64562785 61329722 58493617 54882987 52425362 49705604 47511680
5772 47511680 45473754 43793291 42344558 40573460 38797215 37454793 36014851 34516099
5764 34516099 33691519 33055019 32138956 31295635 30585721 29742593 29049835 28458252 28131220
5755 28131220 26929664 25204125 24997201 25224937 24903917 24512491 23661447 23409475 23217699
5746 23217699 22424201 22778346 22991955 22385171 22020716 21573157 21549140 21157150 20563595 20828137
5736 20828137 20544860 20143648 20147998 20171735 19562392 19378119 18785328 18401662 19234421 18933761
5726 18933761 18394579 17880503 17860314 18167656 18305062 18799760 18464553 18314090 18133554 17773111
5716 17773111 17464164 17323995 17408836 16992693 16785819 16954451 17504259 17283804 17066129 17122002
5706 17122002 16598714 16558876 16458952 16152706 15706497 16144428 16872612 16755417 16319670 16028503
5696 16028503 17021662 16766619 16556683 15913867 16013710 15978995 15601370 14684718 15258924 15318513
5686 15318513 14890664 14454932 14613401 15376887 15309271 14820861 14748874 14587913 13952525 13541807
5676 13541807 13632805 14207081 13940981 13585993 13124969 13145251 13852956 14175977 13927882 13780903
5666 13780903 12960841 12706922 13038576 12831340 12993566 13468332 13583078 13781173 12974295
5657 12974295 12810100 12911633 13187531 13060250 13549641 13456154 12995247 12400316 12824017 12475770
5647 12475770 12348175 12746416 12558671 12889569 12690039 12142311 12254694 11809787 12125833
5638 12125833 12115028 11789399 11285104 11632981 11973380 11949819 11845808 11533018 11659226 11992133
5628 11992133 12062222 12038791 12654977 12719752 12341025 12481154 12106979 12042821 11865122 11452907
5618 11452907 12299053 11942547 12195862 12289854 12419489 12220423 11702114 11925567 12107951 12270383
5608 12270383 12025906 11665817 12497680 11827012 12008941 12130184 11863525 11565485 11806045
5599 11806045 11849678 11889493 11442097 11747263 11856362 11842278 11558104 12500867 12867760 12824334
5589 12824334 13081328 12968386 13406230 13147539 13380520 13402935 12665351 12182205 12399349 12588934
5579 12588934 13294949 13300207 12821927 12860639 12758872 12922449 12834257 13125835 13488787 13498055
5569 13498055 13962665 13864107 13869959 13775697 13517143 13318543 13060052 12877267 13350412 12666796
5559 12666796 12974900 13761535 14167879 13970202 13437599 13427936 13784189 13574876 13261587 14004806
5549 14004806 14846368 14796790 14012870 14688230 14211730 14410342 14649547 15145432 15493600 15137211
5539 15137211 14713030 14499166 15228290 15411379 15685863 15305223 15489003 15363875 14790651
5530 14790651 15360850 15572121 15224076 15784854 15735153 15930562 16470752 15780017 15921977 16225792
5520 16225792 16434445 16520994 16322245 16020058 15783239 16504407 16205803 15925320 16030498 16371200
5510 16371200 16713495 17242153 17341465 17401781 17023111 17220500 17178651 16982005 16757434 17235101
5500 17235101 17460741 18340536 17801267 18547160 18386306 18613546 18924764 19003454 18775479 19276885
5490 19276885 19640661 19268246 19528148 19578295 19864193 20453351 20971699 21075404 21160123 21204411
5480 21204411 22184758 22203468 22656786 23597626 24430207 25383179 26531540 26831116 28042981
5471 28042981 29072733 30965278 32362052 33958070 35799378 37556556 38457112 39627564
5463 39627564 40927630 42590908 43260276 43182928 41908306 39773061 38215507 36062074 33990753
5454 33990753 31846863 30087123 28963587 27174421 26335096 25390537 24433229 23096907 22331180
5445 22331180 21617688 21218185 20927123 20931496 20646675 20617659 20611130 19840443 19838556 19509014 19186718
5434 19186718 19524697 18823782 18123031 19050843 19041816 18624782 18610850 18396590 18060738 17920059
5424 17920059 17581669 18323724 18130061 17576035 17847430 17590274 17779627 18160192 17903071
5415 17903071 17369640 17896441 17696778 17929830 18159313 18345483 18453111 17926194 17670929
5406 17670929 16976803 16802270 16191057 16186415 15988907 15961798 15773289 15238652 15496406 15764938
5396 15764938 16060941 15569521 15464435 14953864 14484500 14081861 13998743 14757298 14561707 13717025
5386 13717025 13969090 13373481 13470857 13701810 13250729 13753866 13781279 14257100 14358657 13802417
5376 13802417 13356768 13836240 14368398 14802039 14183928 14468285 14503761 14343994 15132565 15122671
5366 15122671 14523680 15021380 15295207 15177719 15404892 15624818 15789185 15528439 15713725
5357 15713725 15780110 15889925 16416992 15930058 16219251 15791357 15793383 16276055 16136480 15482319
5347 15482319 15570189 15710359 16127426 16299953 16521298 17101967 17372387 17325891 16322034 16109667
5337 16109667 15709476 15773122 16064540 16499463 16360252 16274242 16211094 16151063 15815411 15336391
5327 15336391 15544137 15402727 14839378 14737296 14911730 15223959 15843075 16026814 15809665
5318 15809665 15677171 15642188 15913180 15959894 16090493 15440676 14991964 15543141 15758026 15993692
5308 15993692 15999084 15870880 15703798 15610659 15383697 15984926 15063944 14797052 15585785 15538831
5298 15538831 15805508 15517287 15353176 15184136 14509701 13367919 13056256 13365568 13431069
5289 13431069 13735121 13524359 12753556 12541730 11840878 11874075 12925558 12314835 12008367
5280 12008367 12213195 11964323 11921265 12256469 12890369 12522518 12448698 12704492 13314466 12885654
5270 12885654 13186327 13535180 13480711 12661973 12077212 11696577 11593355 12239900 12185440 11682575
5260 11682575 11656553 11775752 11164841 10994765 11413699 11489912 11611120 11396423 11382368 11699834
5250 11699834 11146590 11414789 11267131 10940508 10955301 11043519 11348387 11565196 11444885 10887073
5240 10887073 10727594 10503170 10552645 10334302 10839589 11276748 10462252 10374688 10943917 10934269
5230 10934269 10622604 10871469 10923886 11548799 11693168 11736386 10897074 11065805 11992902 11998667
5220 11998667 11684559 11387567 11299082 10812403 10845604 10634759 10154767 10868835 11063290 11312584
5210 11312584 11002370 10756428 11183134 11306280 11954666 11761719 11376421 11882674 12009580
5201 12009580 11584727 11811238 11987533 11621369 11412499 11959874 12086320 12047982 12376360 11756815
5191 11756815 12108361 12471812 12267073 12233622 12486945 12659911 12686078 12746907 12298518 12106809
5181 12106809 12026296 12000578 12230971 12429949 12023006 11861550 11536163 12265563 12291049 11977837
5171 11977837 11953997 12370786 12847871 12656989 12494736 11763949 11764340 12399679 13032103 12929294
5161 12929294 13073544 13391008 13596049 13499165 13226572 13369430 13135644 13263798 12898349 13212222
5151 13212222 13044271 12958356 13143153 12790967 12836489 12742399 12745211 13201011 12907901 13603013
5141 13603013 13052306 12774947 13186398 13282991 14168163 14333582 15230300 15572594 15716337 15457482
5131 15457482 15115422 15512538 15631078 15635874 15212859 15177810 14338060 14244043 14260269 13617805
5121 13617805 13723296 13667301 13792594 13698100 13318662 13425004 13413827 13166735 13265142 13257657
5111 13257657 13472471 13520896 13168851 12559192 12517657 12159053 12419327 11891426 12570461 12200118
5101 12200118 12286770 12453975 11781612 11540030 11784993 11361276 11491125 11965942 11635545 11052893
5091 11052893 10995529 11062228 10779081 11078626 11220997 10314072 10836701 10820702 10530156 10394452
5081 10394452 10992143 10867875 9791778 10243605 10140990 9904042 9132312 9429909 9266993
5072 9266993 9567965 9005240 9044468 9467772 9317408 8894823 9580284 9727192 9599870 9658474
5062 9658474 9501043 9212532 8906073 9404593 9419136 9571808 9859788 9224177 9322861 9165259
5052 9165259 9116510 9746165 10126744 9300439 8714602 9668686 10289297 10216173 9624761 9416163
5042 9416163 9501913 10070785 10230162 9833886 9424314 9481901 8971092 9347590 9913821 10026842
5032 10026842 10155876 10074253 9783421 9291849 9529094 9696384 9515771 9206897 8897248 8519758
5022 8519758 8136754 9166360 9202728 9042202 8786361 8616520 8354195 8642111 9334045 9236413
5012 9236413 9385246 9201641 8223964 7895234 9406422 9417468 9648380 9895042 9582715 8938802
5002 8938802 9020666 8809962 8519683 8642460 8807046 8948412 9114963 9219032 9100291 8965156
4992 8965156 9013590 9328670 9799444 9065233 9251789 9364763 9745066 10536992 9823913 10138585
4982 10138585 10378289 10116264 10299669 10264416 10388455 10107727 9965975 9577362 9865540 9972639
4972 9972639 9767860 9791662 9564159 9770297 10100503 10755014 10533647 10773954 9944580 9738500
4962 9738500 10228385 9857713 9806587 10292378 10081433 9720924 9971315 10002780 10434027 10825399
4952 10825399 10698055 10760168 11211777 10784393 10813466 10957170 10686228 10965530 10851783 10706949
4942 10706949 10622893 10798778 11304622 11004557 10794543 11462685 11586055 11874306 11371865 11582058
4932 11582058 11690130 11307606 11065559 11593404 11893410 11846668 11944541 12445327 12288186 11392922
4922 11392922 11318172 11953724 12648687 12515606 12369853 12979292 12690736 12402127 12433178 12765172
4912 12765172 13296744 13202522 13286377 13310686 13685605 13603747 14026766 14496506 14443487 14981769
4902 14981769 15104154 15385398 15517669 15286364 15827788 15637323 15786829 15481202 15866204
4893 15866204 16086624 16054682 16840816 17427498 17659166 17759371 17531946 18057401 18769555 19419313
4883 19419313 20425995 20010198 20146691 20229135 20497575 20943875 21241854 21594156 21604256 22133020
4873 22133020 21782620 22025651 21910746 22087449 22591733 22322815 22439299 22382417 22496993 23425422
4863 23425422 23581044 23403228 23246039 23149077 24120734 23930208 23133127 23316545 23183003 23410559
4853 23410559 23430094 23660119 23731463 23523675 23668659 24064882 24629186 24169912 24622663 24405692
4843 24405692 24584559 25175740 25616209 26162715 25994962 26163215 26508162 26970613 27855056
4834 27855056 28299791 28447874 28737498 29027021 29339500 30389455 30810658 30868002 30566207
4825 30566207 31173077 31282399 31435319 31434769 31296457 30759110 30816043 31369386 31714154 31982428
4815 31982428 32579658 33101895 33587720 33837208 33556136 33862250 33535818 33860625 34086425
4806 34086425 33922672 33924559 34741937 34303507 34225840 34760845 34737536 35200700 35471043 36028878
4796 36028878 36646472 36473938 36320001 36287476 37406485 38181772 38700906 38899355 39476457
4787 39476457 40151987 40454570 40159120 39893101 40089771 40504155 40979304 40537679 40699748
4778 40699748 41579419 42393907 42974806 43924775 44497942 44794546 45196386 45791838 45852596 46191535
4768 46191535 47080071 47602973 48038370 48055631 49175852 49494931 49265159 49556561 49783176
4759 49783176 49080845 49159535 49214987 50087342 50162821 50871606 51844808 53087470 54908586 55896390
4749 55896390 57675509 59331245 60183086 61626237 63190766 63947624 64648413 66279304 66650167
4740 66650167 66827268 67435879 66698309 66387009 66132113 65525548 64682962 64570811 64431700
4731 64431700 64807054 64919992 66164107 66960091 68364728 70865123 73616862 76988364 81057808
4722 81057808 85451330 90384437 94891171 99215475 103640539 106616088 107949252 106307586
4714 106307586 102661788 98907491 93909588 88639497 82938118 77486928 72874305 69441427
4706 69441427 65921389 62316855 59294367 56537951 54673601 53623860 52358880 50358278
4698 50358278 49288666 48895527 48536602 47337947 46089217 45479378 46072005 46677046 45741590
4689 45741590 45233507 44580185 44533245 44881808 44483077 43658235 43475692 43556679 43634753 43295455
4679 43295455 44141163 44234324 44354489 45307937 45158542 45130736 45301520 45322549 44762116 45526511
4669 45526511 45671102 45844699 46291494 46546592 46770793 46592737 47455385 48205838 48256794 47735248
4659 47735248 47493749 47605647 47889626 48714940 49364826 49557360 50019023 50522128 50419581
4650 50419581 50356492 50860334 51982381 52369141 53344613 53835920 54630298 55067133 55562464
4641 55562464 56522144 57407912 58200501 58642276 59564315 60791567 61257268 61622647 62549760
4632 62549760 63175523 64046470 64964934 64666742 64869420 65282304 65799237 66606968 67097879
4623 67097879 68013331 68265162 69634611 71282381 72500708 73376023 74279145 75092185 75222234
4614 75222234 75948697 76489556 76139797 76148753 76654696 76741633 76348286 77100533 77963399 77906273
4604 77906273 77963451 78869499 79771550 80215259 80481431 80974598 81859547 82314464 82810272 84008477
4594 84008477 84799370 86354416 87387809 88358027 89531537 90670244 92202972 94386514
4586 94386514 96586760 98208834 99792008 99764604 98904842 97822609 96653296 94733258 93762727
4577 93762727 93549752 92873840 92607676 92630515 91881367 91028391 89719922 88363107 87251745
4568 87251745 87419576 86970264 86114789 86640799 87244973 87221246 87487215 88298445 89510947
4559 89510947 90185973 91560693 93645450 95175593 97234866 99631242 102963072 105014201
4551 105014201 106683462 107711090 107684026 107367613 107326653 107991775 108600629 110665825 112581497
4542 112581497 114098851 114944893 114753770 113330430 112256358 111105005 108874822 106942947
4534 106942947 105877417 104384302 103161818 102671394 101876730 101450931 100640179 100216635 100333413
4525 100333413 100391776 100848384 101393248 101757246 103159606 104154536 104339688 105137231 106053722
4516 106053722 106227725 106046827 106799925 107555605 108624486 109964232 111026762 112389441 112161433
4507 112161433 110329320 107920929 104869665 101613329 98399700 94984145 92145815 89512132
4499 89512132 87577685 85626691 83353586 81933905 80686173 79378918 78428263 77291265
4491 77291265 77239184 77059876 75977021 75112834 74667940 74632650 74431071 73536202 73248643 73110866
4481 73110866 73258583 73859539 73890172 74948630 75891763 74927313 73798688 71592908 68242617
4472 68242617 65765762 63958603 63187551 61303047 59549673 58538409 57317893 56777030
4464 56777030 55978504 55637430 54657052 54051839 53638717 53007740 51722493 51274198 50788706
4455 50788706 50486745 49909812 49045248 49097318 48917144 49130916 47852719 46974976 47573239
4446 47573239 47657149 47469762 47766668 47924766 47790819 47395667 47127738 47107093 47349247 47313758
4436 47313758 47034032 47540043 48517636 48495850 48781972 48983323 48643144 48151960 47969383 48481511
4426 48481511 49138379 48809869 48267273 48480591 49170614 48298781 48076768 47399853 46244314
4417 46244314 46413491 46802052 47382319 47831172 47875136 48020322 48493958 48593396 48854570 48701925
4407 48701925 48557865 48830974 48946997 48620322 49358125 49253024 49137125 49531222 50334240
4398 50334240 50460265 49761232 50168994 51174387 51319197 51107195 51222259 51447772 51359506
4389 51359506 52178881 52609624 52849286 53031797 53870921 54432981 54532358 54912473 55608000 56459907
4379 56459907 56706819 58126016 59057529 59891277 60804428 61984964 62297148 62997786 64494085
4370 64494085 65690359 66553990 67618631 68599822 69488319 70205219 70974293 71811061 73500467
4361 73500467 74030518 74771066 75990300 76978548 77574033 78317394 79230002 79711026 79702817 80021732
4351 80021732 80840936 80868294 80953827 81128201 80890656 81140916 81728947 81875313 82289198 83132486
4341 83132486 83732995 83694381 84135541 85442133 86144961 86733873 87042892 87274266 88607461
4332 88607461 90000399 90697567 91072764 92177309 93245807 94606849 95980632 97459249
4324 97459249 99382230 101382138 103155538 105028257 107596847 108988668 110473352 112457892
4316 112457892 113866622 116028960 118665913 122798533 127935995 133824148 139880508 145716395
4308 145716395 150149179 153117702 154337792 153289993 149675174 144998564 141291109 136773657
4300 136773657 133736060 132539232 131605610 132464786 134536942 136664100 140036409 144997822
4292 144997822 149997984 156803950 164581649 173456485 184160243 194868327 204531441 211980618
4284 211980618 216677843 218621418 217107485 211838236 204326542 196248104 187699507 178997423
4276 178997423 170921617 164801967 158346912 152270217 147596377 143730144 140451299 137784738
4268 137784738 135585905 133936084 133367181 132678265 132404967 132963416 134573631 136050869 137759745
4259 137759745 139626967 142204622 145775902 148748294 152754182 156351102 160626657 165006860
4251 165006860 170002660 175138000 178045897 179547516 177796577 174288011 168273444 160235029
4243 160235029 151647314 141965123 132597258 123798855 116743433 110972912 106427059 102272378
4235 102272378 98137477 94431676 91193862 88635601 86229333 84732307 83205365 82084813
4227 82084813 80863926 79360406 78261161 76426610 75205241 74381962 72120057 70303032
4219 70303032 69150010 67827119 66369259 65315726 64189578 64180398 63557295 62576269 61774007
4210 61774007 61532861 61250297 61059594 60878213 60158176 59128737 58785060 58110644 57193942
4201 57193942 56456763 55667814 54701735 54233853 54141344 54286056 54192751 53003956 53930559 53482709
4191 53482709 52792607 52506266 51536742 50641123 50494487 49841530 49120914 48318096 47817199
4182 47817199 47686725 47453638 47830997 48079320 47859767 46940051 46912068 47402882 47285727 47249399
4172 47249399 47720093 47894609 48412674 48939603 50376867 51924460 54227820 56928211 58895423
4163 58895423 58826276 56749465 54261760 51299068 48519766 47409973 45780599 44870101 45387860
4154 45387860 45292756 44682203 44116583 43261382 41952717 41356845 40582052 39817383 39542307
4145 39542307 39119235 38816432 38103307 37581548 37832036 36888784 36162686 35705849 36243886
4136 36243886 37194285 37009921 36811909 37080821 37063438 36443142 35368564 35022390 34957721 35327728
4126 35327728 34669838 33935187 34127188 33763833 34289690 34766258 34645194 34999397 35674905
4117 35674905 35265589 35178785 34263609 34399261 34612309 34145583 34677130 34484312 33936654 34080862
4107 34080862 34311768 34236076 34035230 33768969 34399315 35033113 34430067 34842382 35430601 35452802
4097 35452802 35556639 35837320 35752114 35795126 35819531 35405552 35615333 36301011 36389441 36452295
4087 36452295 37164626 35763088 35808470 36453969 36472897 36878498 37054433 36381298 37517965
4078 37517965 36799809 37245549 37370747 37005202 37407317 37871867 38513593 38825393 38986180
4069 38986180 38983208 38944930 39325266 39537535 39642741 39932458 40611239 40384071 39830843 40547563
4059 40547563 40347485 40366585 40634493 40436220 40376846 41082823 40940783 41343553 41231387 41223580
4049 41223580 41140941 41741134 41924857 41441843 41276080 42022023 42733003 42108873 41686226 41311976
4039 41311976 40996231 40778898 40509242 40891172 41340045 41352838 41515867 41024511 40584070 39901556
4029 39901556 40376106 40074018 39001888 39117992 38430734 38205530 38045959 38168571 37887933
4020 37887933 37512212 36919927 36797528 35805855 34126044 33505421 33680408 32829198 32273599
4011 32273599 31319184 30443974 29595280 29042434 28509735 27872096 27010389 26969584 26657405 26170809
4001 26170809 25424166 24531438 23818877 23790602 23494564 22958453 22644551 21955163 21607489 21294787
3991 21294787 21250813 21070756 19998750 19619255 19518077 18511932 17906804 17693188 17911782
3982 17911782 17008549 16497958 15903983 15388915 15370519 15475071 15215500 15047994 14973119 14770333
3972 14770333 14029689 14417866 14512785 14820281 14882543 14427176 14236525 14284024 13696328 13798685
3962 13798685 13371744 13071104 12816273 12517905 11829202 11618995 12387082 11976313 11871908
3953 11871908 11654618 11596463 11055828 10337198 9812479 9526840 9897550 9949941 9864640 10023811
3943 10023811 9496654 9420936 9221361 9660506 10047021 10185643 9965006 9720429 9190006 9006816
3933 9006816 8928859 9001402 9547831 9880676 9724217 9376486 9301790 8756344 8795013 8337125
3923 8337125 8503383 8155443 8057160 7983200 7563005 8193860 7783112 7725192 7276166 7426884
3913 7426884 7990403 8327535 7859027 7858603 7861434 7851035 7503281 7625736 7881961 7848393 8558433
3902 8558433 8501169 8644214 7786996 7716755 7732965 7707278 8235071 8616659 8097519 7806419
3892 7806419 7178350 7453768 7645317 7393918 7369609 7672200 7876142 7941669 8317103 8141905
3882 8141905 7519869 7150246 6876016 6439335 5975154 6443047 7051110 7331460 7255350 7049495
3872 7049495 7517150 7850447 7226823 6828020 6997650 7283525 7632980 7988148 8135879 7802795
3862 7802795 7304913 7282095 7409065 7071324 7456559 7486403 7502188 7633223 7518862 7298691
3852 7298691 7288292 7581794 7518103 7443735 6936222 7433684 7657825 6581991 7309949 7313173
3842 7313173 7112277 7094391 7190069 7184179 6622801 7240098 8272942 7753942 7529428 7469782
3832 7469782 7054556 7260665 8120956 7979021 8031298 7993471 7565311 8388261 8527130 8378438
3822 8378438 8025161 7788899 7937189 8148852 8278097 8139631 8761514 8603204 8173003 9024696
3812 9024696 9064872 8875821 9219723 8793479 8937193 9242887 9169690 9205286 8902481 9008864
3802 9008864 8492869 8862793 9050341 9228996 10296898 9669104 9299107 9268630 9537929 10031414
3792 10031414 9535786 9758773 9839733 9831660 10586955 10259809 10156787 10555372 10521889 11207969
3782 11207969 11003086 11260961 11221008 11388264 11472062 11318745 11867731 11293217 11706418 11762421
3772 11762421 12379132 11977414 12094257 12436707 12628733 13084300 13414986 13003662 12683882
3763 12683882 12608539 13041421 13386229 12957130 13555013 14263423 14784931 14791702 14276405 14518790
3753 14518790 14693334 14530384 14721882 14895867 15455126 15145423 15306889 15718603 15460937
3744 15460937 15322550 15504541 15568437 15751155 16233050 16561031 16652793 17244721 17242111 17755820
3734 17755820 18296535 18468449 18115489 18020036 18260796 18452838 18535560 18868396 19194789 19278992
3724 19278992 19131355 19529496 19622968 19898957 20462611 21093674 21401254 22015236 22033348 22058400
3714 22058400 22376650 22742499 22368616 22702600 23273044 23112724 23631478 23640332 23755139 23528914
3704 23528914 24389823 24380122 24208817 23801150 23568310 24144543 24473942 24763087 24605684 24172165
3694 24172165 24242670 24284367 24130593 23785474 23952773 23795913 23942025 24472185 24645496 24235164
3684 24235164 24659542 24270156 24332509 24664571 24939424 25012927 25020950 25582195 25996361 26424061
3674 26424061 26277448 26835649 27402139 28008988 27449767 27130372 27056157 27731749 28691249 28729325
3664 28729325 28964548 29059759 29025048 29497879 29921853 30220740 31051765 31641930 31405868 31299703
3654 31299703 31632098 32396848 32743901 32758606 32326187 32462323 32867925 33059845 33253720 33343622
3644 33343622 33352957 33269356 33539410 33729589 33829725 34150386 34326354 34784991 35237858 34542468
3634 34542468 34442901 35169394 35479295 35778144 35564983 35628456 35944204 36696693 36954694 37662193
3624 37662193 38543534 38266342 38919149 39833160 40132966 40849922 42033657 42978624 43085611
3615 43085611 44704056 45305283 45134210 45950184 46180821 47141757 47728272 48425034 49417773
3606 49417773 49589625 50011122 50115605 50327469 51341110 51568640 52352161 52566332 52690132
3597 52690132 52799763 53004401 53240602 52997546 53762281 53831841 53387383 53760839 53669415 53248780
3587 53248780 52741362 52614208 52200449 52082971 50897507 50130061 49528608 49289435 48862202
3578 48862202 48226931 47490268 47614200 48266464 47018392 46185743 45469308 44771077 44459394
3569 44459394 43924756 43011140 43147572 42561512 41858663 41398870 40936982 40673201 40969329
3560 40969329 40476686 40015587 40082320 40100464 40506530 40740661 40506937 40900735 40921217 41231879
3550 41231879 41560230 42167460 42961543 42961958 43366464 44256084 44990856 45668398 46134224 46004104
3540 46004104 46751698 47866981 48844747 48630318 49118012 49762866 50410205 50260324 50895814
3531 50895814 51004628 51381865 51255519 51398408 50908168 50840487 51063030 51038951 51433341 51439439
3521 51439439 51183089 50813718 51414721 51632004 51854755 52061973 52252882 52394155 52695918
3512 52695918 53651919 53622127 54109958 54368877 54504235 55581386 56340957 56628994 57316595
3503 57316595 58704454 58448281 58889292 59842943 60567814 61714750 62013493 62646392 63650141
3494 63650141 63831016 63955777 64122874 64622077 64092489 63646598 63783289 63822680 63841233 64535224
3484 64535224 63963741 64256735 63937116 64281986 64073899 64542728 65176369 65024246 65685412
3475 65685412 66150977 66321824 66450320 66930270 67546732 68420701 69172177 69045687 69725600
3466 69725600 69659982 69648793 70273033 70462445 70249821 69962972 69364679 69378201 69337254 68881864
3456 68881864 68821745 68173906 68061782 68247367 68633106 68665601 68931254 68669158 69536453 69572608
3446 69572608 70137099 71274205 72052700 71993170 72921942 73310559 73566740 74407275 74992122
3437 74992122 75533527 76349055 76918089 77112030 77575727 77771475 78402535 78946082 79595712
3428 79595712 80316235 81471895 81655096 81846724 82324424 82788293 83513569 83908739 84122463
3419 84122463 84368766 85242551 85868824 86271131 86979897 87332263 87968766 88826655 89035032
3410 89035032 89049778 89433068 89054635 89169749 89566325 90021426 89814614 89383375 89268662 89461328
3400 89461328 89642680 90434273 91360864 92029080 92968145 94027970 94517424 94790334 95315319
3391 95315319 95747382 95785685 96165821 96039488 95670653 94981862 94549240 93566066 92199997
3382 92199997 91191436 88743197 87258068 86276161 85159294 83411949 82123123 81348247
3374 81348247 80967054 80948895 80305295 79566415 79007254 78903364 78214555 78106105 78814713 78877334
3364 78877334 78335143 78666142 78864001 79279763 79697429 80037599 80338030 80388675 81170097 81156659
3354 81156659 81607882 82316503 83213929 83028861 83647698 84557179 86007096 87523485 88596716
3345 88596716 90101982 91513068 93117319 94991299 95981626 97683835 98881212 99999366
3337 99999366 101145372 102646114 104232980 106235998 107604870 109131780 110652176 112520058
3329 112520058 114111194 115501820 115681048 116447603 117014684 117733347 118353099 118020462 117186551
3320 117186551 116812980 117541900 117724491 118180477 119050936 119654198 119649588 120726135 121295670
3311 121295670 122235829 122705800 123243475 124496129 126061855 127972032 129437923 129820240 130793909
3302 130793909 131822784 133359467 134276809 135046501 136843747 137997474 138838819 140464553
3294 140464553 141795558 143762555 144831431 146155728 148047658 148790796 149521478 150529669
3286 150529669 151556858 152582273 153562328 154429686 155042860 156592619 157382963 158372811 158383299
3277 158383299 158247972 159441377 160325837 161084033 162553000 163976879 164908583 166099830 167567334
3268 167567334 169084408 171254148 173005275 175316970 177750016 180382151 182400866 183210905
3260 183210905 183578198 183357533 182819322 182422371 182223993 182718451 183990346 185375053 186495583
3251 186495583 187528845 188660481 189711264 192347465 194357790 196492303 198352508 198499853
3243 198499853 199345489 200401352 201080888 200993676 200417940 200135745 199704322 198652871 198662525
3234 198662525 199508672 199949552 200862627 202272674 203909026 204082814 201380511 194948042 187645028
3225 187645028 180611517 174286997 168373982 161965225 157091717 152504340 147905466 144044441
3217 144044441 140018960 136866828 134370787 131421616 128820801 126385766 124144733 122203935
3209 122203935 120688966 119536462 118832767 118721226 118423416 118657345 119809563 120930293 122300270
3200 122300270 124558515 127566045 129994580 132768038 134736419 135145064 134662096 133640705
3192 133640705 130905236 127375585 123127232 119914139 117159001 114282267 112430976 111315265
3184 111315265 111130217 110837609 110905951 110989402 110582456 110387069 111299121 112287912 112209499 112656125
3174 112656125 114220716 115226726 117065585 118813677 121319755 123720714 126805227 130465800
3166 130465800 133505918 137196420 140631297 144066024 148426461 151340093 151308173 146767916
3158 146767916 140418516 133802210 127618411 122176153 117774878 113888621 110904998 109131977
3150 109131977 108435285 106382513 105051877 103323623 102385553 102138980 101094652 100712266 100281309
3141 100281309 100168923 101047435 101738766 102543273 103242994 104097130 105258154 106384621 107504551
3132 107504551 108453640 109484881 110966216 111876227 112218797 111839325 109937384 107245762 105061979
3123 105061979 102644403 100208803 98276477 96974869 95819238 94876212 93551624 92297226
3115 92297226 91521053 90535490 89493140 88340176 88032229 87364554 86603173 86558607 85499425
3106 85499425 84594709 84395322 82718998 82446920 82616710 81696736 80573234 80201139 79674190
3097 79674190 79474564 78754286 78599723 78306779 78423600 77782576 77518653 78325551 78639967
3088 78639967 78538552 78897814 78140016 78202019 78426789 79224287 79288320 79327353 79135846 78164623
3078 78164623 77450292 77359277 76559145 75505185 74637060 73963883 73217754 71890742 70938167
3069 70938167 70183518 68966407 68060898 67333801 66812678 66282140 65843968 65171387 65507974
3060 65507974 65044741 64491436 64336722 63491164 62933630 62385510 61594873 60668120 59800970
3051 59800970 58501456 57625810 56211509 55026664 53645294 52219613 51465184 50624474 49280052
3042 49280052 48808434 48006502 47182329 46761091 46101574 45273450 44957037 44315218 43916588
3033 43916588 43707278 43246558 42684674 42343559 42151547 41846417 41477709 41528856 40828148 40167002
3023 40167002 40161548 40592575 40392790 39843788 39877046 40344648 40148487 39890142 39439952 39804705
3013 39804705 39516757 40110783 40601809 40697174 41141920 41399163 41257832 40918633 41391526 42058370
3003 42058370 42322756 42351549 42807458 42981981 43077686 42995916 43247662 43791674 43552449 43509668
2993 43509668 43360470 43432514 43933590 44474558 45075905 44692212 45208512 46243241 46318434 46519837
2983 46519837 47435784 47324268 47425903 47356036 47384090 47984801 48101498 47997563 48596910 49285704
2973 49285704 50575552 51357465 51165293 51737479 52923052 53797756 54979107 55999334 56594176
2964 56594176 57809273 58639533 59573836 61179426 62557106 63414854 64006797 65779827 67765794
2955 67765794 68933610 70015513 71526326 72401991 73729076 74944564 74887156 75664273 76226976
2946 76226976 77227853 78412097 79380837 80902050 83182321 84974206 87487576 89709264
2938 89709264 92440721 95827176 99140494 103607878 108629382 113652461 119062554 124535758
2930 124535758 131196236 138471499 144933314 152093510 158320923 163705744 170308846 176620327
2922 176620327 183179581 188622038 191355618 191438684 188511069 183657591 179630828 175351324
2914 175351324 170905336 166674209 163536613 161594058 159545288 159166198 159056232 160657388
2906 160657388 163267338 165684115 169091707 173706056 179148162 185205394 192107757 199082855
2898 199082855 206761713 214788985 221785466 227822562 230914869 231676781 230510362 228000151
2890 228000151 225364203 222899131 220718209 219334521 218936631 220088115 222496125 225599020
2882 225599020 228930950 234351124 240141755 246613718 253655137 260442016 267659275 274459597
2874 274459597 279905513 283064007 284798650 285348642 284707613 282168149 278649574 274309232
2866 274309232 269164907 265003960 260369021 255913203 252051109 247985412 243493064 237974334
2858 237974334 233072868 228539916 223453729 219038737 215059754 210544470 205211101 199688387
2850 199688387 194012887 189018555 184705048 180270747 176731118 173668092 170554857 168049111
2842 168049111 166212954 165307162 164438996 164698673 165632935 167717472 170333749 173136562 177755704
2833 177755704 182048425 186714730 191926794 196465986 200238729 202021322 202348002 199255267
2825 199255267 193738613 185880650 177038862 166970153 156366122 146108576 135999240
2818 135999240 127601203 119512138 112394799 106259981 101292967 96239172 91831436 87815642
2810 87815642 84349873 81143381 78205216 75151847 72289493 69377379 67247704 64462486
2802 64462486 61885623 59645032 57273108 55695079 53824010 51308243 49733687 48343619
2794 48343619 47549170 45517550 44202005 43208135 42077584 40543828 40182555 38976713 37376387
2785 37376387 37076615 36245505 34943241 34199178 33747635 32526047 31987214 31325493 30686296
2776 30686296 29932145 29265340 28522828 27594656 27285155 26969135 26233001 26035020 25863271
2767 25863271 24776595 24238485 23889506 24000708 23920132 22875008 22249658 21975089 21571788
2758 21571788 21210782 20710488 20017842 19907403 19630456 18929006 18641172 18602590 18139908 17813566
2748 17813566 17832987 17684703 17148511 17482322 16682873 16413419 15780296 15171730 14866825 14840944
2738 14840944 15117943 14778695 14320132 14284734 13595982 13452161 13443688 13878074 13384982 13452788
2728 13452788 13169982 12907995 12631093 12074739 12399149 12899225 12532341 12043653 11745187
2719 11745187 11183293 11395354 11319686 10996346 10365711 9876913 10095155 10167110 10216533 10194981
2709 10194981 9542058 9692844 9805952 9638886 9298668 9135068 9443614 9501388 8981126 8199430
2699 8199430 8418607 8305968 8526931 9452122 9191100 8701336 8751400 8319875 8477640 8531556
2689 8531556 8517392 8067875 8099430 8359023 7323711 7212886 6965820 7036467 6939014 6841211
2679 6841211 6900412 6208998 6342880 6284094 6582888 6500469 7268899 7820470 7208814 6664064
2669 6664064 6795439 6525362 6801889 6941224 6567298 6389139 5880928 6647627 6209478 6081697
2659 6081697 5998600 6137083 5884609 6163550 6737726 6901212 6401780 6917770 6488155 5700695
2649 5700695 5839768 5973400 5782721 6099105 6065176 6109163 5757425 5519239 5285571 5309117
2639 5309117 5033481 5226810 5690637 5264146 5268712 5397575 5260143 5473524 5617952 5755475
2629 5755475 5449229 5341869 5502937 5677241 4889399 5122628 5256617 4939145 4640019 4824445
2619 4824445 4974880 5337956 5374608 5529547 5447464 5068627 5446873 4989152 5004194 5116231
2609 5116231 5183840 4508924 4669066 5284059 4800584 4717890 4719922 4963697 4982615 4856352
2599 4856352 5042889 4771473 4762149 4586561 4638326 4815957 4969336 5221276 5098649 4503124
2589 4503124 5209482 4654627 4767406 4248719 3664820 4695690 4863263 4458015 4108938
2580 4108938 3902590 4560827 4358473 4556983 4095089 3833436 3821888 4331264 4188144 3940589
2570 3940589 3696023 3966846 4104749 3930921 3616690 4104879 4053698 3835732 3854550 3810806
2560 3810806 3769023 3297324 3459915 3582356 2749094 2844606 3649385 3523447 3873978 3755340
2550 3755340 3516123 3255045 3768822 3859553 3445165 3378885 3688384 3702810 3003309 3387908
2540 3387908 3796103 3540825 2518151 3177117 3186118 2859185 3573808 3397231 2865531 2522813
2530 2522813 2394980 2926044 2498106 2387713 2687764 2260826 2949041 2657285 3200687 2613677
2520 2613677 2335468 2845186 2571699 2502118 2755577 2380782 2942036 2947353 2225951 2231750
2510 2231750 2823351 3215539 3041279 2105329 1977710 2206449 2499645 2873347 2704734 2723500
2500 2723500 2229018 1994086 2535490 2413289 2969476 2220647 1796054 2558941 3075293 2939154
2490 2939154 2354134 1870756 1551543 1720280 1952854 1728392 1820545 2479401 2415704 2267928
2480 2267928 1475673 1485165 1937048 1600540 1250337 2093515 2158237 1475832 1398856 1434667
2470 1434667 1911828 1653194 1236452 1296865 1033212 1216502 1684279 1790581 1915000 2008044
2460 2008044 1825523 1419296 1422928 1578577 1804758 1781051 1936808 1830244 1853914 1553725
2450 1553725 1399435 1660955 1781814 1544844 1819937 1767157 1040463 1847518 2360523 1946284
2440 1946284 2248444 1390860 672610 1218491 1579773 1237596 1062710 1961006 1467640 1564907
2430 1564907 2395101 1786498 2093285 2328180 2506965 3139928 2385052 2228156 1455936 1130837
2420 1130837 2093259 1961812 1490524 1304873 2042450 2448960 1682505 1628313 1356812 1198356
2410 1198356 930287 772747 1054727 852946 918271 675389 765208 1462158 1403782 1259961
2400 1259961 957593 716559 968473 1015107 1252292 1477137 1778452 1657942 1582424 2073595
2390 2073595 1502030 1121520 829586 1315119 1472756 1425749 1390250 1584063 1531871 1957929
2380 1957929 2042978 2067291 2208009 2581244 2420336 2222729 2453103 2502160 2437036 2209278
2370 2209278 1793920 2104554 1841802 1495093 1869207 1720577 1118718 816356 1872001
2361 1872001 1710060 1078281 1697973 2258664 1759430 1602477 1428755 1566009 1748464 2015380
2351 2015380 1576599 1319336 1553920 1692967 1825355 1300949 1280608 1452042 935675 1467406
2341 1467406 1778582 2207532 1776275 1427834 728248 732604 1371078 869869 1088733 1509440
2331 1509440 1392701 1372254 1113649 685798 713320 529828 1083787 1174282 991313 1457249
2321 1457249 1559719 1605681 1182001 1207173 1762285 1244245 1113041 831661 1459149 1775020
2311 1775020 970077 724860 851565 800840 1201934 1682832 1059936 1445341 1137938 541431
2301 541431 1532997 1490667 1071462 1276686 1614738 1447119 1259553 1802439 1679261 1676111
2291 1676111 2052037 2359754 1992434 2399751 1697077 1655864 1575882 1394610 1782313 1353242
2281 1353242 970676 884257 1767987 1449516 2041607 2837405 2307212 2321348 1976734 1408739
2271 1408739 1932841 2223582 2224268 2409589 2096614 1794393 1790933 1471260 1627021 1727102
2261 1727102 1579737 1573236 1799482 1983284 1362955 1661885 1352831 1214649 1440791 1396926
2251 1396926 1435577 1722870 1855734 1198146 1331023 1929772 1802254 2308270 2658894 1586144
2241 1586144 1752467 2412874 2693809 2769426 2428614 2055325 2249078 1853058 1889513 1872810
2231 1872810 2261645 1908387 2222706 2560061 2738342 2729585 1994800 1611697 2545635 2796283
2221 2796283 2570186 2346602 2623575 2651360 2381882 3087432 3100250 2495083 2466783 2235770
2211 2235770 2214861 3288253 3620574 3180628 3201546 3425483 3204928 2998871 3091147 2986746
2201 2986746 3207948 3553387 3308829 3754258 4053463 3921448 3770623 4431053 4662439 4003977
2191 4003977 3371579 4212933 4360488 4841783 4949454 4779021 4853337 4685102 4109709 4722830
2181 4722830 5049704 4920755 5782305 6040455 6161918 6160653 6818042 6711934 6484092 6426330
2171 6426330 6191309 6546510 7204348 7272322 6817955 6455917 6652017 7397187 8010265 7585812
2161 7585812 7594152 7859799 8499811 8466265 8580627 8778500 9153691 9173523 9285596 9699936
2151 9699936 10117010 10532672 10370562 10946515 11237116 12072559 12893529 13455796 13299200 14549243
2141 14549243 14265430 14792124 15888618 16686947 17168189 17671283 18309783 18558322 19010502
2132 19010502 19962193 21421408 23225517 24247313 24748684 25223731 27558331 30178763 32879560
2123 32879560 35453459 38656682 40374568 42158747 44323948 48809321 53846841 60658076
2115 60658076 68244599 78689626 91753379 109707184 133885586 166194035 206102082
2108 206102082 242577609 246682609 201147748 151470420 116925854 93887653 76757581
2101 76757581 64698121 55293397 48308194 42688257 38680559 36519393 34123784 32303926
2093 32303926 31260465 29273394 27271381 24705048 22337845 20136671 19086822 18003557
2085 18003557 16468843 15767169 14528021 14014203 13737694 12813879 12271414 11695216 11347951
2076 11347951 10480980 10852206 10841185 9625781 8975352 9382216 8820675 8469104 8513603 8204511
2066 8204511 7872590 6766591 6314011 6098271 6811439 7116516 6613516 5991733 5972066 6122267
2056 6122267 6554883 6672001 6045174 5486563 5550993 5385726 4837716 4390003 4513794 4326824
2046 4326824 4410645 4435982 4151823 4166321 3922859 4172234 3693401 3749493 3910907 3502413
2036 3502413 4103836 4071638 3879595 3072059 3027773 3088478 3134094 3020761 2634209 2855865
2026 2855865 2818940 3272141 2922037 3178193 2636523 2153227 2264474 2156242 2043056 2312131
2016 2312131 2697591 2771951 2324552 1461675 2079739 2097742 2677480 2982237 2265075 1754853
2006 1754853 1759460 1625125 2103849 1936429 1928538 1756977 1936946 2381652 1616374 1055596
1996 1055596 1528216 1631401 1589379 1130677 1972403 1965678 1785434 1168640 753272 831759
1986 831759 970560 1440038 1603346 1491828 1570691 1232623 1322570 1943428 1884105 1857147
1976 1857147 1349350 1278704 1669221 1257433 1406490 1863501 1740967 1626011 915581 908087
1966 908087 1390499 1017765 1319762 1353312 917036 526643 765516 937377 964520 845401
1956 845401 1042115 1268640 1582930 1222764 1330147 1705715 1701505 1314409 982823 853937
1946 853937 739771 894069 995440 1339619 1418956 1273692 1000368 1342287 1654275 1072452
1936 1072452 839812 635114 -79340 241237 326138 1401253 1402536 683453 881409 1669774
1926 1669774 562723 280270 -39919 35768 482099 836033 1531066 1044318 942061 1145802
1916 1145802 806913 1153864 847333 1002587 732635 639937 1087289 971285 515644 805059
1906 805059 680140 527218 721566 456354 309668 631798 777580 618143 737634 614806
1896 614806 655390 1175774 762689 578946 829745 716250 -138902 122790 539813 880797
1886 880797 933233 290225 403343 495467 1024533 869313 978850 758414 503839 335965
1876 335965 747929 998334 526480 300182 273839 452936 131431 448395 698019 70676
1866 70676 394142 676369 128464 -20664 901107 524764 182946 1060294 655287 818198
1856 818198 1407923 873748 749068 1142590 1251116 1178583 1495728 1161738 1144553 872753
1846 872753 731036 684612 938981 1124272 1291425 1869881 2249026 2226549 2151646 2090891
1836 2090891 1906976 1177103 1164739 933230 1384829 1549657 685916 521953 576872 696498
1826 696498 166338 -169830 -267008 -67751 324061 481441 1086600 1502904 1476075 1033496
1816 1033496 -236739 408675 723689 1055171 721676 882409 946277 573071 364938 -30409
1806 -30409 -128866 161714 338880 717154 134630 -351189 239095 641759 333544 281908
1796 281908 -83707 53272 1023629 539979 568111 -45844 369047 856393 516290 640577
1786 640577 483209 917816 810809 569168 414712 -49981 113432 -417921 686207 920823
1776 920823 827160 1129257 822139 33696 -192776 343096 220963 25090 358357 162564
1766 162564 727331 1133155 280285 -68142 453011 551701 274221 -15405 346461 174040
1756 174040 -134266 -248454 -222044 -400746 -129957 -131779 -304512 290378 148163 78973
1746 78973 -110343 -243033 296930 104492 -207890 397785 709336 324646 778228 510012
1736 510012 524774 -6126 275370 1038702 1263023 1136325 433311 703569 33421 -332174
1726 -332174 -523425 -310828 76140 281678 336258 775905 630340 207195 -125661 384565
1716 384565 322750 505843 347823 112218 627194 727251 346319 1398527 1273955 465088
1706 465088 503927 182972 273006 568241 366789 -87385 -50158 319120 110120 718389
1696 718389 396765 91964 570825 596240 -86825 267452 597499 720970 751116 494785
1686 494785 825085 160449 12482 172239 611463 812860 -95389 -643919 -181507 258053
1676 258053 321052 130554 189882 311827 767713 596630 874650 779907 1153450 424921
1666 424921 228872 257484 374621 112523 661244 1043449 1077074 462764 39092 281697
1656 281697 137835 121496 -179902 34924 21152 389407 532652 605655 286722 -28729
1646 -28729 132127 -61045 -34533 603418 204747 281661 34815 -784184 -729025 -244898
1636 -244898 456683 461557 567964 221137 -395658 229313 709988 1430744 1180541 1062284
1626 1062284 363885 459625 -150655 -414564 -345688 688932 732208 502603 249608 -124628
1616 -124628 277307 388757 208438 229841 320923 1145251 1227586 306781 540006 991116
1606 991116 923514 468602 -54795 216903 215889 11706 -410780 -73638 19019 -216 -125311
1595 -125311 -648478 -623481 -707697 -639857 -720077 759132 605811 687463 623352 529257 634296
1584 634296 742206 -44159 -550161 -282662 490049 282012 11899 319490 128820 -71838
1574 -71838 47450 -122257 178041 102750 -355492 -175262 399243 14581 -122541 -146660
1564 -146660 288892 -248161 20254 625830 -539300 -128804 -10885 172422 -164283 -139942
1554 -139942 508192 612341 785488 558889 494803 709062 -1924 -255873 -228829 197157
1544 197157 467731 538491 433048 221434 177886 663227 841272 602445 156871 142123
1534 142123 -163782 274958 334862 491101 533808 174766 239071 -552039 -157746 287890
1524 287890 387460 410757 558209 -206487 134361 397506 -153286 -367065 -145843 356009
1514 356009 349799 -169948 283763 65458 311162 306027 378945 446245 216128 -222619 -144539
1503 -144539 -301433 -207922 -146601 424017 622791 267673 -144667 -168489 204208 130367
1493 130367 -249153 -623237 -306796 208835 498046 545776 -104765 206156 573156 -197254
1483 -197254 -88601 96637 -200576 -595275 223220 789313 -11105 172244 496559 22982
1473 22982 208989 -311982 52484 563402 770086 471564 210991 571167 375618 301469
1463 301469 282289 274407 299529 266958 169741 -337032 -783792 -582382 -48575 -102791 413975
1452 413975 480647 395493 77687 401913 693033 465019 477807 64370 -144732 105293
1442 105293 93412 392970 -396701 -626187 -180613 297092 330716 -83789 243465 535268
1432 535268 188463 -216950 -335535 108026 -259344 206861 -629288 -210758 -39304 -788750
1422 -788750 -416581 628049 105096 197013 447083 562616 189483 -507493 -755974 -660746
1412 -660746 218231 248649 -86053 50998 -42483 -63323 -293026 -773177 -599600 -246155
1402 -246155 -80316 326240 287956 78579 91510 633354 559357 206749 550377 112107
1392 112107 43813 354690 -272856 -289200 -175371 9853 641230 449223 196986 127543
1382 127543 579460 730748 541204 313719 573665 128023 152791 -430658 -415182 -435650
1372 -435650 188977 -137465 -115363 -55317 176957 -133631 278108 611604 502554 281022
1362 281022 88191 199413 262367 105230 -291402 276896 730757 1001627 719097 -404811
1352 -404811 -796010 -878681 68820 -411238 -515709 -313802 35294 103532 450954 298031
1342 298031 10522 -99247 465397 95950 -467417 -121461 -251752 56683 295053 307457
1332 307457 -210472 -281095 433229 687129 759033 -92722 -375515 -9691 325648 775519
1322 775519 530156 478501 888086 585963 271287 725468 211982 -137706 122536 389782
1312 389782 88876 373809 558106 67842 -431237 154352 436040 447772 493024 682463
1302 682463 160030 162918 232578 515197 208042 -265072 -390611 79204 16859 -820827
1292 -820827 -600631 -769465 -785595 -303084 -267891 40292 -205336 242164 185905 148306
1282 148306 516961 609336 224666 197784 -323521 119211 30478 -486586 47947 178112
1272 178112 61337 -137190 711422 622557 529951 423341 304099 -245358 -387263 -77592
1262 -77592 -594368 -183006 -205071 -623996 -250749 237787 105583 218637 486122 431538
1252 431538 -66915 -168016 -675589 -923049 -325003 275093 766534 -354518 -455473 -298577
1242 -298577 -222861 320671 429801 590930 693153 188943 -35686 238295 423579 399042
1232 399042 712483 1123164 362242 105476 -334958 -929233 -519103 549325 1128539 807692
1222 807692 213386 422998 57067 -59960 294790 739724 971669 645571 97209 35078
1212 35078 295911 -55541 170967 194011 -428657 -573772 -547275 -829041 -401837 -193484
1202 -193484 370938 269921 132074 515682 587415 112600 86607 -201588 -277916 -628769
1192 -628769 -459330 494876 -56333 -315725 -513011 480817 -57685 -260298 -601401 -124799
1182 -124799 723243 461617 -50201 -277226 488098 353561 94070 -114764 526624 706832
1172 706832 743808 493969 -29428 -197391 205297 338868 868148 438801 243438 238057
1162 238057 673785 801644 151150 223640 -398085 -474590 -688398 -49108 -266264 -370225
1152 -370225 -166375 -146702 139547 -46836 362552 797282 677104 17615 56522 -143049
1142 -143049 -123665 -430347 -70714 38727 -155773 -284991 -482300 -127384 304002 370764
1132 370764 249495 -285219 -36863 389428 708965 905405 627439 928312 629667 612087
1122 612087 293872 616354 314699 11980 47738 -340032 -208379 316417 411149 -436221
1112 -436221 -503550 -166920 -318111 -626392 -202447 57809 261345 -283521 -515396 -146687
1102 -146687 -304676 277219 377050 -189649 118888 26358 -228589 174212 -4802 -318848
1092 -318848 -450986 -538912 -465139 -125571 -182694 -255591 83918 -134714 495021 364822
1082 364822 224166 96143 68739 257115 201342 11387 -140888 79016 -20846 747775
1072 747775 394351 265360 -258458 -31505 218578 -506301 -214938 -154821 -124547 277454
1062 277454 353310 -258550 -282437 -87631 -96506 119936 35735 -260902 -178886 68986 324824
1051 324824 411786 328611 17352 -510478 -351701 306085 -301281 208900 119284 255229
1041 255229 73124 74444 -626848 -937423 -759452 257336 630831 523798 160954 -106955
1031 -106955 285686 172636 96313 -254458 59673 255874 704442 147138 33489 -282068
1021 -282068 -110188 159699 -158223 -582453 -353087 -1011412 -817318 -805530 -941552 -483772
1011 -483772 -40373 -283023 100149 157503 -303447 -250677 365311 107316 -46466 -608147
1001 -608147 -605369 -525901 -270295 -303836 -30309 676602 567702 626720 711856 650190 18423
990 18423 -111165 298563 -207205 215249 651077 505744 688355 -422164 -304416 -119077
980 -119077 307319 432444 138662 335532 388244 76828 -374613 -178352 333741 235377
970 235377 -110142 232187 639517 78165 22246 294551 -97370 98838 246657 477245
960 477245 -120858 -434817 324162 207773 50892 431112 -10670 -703360 -683078 -170995
950 -170995 -338128 -553936 -111362 -605464 -806642 17759 70949 400555 749958 32419
940 32419 -72033 1014782 831236 136079 -325247 -381379 -297700 40717 -5929 -251600
930 -251600 -340547 -468947 -171133 412420 129898 -725303 -180868 -19228 -403328 -630022
920 -630022 -80412 -985638 -821015 -252185 364565 79771 -159150 262423 117495 -399491
910 -399491 327709 293025 -82557 62283 689110 195857 207602 214201 -66874 134267 -267339
899 -267339 -562752 -421583 -405659 -401323 -235225 -460533 -382856 -283112 -136733 -610051 -917726
888 -917726 -1061398 -406555 -457402 -535248 36085 195749 337887 214732 -182433 -401982
878 -401982 -470225 -30022 639134 -260818 -456547 -33582 540863 245062 -113834 -574124
868 -574124 -263475 -68507 253880 294198 -161906 -192173 -263016 -338090 -116753 -50020 -220109
857 -220109 109128 52932 218180 -441962 -208512 -237348 -20194 201290 -87912 -318107
847 -318107 -489326 -179389 -163073 -112726 -29994 -160506 -139900 -581011 -112270 -499639 -401545
836 -401545 -208413 17661 304943 -133879 -853712 -395261 -94890 345783 63815 -242517
826 -242517 -95894 -341909 -641706 -669298 -916403 -853480 -436347 40314 174801 -35415
816 -35415 -432928 -374075 -292137 -67545 201725 378850 123846 -193239 -567553 -514164 -229453
805 -229453 237648 -193602 -263186 200629 -519035 -58868 432452 375941 -42355 202763
795 202763 -185723 -516057 -500405 -893107 -625838 117556 -31978 401967 113722 -369235
785 -369235 -306062 -225073 -680061 -458109 -257443 -564028 -435014 633375 745540 510846
775 510846 264910 -2518 101158 -107783 105297 151110 -69103 -427829 -100664 158168
765 158168 -250151 -125666 -183211 -150521 182358 106548 -81462 -102708 191475 497546 345614
754 345614 -65312 -1011225 -1129887 -962139 -545616 -707747 -1385837 -898840 -569742 -196355
744 -196355 292525 -437852 -336061 -362055 -1070170 -483194 254721 -111727 75255 592080
734 592080 481939 30672 355296 398276 -324190 -927749 -624664 -246082 231718 909242
724 909242 126625 -349011 -471094 -320840 -224506 319613 -71124 -48887 159459 498527
714 498527 125358 -334280 -72306 102482 -556173 -60470 362735 184782 104971 -308661
704 -308661 -129506 29005 -20541 19412 -67043 -403267 -427787 -39479 510261 129859 -266329
693 -266329 -315710 -625286 -380036 52373 -124253 -275996 -467913 23211 304404 -399822
683 -399822 -582020 45504 -299330 -798351 -308422 -786976 46897 -164870 -1028800 -879066
673 -879066 -695246 -591359 -566190 -472093 -199847 42890 -107162 22644 -92934 -92137 278923
662 278923 221375 -229961 -288541 -82044 -229089 -325233 -509124 -972280 -777243 -588032
652 -588032 -423859 -449065 -581936 -712213 -771646 -1093929 -708416 -102570 -198253 -509204
642 -509204 -382098 -59399 -331287 -218069 -165606 -250336 -23230 77524 20072 -163353
632 -163353 503731 -54057 -927072 -496113 7763 545246 391413 619750 496350 908
622 908 -308952 -76380 -32473 -1095377 -987116 -550844 -639420 -349052 -365734 -367234 -279295
611 -279295 -596418 -288129 -140615 316765 22706 -126282 -746878 -188403 26815 -93468
601 -93468 -891506 -247493 -163645 36526 298947 -109430 171455 -115606 -5712 149054
591 149054 -4871 -81956 -512677 -628367 -884855 -491219 -413338 -630530 -310515 -225503
581 -225503 -337579 -303592 -304895 -61456 -477671 -1217388 -880241 -904402 -113165 -350746 -218987
570 -218987 -589887 32258 -26095 -257942 -417778 132639 184368 434303 442336 108383 -328801
559 -328801 -452919 -467015 -353760 -81729 241866 71300 -87795 350287 246825 168602
549 168602 -488459 -726797 -440086 -146846 -779041 -1041419 -579114 -917526 -1161707 -1411202
539 -1411202 -519957 -234015 -511235 34603 280058 567256 350926 161623 388093 403336
529 403336 297153 147468 -789860 -1021953 -656833 -248826 -435049 -647436 -576508 -61960
519 -61960 325621 507288 -236427 -527289 -168990 -332720 -127771 -472500 -595641 -142577
509 -142577 -361222 -640658 -232243 -360768 -614263 -686097 -361611 -164083 273430 -207094
499 -207094 -39102 25355 -20823 -452141 109613 702551 156506 -381185 -662297 -431114
489 -431114 53931 -377175 -573201 -999636 -444735 -512131 -344222 -368960 -478900 -174662
479 -174662 474098 691840 63713 -234686 -47837 52133 -538977 -166595 -185157 21047
469 21047 -296637 -151304 -929396 -562294 -215363 -421375 -112751 444367 -19149 148706
459 148706 77049 35839 -96557 338577 159381 -480884 -167223 307487 425028 -233428
449 -233428 -289038 -544923 8785 -31586 -334980 5218 173507 667297 -122048 -407012
439 -407012 -225036 -462232 -530968 -513098 -792335 -350705 -360406 110442 -54705 247342 -424643
428 -424643 -1003245 -904964 -538669 519056 -9215 -467440 -1162592 -602696 -1184832 -1379905
418 -1379905 -494635 -499769 -19102 -392828 -348587 -288524 113357 -66968 -208158 -189864 -610665
407 -610665 -527008 -517036 -479300 -87253 300073 -526257 -985867 -958505 -787536 -640836 -447840
396 -447840 -202877 -669854 -280375 -182388 -109214 -176911 -541195 -525604 -596851 -848341 -230440
385 -230440 -8581 -452525 -876031 -919706 -390349 -284138 -442727 -504552 -446390 -636657
375 -636657 -1021216 -803753 -271349 -400305 -104752 -34446 -482127 -1097143 -1072573 -523944
365 -523944 -408052 -1215996 -771801 -413989 -207003 -430109 -289304 152873 -16334 28736
355 28736 -38692 281222 417627 281193 465159 -25857 -179358 150529 76756 174678 -149621
344 -149621 -330333 -202273 -437605 -272989 -592235 -388270 -620240 -588026 -406094 -210129
334 -210129 -394920 -184611 -246213 381303 -188957 -227882 -147348 -466442 -710614 -1122678
324 -1122678 -925099 -431257 -382874 -226187 -875248 -1037859 -393835 -876860 -1101488 -1011735
314 -1011735 -1285053 -752407 -76661 -368304 257933 -427760 -533279 -340350 -154497 71957
304 71957 -53523 -351103 -297224 -429931 -524674 -311797 -741932 -248715 -782700 -739445 -746439
293 -746439 -762253 43915 -447272 -229910 -243431 -109503 -76711 22438 -135061 -292284 -497638
282 -497638 -1058313 -731193 -503039 -784245 -659378 -981224 -1374948 -927181 -753190 -884486
272 -884486 -970419 -646358 -838568 -1230515 -609062 -995016 -777138 -136930 -180142 -641846
262 -641846 -243122 -770288 -1307463 -476712 -379159 -262662 373081 -433123 -612502 -846408
252 -846408 -732575 -994179 -991898 -223805 -440800 -717970 -481454 -427069 -668289 -1179701
242 -1179701 -518657 220755 262103 84088 102851 375580 -451477 -529759 -734559 -546337
232 -546337 101047 -317737 -315882 -282837 -116684 -494267 -732485 -575595 -640287 -529904 -483250
221 -483250 -238088 -431705 -233031 -362619 -685047 -913004 -1039725 -1127995 -801782 -288353
211 -288353 -506948 -352226 -199208 -816990 -976225 -724139 -644987 -747766 -771058 -1179642
201 -1179642 -501203 -400988 -542022 -141620 -254096 -442687 -666374 -102803 -181334 45085
191 45085 -413612 -639056 -150336 -95735 -130170 -626559 -572283 -630122 -426022 -485569 -475821
180 -475821 -586378 54685 -160770 -751217 -595733 -517862 -467245 -301497 -327337 -425402 -512431
169 -512431 -198935 -379464 -918995 -967561 -159382 165004 -220649 -415608 -512844 -705320
159 -705320 -851554 -132686 -183441 -640964 -298549 -33657 -202148 -298878 -735841 -559198
149 -559198 -780910 -106447 -150108 -541655 -420142 -406498 -674770 -879960 22632 -80420
139 -80420 -145171 -250580 -382945 -327217 -583584 -647998 -798027 -790507 -1043011 -1068863 -793806
128 -793806 -475485 91522 -133936 -150988 -521007 -387043 -91827 268836 76266 240600
118 240600 122655 -412662 -369988 -683056 -839345 -562430 -537633 -285267 -390230 -496307
108 -496307 -214261 -150919 -102466 -473429 -438574 -858661 -812775 -508607 -792377 -410619 -691798
97 -691798 -1033555 -717298 -1007650 -1134571 -1135786 -1008966 -999156 -733308 -535732 -219833 -1010045
86 -1010045 -1104769 -926525 -1058642 -835174 -360072 -321248 -685365 -903214 -783137 -524895
76 -524895 -288333 -201813 -190087 -377669 -395178 -466445 -171170 -399985 -501969 -237750 -274683
65 -274683 -643616 -873450 -554803 -982371 -748646 -526374 -828954 -608215 -411468 -149179
55 -149179 -10803 -426405 -566414 -683658 -387667 -490140 -971513 -949216 -857727 -1376470
45 -1376470 -800578 -718858 -717946 -743801 -652461 -646785 -573601 -357785 -392047 -354015 -299014 -421702
33 -421702 -464320 -359061 -125586 -288871 -237412 -66333 -320247 -385151 -344969 -604337 -1054545
22 -1054545 -1054507 -594925 -91394 -285125 -545355 -1000934 -804112 -737813 -565029 -463556 -628873
11 -628873 -432234 -512471 -928032 -541652 -83314 -225875 -166682 -395879 -669839 -638091 -588398
0 -588398
$$ Imaginary data points
##PAGE= N=2
##DATA TABLE= (X++(I..I)), XYDATA
16383 -5507884 -5351165 -5304788 -5031489 -5147023 -5182511 -4894676 -4745043 -4630698 -4588843 -4867399
16373 -4867399 -5027831 -4595446 -4115593 -4247904 -4220073 -3735612 -3591317 -3955022 -4043514 -4222211
16363 -4222211 -3898823 -3735876 -3571418 -3457454 -3406250 -3440499 -2941814 -2870064 -2842939 -2615792
16353 -2615792 -3012051 -3202863 -3226299 -2982867 -3191673 -2873208 -2154086 -2315276 -3011450 -3252038
16343 -3252038 -2800659 -2824394 -2701181 -2097651 -1566351 -1950295 -1907075 -1415797 -1033082 -1411011
16333 -1411011 -1465831 -1473516 -1273918 -1148169 -1147706 -1448171 -1139095 -624438 -793376 -699334 -485925
16322 -485925 -598305 -927641 -956211 -733402 -1029714 -339972 -126391 -303319 -166052 -127412
16312 -127412 209369 223141 380381 -260113 -213266 -329616 -45149 487410 125030 -265665
16302 -265665 -53886 -166422 18839 90696 746684 731901 914375 408012 312215 897399
16292 897399 1050822 689103 1468796 1237783 1200360 1346596 958210 1029603 1265135 1725220
16282 1725220 1434289 1095896 1483276 1514472 1750092 2344000 2312233 2002035 1897951 1740167
16272 1740167 2081182 2337395 2157155 2397541 2725263 2566453 1893646 1851685 1952103 2446541
16262 2446541 2441522 2538498 2679801 2909088 3129912 2174167 2331236 2910972 3058776 3414389
16252 3414389 3677425 2956066 3216068 3497257 3091411 3105569 3258744 3418827 3953005 4330270
16242 4330270 3964176 3560844 3429648 3003279 3087956 3545466 3423720 3087422 2864698 2894203
16232 2894203 3216478 3555934 4001260 4164829 3775183 3685129 4111213 4307851 3883390 4001199
16222 4001199 4008165 4624972 4161945 4406228 4317989 4250123 4387867 4805764 4645377 4921365
16212 4921365 5012964 4208540 4569197 5801471 5747611 5490927 4678482 5164194 5196489 4663948
16202 4663948 4816353 4609308 4728379 5262544 5561139 5870469 4905476 4701692 4765894 4389063
16192 4389063 4256994 4818454 5100249 5082934 5121555 5032617 4990581 5027260 4969723 4769603
16182 4769603 4874838 4786871 5205620 5617520 5434724 5305885 5374029 5501611 5421329 5013972
16172 5013972 4994253 5025235 5875914 5411797 5400483 5760890 5629114 5433824 5957544 5094358
16162 5094358 4925072 5486376 5218737 5377930 6218050 5898225 5382286 5100596 5418062
16153 5418062 5867956 6359758 5939035 5975331 6130483 6079246 6247347 6264872 6291578 6592611
16143 6592611 6806127 6042609 6110879 5978752 5987966 5995794 6405784 6473429 5808051 5306338
16133 5306338 5349055 6089149 5974665 6104405 6015146 6462648 6295452 6187866 6258364 5665471
16123 5665471 5918138 6387953 6164818 5865871 6653042 6514744 6332225 5740221 6191446
16114 6191446 6840503 7002777 6707009 5765988 6274228 6000969 5865716 6548370 6523871 6794356
16104 6794356 6500334 6883882 6888794 6586174 6664414 6523900 6305213 6182378 5715987 5590361
16094 5590361 6337418 5978691 5883038 5864794 5822915 6155392 6341708 6456339 5818515 6056249
16084 6056249 6899551 6120011 5859920 6430884 6541758 5940166 5855788 6141254 6774386 6203644
16074 6203644 6303853 6363477 6849085 6616753 6530427 6367409 5687309 5748967 5829137 7064700
16064 7064700 6878978 6640788 6607394 6036033 6450577 6244125 6412230 6823433 6403479 6900202
16054 6900202 6815771 6629190 6766569 7030629 6334978 6382336 5960645 6063936 6158780 6289045
16044 6289045 7179487 6539512 6716090 6988839 6313795 6534688 6781381 6283906 5796621
16035 5796621 6306341 6556957 6527527 6491010 6208867 5769469 6337364 6624835 6542229 6737130
16025 6737130 6606689 6253184 6123888 6359328 6735699 6267632 6617612 6509761 6181391
16016 6181391 6280908 6664387 6977693 6594938 6216039 5521478 5801292 6289266 6214501 6375221
16006 6375221 6450920 5877171 5784505 6035785 6520441 6648793 7079304 6664267 6637031 6938183
15996 6938183 6563734 6110317 6112790 6469720 6237649 6136485 6060641 6035395 6344759 6122215
15986 6122215 6970207 6745011 6070004 5894456 5533263 5980207 5647218 6290055 6879693
15977 6879693 6862808 6348700 6596326 6482465 6351254 6953960 6393493 6256843 6553576 6259380
15967 6259380 6188616 6917394 6514905 6035963 6025524 5992780 6109104 5950594 6069461 6670762
15957 6670762 6750972 6555360 6304170 5867758 6377041 6423261 6150959 6902398 6767789 6777526
15947 6777526 5736341 5654925 6000120 6277512 6146413 6661032 6311035 6453842 6630911
15938 6630911 6716626 6780048 6001050 6068596 6413257 6550814 6988809 7598617 7619488 6935082
15928 6935082 6821365 7038729 7105831 6985170 6314456 6183473 5932217 6392024 6429910 7475348
15918 7475348 6494821 6713585 6326527 6024749 6149087 6002352 6201382 6709750 6776316 6438842
15908 6438842 6460094 6821333 6417667 7023508 7309861 6794811 6985229 6511661 6578560 6313982
15898 6313982 6964829 7122769 6375211 6478874 6828252 6902347 6627231 5901455 6238603 6491220
15888 6491220 6406434 6664759 6750145 6776490 6580849 6238948 6098153 6455568 6252628 6889141
15878 6889141 6863388 6429266 6461592 6240995 6789063 6481258 7008391 6388925 6581749 6564870
15868 6564870 6058519 6493036 6493263 6323517 6629946 6736225 7046402 6922222 6973613 7076840
15858 7076840 6440605 6801304 6860972 7146615 6824902 6449800 6380590 6713857 7022370 7017812
15848 7017812 6568804 6788619 6684676 6330900 7068591 7722318 7174953 6318307 5981941
15839 5981941 6410106 6219385 6023912 6462890 6483982 6963976 7087579 7139854 6724458 7005273
15829 7005273 6210799 6476954 6267183 5283479 6000271 6359867 7066429 7181575 6306170
15820 6306170 6596908 6811087 6314648 6604280 6676513 6231325 6240764 6020944 6073721 6363034
15810 6363034 7064470 7279089 6648276 6198293 6305951 6743823 6927234 6626342 6592726 7395079
15800 7395079 6415760 6271425 6195652 6392417 6826661 6857586 6956125 6606477 7088784 7152316
15790 7152316 6673441 7057788 6909660 6693707 7127434 6364549 6273451 6306844 6388931 6620520
15780 6620520 6511746 6475685 6455059 6141012 6288065 5813190 5921191 6191412 6456670 6723199
15770 6723199 6655901 7061693 7082859 7326386 7625773 7022380 7214128 7139634 6824668 6778971
15760 6778971 6766802 7166068 7010225 6490463 6774283 7551174 6852214 6608425 6681208 6976831
15750 6976831 6876155 6527262 6393459 7302355 7368633 6428002 6595578 7474931 7255777 7342341
15740 7342341 7316582 7014745 6555011 6403767 6836984 7289186 7270674 6518836 6587702 6638223
15730 6638223 6339078 6276962 6604060 6106585 6194423 6405195 6713101 6792505 6347706 6804664
15720 6804664 6482364 6846448 6847281 6533136 6999518 6910390 6789796 7039682 7223799 7582854
15710 7582854 6949032 6617380 6613042 6259674 6803287 6515254 6945455 7389950 7330929 6945058
15700 6945058 6281954 6647089 6529427 7029029 6636893 6519660 6229225 6583193 7638164
15691 7638164 7129862 6529080 6732367 6634694 6927957 7092113 6806446 6651423 7134592 6876072
15681 6876072 6170581 6284905 6176841 6164563 6831898 6580396 6863450 7502347 6884301 7060731
15671 7060731 7345691 6824585 6636217 6491721 6118168 6716042 6322172 6385385 6295094 6443733
15661 6443733 6740982 7117054 7095136 7044448 7253648 7045470 7367313 7708874 7087424 7083916
15651 7083916 6445534 5869271 6094400 6190227 5814329 6565343 6435503 6555819 7264265 7275267
15641 7275267 6517557 6293997 6711966 6982740 6391674 6064551 6333046 6134956 6400383
15632 6400383 6668518 6834811 6745880 7058712 7209072 7348411 7251155 7268784 7828688 6961837
15622 6961837 7355699 7233626 7036311 6468349 6521899 6974413 6382997 6236747 6409968 6516869
15612 6516869 6891248 6913027 6413206 6643821 6864169 7224931 6931310 6772057 6301780 6378558
15602 6378558 6179797 6374623 6511439 6585469 6457099 6708783 6482875 6145988 6101597 6047953
15592 6047953 6154219 6542259 6736954 6466472 6138404 6530463 6762703 6390687 6134865
15583 6134865 6133696 6645429 7194601 7299491 6695445 6422111 6393099 6507845 6768905 6339762
15573 6339762 7048362 7280816 7033092 6857837 6555614 6563667 6650211 6764072 6374696 6773515
15563 6773515 6804900 7100083 6884215 6555197 7194058 6361964 6715540 6602947 6243229 6056589
15553 6056589 6428232 6880292 7273589 7391857 7047414 6859487 6730842 6298595 6244424 6802416
15543 6802416 6792941 6286994 6079049 6073192 6476471 6448586 6482719 6813353 6864576 7026669 7413454
15532 7413454 7314582 6935040 7032592 7094973 6623272 6368966 6701991 7211772 6976395 6666263
15522 6666263 7378757 7124610 6424290 6451308 6544092 6394330 6562324 7058832 7169787 7236946
15512 7236946 7243183 6905952 6340369 6361006 6698313 7002250 7582492 7258435 7145159 7251423
15502 7251423 7059496 6825922 6361563 6438806 7164939 6965560 6930010 6742759 7469489 7680248
15492 7680248 7871116 7775784 7384780 6435304 6625946 6514596 6189222 5971445 5960786 6020849
15482 6020849 6836735 7159033 7023138 7193051 6644703 6662329 6766597 6840227 7356578 7156338
15472 7156338 6788135 6245835 6965318 7265938 6996688 7248870 6693150 6825001 7186618
15463 7186618 7223249 7064944 6999086 7553459 7579022 7323244 7406148 6904382 7173611 7877931
15453 7877931 6909977 7288858 7165026 6913607 7125770 6612197 6688133 6699129 6767346 6090078
15443 6090078 6315807 6235512 6362746 5861092 6197336 6383040 6598949 6297444 6351777 6615539
15433 6615539 6811174 7105368 6613854 6458640 6319005 7057392 6623716 6811350 7312456
15424 7312456 7523821 7434999 7086044 6989759 6811634 6990970 6335207 6665322 6345267 6943577
15414 6943577 7597275 7664228 7241266 7090807 6973106 7187141 7385167 6604372 6583758 6933092
15404 6933092 6991579 7746083 7608428 7498589 7097000 7417757 7393971 7238635 6954267 6916184
15394 6916184 6356091 6260626 7299836 6335702 6238201 7218729 7535171 7005127 6917842 6662891
15384 6662891 7021402 7877466 8439678 7328276 7246979 7342047 7195290 7193598 6723208 6736742
15374 6736742 7356909 7405339 7665725 7085588 6875160 6999526 6979606 7298195 6872745 6919819
15364 6919819 7029511 7255905 7417628 7270848 7186349 7206486 6843607 6735381 6652872 6337378
15354 6337378 6593840 6548522 6398698 6864779 7088095 6835644 6348480 6871548 6861548 6221967
15344 6221967 6133489 7241739 7814010 7426073 6956789 6831691 7199683 6677495 6207359
15335 6207359 6085758 6933484 7503389 7088492 7529149 7504776 6689329 6674151 7389932 7400092
15325 7400092 7160814 7458214 7046467 7335554 7097490 7162208 6985793 7220011 7449552 6567341
15315 6567341 7348407 7451465 7013676 6485940 7040644 8122514 7810884 7322428 6750024
15306 6750024 6840629 6837601 6612186 6821186 6525881 6648848 7022522 6413086 6758572 7259379
15296 7259379 7166907 7190437 7553270 7737994 7164173 7136971 7161050 6873326 7270592 7626186
15286 7626186 7167639 7210966 7365824 6602454 6973463 7321562 7105736 7221582 6831115 6570656
15276 6570656 6855180 6745332 6546009 7281326 7020446 7138883 7318323 7201305 7602876
15267 7602876 7413758 6749035 6908704 6642834 6013982 6695166 6885746 6881336 7035227 7028304
15257 7028304 7577438 7229236 6878074 6423067 7032040 7027535 6974315 7234916 7090465 7542815
15247 7542815 7436195 7656932 7516188 6981749 6669909 6880841 6633274 7304032 7308093 7397510
15237 7397510 6694472 6496728 7033346 7811814 7481835 7419551 7935725 7257465 6475211 6978980
15227 6978980 7131717 6977064 7135797 7107518 7121358 6206893 6102074 6709101 7128565 7542304
15217 7542304 6450755 6405787 6245733 6470004 7285514 6911294 7035619 7616029 7643327 7305092
15207 7305092 7286431 7326634 7352196 7419493 8036315 7270193 6764113 6459748 6861055 6906898
15197 6906898 7406164 7844685 7347819 7294841 7024392 6591156 6505347 6743572 8164500 7942068
15187 7942068 7156524 6784655 6843524 7088238 6863794 7359919 7269668 7193906 7072499 7312385
15177 7312385 7212189 7387070 7510647 7454938 8342354 7709169 7410868 7006791 7286349 7517065
15167 7517065 7544708 6732228 6258149 6879768 6918197 7377691 7143214 7098008 6865048 6111011
15157 6111011 6294076 6938468 6825273 6256318 6712431 6643304 6782624 7216741 6500851 6359649
15147 6359649 7126506 7130924 6840718 6671141 6960063 7155691 7318040 7175459 6788526 6986894
15137 6986894 7179223 7175013 7657677 7594706 6902781 6644188 6810803 6543791 6634642 6777364
15127 6777364 6591049 7445761 7711185 7642643 7741619 7569075 7031448 6849649 7314826 7160517
15117 7160517 7199709 6795682 6598361 6777368 7464983 7721855 7572820 7225142 7873552 7448057
15107 7448057 6413571 6686155 7066288 7262425 6942960 6999168 7308758 7154773 7008522
15098 7008522 7053162 7395078 7832215 7448501 7843734 7189342 7576870 7529238 7706291 7235912
15088 7235912 7015437 7172859 7463509 7529502 6481650 6577561 6695136 6538099 6499336 6210982
15078 6210982 7287985 7027762 7271560 6935363 6971464 7420957 7521357 7256830 6839705
15069 6839705 7163629 7883404 7772489 6878966 7141839 7499945 7262488 7020077 6630245
15060 6630245 6567501 7262110 7217556 7557436 7266533 7088567 7080675 7307285 7162942 6987482
15050 6987482 7345026 7103720 7539764 6911318 6921721 7155230 7014560 6766962 6804559 6972697
15040 6972697 6943743 7512427 8108275 8379005 8047036 7830099 8100471 7595959 7442444 7011386
15030 7011386 6605824 7078220 7287679 7041166 7557875 7380139 6879631 7205155 7331333
15021 7331333 7543277 7419533 6893480 7073864 7406181 7014549 6813222 6958600 6629575
15012 6629575 7038127 7187850 6908420 7000438 6944112 7386672 6957317 6981851 7033936 7177084
15002 7177084 7626181 7567413 6808816 7122289 7023395 7007510 6558656 7047761 6659025 6912623
14992 6912623 7317433 7630161 7146497 6724254 7343336 7300729 7516644 7548470 7376270 7975877
14982 7975877 8223782 7514415 6517753 6608550 6879343 6777653 6784733 7573330 7432450 7444292
14972 7444292 7375958 7623537 7690858 7097795 7390593 7581246 7954081 7919322 7175754 6829736
14962 6829736 6583087 6533186 6978423 7285989 7328184 7614162 7203083 7234990 7037290 6627394
14952 6627394 6374745 6847034 7315800 7299704 7489459 7276797 7245549 7132739 7321415 7411254
14942 7411254 6921661 6585631 7258565 7220700 6995046 6912740 6575870 6590359 6603691 6536747
14932 6536747 6829023 6502084 7122457 7642535 7812189 7020090 6934024 7868317 8135444 7739648
14922 7739648 6797278 6493986 6910318 7265892 7125610 7155725 7559691 7839968 7889962 7281359
14912 7281359 6764119 7218253 6898976 6960941 6658394 6163846 6442704 7046072 7725022 7876122
14902 7876122 7580513 7327513 7786479 7076647 6865946 7141844 6915194 6751006 7191738
14893 7191738 6895204 7406284 7203168 7639402 7037433 6848205 7057743 6660977 6604545 7138078
14883 7138078 7488824 7135079 6657226 7547300 7433606 6996794 6845542 6888739 7458679 8066664
14873 8066664 7911016 7537643 8068996 7953831 7570931 7334967 6754070 7308694 7782531
14864 7782531 7261126 7287314 7219243 7270275 7214763 7423051 6956032 7224199 7168602 7748146
14854 7748146 7451133 7415969 6992232 6879533 6908279 7616096 7629305 7529652 7077564 7182798
14844 7182798 7709959 6991429 7236439 7394391 7808089 7322694 7457862 8238772 7846722
14835 7846722 7464740 7471281 7605289 7720074 7199970 7027173 7374710 7870148 7581905 7846812
14825 7846812 7831437 7280491 7191804 7099728 7341653 7599068 7420578 7345467 7496636 7383845
14815 7383845 7123479 7553018 7438986 7296701 7285807 7132049 7510860 7397325 7138835 6773443
14805 6773443 6945285 7081908 7212208 7505692 7816560 7821754 7377900 7142351 6884126 7288391
14795 7288391 6634132 6751900 7534330 7341596 6916575 7237163 7206358 7333739 7717903 7409487
14785 7409487 7544164 7908742 8067350 7650480 7173159 7208974 7045121 6961661 7865132 7394003
14775 7394003 7201665 7237773 7614833 7139049 7108542 7078497 7579228 7682995 7880292 7716729
14765 7716729 6832043 7045897 7249724 7097726 6709477 6605581 7363548 7509763 7625981
14756 7625981 7476931 6879585 6976959 7298642 7149317 7024601 7622600 6928532 6891489 6849162
14746 6849162 6927082 7572318 7074536 7447750 7635836 7674631 7735350 7989846 7525336 7541793
14736 7541793 7707877 7261213 7499634 7658158 7896433 7842498 7343674 7025132 7395639 6990673
14726 6990673 6951783 7624020 8413796 7735639 7635633 7373158 7328706 7329912 7537043 7236272
14716 7236272 7442642 7796062 7624740 7731398 7202753 7884737 7715728 8249630 8176707 7800195
14706 7800195 7382068 7422814 6906605 6971062 7394794 6783203 7020875 7605125 7986652 7675497
14696 7675497 7558125 7757261 8440114 8100447 7467427 7457639 7497987 7279376 7155719 7259583
14686 7259583 7302368 7369045 6823291 7069240 7424268 7586725 7594756 7434239 7576990 8077318
14676 8077318 7869358 7499272 7278043 7095558 7391430 7071259 7184249 7156505 7201848 7517463
14666 7517463 7778795 7571483 7205265 8072210 7425445 7377928 8233839 7685800 6865018 6835269
14656 6835269 6724568 6849915 7636464 7462643 7228162 7115113 7011069 6966722 7725288 7151734
14646 7151734 7140896 7401605 7205669 7082375 7044244 7051909 7159103 7463829 8126388 7797739
14636 7797739 7743150 7946883 7379685 6883267 7582752 7335229 7200311 6709487 7063498 7013076
14626 7013076 6734412 6875158 7244190 7169661 7497509 7307801 7645376 7193383 7076436 7461142
14616 7461142 7181073 7769796 7820049 8267018 7982271 7670608 7792335 7752206 7887103 7564775
14606 7564775 6940242 7388086 7601588 8060516 7910657 7343531 7564792 7492227 7796271 7906804
14596 7906804 7626756 7659441 7659173 7839337 7474633 7533386 7325096 7210164 7665536 7614628
14586 7614628 7046600 7049440 6928604 7000008 7662872 8070566 7910135 7788916 7457204 7862552
14576 7862552 7356501 7698602 8099299 7478141 7012550 7442384 7512566 8047428 7963817 7480448
14566 7480448 7790884 8014374 7874894 8055670 8022985 7727745 7465232 7095200 6818609 7411546
14556 7411546 7552710 7997048 7747305 7732165 7722610 7928063 8177966 7754444 6884911 7235226
14546 7235226 8120275 7437753 7447523 7657527 7690740 7550901 7247236 7577186 8287706 8164465
14536 8164465 7765119 7197137 7082189 7232624 7296602 6962685 7549926 7873728 7579436 7968989
14526 7968989 7696062 7373334 7176629 7376767 7616478 7753883 7086530 6547905 7460160
14517 7460160 8027225 7848177 8527959 8288473 7549468 7790815 7722312 7404046 7467737 7726796
14507 7726796 7640934 7502535 8090671 8464116 7851727 8049623 7395954 7272840 7465055 7201292
14497 7201292 7051682 6939651 7237688 7706308 7476759 7468555 7255522 7528218 8056841 7500887
14487 7500887 7926291 7928937 7707417 7373417 7154605 6955899 6906617 7245315 7372677 7355115
14477 7355115 6971243 6714469 6556430 7312185 7420499 7487206 7441979 7483535 7727719 7686424
14467 7686424 8184674 8229774 7480001 7246390 7775980 7715541 7497700 7648630 7532206 7631928
14457 7631928 7725344 8266628 8187260 7549362 7893570 7260166 7715575 8704932 8750065 8279756
14447 8279756 7834218 8066723 7770644 7711894 7369904 7417262 7306365 7316134 7338897 6925233
14437 6925233 7144608 7808765 7007910 6906784 7050514 7230064 7665512 7443825 6736320
14428 6736320 7004917 7000125 6935983 7052019 7601168 7595947 7671597 8563670 8095198 7615335
14418 7615335 7189380 7726219 8165352 7534955 6884236 7549042 8505035 8182479 8135520 8002913
14408 8002913 7706138 7349876 7298287 7617646 7523128 7321470 7903414 7731119 7905545 7519836
14398 7519836 8022101 7973173 8067712 8150795 7799691 7776270 7731125 8101127 7461125 7592969
14388 7592969 7592852 7690314 8014419 8050971 8116848 8262346 7849267 7421097 7961321 8016864 7360304
14377 7360304 7722788 7779096 7460977 6833575 6979659 7065098 7530350 7945454 8177479 7808060
14367 7808060 7975290 8220448 8473706 7820128 7575243 7659078 7259373 7220600 7650637 7092451
14357 7092451 7516569 8114395 7935293 8033444 7916962 7896873 6837888 6934422 7450571 7903100
14347 7903100 8230270 7823807 7499002 7425936 7258456 7269319 7856274 7719355 7415098 7737227
14337 7737227 8169783 7663743 7571492 8419819 8091388 7606838 8287070 8636848 7354508
14328 7354508 7501103 7858251 7323802 7242236 6654196 7666756 7608642 7109751 7960216 7975475
14318 7975475 7783280 7836832 7809170 8237683 8012185 7742299 7675375 7247809 7412113 7389518
14308 7389518 7907939 8304019 7875897 8069717 7674838 8065446 8500845 8415913 8056757 7886652
$$ [...]
##END NTUPLES=NMR SPECTRUM
##END=
