##TITLE=1H_CA-91B1-32
 CDCl3
 8 sc, 
 1.8.2023
##JCAMPDX= 6.0         $$ Bruker NMR JCAMP-DX V2.0
##DATA TYPE= NMR SPECTRUM
##DATA CLASS= NTUPLES
##ORIGIN= UXNMR, Bruker Analytische Messtechnik GmbH
##OWNER= root
$$ XWIN-NMR		Version 3.5
$$ Wed Aug  2 13:58:48 2023 Russian Standard Time (UT+4h)  she@DPX200
##.OBSERVE FREQUENCY= 200.13135
##.OBSERVE NUCLEUS= ^1H
##.ACQUISITION MODE= SIMULTANEOUS
##.ACQUISITION SCHEME= undefined
##.AVERAGES= 8
##.DIGITISER RES= 18
##SPECTROMETER/DATA SYSTEM= spect
##.PULSE SEQUENCE= zg30
##.SOLVENT NAME= D2O
##.SHIFT REFERENCE= (INTERNAL, D2O, 0, 15.726)
##AUDIT TRAIL= $$ (NUMBER, WHEN, WHO, WHERE, WHAT)
$$ ##TITLE= Audit trail, XWIN-NMR		Version 3.5
$$ ##JCAMPDX= 5.01
$$ ##ORIGIN= Bruker BioSpin GmbH
$$ ##OWNER= she
$$ F:/spectra/data/she/nmr/H-F/1/pdata/1/auditp.txt
$$ ##AUDIT TRAIL=  $$ (NUMBER, WHEN, WHO, WHERE, WHAT)
(   1,<2023-08-02 13:57:39.46 +0400>,<she>,<DPX200>,
      <created by zg, POWCHK disabled, PULCHK disabled
       configuration hash MD5:
       00 E9 B6 7A A2 85 ED C7 34 08 36 98 17 FE 4E 26
       data hash MD5: 16K
       5F B3 A0 4C 85 1F 2C 1D B0 8B 19 78 EF 1F 40 64>)
(   2,<2023-08-02 13:57:41.65 +0400>,<she>,<DPX200>,
      <Start of raw data processing
       efp BC_mod = 2 LB = 0.24 FT_mod = 6 PKNL = 1 PHC0 = -21039.12 PHC1 = 10.05272 SI = 16K 
       data hash MD5: 16K
       66 25 CB E1 2F 83 96 5B DD 38 25 8E 03 BB BF 05>)
(   3,<2023-08-02 13:57:59.43 +0400>,<she>,<DPX200>,
      <pk PHC0 = -160.1056 PHC1 = 4.4 
       data hash MD5: 16K
       DF 3A 10 57 09 E4 70 7A 92 36 86 34 A8 DA 51 7C>)
(   4,<2023-08-02 13:58:03.01 +0400>,<she>,<DPX200>,
      <abs ABSG = 5 
       data hash MD5: 16K
       C3 C1 08 94 B3 02 94 EF 85 E0 19 81 3D 7B 6B 10>)
$$ ##END=
$$ 
$$ hash MD5
$$ 17 3D 26 CC BB 2A 38 BD 70 B1 AC 63 AC 74 7A B9
##$RELAX= 
##$RELAX= 
##$RELAX= 
##$RELAX= 
##$RELAX= 
##$RELAX= 
$$ Bruker specific parameters
$$ --------------------------
##$DU= <F:/spectra>
##$EXPNO= 1
##$NAME= <H-F>
##$PROCNO= 1
##$TYPE= <nmr>
##$USER= <she>
##$AMP= (0..31)
100 100 100 100 100 100 100 100 100 100 100 100 100 100 100 100 100 100 
100 100 100 100 100 100 100 100 100 100 100 100 100 100 
##$AQSEQ= 0
##$AQ_mod= 1
##$AUNM= <au_zg>
##$AUTOPOS= <>
##$BF1= 200.13
##$BF2= 200.13
##$BF3= 200.13
##$BF4= 200.13
##$BF5= 200.13
##$BF6= 200.13
##$BF7= 200.13
##$BF8= 200.13
##$BYTORDA= 1
##$CFDGTYP= 0
##$CFRGTYP= 5
##$CHEMSTR= <none>
##$CNST= (0..31)
1 1 145 1 1 1 1 1 1 1 1 1 1 1 1 1 1 1 1 1 1 1 1 1 1 1 1 1 1 1 1 1 
##$CPDPRG= <>
##$CPDPRG1= <>
##$CPDPRG2= <>
##$CPDPRG3= <>
##$CPDPRG4= <mlev>
##$CPDPRG5= <mlev>
##$CPDPRG6= <mlev>
##$CPDPRG7= <mlev>
##$CPDPRG8= <mlev>
##$CPDPRGB= <>
##$CPDPRGT= <>
##$D= (0..31)
0 1.2 0 0 0 0 0 0 0 0.06 0 0.03 0 0 0 0 0.0002 0 0 0 0 0 0 0 0 0 0 0 0 
0 0 0 
##$DATE= 1690970258
##$DBL= (0..7)
120 120 120 120 120 120 120 120 
##$DBP= (0..7)
150 150 150 150 150 150 150 150 
##$DBP07= 0
##$DBPNAM0= <>
##$DBPNAM1= <>
##$DBPNAM2= <>
##$DBPNAM3= <>
##$DBPNAM4= <>
##$DBPNAM5= <>
$$ [...]
##$SUBNAM3= <"">
##$SUBNAM4= <"">
##$SUBNAM5= <"">
##$SUBNAM6= <"">
##$SUBNAM7= <"">
##$SUBNAM8= <"">
##$SUBNAM9= <"">
##$SW= 18.05172834244
##$SWIBOX= (0..15)
0 0 2 0 0 0 0 0 0 0 0 0 0 0 0 0 
##$SW_h= 3612.71676300578
##$TD= 16384
##$TD0= 1
##$TE= 0
##$TE2= 300
##$TE3= 300
##$TEG= 300
##$TL= (0..7)
0 120 120 120 120 120 120 120 
##$TP= (0..7)
150 150 150 150 150 150 150 150 
##$TP07= 0
##$TPNAME0= <>
##$TPNAME1= <>
##$TPNAME2= <>
##$TPNAME3= <>
##$TPNAME4= <>
##$TPNAME5= <>
##$TPNAME6= <>
##$TPNAME7= <>
##$TPOAL= (0..7)
0.5 0.5 0.5 0.5 0.5 0.5 0.5 0.5 
##$TPOFFS= (0..7)
0 0 0 0 0 0 0 0 
##$TUNHIN= 0
##$TUNHOUT= 0
##$TUNXOUT= 0
##$USERA1= <user>
##$USERA2= <user>
##$USERA3= <user>
##$USERA4= <user>
##$USERA5= <user>
##$V9= 5
##$VALIST= <valist>
##$VCLIST= <CCCCCCCCCCCCCCC>
##$VD= 0
##$VDLIST= <DDDDDDDDDDDDDDD>
##$VPLIST= <PPPPPPPPPPPPPPP>
##$VTLIST= <TTTTTTTTTTTTTTT>
##$WBST= 1024
##$WBSW= 4
##$XGAIN= (0..3)
0 0 0 0 
##$XL= 0
##$YL= 0
##$YMAX_a= 284007
##$YMIN_a= -173359
##$ZGOPTNS= <>
##$ZL1= 120
##$ZL2= 120
##$ZL3= 120
##$ZL4= 120
##$ABSF1= 15.73807
##$ABSF2= -2.31378
##$ABSG= 5
##$ABSL= 3
##$ALPHA= 0
##$AQORDER= 0
##$ASSFAC= 0
##$ASSFACI= 0
##$ASSFACX= 0
##$ASSWID= 0
##$AUNMP= <proc_1d>
##$AZFE= 0.1
##$AZFW= 0.1
##$BCFW= 0
##$BC_mod= 2
##$BYTORDP= 0
##$COROFFS= 0
##$CY= -3
##$DATMOD= 1
##$DC= 0
##$DFILT= <>
##$DTYPP= 0
##$F1P= 0
##$F2P= 0
##$FCOR= 1
##$FTSIZE= 16384
##$FT_mod= 6
##$GAMMA= 0
##$GB= 0
##$INTBC= 1
##$INTSCL= 3.70164e-10
##$ISEN= 128
##$LB= 0.24
##$LEV0= 0
##$LPBIN= 0
##$MAXI= 10000
##$MC2= 0
##$MEAN= 0
##$ME_mod= 0
##$MI= 1.114404
##$NCOEF= 0
##$NC_proc= -8
##$NLEV= 6
##$NOISF1= 3.799351
##$NOISF2= 2.8
##$NSP= 0
##$NTH_PI= 0
##$NZP= 0
##$OFFSET= 15.72596
##$PC= 1
##$PHC0= -21199.22
##$PHC1= 14.45272
##$PH_mod= 1
##$PKNL= yes
##$PPARMOD= 0
##$PSCAL= 0
##$PSIGN= 0
##$REVERSE= no
##$SF= 200.130009122584
##$SI= 16384
##$SIGF1= 3
##$SIGF2= 2
##$SINO= 5.538805
##$SIOLD= 16384
##$SREGLST= <1H.CDCl3>
##$SSB= 0
##$STSI= 16384
##$STSR= 0
##$SW_p= 3612.71676300578
##$SYMM= 0
##$S_DEV= 0
##$TDeff= 16384
##$TDoff= 0
##$TI= <>
##$TILT= no
##$TM1= 0
##$TM2= 0
##$TOPLEV= 0
##$USERP1= <user>
##$USERP2= <user>
##$USERP3= <user>
##$USERP4= <user>
##$USERP5= <user>
##$WDW= 1
##$XDIM= 16384
##$YMAX_p= 350244091
##$YMIN_p= -938917
$$ End of Bruker specific parameters
$$ ---------------------------------
##NTUPLES= NMR SPECTRUM
##VAR_NAME=  FREQUENCY,     SPECTRUM/REAL,   SPECTRUM/IMAG
##SYMBOL=    X,             R,               I
##VAR_TYPE=  INDEPENDENT,   DEPENDENT,       DEPENDENT
##VAR_FORM=  AFFN,          ASDF,            ASDF
##VAR_DIM=   16384,         16384,           16384
##UNITS=     HZ,            ARBITRARY UNITS, ARBITRARY UNITS
##FACTOR=    0.220516191357247, 1,           1
##FIRST=     3147.23647379891, 0,            0
##LAST=      -465.480289206867, 0,           0
##MIN=       -465.480289206867, -938917,     0
##MAX=       3147.23647379891, 350244091,    0
$$ Real data points
##PAGE= N=1
##DATA TABLE= (X++(R..R)), XYDATA
$$ [...]
5570G621329R7345j16311l1130K31848J42355J98288r8140R5240o3563J18403
$$ 7621329 7718674 7602363 7571233 7803081 7945436 8143724 8045584 8140824 8077261 8195664
5560H195664J56117M7161j10809L45822J16879J82671R0601P2773J08368N6503
$$ 8195664 8351781 8398942 8288133 8633955 8750834 8933505 9024106 9096879 9205247 9261750
5550I261750L2587K31587j57171J86307m2569L49169K11484O2983J32518J03027
$$ 9261750 9294337 9525924 9368753 9555060 9512491 9861660 10073144 10136127 10268645 10371672
5540A0371672J35055K74930J63737J9670M4458m7586k0756L49451J90698j40588
$$ 10371672 10506727 10781657 10945394 10965064 11009522 10961936 10941180 11290631 11481329 11340741
5530A1340741J07627K17390K15371J72083K11505j51270J30264j38634K23069
$$ 11340741 11448368 11665758 11881129 12053212 12264717 12113447 12243711 12105077 12328146
5521A2328146J50222J24310Q637K7898K14473L95966M64136J21570j49947R8756
$$ 12328146 12478368 12602678 12611315 12639213 12853686 13249652 13713788 13835358 13685411 13784167
5511A3784167J84208M07238J38338j39857J62548M12628L5776M8185J26007K11505
$$ 13784167 13968375 14375613 14513951 14374094 14536642 14949270 14985046 15033231 15159238 15370743
5501A5370743P6443K71478N37683J24035O1938J63591R6520R0013L59973L52042
$$ 15370743 15447186 15718664 16256347 16380382 16442320 16605911 16702431 16792444 17152417 17504459
5491A7504459J97923L64456J62114M90633m2426L88679M31959L95444N19131L45785
$$ 17504459 17702382 18066838 18228952 18719585 18677159 19065838 19497797 19893241 20412372 20758157
5481B0758157L34938N52035N00295O36218O37824Q38242N81828M66353N48176
$$ 20758157 21093095 21645130 22145425 22781643 23419467 24257709 24839537 25305890 25854066
5472B5854066Q48878Q46135P15325J078050J242392J246138J548261J636665J861705
$$ 25854066 26702944 27549079 28264404 29342454 30584846 31830984 33379245 35015910 36877615
5463C6877615K039229K557480K900755L090385L606519L629840M379905M538650
$$ 36877615 38916844 41474324 44375079 47465464 51071983 54701823 59081728 63620378
5455F3620378M428387M323744M546330M293615M062451L454319J954139p2828
$$ 63620378 68048765 72372509 76918839 81212454 85274905 88729224 90683363 90610535
5447I0610535j446113k779950l850346m794500n146057n245866m850897m669711
$$ 90610535 89164422 86384472 82534126 77739626 72593569 67347703 62496806 57827095
5439E7827095m209540m294231l564314l237521k969296k278802j915059j604627
$$ 57827095 53617555 49323324 45759010 42521489 39552193 37273391 35358332 33753705
5431C3753705j336727j117085j102120r70936o98972m40929m03480l59864k80396
$$ 33753705 32416978 31299893 30197773 29226837 28527865 28086936 27683456 27323592 27043196
5422B7043196k46083n234j40840k49416j99844o718l48168o373J51829k70915
$$ 27043196 26797113 26791879 26651039 26401623 26201779 26195061 25846893 25840520 25992349 25721434
5412B5721434j96126j59002l65260k62976l68111r4062p4134m48965n07325o41097
$$ 25721434 25525308 25366306 25001046 24738070 24369959 24275897 24201763 23752798 23245473 22604376
5402B2604376j55375k86092o94369n57992m78973n42691o97537l42270j28433
$$ 22604376 22449001 22162909 21468540 20910548 20431575 19888884 19191347 18849077 18720644
5393A8720644l02872j05114j15606M4319r9562j12530k14702j15151p2998m4362
$$ 18720644 18417772 18312658 18197052 18241371 18141809 18029279 17814577 17699426 17626428 17582066
5383A7582066L59976j6758q4170J72537J28031O6429J63903q4502j32988O5072
$$ 17582066 17942042 17925284 17841114 18013651 18141682 18208111 18372014 18287512 18154524 18219596
5373A8219596k42922k06020m12045j49967k38190o11526m35343K0988l59417l53152
$$ 18219596 17976674 17770654 17358609 17208642 16970452 16358926 15923583 15944571 15585154 15232002
5363A5232002j25329l59705J946j11218l99438m1204k33110r9705l06274M995
$$ 15232002 15106673 14746968 14748914 14637696 14238258 14197054 13963944 13864239 13557965 13562960
5353A3562960M9814j31969j78945J58810J70560j90054J20929o3077l25550P8457
$$ 13562960 13612774 13480805 13301860 13460670 13631230 13441176 13562105 13499028 13173478 13251935
5343A3251935J2682J02741K08928K16181J44268J6879L269L09518j77868k06531
$$ 13251935 13264617 13367358 13576286 13792467 13936735 13953614 13956883 14266401 14088533 13882002
5333A3882002K04316J24474j23975k43829j60744j87112m77876l81902J05843
$$ 13882002 14086318 14210792 14086817 13842988 13682244 13495132 13017256 12635354 12741197
5324A2741197j63717J70347L41722l9288J53069K29590M16487L89385R7530K36919
$$ 12741197 12577480 12747827 13089549 13050261 13203330 13432920 13849407 14238792 14336322 14573241
5314A4573241J40364k36832r8232j33835p3068J9220O1788j2013r0229J7622k44685
$$ 14573241 14713605 14476773 14378541 14244706 14171638 14190858 14252646 14240633 14150404 14168026 13923341
5303A3923341k27674n1275j56220k90529Q1059N3862k37549P2407l34813l59191
$$ 13923341 13695667 13644392 13488172 13197643 13278702 13332564 13095015 13167422 12832609 12473418
5293A2473418j1956m15206l07528m58607j5101m73131n7115k1739j39871m4416
$$ 12473418 12461462 12046256 11738728 11280121 11265020 10791889 10734774 10713035 10573164 10528748
5283A0528748J60029n55132p3562L8718J00513J3800k343j85938m07762j30524
$$ 10528748 10688777 10133645 10060083 10098801 10199314 10213114 10210771 10024833 9617071 9486547
5273I486547K02235j70486J55814m9272k4415J00627j70515j90884k01317L63336
$$ 9486547 9688782 9518296 9674110 9624838 9600423 9701050 9530535 9339651 9138334 9501670
5263I501670k43500j23076j02067m0861Q6410k31574N4672p8576k22082J95001
$$ 9501670 9258170 9135094 9033027 8992166 9078576 8847002 8901674 8823098 8601016 8796017
5253H796017o1558J41230m22837P6106K2046n4650J75213L01297j56115j52060
$$ 8796017 8734459 8875689 8452852 8528958 8551004 8496354 8671567 8972864 8816749 8664689
5243H664689J7915K41286k11902q28N4776Q7308j25230k8171r7138r5412K63436
$$ 8664689 8682604 8923890 8711988 8711160 8765936 8853244 8728014 8699843 8602705 8507293 8770729
5232H770729J13457q3917j72110K54836J22201j32567J13274Q5458L05131N60187
$$ 8770729 8884186 8800269 8628159 8882995 9005196 8872629 8985903 9071361 9376492 9936679
5222I936679J11691j60436J03930J15210J9373P9276j52534j34343R7909M3917
$$ 9936679 10048370 9887934 9991864 10107074 10126447 10205723 10053189 9918846 10016755 10060672
5212A0060672l04075J54097j8095n1777K30020J0613K9200J68939p4608K91484
$$ 10060672 9756597 9910694 9892599 9840822 10070842 10081455 10110655 10279594 10204986 10496470
5202A0496470K58478J51696p1584m2777M54003M00614K23816K02319L13106O28353
$$ 10496470 10754948 10906644 10835060 10792283 11246286 11646900 11870716 12073035 12386141 13014494
5192A3014494K87792N13998O80160P93621L82168L24587J19964k31081q8403k8064
$$ 13014494 13302286 13816284 14496444 15290065 15672233 15996820 16116784 15885703 15797300 15769236
5182A5769236j95826k70113k64363k78949l88870o2132K38228q2520l2977k46403
$$ 15769236 15573410 15303297 15038934 14759985 14371115 14308983 14547211 14464691 14431714 14185311
5172A4185311l4705j0022K45417L60104J81404j21565J95485L16724N32001M61015
$$ 14185311 14150606 14140584 14386001 14746105 14927509 14805944 15001429 15318153 15850154 16311169
5162A6311169K46646J34076J15067J4253J90422j07540J55594K7546K47976K04894
$$ 16311169 16557815 16691891 16806958 16821211 17011633 16904093 17059687 17087233 17335209 17540103
5152A7540103m4163j50002n27630j0947K2637k45030P8147O146k92545J60266
$$ 17540103 17495940 17345938 16818308 16807361 16829998 16584968 16663115 16669261 16376716 16536982
5142A6536982j7594J51120k14871r3417j85650k20301j01635j14151l28950k72588
$$ 16536982 16519388 16670508 16455637 16362220 16176570 15956269 15854634 15740483 15411533 15138945
5132A5138945j62015j22525K08123j41867k61700j64700q8242J13533R94K57099
$$ 15138945 14976930 14854405 15062528 14920661 14658961 14494261 14406019 14519552 14520546 14777645
5122A4777645N2368k5738P9074P8036K69650k13714k51158K73274l48153n51300
$$ 14777645 14830013 14804275 14883349 14961385 15231035 15017321 14766163 15039437 14691284 14139984
5112A4139984k61319m09964k03781l84409k96998m06866n74237j72981k71609
$$ 14139984 13878665 13468701 13264920 12880511 12583513 12176647 11602410 11429429 11157820
5103A1157820j25078J07695k40262l74671k72661j34647j73423m13909P4259l18955
$$ 11157820 11032742 11140437 10900175 10525504 10252843 10118196 9944773 9530864 9605123 9286168
5093I286168m12599q5432l9077j46957J99497N7528k48802k46003r1831j29220
$$ 9286168 8873569 8788137 8749060 8602103 8801600 8859128 8610326 8364323 8272492 8143272
5083H143272n973M4529l5616j5905l50379j89086M9135J66489l00427J53845j94295
$$ 8143272 8137299 8181828 8146212 8130307 7779928 7590842 7639977 7806466 7506039 7659884 7465589
5072G465589j33644J20125l2537N1085j96434K28115Q2591j14695l42530L0872
$$ 7465589 7331945 7452070 7419533 7470618 7274184 7502299 7584890 7470195 7127665 7158537
5062G158537m060J86724J16107j25013K35769k12R0326l3860J82233k14855M943
$$ 7158537 7154477 7341201 7457308 7332295 7568064 7567852 7658178 7624318 7806551 7591696 7596639
5051G596639K3618J92245K57606p6580j99820J35028j77809M22982N6288q7520
$$ 7596639 7620257 7812502 8070108 7993528 7793708 7928736 7750927 8173909 8230197 8142677
5041H142677N0140J08870L81544m3687J19621J73341l8912L61105N0530q1873
$$ 8142677 8192817 8301687 8683231 8639544 8759165 8932506 8893594 9254699 9305229 9223356
5031I223356j20978j81916J5441K66183J53961P1194J24509l3641n4013j80466
$$ 9223356 9102378 8920462 8935903 9202086 9356047 9427241 9551750 9518109 9464096 9283630
5021I283630k06319j8425j78690q2487j24551o0602k09777j71025p3206o5401
$$ 9283630 9077311 9058886 8880196 8797709 8673158 8612556 8402779 8231754 8158548 8093147
5011H093147M5669j33677r5768k00041j8159R854J10107j25347j31821K3694K5511
$$ 8093147 8138816 8005139 7909371 7709330 7691171 7701025 7811132 7685785 7553964 7577658 7603169
5000G603169j20247K1814O5950J80731j09698m028J21849j01323j49682K54504
$$ 7603169 7482922 7504736 7570686 7751417 7641719 7637691 7759540 7658217 7508535 7763039
4990G763039O0315J0482J26176J20810j61914O4487j60072J37579j75739L43476
$$ 7763039 7823354 7833836 7960012 8080822 7918908 7983395 7823323 7960902 7785163 8128639
4980H128639N14890O7353k1205O8060J44850N8062k4284j76571M9210k4459M8350
$$ 8128639 8643529 8710882 8689677 8757737 8902587 8960649 8936365 8759794 8809004 8784545 8832895
4969H832895M06500J5812l16113J20082K56400p3002o3781k81194o1259k936L48128
$$ 8832895 9239395 9255207 8939094 9059176 9315576 9242574 9178793 8897599 8836340 8833404 9181532
4958I181532j83996m7412j4090J29305J08961k67426J06557k7204k3311k69621
$$ 9181532 8997536 8950124 8936034 9065339 9174300 8906874 9013431 8986227 8962916 8693295
4948H693295k16388j06429K3996J13971J75244j9353l1672r651p7346j31372J32744
$$ 8693295 8476907 8370478 8394474 8508445 8683689 8664336 8632664 8623013 8545667 8414295 8547039
4937H547039L07633R215j28012J00137l73294R7176L37326m0491P9774L6545l124
$$ 8547039 8854672 8863887 8735875 8836012 8462718 8559894 8897220 8856729 8936503 8973048 8969924
4926H969924J27861j05825r1477K39401O850p7040J14306J68142J91346m8140
$$ 8969924 9097785 8991960 8900483 9139884 9146734 9069694 9184000 9352142 9543488 9495348
4916I495348o6052k37037K35522Q3217L1526J87291M2787l6724J09769L82738
$$ 9495348 9429296 9192259 9427781 9510998 9542524 9729815 9772602 9735878 9845647 10228385
4906A0228385N8272R5431o791o9653O3029J03854P1147n577J88758L5295j47395
$$ 10228385 10286657 10382088 10375297 10305644 10368673 10472527 10543674 10538097 10726855 10762150 10614755
4895A0614755k1600J97077J21385Q8016J86752j6367j28760K72241J61960K27545
$$ 10614755 10593155 10790232 10911617 10999633 11186385 11170018 11041258 11313499 11475459 11703004
4885A1703004L96987M2926N7234Q8618K68062J79047N3382J20467N8566L71567
$$ 11703004 12099991 12142917 12200151 12288769 12556831 12735878 12789260 12909727 12968293 13339860
4875A3339860p1122M2248N3118J38529M08962K15162l19247M00460M61261L25600
$$ 13339860 13268738 13310986 13364104 13502633 13911595 14126757 13807510 14207970 14669231 14994831
4865A4994831M26100J07074J87757K12685J34553K44232K07579M37557J97757
$$ 14994831 15420931 15528005 15715762 15928447 16063000 16307232 16514811 16952368 17150125
4856A7150125K774J76324L60000J34759L40514J56938J31529K42766J21309j65407
$$ 17150125 17152899 17329223 17689223 17823982 18164496 18321434 18452963 18695729 18817038 18651631
4846A8651631K16386L82505J78030K51679O2184N02397P0557J45818L2442N8142
$$ 18651631 18868017 19250522 19428552 19680231 19742415 20244812 20315369 20461187 20493629 20551771
4836B0551771K9840o6500j37707j03535M7322k1120L8271K06027o2022K06600
$$ 20551771 20581611 20515111 20377404 20273869 20321191 20300071 20338342 20544369 20482347 20688947
4826B0688947R3541Q3186P1707K51019K29850K39979N5444K50233J29849J08512
$$ 20688947 20782488 20865674 20937381 21188400 21418250 21658229 21713673 21963906 22093755 22202267
4816B2202267J97553J80113L61200M52464M41865L69343M58365L22512J52657
$$ 22202267 22399820 22579933 22941133 23393597 23835462 24204805 24663170 24985682 25138339
4807B5138339L46657O64518M09108K93645K95774L96886J90631N52649M62322
$$ 25138339 25484996 26149514 26558622 26852267 27148041 27544927 27735558 28288207 28750529
4798B8750529J75040K48655L59945K18595M28563M15279J77487K38268M29502
$$ 28750529 28925569 29174224 29534169 29752764 30181327 30596606 30774093 31012361 31441863
4789C1441863N76939O39006L90980K06363K92340M78285N82195N20068O01483
$$ 31441863 32018802 32657808 33048788 33255151 33547491 34025776 34607971 35128039 35729522
4780C5729522L98140O10670Q53964J164039Q17540M57904K38463q1508r3876K52408
$$ 35729522 36127662 36738332 37592296 38756335 39573875 40031779 40270242 40188734 40094858 40347266
4770D0347266M38795M20408M55607L21306J56521L10051M11472K82067K71180
$$ 40347266 40786061 41206469 41662076 41983382 42139903 42449954 42861426 43143493 43414673
4761D3414673M05678L97578O31864O06320Q04403L32173L00656L44870N16010
$$ 43414673 43820351 44217929 44849793 45456113 46260516 46592689 46893345 47238215 47754225
4752D7754225J17460N12468M61058N71697M25425Q41274Q83877M19101O82675
$$ 47754225 47871685 48384153 48845211 49416908 49842333 50683607 51567484 51986585 52669260
4743E2669260J103423Q95712Q75236R95886Q47394M13847L06041K98199j09619
$$ 52669260 53772683 54668395 55543631 56539517 57386911 57800758 58106799 58404998 58295379
4734E8295379j22113m34021j43533q4479J01048K89657M25131Q74472M83467O08514
$$ 58295379 58173266 57739245 57595712 57511233 57612281 57901938 58327069 59201541 59685008 60293522
4724F0293522J038679R66936J397872J442291J358061J452302J438980J300034
$$ 60293522 61332201 62299137 63697009 65139300 66497361 67949663 69388643 70688677
4716G0688677J072799N77057Q88434Q37630R63427J153770J541711J431688K047118
$$ 70688677 71761476 72338533 73226967 74064597 75028024 76181794 77723505 79155193 81202311
4707H1202311J986833K642445L078262L878504M759634N750738O589382P415406
$$ 81202311 83189144 85831589 88909851 92788355 97547989 103298727 109888109 117303515
4699A17303515P844896P998650P782344P064802O402002N282596M229148K780368
$$ 117303515 125148411 133147061 140929405 147994207 154396209 159678805 163907953 166688321
4691A66688321P86168j799673l960861n906794p176953q129203q346983p944988
$$ 166688321 167474489 165674816 161713955 155807161 148630208 140501005 132154022 124209034
4683A24209034p498533p293253p047541o064722n231170m892136m249511m066853
$$ 124209034 116710501 109417248 102369707 96304985 91073815 86181679 81932168 77865315
4675G7865315l503602k792016k717095k342967k469627k258736j782857j367297
$$ 77865315 74361713 71569697 68852602 66509635 64040008 61781272 59998415 58631118
4667E8631118j523461j306072j258519q99270q58373o61689m84093m65517l57049
$$ 58631118 57107657 55801585 54543066 53643796 52785423 52123734 51639641 51174124 50817075
4658E0817075m31330m20866p8587k97565l33597j08202o3620j97371k75699j68442
$$ 50817075 50385745 49964879 49886292 49588727 49255130 49146928 49083308 48885937 48610238 48441796
4648D8441796L45224J68144j19772N08016J09330p6316K85707N05010J90604L27067
$$ 48441796 48787020 48955164 48835392 49343408 49452738 49376422 49662129 50167139 50357743 50684810
4638E0684810L57340L37336L76383K30349L72087M25433N73815N22986M65860
$$ 50684810 51042150 51379486 51755869 51986218 52358305 52783738 53357553 53880539 54346399
4629E4346399P86896P24792K48938K60882Q64392Q08783K58424M81798M51964
$$ 54346399 55133295 55858087 56107025 56367907 57232299 58041082 58299506 58781304 59233268
4620E9233268N03620P06024O71114R30119Q73331J134865J077995J403039J356120
$$ 59233268 59736888 60442912 61114026 62044145 62917476 64052341 65130336 66533375 67889495
4611F7889495J648884K026822J556505J636128J243420N32681J02875l49898q77127
$$ 67889495 69538379 71565201 73121706 74757834 76001254 76533935 76636810 76286912 75409785
4602G5409785o25874m42420m84238k7162n9571R8741M11920M21644N65423P27303
$$ 75409785 74783911 74341491 73857253 73830091 73770520 73869261 74281181 74702825 75268248 75995551
4592G5995551N25560Q68390J045453R96848P30483P91023J152230R08621R48893
$$ 75995551 76521111 77389501 78434954 79431802 80162285 80953308 82105538 83014159 83963052
4583H3963052J577905J602336J927169K151373L016417L269046M254924M693342
$$ 83963052 85540957 87143293 89070462 91221835 94238252 97507298 101762222 106455564
4575A06455564M264917K837300L57904k294179l875061m108010l821350l618869
$$ 106455564 110720481 113557781 113915685 111621506 107746445 103638435 99817085 96198216
4567I6198216k979485k160611j675559j408354q36993p57597q74995m49343k65318
$$ 96198216 93218731 91058120 89382561 87974207 87137214 86379617 85504622 85055279 84789961
4558H4789961L69850O68177Q70265J234231J257759J652084J957979J985574K135730
$$ 84789961 85159811 85827988 86698253 87932484 89190243 90842327 92800306 94785880 96921610
4549I6921610K272178K795909L440274L981969M243540N325574N633256N187264
$$ 96921610 99193788 101989697 105429971 109411940 113655480 118981054 124614310 129801574
4541A29801574L094719l550k778873m836772n391388n571717m707871l953848
$$ 129801574 132896293 132892743 130113870 125277098 119885710 114313993 109606122 105652274
4533A05652274l537069k707163k468160k351055j873208j536879j162353q10176
$$ 105652274 102115205 99408042 96939882 94588827 92715619 91178740 90016387 89206211
4525H9206211m43416l54562k5675K73150K89512N94900Q97644J265133J139395
$$ 89206211 88762795 88408233 88382558 88655708 88945220 89540120 90437764 91702897 92842292
4516I2842292J454986J357011J112502J247015J760171J596061J777774J172507
$$ 92842292 94297278 95654289 96766791 98013806 99773977 101370038 103147812 104320319
4508A04320319m1945j104607k167271l369012l908360l575939l651265l157968
$$ 104320319 104278374 103173767 101006496 97637484 93729124 90153185 86501920 83343952
4500H3343952k936409k520741k506835k204634j825240j454245j457862j141535
$$ 83343952 80407543 77886802 75379967 73175333 71350093 69895848 68437986 67296451
4492F7296451r87356p81282o73407q17652o17277l52251l9607l33225n30152m60967
$$ 67296451 66309095 65527813 64854406 64036754 63419477 63067226 63027619 62694394 62164242 61703275
4482F1703275m98250m88093l80171k62290m31571m36164l16358o74854j83406
$$ 61703275 61205025 60716932 60336761 60074471 59642900 59206736 58890378 58215524 58032118
4473E8032118q28829r10142j014158j285999o98135o64686l83381l52270n34278
$$ 58032118 57203289 56293147 55278989 53992990 53294855 52630169 52246788 51894518 51360240
4464E1360240J4705l99098p49441r09508p16504q47779r10326q02662m51644l23811
$$ 51360240 51374945 50975847 50226406 49316898 48600394 47752615 46842289 46039627 45587983 45264172
4454D5264172j54528m30050m23566o04018k87153j52946j60576l09625l98774
$$ 45264172 45109644 44679594 44256028 43652010 43364857 43211911 43051335 42741710 42342936
4445D2342936l08436P9887j55774j01726k75139O6205P7019k54501o3578J27656
$$ 42342936 42034500 42114387 41958613 41856887 41581748 41647953 41724972 41470471 41406893 41534549
4435D1534549M6364k57213L7173q798n931o7837N4134k23037l8818O7375Q4276
$$ 41534549 41580913 41323700 41360873 41352075 41346144 41278307 41332441 41109404 41070586 41137961 41222237
4424D1222237R783J79157J69349K60467j9198K01901O4650J03330j04096R9884
$$ 41222237 41232020 41411177 41580526 41840993 41821795 42023696 42088346 42191676 42087580 42187464
4414D2187464r8165K09980j9758j66124K99493M1270K4764K7428Q2908K19144
$$ 42187464 42089299 42299279 42279521 42113397 42412890 42454160 42478924 42506352 42589260 42808404
4404D2808404k62421j4837p8562J44290O8573n2612J30216J22810K53270J58927
$$ 42808404 42545983 42531146 42452584 42596874 42665447 42612835 42743051 42865861 43119131 43278058
4394D3278058K07124L62879L58714J20487L79364M75285M44198J9526L42890L09378
$$ 43278058 43485182 43848061 44206775 44327262 44706626 45181911 45626109 45645635 45988525 46297903
4384D6297903j05456J10715L5287M43771N56803L94584N32554N20969N96675M58054
$$ 46297903 46192447 46303162 46338449 46782220 47339023 47733607 48266161 48787130 49383805 49841859
4374D9841859M05267P71520N55068O87968O30127L49770N81428O71643P44800
$$ 49841859 50247126 51018646 51573714 52261682 52891809 53241579 53823007 54494650 55239450
4365E5239450N26998P58629P83585Q52858J023161R64924J287258J116699J513013
$$ 55239450 55766448 56525077 57308662 58161520 59184681 60149605 61436863 62553562 64066575
4356F4066575R60620P82979J203322P47135J055841Q63373Q12105O52782P84495
$$ 64066575 65027195 65810174 67013496 67760631 68816472 69679845 70491950 71144732 71929227
4347G1929227P75822N79671O30971O71893M76146L63108R37776N84157O75264
$$ 71929227 72705049 73284720 73915691 74587584 75063730 75426838 76364614 76948771 77624035
4338G7624035O11630Q76151R46380J200086J425149J341029R94601J135405J383353
$$ 77624035 78235665 79111816 80058196 81258282 82683431 84024460 85019061 86154466 87537819
4329H7537819J286915J667824J545745J548398J999691K020465J950411J996320
$$ 87537819 88824734 90492558 92038303 93586701 95586392 97606857 99557268 101553588
4321A01553588K476965K629600K604701L010068K960997L644394M002759M732465
$$ 101553588 104030553 106660153 109264854 112274922 115235919 118880313 122883072 127615537
4313A27615537N760636O758291Q830710J1522731J4459943J6881082J7485110
$$ 127615537 133376173 140134464 148965174 160487905 174947848 191828930 209314040
4306B09314040J5669965J2156604P087481K58514n880925j0964720j3889215j5161039
$$ 209314040 224984005 237140609 244228090 244486604 238605679 227640959 213751744 198590705
4298A98590705j3761383j1223957p984789m942823k553557l04980J551101L312194
$$ 198590705 184829322 173605365 165620576 160677753 158124196 157819216 159370317 162682511
4290A62682511M335793N597673N348047M549957L164227P85995j448866l872366
$$ 162682511 167018304 172615977 177964024 182513981 185678208 186464203 185015337 181142971
4282A81142971n571994o353737o712856o153261n692322n024830m312383l695497
$$ 181142971 175570977 169217240 162504384 156351123 150658801 145633971 141321588 137626091
4274A37626091l154864k515258j981576j950729j168909j169073j064282m00500
$$ 137626091 134471227 131955969 129974393 128023664 126854755 125685682 124621400 124220900
4266A24220900k75144k232L21952M0128L15202J73691L60708R76436J087227J620950
$$ 124220900 123945756 123943524 124265476 124305604 124620806 124794497 125155205 126131641 127218868 128839818
4256A28839818J913274K714976L226692L508017L970928L343309K569171J045160
$$ 128839818 130753092 133468068 136694760 140202777 144173705 147517014 150086185 151131345
4248A51131345p25245l039048m493817n986405o737643o790571o616788n380491
$$ 151131345 150406100 147367052 142873235 136886830 130149187 123358616 116741828 111361337
4240A11361337n175316m814861m293310l776324l370350k950988k540416k222352
$$ 111361337 106186021 101371160 97077850 93301526 89931176 86980188 84439772 82217420
4232H2217420j965085k382006k409769k221343k273876k055738j885866j635145
$$ 82217420 80252335 77870329 75460560 73239217 70965341 68909603 67023737 65388592
4224F5388592j571843j094122j224274j319087r54383n58135q79618o27990m21380
$$ 65388592 63816749 62722627 61498353 60179266 59224883 58666748 57787130 57159140 56737760
4215E6737760n50093O4454j31217k08123l39159l82163j61180j3913j06694l66404
$$ 56737760 56187667 56252121 56120904 55912781 55573622 55191459 55030279 55016366 54909672 54543268
4205E4543268l72555o89024o99387o87329p53012p60595q70756p26933q22416
$$ 54543268 54170713 53481689 52782302 52094973 51341961 50581366 49710610 48983677 48161261
4196D8161261j161404r81886q38690p01215l97592m85057l53713l17653m26012
$$ 48161261 46999857 46017971 45179281 44478066 44080474 43595417 43241704 42924051 42498039
4187D2498039k62477J85187k72611r799P2495K0862O01948M07954J11940k66M73819
$$ 42498039 42235562 42420749 42148138 42138339 42210834 42231696 42833644 43241598 43353538 43353272 43827091
4176D3827091K30637J89575P4774j54225l74128J50330M92944q1805r892K8484
$$ 43827091 44057728 44247303 44322077 44167852 43793724 43944054 44436998 44355193 44345301 44373785
4166D4373785K79767L04843N82486J323813J763218J911735J257785j93321j322207
$$ 44373785 44653552 44958395 45540881 46864694 48627912 50539647 51797432 51604111 50281904
4157E0281904k077464k354199j817687j406717r65997q88906m12523j18193L2764
$$ 50281904 48204440 45850241 44032554 42625837 41659840 40770934 40358411 40240218 40272982
4148D0272982j73343m77448n75151k99807n6201j38604n42556n71636m42965n53377
$$ 40272982 40099639 39622191 39047040 38747233 38691032 38552428 38009872 37438236 36995271 36441894
4138C6441894m15224K7279p2723m41256j09369j35875n1925j77647m42362k81791
$$ 36441894 36026670 36053949 35981226 35539970 35430601 35294726 35242801 35065154 34622792 34341001
4128C4341001k9193m66056l22435l74593j52213o8260k91199j57156m8829j85974
$$ 34341001 34311808 33845752 33523317 33148724 32996511 32928251 32637052 32479896 32431067 32245093
4118C2245093k22546j16036j38229p4322J30806k0203k03996P1832q0929K05721
$$ 32245093 32022547 31906511 31768282 31693960 31824766 31804563 31600567 31672399 31591470 31797191
4108C1797191J50693M402q5693L60478k10599j03836o1394K05533J70308k61699
$$ 31797191 31947884 31952286 31866593 32227071 32016472 31912636 31851242 32056775 32227083 31965384
4098C1965384K60092J35136K15540P8708K07804K65627K50934J99333K01960J0123
$$ 31965384 32225476 32360612 32576152 32654860 32862664 33128291 33379225 33578558 33780518 33790641
4088C3790641J33971K63463L40376K73835M38609L12061M71926K33496L41688
$$ 33790641 33924612 34188075 34528451 34802286 35240895 35552956 36024882 36258378 36600066
4079C6600066K86689O62342N93936M39241N60155j01567K72067L84653N58175
$$ 36600066 36886755 37549097 38143033 38582274 39142429 39040862 39312929 39697582 40255757
4070D0255757M06767L71691N66594N44451L10044L32661L99776P37170J16325
$$ 40255757 40662524 41034215 41600809 42145260 42455304 42787965 43187741 43924911 44041236
4061D4041236K13894L28116J71377J03626L4135J24063J73804L848R4889L12802
$$ 44041236 44255130 44583246 44754623 44858249 44892384 45016447 45190251 45194099 45288988 45601790
4051D5601790K20905J36157k39673K14864O0869j29027m29721l64558m1139j56553
$$ 45601790 45822695 45958852 45719179 45934043 45994912 45865885 45436164 45071606 45030467 44873914
4041D4873914k76590l16020m46146m02270k82670k80347k90800o39255p28172
$$ 44873914 44597324 44281304 43835158 43432888 43150218 42869871 42579071 41939816 41211644
4032D1211644l83308l40079j91611p34119o61862l81492n75116r94325m33601
$$ 41211644 40828336 40488257 40296646 39562527 38900665 38519173 37944057 36949732 36516131
4023C6516131n58080m98747j34475j000969q04393n95254o55007o48487p76800
$$ 36516131 35958051 35459304 35324829 34323860 33519467 32924213 32269206 31620719 30843919
4014C0843919n58209n67655j073120j017104o07732o61244n55969n70161q89899
$$ 30843919 30285710 29718055 28644935 27627831 27020099 26358855 25802886 25232725 24342826
4005B4342826n15134n50485o11135o61153m29372m94562o51972o44876m03367
$$ 24342826 23827692 23277207 22666072 22004919 21575547 21080985 20429013 19784137 19380770
3996A9380770k66885l52930p30758o07772k07693k47754k77427o89476k58452
$$ 19380770 19113885 18760955 18030197 17422425 17214732 16966978 16689551 16000075 15741623
3987A5741623k37161l81298p22551l30511j57545k64164l83844j52574k55494
$$ 15741623 15504462 15123164 14400613 14070102 13912557 13648393 13264549 13111975 12856481
3978A2856481j32085k82230m05792M4607l60713l0627m53319j8077j21108p6939
$$ 12856481 12724396 12442166 12036374 12080981 11720268 11689641 11236322 11218245 11097137 11020198
3968A1020198l0437k45432j26961n0401J24305j35113j63447k03435k0055k6798
$$ 11020198 10989761 10744329 10617368 10566967 10691272 10556159 10392712 10189277 10169222 10142424
3958A0142424m00415k73261j53215J2631k56378k1698l65979k66881K37466j35369
$$ 10142424 9742009 9468748 9315533 9328164 9071786 9050088 8684109 8417228 8654694 8519325
3948H519325R4824j46243k62192q066j8824l49151o4231J71814o1125m8678j69414
$$ 8519325 8614149 8467906 8205714 8197648 8178824 7829673 7765442 7937256 7876131 7827453 7658039
3937G658039j39190J45410l74045k3549k85793J16885K20735O4969J04006l18529
$$ 7658039 7518849 7664259 7290214 7266665 6980872 7097757 7318492 7383461 7487467 7168938
3927G168938m8418k8874p2431Q5029j73l3813k35749k33224j13537l71164j00010
$$ 7168938 7120520 7091646 7019215 7104244 7104071 7070258 6834509 6601285 6487748 6116584 6016574
3916F016574J85169L0420k27037l0366J88047j1321Q5644J41817k13718j9675
$$ 6016574 6201743 6232163 6005126 5974760 6162807 6151486 6237130 6378947 6165229 6145554
3906F145554r0592r1232r4487q291k71049j33838J77448O9152M7035K8596Q8461
$$ 6145554 6054962 5963730 5869243 5860952 5589903 5456065 5633513 5702665 5749700 5778296 5866757
3895E866757j8951l36555j01191j82803P4204j01176j32198L5921J4724q9020
$$ 5866757 5847806 5511251 5410060 5227257 5301461 5200285 5068087 5104008 5118732 5029712
3885E029712K25418Q4897k90495r68J33734O0253J96363k24606r8129K08602J04946
$$ 5029712 5255130 5340027 5049532 5048564 5182298 5242551 5438914 5214308 5116179 5324781 5429727
3874E429727j09823l05951M1034Q8205O1962J67071l48101r3749K38305j11514
$$ 5429727 5319904 5013953 5054987 5143192 5205154 5372225 5024124 4930375 5168680 5057166
3864E057166j06358j16007N5342n9706J00706n9491J96137Q9773j87912J45434
$$ 5057166 4950808 4834801 4890143 4830437 4931143 4871652 5067789 5157562 4969650 5115084
3854E115084K1012j68414J90399j14507m6250q7197p2426j59955L44418q754k18861
$$ 5115084 5136096 4967682 5158081 5043574 4997324 4910127 4837701 4677746 5022164 5013410 4794549
3843D794549J48385J02172m58p5397L6837q743l8599R8885Q0557n1749m1672j34905
$$ 4794549 4942934 5045106 5044648 4969251 5006088 4997345 4958746 5057631 5138188 5086439 5044767 4909862
3831D909862k21324j22904K25471J74588J28107Q5976J65872j09833j33720n1055
$$ 4909862 4688538 4565634 4791105 4965693 5093800 5179776 5345648 5235815 5102095 5051040
3821E051040O0507Q415N0j7793j33792j63413j03912K06088L79692o0679J01913
$$ 5051040 5111547 5119962 5120012 5102219 4968427 4805014 4701102 4907190 5286882 5226203 5328116
3810E328116L1611L9607J13707j92213j03187J05351J10731J7893J60211l0316
$$ 5328116 5359727 5399334 5513041 5320828 5217641 5322992 5433723 5451616 5611827 5581511
3800E581511L11849L6622O26K88883m5891j06709j85731p0766J90638K03523K10264
$$ 5581511 5893360 5929982 5930608 6219491 6173600 6066891 5881160 5810394 6001032 6204555 6414819
3789F414819p4433L8955O2722p908J14631l0650M37442P1383j77681R5973j44427
$$ 6414819 6340386 6379341 6442063 6434155 6548786 6518136 6955578 7026961 6849280 6945253 6800826
3778F800826J12555K71563L62826q6545j41690K66880l76572p3519K24732J19287
$$ 6800826 6913381 7184944 7547770 7461225 7319535 7586415 7209843 7136324 7361056 7480343
3768G480343J74931K65008Q356j50235N7851j3919J04814K1783K08038j8197R6372
$$ 7480343 7655274 7920282 7928638 7778403 7836254 7822335 7927149 7948932 8156970 8138773 8235145
3757H235145J42772M8370J86067K46505J35085j38032L25622L70184J32421N8883
$$ 8235145 8377917 8426287 8612354 8858859 8993944 8855912 9181534 9551718 9684139 9743022
3747I743022K26274K21410m09038L45912Q0814J68438K64754P8187J46480L0969
$$ 9743022 9969296 10190706 9781668 10127580 10208394 10376832 10641586 10719773 10866253 10897222
3737A0897222j57051L78227L92055j5435Q4739J26513L70775J10554J25331L34771
$$ 10897222 10740171 11118398 11510453 11495018 11579757 11706270 12077045 12187599 12312930 12647701
3727A2647701K86493p2534M18869J2395j33930K36581K22407J61041N66527r2405
$$ 12647701 12934194 12861660 13280529 13292924 13158994 13395575 13617982 13779023 14345550 14253145
3717A4253145N392L71304K94530J22693O8215j03782K95401L64045k9142j6184
$$ 14253145 14258537 14629841 14924371 15047064 15115279 15011497 15306898 15670943 15641801 15625617
3707A5625617k7884N7336L35089J88413J23058J58437J47931K62139L47808J08901
$$ 15625617 15597733 15655069 15990158 16178571 16301629 16460066 16607997 16870136 17217944 17326845
3697A7326845l7774L17852J39743K55893j16406N4703L31997J00124R8382j27399
$$ 17326845 17289071 17606923 17746666 18002559 17886153 17940856 18272853 18372977 18471359 18343960
3687A8343960q9684L06802M4971P6512J53124J56505R0638M3882N4357K84447
$$ 18343960 18254276 18561078 18606049 18682561 18835685 18992190 19082828 19126710 19181067 19465514
3677A9465514K27665M53107j90524J86967N43558J62039N1979J5744L37440O9765
$$ 19465514 19693179 20146286 19955762 20142729 20686287 20848326 20900305 20916049 21253489 21323254
3667B1323254J57576K81987K05202M38867J7441j38088M32342L21186J14149P3655
$$ 21323254 21480830 21762817 21968019 22406886 22424327 22286239 22718581 23039767 23153916 23227571
3657B3227571N46447L88499N06806K69168j61020P0654K38020J53488r4498K80278
$$ 23227571 23774018 24162517 24669323 24938491 24777471 24848125 25086145 25239633 25145135 25425413
3647B5425413J67965p6772J03924P7669J87258n3041r5397j27917J85218J98327
$$ 25425413 25593378 25516606 25620530 25698199 25885457 25832416 25737019 25609102 25794320 25992647
3637B5992647m63193p0625J82804N3565j52517L41945N4017j8625P7213K60098
$$ 25992647 25529454 25458829 25641633 25695198 25542681 25884626 25938643 25920018 25997231 26257329
3627B6257329k15819m8454N63959J99569L23686J63813L26676K50410K77746O36237
$$ 26257329 26041510 25993056 26557015 26756584 27080270 27244083 27570759 27821169 28098915 28735152
3617B8735152K44589K07309M74291P43003M58224K3280O57956M68720N49230O37409
$$ 28735152 28979741 29187050 29661341 30404344 30862568 30885848 31543804 32012524 32561754 33199163
3607C3199163O32325M86788N56448N74339N25085L52029N35334L66800O85495
$$ 33199163 33831488 34318276 34874724 35449063 35974148 36326177 36861511 37228311 37913806
3598C7913806M74943M48538N91168O93226J16721L14183L03817J04103R1278J04385
$$ 37913806 38388749 38837287 39428455 40121681 40238402 40552585 40856402 40960505 41051783 41156168
3588D1156168K38508K14239K02703j68815j78234L5477q3569l60266r7521Q1121
$$ 41156168 41394676 41608915 41811618 41642803 41464569 41500046 41416477 41056211 40958690 41039811
3578D1039811j01262L7192J63447k31363o8749J81905j46740l67594j47590j92259
$$ 41039811 40938549 40975741 41139188 40907825 40839076 41020981 40874241 40506647 40359057 40166798
3568D0166798r6585l22813O2432R8026j08055J9952l15870l6981p2946j64081
$$ 40166798 40070213 39747400 39809832 39907858 39799803 39819755 39503885 39466904 39393958 39229877
3558C9229877r7944K26977K98241l2445K06289j87297N5310j02888o1497k31030
$$ 39229877 39131933 39358910 39657151 39624706 39830995 39643698 39699008 39596120 39534623 39303593
3548C9303593N70030L80315j95207Q7881J34373K11369R9876P4580K73849K69916
$$ 39303593 39873623 40253938 40058731 40146612 40280985 40492354 40592230 40666810 40940659 41210575
3538D1210575J39434J51540J98220Q5954J36405J16726J9384K15039J08694l9601
$$ 41210575 41350009 41501549 41699769 41785723 41922128 42038854 42058238 42273277 42381971 42342370
3528D2342370R6216p3026l1535J21842k0093R8462K41331M8961n067l26237j91195
$$ 42342370 42438586 42365560 42334025 42455867 42435774 42534236 42775567 42824528 42819461 42493224 42302029
3517D2302029q8256M79045N1742J89426M11262K51993J36545M93080L73944Q0665
$$ 42302029 42213773 42692818 42744560 42933986 43345248 43597241 43733786 44226866 44600810 44681475
3507D4681475K31793L97100L74932M23930N23925L53084P25312L57762L14619
$$ 44681475 44913268 45310368 45685300 46109230 46633155 46986239 47711551 48069313 48383932
3498D8383932N28161N60943K90245O03089M40567O54773L95103P47524N80032
$$ 48383932 48912093 49473036 49763281 50366370 50806937 51461710 51856813 52604337 53184369
3489E3184369N08998M82229P35189N06552N08984N73214P60254J67510M3425R0899
$$ 53184369 53693367 54175596 54910785 55417337 55926321 56499535 57259789 57427299 57470724 57561623
3479E7561623q3172K56460j87362K13651p8828l70686J14971R7131j79706n5399
$$ 57561623 57478451 57734911 57547549 57761200 57682372 57311686 57426657 57523788 57344082 57288683
3469E7288683j50654P8448j82982L72452M415L84247L88052K54866K73973N57876
$$ 57288683 57138029 57216477 57033495 57405947 57410362 57794609 58182661 58437527 58711500 59269376
3459E9269376M26806K94884J83089J35782L37043K46279K68218K88242K89815
$$ 59269376 59696182 59991066 60174155 60309937 60646980 60893259 61161477 61449719 61739534
3450F1739534k3960R1900M64600L99796j54300P10545P33346N60285M37455N68243
$$ 61739534 61715574 61807474 62272074 62671870 62517570 63228115 63961461 64521746 64959201 65527444
3440F5527444O43562O65798N21576M53364Q95799P72440M71067P84078L58508
$$ 65527444 66171006 66836804 67358380 67811744 68707543 69479983 69951050 70735128 71093636
3431G1093636Q09779M53937M97389O20812P2611M76717P15112N26288P21623L85175
$$ 71093636 71903415 72357352 72854741 73475553 73548164 74024881 74739993 75266281 75987904 76373079
3421G6373079N16951L65860N93507O24845N75394O16179M65482N40539M57148
$$ 76373079 76890030 77255890 77849397 78474242 79049636 79665815 80131297 80671836 81128984
3412H1128984N32100O46928P25405Q42953Q02010O84056J212617Q88845J129837
$$ 81128984 81661084 82308012 83033417 83876370 84678380 85362436 86575053 87463898 88593735
3403H8593735J025543J182072J630008J339990J304214J406114Q01227N77022
$$ 88593735 89619278 90801350 92431358 93771348 95075562 96481676 97282903 97859925
3395I7859925P96671M36153j61668k86632J13901l00588r05723o50897l13200
$$ 97859925 98656596 99092749 98931081 98644449 98758350 98457762 97552039 96901142 96587942
3386I6587942n99891o23609n19362n86170m19823n69261p40473m99576p67780
$$ 96587942 95988051 95364442 94845080 94258910 93839087 93269826 92529353 92029777 91261997
3377I1261997p80667j008020p08775m87311m67686l07877n39759n97733k60262
$$ 91261997 90481330 89473310 88764535 88277224 87809538 87501661 86961902 86364169 86103907
3368H6103907O8181J6181j4390m4701l4738J1108J40916m16626r9495k83103n02071
$$ 86103907 86172088 86188269 86173879 86129178 86094440 86105548 86246464 85829838 85730343 85447240 84945169
3357H4945169m05035l72253l56720n29431p88204p27299m61381m14253k38204
$$ 84945169 84540134 84167881 83811161 83281730 82493526 81766227 81304846 80890593 80652389
3348H0652389O4607O2122J17339L96915N50422L62193P88455J081584J094208
$$ 80652389 80716996 80779118 80896457 81293372 81843794 82205987 82994442 84076026 85170234
3339H5170234J352821J495979J328485J284414J356548J454245J593962J260804
$$ 85170234 86523055 88019034 89347519 90631933 91988481 93442726 95036688 96297492
3331I6297492J363845J330705J090629Q64297J272107J657779J314433J581427
$$ 96297492 97661337 98992042 100082671 100946968 102219075 103876854 105191287 106772714
3323A06772714J559895J839899J924620K016320J917739J894020J615747J701092
$$ 106772714 108332609 110172508 112097128 114113448 116031187 117925207 119540954 121242046
3315A21242046J239287P64522J134218P94651N27381Q63596R94724R77472J249338
$$ 121242046 122481333 123245855 124380073 125174724 125702105 126565701 127560425 128537897 129787235
3306A29787235J126427J521433J663810J396186J413792J143755J114323J015587
$$ 129787235 130913662 132435095 134098905 135495091 136908883 138052638 139166961 140182548
3298A40182548J039365Q52401R08746R11920R13260J068236J528824J473879J822844
$$ 140182548 141221913 142074314 142983060 143894980 144808240 145876476 147405300 148879179 150702023
3289A50702023J984795J873879J947919K231105K079964J641619J524998J314269
$$ 150702023 152686818 154560697 156508616 158739721 160819685 162461304 163986302 165300571
3281A65300571J286068R72389J036409J107238J115593R81784J425024J403921
$$ 165300571 166586639 167559028 168595437 169702675 170818268 171800052 173225076 174628997
3273A74628997J672595K119196J691201K049736K101753K062999K173040K414487
$$ 174628997 176301592 178420788 180111989 182161725 184263478 186326477 188499517 190914004
3265A90914004K812102L036123L224848L383015M142650M477698M884684N058737
$$ 190914004 193726106 196762229 199987077 203370092 207512742 211990440 216875124 221933861
3257B21933861N524135O255404O819427O717307N315056K231116n93061l353503
$$ 221933861 227457996 233713400 240532827 247250134 252565190 254796306 254203245 250849742
3249B50849742m623358m430305m257911l867164l125952k659331k857959l212641
$$ 250849742 246226384 241796079 237538168 233671004 230545052 227885721 225027762 221815121
3241B21815121l013501l016803l446267l698032l763812l728998l920710l706489
$$ 221815121 218801620 215784817 212338550 208640518 204876706 201147708 197226998 193520509
3233A93520509l519620l079342k670846k574064j842075j136475j80878M86869
$$ 193520509 190000889 186921547 184250701 181676637 179834562 178698087 178517209 179004078
3225A79004078K404825M160963O652231Q547621Q716105M052548l429311q661678
$$ 179004078 181408903 185569866 192222097 200769718 209485823 213538371 210109060 201447382
3217B01447382j1308611j1123483r965399p988024o227298m743535l516368k530321
$$ 201447382 190138771 179015288 169049889 161061865 154834567 150091032 146574664 144044343
3209A44044343k173036j506119j055358q08141l85655k23260p5804J98875P43789
$$ 144044343 141871307 140365188 139309830 138501689 138116034 137892774 137816970 138015845 138759634
3200A38759634Q97644Q33251Q27862J153397J557735J674767J894924J911130
$$ 138759634 139657278 140490529 141318391 142471788 144029523 145704290 147599214 149510344
3192A49510344J677861J448908J484073J179604P48476j430324l818606n314274
$$ 149510344 151188205 152637113 154121186 155300790 156049266 154618942 150800336 145486062
3184A45486062n926741n772623n354869m001986l535245k798135k156885j854708
$$ 145486062 139559321 133786698 128431829 124429843 120894598 118096463 115939578 114084870
3176A14084870j226184j130354j062060n75206m9321M80894P12041J503625J646833
$$ 114084870 112858686 111728332 110666272 110091066 110041745 110522639 111234680 112738305 114385138
3167A14385138J786507K135736K816106K502880K518961L091993K675962J393187
$$ 114385138 116171645 118307381 121123487 123626367 126145328 129237321 131913283 133306470
3159A33306470j760062l733595m715115n069736m072572l359580l002864k362256
$$ 133306470 131546408 127812813 123097698 118027962 113955390 110595810 107592946 105230690
3151A05230690k143635j346119r51145q07577j036688p11788q66759o91768n27678
$$ 105230690 103087055 101740936 100789791 99982214 98945526 98233738 97366979 96675211 96147533
3142I6147533k96558l97824l30618l6005p391L25972M48310O91184O75746Q88978
$$ 96147533 95850975 95453151 95122533 95086528 95079137 95405109 95853419 96544603 97220349 98109327
3132I8109327J026409R02944J313035J109804J349394J16650o85364j299229j346387
$$ 98109327 99135736 100038680 101351715 102461519 103810913 103927563 103242199 101942970 100596583
3123A00596583j428546j619990p09857r65833p07251m12544m76256k16374j85113
$$ 100596583 99168037 97548047 96838190 95872357 95165106 94752562 94276306 94059932 93874819
3114I3874819o9877K19244k65235K3060J71934j8211j11015k97736j80880k95394
$$ 93874819 93804942 94024186 93758951 93782011 93953945 93935734 93824719 93526983 93346103 93050709
3104I3050709l93797m64169o24378n50557n27394m91384o17047o63367k96008
$$ 93050709 92656912 92192743 91568365 91017808 90490414 89999030 89381983 88718616 88422608
3095H8422608j59902m90260k05147k82581l13735m96663n07191j99472m54418
$$ 88422608 88262706 87772446 87567299 87284718 86970983 86474320 85967129 85767657 85313239
3086H5313239k70094k12902n59924l37973k28439m89676m88581p21455n59963
$$ 85313239 85043145 84830243 84270319 83932346 83703907 83214231 82725650 82004195 81444232
3077H1444232q85678j011440q13719j139907j383334j842931j780154k018277
$$ 81444232 80558554 79547114 78733395 77593488 76210154 74367223 72587069 70568792
3069G0568792j917466j751358j746963j829170j842849j495758j540472j536594
$$ 70568792 68651326 66899968 65153005 63323835 61480986 59985228 58444756 56908162
3061E6908162j470902j186764j176220r49203p28621j073128q80529j061131p65710
$$ 56908162 55437260 54250496 53074276 52125073 51396452 50323324 49442795 48381664 47615954
3052D7615954q42282q64905p70114j111141n93491l51150n51881o88074n03293
$$ 47615954 46773672 45908767 45138653 44027512 43434021 43082871 42530990 41842916 41339623
3043D1339623k64052o76541l54222j16349l57591m51832l46312n4130k09571j63511
$$ 41339623 41075571 40399030 40044808 39928459 39570868 39119036 38772724 38718594 38509023 38345512
3033C8345512j90158p3095j04691J73871O7116q0614K48577p6623j74377k03812
$$ 38345512 38155354 38082259 37977568 38151439 38218555 38137941 38386518 38309895 38135518 37931706
3023C7931706P4687Q9817M04802k2091k75767J19244j17113k3874j83907j38162
$$ 37931706 38006393 38096210 38501012 38478921 38203154 38322398 38205285 38181411 37997504 37859342
3013C7859342k26659R4354j89583j29758j52611k17724p7286j43332K6764M5381
$$ 37859342 37632683 37727037 37537454 37407696 37255085 37037361 36960075 36816743 36843507 36888888
3003C6888888J99358Q3070O658P5031J91087m3311L5969k3123J07283k8257J64856
$$ 36888888 37088246 37171316 37177974 37253005 37444092 37400781 37436750 37413627 37520910 37492653 37657509
2992C7657509J65055P8165Q6899K92747J28004K75630K78477K69391K56487O85698
$$ 37657509 37822564 37900729 37987628 38280375 38408379 38684009 38962486 39231877 39488364 40174062
2982D0174062N45382K30423N35947L99524L24575K82679M60993M99111Q32651
$$ 40174062 40719444 40949867 41485814 41885338 42209913 42492592 42953585 43452696 44285347
2973D4285347P03428M13277O56715P43992N36313Q58692Q13757Q06704O88868
$$ 44285347 44988775 45402052 46058767 46802759 47339072 48197764 49011521 49818225 50507093
2964E0507093P23446J036399J026975J028468J022706J107851J041820J069111
$$ 50507093 51230539 52266938 53293913 54322381 55345087 56452938 57494758 58563869
2956E8563869J143338J082594J202156J286472J307180O40141O11958J147548
$$ 58563869 59707207 60789801 61991957 63278429 64585609 65225750 65837708 66985256
2948F6985256Q53905Q69707J258547J458636J388737J638098J607681J943780
$$ 66985256 67839161 68708868 69967415 71426051 72814788 74452886 76060567 78004347
2940G8004347K472437K153611K472372K882946K792297L025781L314750L726409
$$ 78004347 80476784 82630395 85102767 87985713 90778010 93803791 97118541 100844950
2932A00844950M204604M457327N075333N111492N527760O345086O654851O554901
$$ 100844950 105049554 109506881 114582214 119693706 125221466 131566552 138221403 144776304
2924A44776304O650312O358748N255945M021546K934292K117522J948043R61454
$$ 144776304 151426616 157785364 163041309 167062855 169997147 172114669 174062712 175024166
2916A75024166k40940j739566k981089m002517m352868m059071l309362k443329
$$ 175024166 174783226 173043660 170062571 166060054 161707186 157648115 154338753 151895424
2908A51895424j655605n07440k232J105599K128993K801394L424690L914253M703734
$$ 151895424 150239819 149732379 149730147 150835746 152964739 155766133 159190823 163105076 167808810
2899A67808810N157014N657013O063890O091198N480445M881850L738490K489207
$$ 167808810 172965824 178622837 184686727 190777925 196258370 201140220 204878710 207367917
2891B07367917J743253R91012J499449J402554K757465L635477M659812O422391
$$ 207367917 209111170 210102182 211601631 213004185 215761650 219397127 224056939 230479330
2883B30479330P337334Q376907R273301J0836396J2277766J3625654J3950363
$$ 230479330 237816664 246193571 255466872 266303268 278581034 292206688 306157051
2876C06157051J3524312J1417361R032835O079922L538449M94161k618360n219977
$$ 306157051 319681363 331098724 340131559 346211481 349749930 350244091 347625731 342405754
2868C42405754p266114q391388r012958r021214r014322q655005q484898q193473
$$ 342405754 335139640 326748252 317735294 308714080 299699758 291044753 282559855 274366382
2860B74366382p886281p389162o529569o464879n924886n107108m743056m503354
$$ 274366382 266480101 259090939 252561370 246096491 240171605 235064497 230321441 225818087
2852B25818087m302102l523814l108688k622525j839416j466307o97027P9071
$$ 225818087 221515985 217992171 214883483 212260958 210421542 208955235 208258208 208337279
2844B08337279P46643J030593J155928Q96393j37313j222447l309622m988054
$$ 208337279 209083922 210114515 211270443 212166836 212029523 210807076 207497454 202509400
2836B02509400p229986q723846r643333r893269r759122r364014q875648q083804
$$ 202509400 195279414 186555568 176912235 167018966 157259844 147895830 139020182 130936378
2828A30936378p310015o625220o160594n627024m800312m442632l929183l756437
$$ 130936378 123626363 117001143 110840549 105213525 100413213 95970581 92041398 88284961
2820H8284961l468126l004399l012168k461424k533259k586773k288960k555115
$$ 88284961 84816835 81812436 78800268 76338844 73805585 71218812 68929852 66374737
2812F6374737k751722k003917k178802k089946j831810j856298j789298j510908
$$ 66374737 63623015 61619098 59440296 57350350 55518540 53662242 51872944 50362036
2804E0362036j421062j235394j382221j196184j066723j096676j188506r80880
$$ 50362036 48940974 47705580 46323359 45127175 44060452 42963776 41775270 40794390
2796D0794390p83537j216089r81215q57647p36553n89706o06381j012392j082853
$$ 40794390 40010853 38794764 37813549 36955902 36219349 35629643 35023262 34010870 32928017
2787C2928017o39258o41594n04999o06271q76967n48319l48422o29134o92009
$$ 32928017 32288759 31647165 31142166 30535895 29658928 29110609 28762187 28133053 27441044
2778B7441044o96133o94082l74494l61193n21245o94699j36126n37859m02589
$$ 27441044 26744911 26050829 25676335 25315142 24793897 24099198 23963072 23425213 23022624
2769B3022624l07917m64998m97680k93874l01615j94646k91959l74626l67605
$$ 23022624 22714707 22249709 21752029 21458155 21156540 20961894 20669935 20295309 19927704
2760A9927704l16676n50833m09682k18516j94085m43975k64662j26015m10051
$$ 19927704 19611028 19060195 18650513 18431997 18237912 17793937 17529275 17403260 16993209
2751A6993209m75948n14933l38310m73951o8740j59166Q5991k38765m37609p4185
$$ 16993209 16517261 16002328 15664018 15190067 15121327 14962161 15048152 14809387 14371778 14297593
2741A4297593k88073l07634m936l2561l43604l49103j83331n2908p1080J18113
$$ 14297593 14009520 13701886 13696950 13664389 13320785 12971682 12788351 12735443 12664363 12782476
2731A2782476l52772p2502j56868j85002j72430l11790l37310k55800l5780o0680
$$ 12782476 12429704 12357202 12200334 12015332 11842902 11531112 11193802 10938002 10902222 10841542
2721A0841542j7026j06361l46419n3067K3703l19960p7745J11962l57906j50903
$$ 10841542 10824516 10718155 10371736 10318669 10342372 10022412 9944667 10056629 9698723 9547820
2711I547820k1920p2331j05167j32926m1042n9437l39795j38529J78947J45296
$$ 9547820 9525900 9453569 9348402 9215476 9174434 9114997 8775202 8636673 8815620 8960916
2701H960916Q4620l24888k02231n4564j42105k32880j70454j33023L4592j61952
$$ 8960916 9045536 8720648 8518417 8463853 8321748 8088868 7918414 7785391 7819983 7658031
2691G658031J18955N0983l33543j34397J89879L611k71943j33770M6674o7086
$$ 7658031 7776986 7827969 7494426 7360029 7549908 7553519 7281576 7147806 7194480 7127394
2681G127394j80836M8901j11018k20662k23161J468Q343j24293P003j0190j48105
$$ 7127394 6946558 6995459 6884441 6663779 6440618 6442086 6450429 6326136 6333139 6322949 6174844
2670F174844K15829N9804j65125K47108L6740j10476k19640r0762j43639k9256
$$ 6174844 6390673 6450477 6285352 6532460 6569200 6458724 6239084 6148322 6004683 5975427
2660E975427j32466j38687K96334o0659j85407M3446l01524k4768M9193M2196
$$ 5975427 5842961 5704274 6000608 5939949 5754542 5797988 5496464 5471696 5520889 5563085
2650E563085l04824J50081j06318L0485K68566l32164o6913J4245N8163K11029
$$ 5563085 5258261 5408342 5302024 5332509 5601075 5268911 5201998 5216243 5274406 5485435
2640E485435k94201o511J90152L9576j58740k73366K25394k45890K69026J52957
$$ 5485435 5191234 5184723 5374875 5414451 5255711 4982345 5207739 4961849 5230875 5383832
2630E383832l23921l67323J29979J95131j12741j13569k2772J2661J16908o4931
$$ 5383832 5059911 4692588 4822567 5017698 4904957 4791388 4768616 4781277 4898185 4833254
2620D833254p453k31245k73247J2957m5827o2819R3755L47953k49798K93509q141
$$ 4833254 4825801 4594556 4321309 4334266 4288439 4225620 4319375 4667328 4417530 4711039 4702898
2609D702898k40947j79964q381K9524m2951k56917L92080M0856K5951k4127j71480
$$ 4702898 4461951 4281987 4273606 4303130 4260179 4003262 4395342 4436198 4462149 4438022 4266542
2598D266542P8255n7937Q2209Q6616P0377r7725J03586J48923O9053N4395j83688
$$ 4266542 4344797 4286860 4369069 4455685 4526062 4428337 4531923 4680846 4749899 4804294 4620606
2587D620606J5481N809q2639J1692l05709j89857J15900L35795j70180j89559
$$ 4620606 4636087 4641896 4559257 4570949 4265240 4075383 4191283 4527078 4356898 4167339
2577D167339m10894k98610K42801K67359j69940O9040k59639l32365J73354l4946
$$ 4167339 3756445 3457835 3700636 3967995 3798055 3867095 3607456 3275091 3448445 3413499
2567C413499q1665K52893j59218o6663j58216j2872P6503R7614L1640j36152m4414
$$ 3413499 3331834 3584727 3425509 3358846 3200630 3187758 3264261 3361875 3393515 3257363 3212949
2556C212949N5291j29543L450J39576J48196j23940l97463j77694J35563l0938
$$ 3212949 3268240 3138697 3142147 3281723 3429919 3305979 2908516 2730822 2866385 2835447
2546B835447J38647J07387m43258R78j77307k18201J29662o7886J43109K0107
$$ 2835447 2974094 3081481 2638223 2639201 2461894 2243693 2373355 2305469 2448578 2468685
2536B468685j53210K26292l70287M7027J74700l12042k1825j24177P878J95300
$$ 2468685 2315475 2541767 2171480 2218507 2393207 2081165 2059340 1935163 1943041 2138341
2526B138341p1359m0301K44360j04295Q2774k02092L8012j83645j39281L7454
$$ 2138341 2066982 2026681 2271041 2166746 2249520 2047428 2085440 1901795 1762514 1799968
2516A799968q8500K40781L5037L6754l73930p9358j03836k8061p7220J23034K86193
$$ 1799968 1711468 1952249 1987286 2024040 1650110 1570752 1466916 1438855 1361635 1484669 1770862
2505A770862O6474n0274k18086q3211O2712L27060j17791l10818l9661p9935K09615
$$ 1770862 1837336 1787062 1568976 1485765 1548477 1875537 1757746 1446928 1407267 1327332 1536947
2494A536947L0781j07997k3131n9404O4125l0807Q8837l2748j95335J05381n5503
$$ 1536947 1567728 1459731 1436600 1377196 1441321 1410514 1499351 1466603 1271268 1376649 1321146
2483A321146l8651M4719J03796K3492m9214P484j61061J90430j82627j4860J69692
$$ 1321146 1282495 1327214 1431010 1454502 1405288 1412772 1251711 1442141 1259514 1244654 1414346
2472A414346K60560k21574k75804L37685K6897j25111k34709m4840M29516j90396
$$ 1414346 1674906 1453332 1177528 1515213 1542110 1416999 1182290 1137450 1566966 1376570
2462A376570J94385j86280k30514J30054j76541J67782O2782L2632j69014j49614
$$ 1376570 1570955 1384675 1154161 1284215 1107674 1275456 1338238 1370870 1201856 1052242
2452A052242K29117l2659k77498K1223j11336J24463K22685R0542q333j00182
$$ 1052242 1281359 1248700 971202 992425 881089 1005552 1228237 1318779 1310446 1210264
2442A210264l99956J56989J5835p3670q6347L20747k71832J89311o9273q4415
$$ 1210264 810308 967297 983132 909462 823115 1143862 872030 1061341 992068 907653
2432I07653j29692J92411M5347l64721K00718M4372J01707k06938J01832o4512
$$ 907653 777961 970372 1015719 650998 851716 896088 997795 790857 892689 828177
2422H28177j48166N43J78330K41894j74103n2560j16776j88613J04645k5611L8437
$$ 828177 680011 680554 858884 1100778 926675 874115 757339 568726 673371 647760 686197
2411F86197j83220J07364K89778J88528K9238k14929q8982q7694Q6299J9400M2449
$$ 686197 502977 610341 900119 1088647 1117885 902956 813974 726280 812579 831979 874428
2400H74428K1499Q3509j677j6341J20306j53081r2520J25924o6454R9722p7143
$$ 874428 895927 979436 977759 961418 1081724 928643 836123 962047 895593 995315 918172
2389I18172K7378j5862k7559N8237J88077k30032j6295j9157J82435K51630j57263
$$ 918172 945550 929688 902129 960366 1148443 918411 902116 882959 1065394 1317024 1159761
2378A159761J03587m725k28936k05391J15276K876j05802k79409K7020R9834K89870
$$ 1159761 1263348 1258623 1029687 824296 939572 942448 836646 557237 584257 684091 973961
2367I73961k16170o5591J7171K2551J1245j28568J18799J78804j38979O3924O8865
$$ 973961 757791 692200 709371 731922 743167 614599 733398 912202 773223 837147 906012
2356I06012j3291k0712O3926r2978r6648m983J88094N6620r4309m221p3494n5816
$$ 906012 892721 872009 935935 842957 746309 741326 929420 986040 891731 887510 814016 758200
2344G58200k1313j70059j00882J48590L06657k03371L3164j38233P1966j6761
$$ 758200 736887 566828 465946 614536 921193 717822 750986 612753 684719 667958
2334F67958K0569j9192r5488J30133k58962l0146J81643j68619J39715J5854r974
$$ 667958 688527 669335 573847 703980 445018 414872 596515 427896 567611 583465 573491
2323E73491J31394R4892O2509k82676K9020J18002R1012R5936k16733j31771o7807
$$ 573491 704885 799777 862286 579610 608630 726632 817644 913580 696847 565076 497269
2312D97269L59776m309k03926N3763j70387J04341J6515L9234J14007J8860P8647
$$ 497269 857045 852736 648810 702573 532186 636527 653042 692276 806283 825143 903790
2301I03790J10093k50434j67745J30684o6353j4795J02153k55454l10466J38442
$$ 903790 1013883 763449 595704 726388 660035 645240 747393 491939 181473 319915
2291C19915L96960o4845k79746m7080P3903J6124J29619m4858J64760L30308k79787
$$ 319915 716875 652030 372284 325204 399107 415231 544850 499992 664752 995060 715273
2280G15273r930J99276j89674o3218k8068R9181N5226o0341o245j52643m4454
$$ 715273 705343 904619 714945 651727 623659 722840 778066 717725 711480 558837 514383
2269E14383K32471K44186L8426m07134o9620k28122J52601J44138j16042R0067
$$ 514383 746854 991040 1029466 622332 552712 324590 477191 621329 505287 595354
2259E95354R9649N1127J89608K39500j3536k09107o7898k32904L6265J03350K53059
$$ 595354 695003 746130 935738 1175238 1161702 952595 884697 651793 688058 791408 1044467
2248A044467r6342r1594N1150j18018J2492r1990K95616K04032j2190J15575l54706
$$ 1044467 948125 856531 907681 789663 802155 710165 1005781 1209813 1197623 1313198 958492
2237I58492l49753L6327K65761J65137o4777k57012r2604J44315m0862J93534
$$ 958492 608739 645066 910827 1075964 1011187 754175 661571 805886 765024 958558
2227I58558q7743j71830K95113R6252q0988p9053l781m4403R7223m05963J33992
$$ 958558 870815 698985 994098 1090350 1009362 930309 926528 882125 979348 573385 707377
2216G07377L67321k6603n1488J58134n702L1689K20610l07866Q87n9610L18952
$$ 707377 1074698 1048095 996607 1154741 1149039 1180728 1401338 1093472 1094359 1034749 1353701
2205A353701J35219j9242M784q9030J87106N4002J1008O0198R2941k30998n7115
$$ 1353701 1488920 1469678 1474462 1385432 1572538 1626540 1637548 1697746 1790687 1559689 1502574
2194A502574R9884J01258J17932J17561j87294j09607j17182M387P6384r2818
$$ 1502574 1602458 1703716 1821648 1939209 1751915 1642308 1525126 1529513 1605897 1513079
2184A513079N0319P1110M2878K67592k7805R9174O8730Q4879J11789o8388J08746
$$ 1513079 1563398 1634508 1677386 1944978 1917173 2016347 2085077 2169956 2281745 2213357 2322103
2173B322103K87223J32808j01703J59130J23886K8404R5482J91173m16866R493
$$ 2322103 2609326 2742134 2640431 2799561 2923447 2951851 3047333 3238506 2821640 2831133
2163B831133L01979J05575K49646J7768N8191J44912K4932n1129j0583K92950
$$ 2831133 3133112 3238687 3488333 3506101 3564292 3709204 3734136 3683007 3672424 3965374
2153C965374J83955O3121j7748L42559J37503J19694L50608K54551j25403J67723
$$ 3965374 4149329 4212450 4194702 4537261 4674764 4794458 5145066 5399617 5274214 5441937
2143E441937M41738l6996K11002M33172J30730M91130J50997N41933K3176K88662
$$ 5441937 5883675 5846679 6057681 6490853 6621583 7112713 7263710 7805643 7828819 8117481
2133H117481L97530O39780N92643L98156O25979R39501J452790R76622K60928
$$ 8117481 8515011 9154791 9747434 10145590 10771569 11711070 13163860 14140482 14401410
2124A4401410R50678L63973P44233J476400K034888K372077K747459L737692N017215
$$ 14401410 15352088 15716061 16460294 17936694 19971582 22343659 25091118 28828810 33846025
2115C3846025O463993J0434233J6236486K1728658Q687534p989397j3477876j6037634
$$ 33846025 40310018 50744251 66980737 88709395 97396929 89407532 75929656 59892022
2107E9892022j2690423r515143o661305m951081l696991k891968j829936j793160
$$ 59892022 47201599 37686456 31025151 26074070 22377079 19485111 17655175 15862015
2099A5862015j330850r09431o16727q55054j024718j082901m24834p00238p37444
$$ 15862015 14531165 13621734 13005007 12149953 11125235 10042334 9617500 8917262 8179818
2090H179818o89039m13809l20554m25896m97512j28292l24600j12244k70103j09596
$$ 8179818 7490779 7076970 6756416 6330520 5833008 5704716 5380116 5267872 4997769 4888173
2080D888173k91233j96211j47024k45608k48655r3707j58354k32839K34871l2610
$$ 4888173 4596940 4400729 4253705 4008097 3759442 3665735 3507381 3274542 3509413 3476803
2070C476803l04957p7859k96093J29555n5903p0636j03456l20605k0724k31139
$$ 3476803 3171846 3093987 2797894 2927449 2871546 2800910 2697454 2376849 2356125 2124986
2060B124986J11772N6362N1964Q4949k3455l4221k21207l8620j25406j57038o4502
$$ 2124986 2236758 2293120 2345084 2430033 2406578 2372357 2151150 2112530 1987124 1830086 1765584
2049A765584M0845k1903R1146O271k82829j00696r019l61682n9746K25591o3458
$$ 1765584 1806429 1784526 1875672 1881943 1599114 1498418 1489399 1127717 1067971 1293562 1230104
2038A230104m4383j01676j70796L46840Q4815j62647R568p0708k7625l187j8296
$$ 1230104 1185721 1084045 913249 1260089 1344904 1182257 1191825 1121117 1093492 1090305 1072009
2027A072009j30806J02632r4372j65011J51784J11530r8154k1091j1123j65902
$$ 1072009 941203 1043835 949463 784452 936236 1047766 949612 928521 917398 751496
2017G51496M4163j0706p49R1624p3099j31594l1374K63634q0633j56806k69647
$$ 751496 795659 784953 784204 875828 802729 671135 639761 903395 822762 665956 396309
2006C96309J5942n6018O4006J21583Q4071K07554K6732o2414o0761n0838J1448
$$ 396309 412251 356233 420239 541822 625893 833447 860179 797765 737004 686166 697614
1995F97614k9466o5962J42000j16179j00548K62833N7310k21558O1979R5257q1431
$$ 697614 668148 602186 744186 628007 527459 790292 847602 626044 688023 783280 701849
1984G01849J15615j4495j43269k04168J00764J99142j26766m27325J17411j30211
$$ 701849 817464 802969 659700 455532 556296 755438 628672 201347 318758 188547
1974A88547P5451J60671L26783J97681k71400k84801M8192J47968j7685J28049
$$ 188547 263998 424669 751452 949133 677733 392932 441124 589092 571407 699456
1964F99456k23166N8373K16201k40921Q4133p0813j43275J88629O4370K9200m2615
$$ 699456 476290 534663 750864 509943 594076 523263 379988 568617 632987 662187 619572
1953F19572L1229J21250N3727j32735j8687j33802P3774q3728j94573P744J95612
$$ 619572 650801 772051 825778 693043 674356 540554 614328 530600 336027 343771 539383
1942E39383M1579o8281j12733j8357Q1783P7294j68971j50368K31531R1331j22265
$$ 539383 580962 512681 399948 381591 463374 540668 371697 221329 452860 544191 421926
1931D21926m4032L77784l42733j67251K81478K17538k8915l70186q7891p579L3365
$$ 421926 377894 755678 412945 245694 527172 744710 715795 345609 257718 250139 283504
1920B83504q8687J17551l0959k94278L75693J94637j49900j6075L4251J22380
$$ 283504 194817 312368 281409 -12869 362824 557461 407561 391486 425737 548117
1910E48117k1854J7911l40520R5595N8904J50738k26070N5827n7639l31921K37343
$$ 548117 526263 544174 203654 299249 358153 508891 282821 338648 281009 -50912 186431
1899A86431J9185J77109o9414L5367k07439K15039K01251j62829K2232J10056
$$ 186431 205616 382725 313311 348678 141239 356278 557529 394700 416932 526988
1889E26988J1917p3879l12162K41080L853J6508q0177J90201J51487O9271l05424
$$ 526988 538905 465026 152864 393944 397797 414305 334128 524329 675816 745087 439663
1878D39663k12266P7268l6216o6529J21628R3133m43803J57348n8141Q2695J75870
$$ 439663 227397 304665 268449 201920 323548 416681 -27122 130226 72085 154780 330650
1867C30650L6735J01375k64537L6984o7906j60468K96921K18185l3372k36204
$$ 330650 367385 468760 204223 241207 173301 12833 309754 527939 494567 258363
1857B58363r2875j57927N26805j12572l45896J41775K01362N9652J04355k32350
$$ 258363 165488 7561 534366 421794 75898 217673 419035 478687 583042 350692
1847C50692L4663J10587J09377q2936J23709r9211J56906l32979j59181O5143
$$ 350692 385355 495942 605319 522383 646092 546881 703787 370808 211627 276770
1837B76770L29451j25090l64104K5182j82078J51788r5145J31523L96107J0214
$$ 276770 606221 481131 117027 142209 -39869 111919 16774 148297 544404 554618
1827E54618l9592j1275k42032N0521j32093J4435Q0334J5233J26803Q5178j98671
$$ 554618 515026 503751 261719 312240 180147 194582 274916 290149 416952 502130 303459
1816C03459L22185L740j29711j36600j20093j41090p3965Q2635k6871k80274P8329
$$ 303459 625644 629384 499673 363073 242980 101890 27925 110560 83689 -196585 -118256
1805a18256L64415Q463r8285k5030J1461J0900j06028M6488K34211j32804k19722
$$ -118256 246159 254622 156337 131307 142768 153668 47640 94128 328339 195535 -24187
1794b4187J06438Q4047N6573l731k78363L62219J89994l01157K7802j18175J85646
$$ -24187 82251 166298 222871 219140 -59223 302996 492990 191833 219635 101460 287106
1783B87106J54931k9427k95007j0589L7478O906k10756O2912j7442M112K61441
$$ 287106 442037 412610 117603 107014 144492 151398 -59358 3554 -13888 -9776 251665
1772B51665m768j66265k00114K59409k01468L5803L06513j33532J24257J57344
$$ 251665 246897 80632 -119482 139927 -61541 -25738 280775 147243 271500 428844
1762D28844l2130l21746m029K11112q7232j8253l3967R7230m099M0947J8757r056
$$ 428844 396714 74968 70939 282051 194819 176566 142599 239829 235730 276677 295434 286378
1750B86378J77891k51592j73936j59495K40108j4689l02515j6539M6203J45113
$$ 286378 464269 212677 38741 -120754 119354 104665 -197850 -214389 -168186 -23073
1740b3073j69460K13617j87176m787o4625J16427K68256Q9347m10097J33060K13225
$$ -23073 -192533 21084 -166092 -170879 -235504 -119077 149179 238526 -171571 -38511 174714
1729A74714J01750j11621k09899K80133k26005j76962M5537Q9025J34628q1514
$$ 174714 276464 164843 -45056 235077 9072 -167890 -122353 -33328 101300 19786
1719A9786j0730j45431j12467j0857J30302n805K3277J01166M4227p9286j20527
$$ 19786 9056 -136375 -248842 -259699 -129397 -135202 -111925 -10759 33468 -45818 -166345
1708a66345K01253J41004L62559j95451k36567k7488k8546J37720N6518m2735
$$ -166345 34908 175912 538471 343020 106453 78965 50419 188139 244657 201922
1698B01922j27359L6739r2088K11742L9082k42782J32894O9111j77574j69252
$$ 201922 74563 111302 19214 230956 270038 27256 160150 229261 51687 -117565
1688a17565q3642O7198P9560k01035Q370L04130l3073k25622L87152J7379j45469
$$ -117565 -201207 -134009 -54449 -255484 -247114 57016 23943 -201679 185473 202852 57383
1677E7383o98O7884j64192K8919P2562j52723P0640k49483j6626J71427J36217
$$ 57383 56685 124569 -39623 -10704 61858 -90865 -20225 -269708 -286334 -114907 21310
1666B1310J30989N3321n5492k46104k06181L25735J5965r4825Q6425j37608L70772
$$ 21310 152299 205620 150128 -95976 -302157 23578 39543 -55282 31143 -106465 264307
1655B64307j47395k12031m7223m0156L78862J48981p8123j06681j17752K22680
$$ 264307 116912 -95119 -142342 -182498 196364 345345 267222 160541 42789 265469
1645B65469l1384R1765j79282k9042J10708p566k59967K8456k20217Q9542J33041
$$ 265469 234085 325850 146568 117526 228234 220668 -39299 -10843 -231060 -141518 -8477
1634h477p9899J1047m5106K1597J2859N7132r124k50444Q8431J87044j56937P3692
$$ -8477 -88376 -77329 -122435 -100838 -87979 -30847 -39971 -290415 -201984 -14940 -171877 -98185
1622i8185K31073J2590j15908k52365N4896K12091j86286o7454M3671K53264l2232
$$ -98185 132888 145478 29570 -222795 -167899 44192 -142094 -209548 -165877 87387 55155
1611E5155j37389J2662J3427q823j24483J59264Q3918J45377r4516k83916m201
$$ 55155 -82234 -69572 -56145 -64968 -189451 -30187 53731 199108 104592 -179324 -183525
1600a83525J72228m4346J02123p6519n7691K61388k82653j79101k95696L79857
$$ -183525 -11297 -55643 46480 -30039 -87730 173658 -108995 -288096 -583792 -203935
1590b03935J48940K87J54421J66716k54274J98545l4590O5459j01804K37570j61175
$$ -203935 -54995 -54708 99713 266429 12155 210700 176110 241569 139765 377335 216160
1579B16160k72471J9687L773M6372J83518J58014r7307k21668J14660k7044L5929
$$ 216160 -56311 -36624 -32851 13521 197039 355053 257746 36078 150738 123694 159623
1568A59623J16648n6545J11080l8883r5931j40565J02803r4650j35050k11781
$$ 159623 276271 219726 330806 291923 195992 55427 158230 63580 -71470 -283251
1558b83251J44235M4678N6314K06818r9517L2293j43626p8026L08131j85331j33466
$$ -283251 -139016 -94338 -38024 168794 69277 101570 -42056 -120082 188049 2718 -130748
1547a30748o7148k8259j9270N755R6092L4030j16183K28118K8178J9173k1757
$$ -130748 -197896 -226155 -245425 -239670 -143578 -109548 -225731 2387 30565 49738 27981
1536B7981k11954K72192M8968N6133r5142j8014o2997k9750J51296J4763k06926
$$ 27981 -183973 88219 137187 193320 98178 80164 17167 -12583 138713 153476 -53450
1525e3450l10924J89466K79300o6277J40029j8115m0879o3278P4531J6589n8657
$$ -53450 -364374 -174908 104392 38115 178144 160029 119150 55872 130403 146992 88335
1514H8335l22905j45493j45339J04886L06489J98471k28614O4561J90273l6833
$$ 88335 -234570 -380063 -525402 -420516 -114027 84444 -144170 -79609 110664 73831
1504G3831j00110n481K54308R1134j25595N6013n3314l10481J77662L8714p3119
$$ 73831 -26279 -31760 222548 313682 188087 244100 190786 -119695 57967 96681 23562
1493B3562r1267K86880m3714N2321n659k7162o5981M597j17814L31036j15339
$$ 23562 -67705 219175 175461 227782 222123 194961 128980 133577 15763 346799 231460
1482B31460m81448J60418RJ76591K84639J43440o2774l54556l9202p5217L09709
$$ 231460 -249988 -89570 -89561 87030 371669 515109 452335 97779 58577 -16640 293069
1471B93069j98043J16139M7941l04547l88152K22230K18440o3897o8949q0278
$$ 293069 95026 211165 259106 -45441 -433593 -211363 7077 -56820 -125769 -206047
1461b06047o0265Q0010J03032K47383L7130k63727j54336O7802J87180o3579P2511
$$ -206047 -266312 -186302 -83270 164113 201243 -62484 -216820 -149018 38162 -25417 47094
1450D7094q5976P5714o6070l2085L78488O4442q4893l57507K20371j54844r7293
$$ 47094 -38882 36832 -29238 -61323 317165 381607 296714 -60793 159578 4734 -92559
1439i2559M7657k3001J37632N2125k141J25878L2982k68929k15244j16314O4159
$$ -92559 -44902 -67903 69729 121854 119713 245591 278573 9644 -205600 -321914 -257755
1428b57755L05120Q2011k6295Q0852k6868J68572k26757l0914j37025j24896J67334
$$ -257755 47365 129376 103081 183933 157065 325637 98880 67966 -69059 -193955 -26621
1417b6621L18860r8561j33911p2464j41924R7288O2108j4247j30822J07447O8903
$$ -26621 292239 193678 59767 -12697 -154621 -57333 4775 -9472 -140294 -32847 36056
1406C6056j88582J4512N2583L74376l8202O9209j36775j45352j19422J27035j53368
$$ 36056 -152526 -138014 -85431 288945 250743 319952 183177 37825 -81597 45438 -107930
1395a07930j1955N5104J64615q0926J20388m6312K4343k72806J8715j644N3572
$$ -107930 -119885 -64781 99834 18908 139296 92984 117327 -155479 -136764 -138408 -84836
1384h4836J30112j30139j74116K65253L6288l3335J83674j45090k45666j32830
$$ -84836 45276 -84863 -258979 6274 42562 9227 192901 47811 -197855 -330685
1374c30685J13182M8503J08918j07629K39492J36082o0351l83065J38475j5290
$$ -330685 -217503 -169000 -60082 -167711 71781 207863 147512 -235553 -97078 -112368
1364a12368j00675j2054j5940M1765J35925L4114R1652k2512o2218J10716j73832
$$ -112368 -213043 -225097 -241037 -199272 -63347 -29233 62419 39907 -22311 88405 -85427
1353h5427j9881j10218k3002J765m149J81161R1890J93675j37843J1050K48741
$$ -85427 -105308 -215526 -238528 -236763 -240912 -59751 32139 225814 87971 99021 347762
1342C47762j05440J44191m788j95597j57199r7435m9079J84198J94267K17595
$$ 347762 242322 386513 381725 186128 28929 -68506 -117585 66613 260880 478475
1332D78475k03320j23946J73979j48377j86181j86420K8152J34050J55181m20255
$$ 478475 275155 151209 325188 176811 -9370 -195790 -167638 -33588 121593 -298662
1322b98662k2719o0490O8796P2137J43011J79100j54485l2003n4431L5693k2849
$$ -298662 -321381 -381871 -313075 -240938 -97927 81173 -73312 -105315 -159746 -124053 -146902
1311a46902J93284k23795l63654m8420L31275J57637j97326J18353Q2785j48963
$$ -146902 46382 -177413 -541067 -589487 -258212 -100575 -297901 -179548 -96763 -245726
1301b45726R0215J40872j43624j58870J67393L69124l12422J3393j8352k5254
$$ -245726 -155511 -14639 -158263 -317133 -149740 219384 -93038 -79645 -97997 -123251
1291a23251P7574P375n6954j07709K02516n387M2267L694J61237J05512k69862
$$ -123251 -45677 -38302 -95256 -202965 -449 -5836 36431 40125 201362 306874 37012
1280C7012k7747J7377j12407n9259P6867R3648j10949j5056k0736r99M1587j19402
$$ 37012 9265 26642 -85765 -145024 -68157 25491 -85458 -100514 -121250 -122249 -80662 -200064
1268b00064J77815Q865o1996J42210K0147j89027Q9273J64292R2301l36458k17110
$$ -200064 -22249 -13384 -75380 66830 86977 -102050 -12777 151515 243816 -92642 -309752
1257c09752K05365K6717r6432n5989J48574K24198J73203o1204j74069j3490Q8958
$$ -309752 -104387 -77670 -174102 -230091 -81517 142681 315884 254680 80611 67121 156079
1246A56079j06355k57762l82798K46818J94100J97535q4217j97242m9105J85020
$$ 156079 49724 -208038 -590836 -344018 -149918 47617 -36600 -233842 -282947 -97927
1236i7927K79174j36510k58817k61731K79044J78362J80450K87778j26757j96437
$$ -97927 181247 44737 -214080 -475811 -196767 -18405 162045 449823 323066 126629
1226A26629J4208j21398J92934O470M6059r0578j15474q0504O3241Q664j51021
$$ 126629 140837 19439 212373 218843 264902 174324 58850 -21654 41587 50251 -100770
1215a00770r2560J80521J9859O795J3413Q8059J87889j86697J66481j52772j94795
$$ -100770 -193330 -12809 7050 13845 27258 115317 303206 116509 282990 130218 -64577
1204f4577m1681M8167k4844m7074n3815q6841k0550K53819J30500j35391q2722
$$ -64577 -106258 -58091 -82935 -130009 -183824 -270665 -291215 -37396 93104 -42287 -125009
1193a25009j47857J43795J4551Q7278P2191n6674m0720J14544J2395n3241L6664
$$ -125009 -272866 -129071 -114520 -27242 44949 -11725 -52445 62099 74494 21253 57917
1182E7917J64446M7488l82382L3714j42637j51543j0796L07715j7480j4142J71237
$$ 57917 222363 269851 -112531 -78817 -221454 -372997 -383793 -76078 -93558 -107700 63537
1171F3537j66475L4215J64062Q2363k5930j1420J91000k78985p9082L7241j11213
$$ 63537 -102938 -68723 95339 177702 151772 140352 331352 52367 -26715 10526 -100687
1160a00687J20007m388J37680k9495k7045j00193j03647J64103J5172R4489k37220
$$ -100687 19320 14932 152612 123117 96072 -4121 -107768 56335 71507 165996 -71224
1149g1224p3816j7058L9742J24238j23178k34521J09788K52250j10489J1064j00264
$$ -71224 -145040 -162098 -122356 1882 -121296 -355817 -246029 6221 -104268 -93204 -193468
1138a93468k6703j0667K5889j67382j07446Q8988J37905J94422J90478j99927
$$ -193468 -220171 -230838 -204949 -372331 -479777 -390789 -252884 -58462 132016 -67911
1128f7911Q7381j34108k1197M4626k00621J92618J97816m2195j03788r2450J19272
$$ -67911 19470 -114638 -135835 -91209 -291830 -99212 98604 56409 -47379 -139829 -20557
1117b0557K32896l37797k17029M00827J69346k01222j7630k08400l8405n2803
$$ -20557 212339 -125458 -342487 58340 227686 26464 8834 -199566 -237971 -290774
1107b90774K2414J83080l7368P2540K54801j04628j55165J35988j93857m3391
$$ -290774 -268360 -85280 -122648 -50108 204693 100065 -55100 80888 -112969 -156360
1097a56360Q3385k0584O859p2595k76209J6524M05569J51428K75610j38893j84106
$$ -156360 -72975 -93559 -86700 -159295 -435504 -418980 -13411 138017 413627 274734 90628
1086I0628l00373k80029K38970K82866n831P1792j59301L6573j95214M11844K26241
$$ 90628 -209745 -489774 -250804 32062 26231 98023 -61278 -24705 -219919 191925 418166
1075D18166j76159j4407l48393l16120N0383K86307J30644J89820j19355r7052
$$ 418166 242007 227600 -120793 -436913 -386530 -100223 30421 220241 100886 3834
1065C834l3018q8916J16055q5464P1168J38724N767l6537j16381q9249l583R7583
$$ 3834 -29184 -118100 -2045 -87509 -16341 122383 128150 91613 -24768 -114017 -117600 -20017
1053b0017p3253m3606L28478K000j13430M3874k68290q6929J05960r834K83629
$$ -20017 -93270 -136876 191602 193602 80172 124046 -144244 -231173 -125213 -135047 148582
1042A48582j4951n6245m6294m2025J15158j23768j48304N7823P964P5358J46308
$$ 148582 133631 77386 31092 -10933 104225 -19543 -167847 -110024 -102060 -26702 119606
1031A19606k12020J87218k04197j63485J4417J36262j47493K03474J02073J56384
$$ 119606 -92414 94804 -109393 -272878 -258461 -122199 -269692 -66218 35855 192239
1021A92239j20455j98756J933J39599j19560J3245j39140K21982J1804j69765
$$ 192239 71784 -126972 -125039 14560 -105000 -91755 -230895 -8913 2891 -166874
1011a66874k06039K19444Q1319j37396K52257l3519l0317n2715K80871l9998m13444
$$ -166874 -372913 -153469 -72150 -209546 42711 9192 -21125 -73840 207031 167033 -246411
1000b46411O9200L1212p5928o9788O8672L32580o3219j38247J18717K7939J14757
$$ -246411 -177211 -145999 -221927 -291715 -223043 109537 46318 -91929 26788 54727 169484
989A69484j13623j30872q6567J63661L13857O3523p9826j05875n8137J1311o9371
$$ 169484 55861 -75011 -161578 2083 315940 379463 299637 193762 135625 146936 77565
978G7565J75423o995m51171J49933J8207O9501N7112l02691K4683J23727o1659
$$ 77565 252988 245993 -205178 -55245 -37038 32463 89575 -213116 -188433 -64706 -126365
967a26365L3837j17514P7868j1812K9661J38428k15117O8951J93998j50021J40630
$$ -126365 -92528 -210042 -132174 -143986 -114325 24103 -191014 -122063 71935 -78086 62544
956F2544k2250k5833J58760J25925k45591j74503N2650R1646Q8640j60644k74999
$$ 62544 40294 14461 173221 299146 53555 -120948 -68298 23348 111988 -48656 -323655
945c23655J09854Q9371J741j344P9908R1303J30752j23036j28677J64511p0306
$$ -323655 -213801 -124430 -122689 -124033 -44125 47178 177930 54894 -73783 90728 20422
934B0422k56491j82716K21020K97627k51277r164N8645m9482k08951N9168J98380
$$ 20422 -236069 -418785 -197765 99862 -151415 -160579 -101934 -151416 -360367 -301199 -102819
923a02819J22731M0941j8656N6303j16332N1242J7861j50026O3168P5926j7670
$$ -102819 19912 60853 42197 98500 -17832 33410 51271 -98755 -35587 40339 22669
912B2669N9887K1749k86335J7454J44140K90212j51527q8262N356m9986j15171
$$ 22669 82556 104305 -182030 -164576 -20436 269776 118249 29987 35343 -14643 -129814
901a29814L4458L08968P0464P393j85569j68217P3040j94359j74887N3772N9696
$$ -129814 -95356 213612 284076 291469 105900 -62317 10723 -183636 -358523 -304751 -245055
890b45055k06530k458L60056K04789j06443P5519j3120o8137j89767N9899K14714
$$ -245055 -451585 -454043 -93987 110802 4359 79878 66758 -1379 -191146 -131247 83467
879H3467k88340K00966K45797k45574l44577K18813J87252m7590r3181n2933L2407
$$ 83467 -204873 -3907 241890 -3684 -348261 -129448 57804 10214 -82967 -135900 -103493
868a03493j49568k3737k5320O0459L18768k1779L4249m2507J07385j49773N1546
$$ -103493 -253061 -276798 -302118 -241659 77109 55330 89579 47072 154457 4684 56230
857E6230K4364N5728j50881j83517N8650O3184K0815Q3400P430M487j45116j15722
$$ 56230 80594 136322 -14559 -198076 -139426 -76242 -55427 27973 35403 39890 -105226 -220948
845b20948J96465K5375P8264j10830K1612J39025j18719n173L7281k97663p4103
$$ -220948 -24483 892 79156 -31674 -10062 128963 10244 5071 42352 -255311 -329414
834c29414Q3553k6046J83354P4998M1581Q8758j97005j65286k5791j5473J92992
$$ -329414 -245861 -271907 -88553 -13555 28026 116784 -80221 -245507 -271298 -286771 -93779
823i3779N3348R1773J02387l0125Q1147j36878J1508R2842k34353m4115K25305
$$ -93779 -40431 51342 153729 123604 204751 67873 79381 172223 -62130 -106245 119060
812A19060o1569k87964j32284J91599J31606R8955r8111j73012K63669R7295J39112
$$ 119060 57491 -230473 -362757 -171158 -39552 59403 -38708 -211720 51949 149244 288356
801B88356O3701n6067l19858j29323o622k3924j22657o9730K51781Q9467r1187
$$ 288356 352057 295990 -23868 -153191 -159813 -183737 -306394 -376124 -124343 -34876 -126063
790a26063J91162L1010R9524j10217r0457M9413j26979O1994K5891l6839k25536
$$ -126063 65099 96109 195633 85416 -5041 44372 -82607 -20613 5278 -31561 -257097
779b57097k826j5507L6071M6078j3798J53295l1344J83826J5769k2711k38527
$$ -257097 -259923 -275430 -239359 -193281 -207079 -53784 -85128 98698 114467 91756 -146771
768a46771J16563J74331j0980j53506N4574k45221q4495M2325n9357J75253L2100
$$ -146771 -30208 144123 133143 -20363 34211 -211010 -295505 -253180 -312537 -137284 -105184
757a05184K16366L8367k7556q9107r4900j63674n523J82680N9142M2201k02826
$$ -105184 111182 149549 121993 32886 -62014 -225688 -231211 -48531 10611 52812 -150014
746a50014k6223L49802J57109J24822k9100j40031k33137r6209j66884J99086
$$ -150014 -176237 173565 330674 455496 426396 286365 53228 -42981 -209865 -10779
736a0779k3044j55615j1939K69029r8597L9889J90276p6518j9419j10835k39245
$$ -10779 -33823 -189438 -201377 67652 -30945 8944 199220 122702 103283 -7552 -246797
725b46797K7823N5487O8283J0826P0803j72323J24533J34736j9268J23174j10947
$$ -246797 -218974 -163487 -95204 -84378 -13575 -185898 -61365 73371 54103 177277 66330
714F6330j52503K1845j5262K00402m945J6667O0630o3741r5748j9325n2973P8565
$$ 66330 -86173 -64328 -79590 120812 115867 132534 193164 129423 33675 14350 -38623 39942
702C9942p5735p7396L11192J2866j36439l10096M8899q3611J56642j3752R3801
$$ 39942 -35793 -113189 198003 210869 74430 -235666 -186767 -270378 -113736 -127488 -33687
691c3687O3931j8170R440k85309J71287J09471l784k39128j16917k6364N6204
$$ -33687 30244 12074 21514 -263795 -92508 16963 13179 -225949 -342866 -369230 -313026
680c13026K93604P8291j21029j31932J68111k57496J65535M6014n8905N1094j95832
$$ -313026 -19422 58869 -62160 -194092 -25981 -283477 -117942 -71928 -130833 -79739 -275571
669b75571K36154R5171P462k07100q9188l8366n3493K1258K87290J35832j80044
$$ -275571 -39417 55754 63216 -143884 -233072 -271438 -324931 -303673 -16383 119449 -60595
658f0595p6372K80121j04773m4829l5337L2077k46350Q8064J32741j79838J81737
$$ -60595 -136967 143154 38381 -6448 -41785 -9708 -256058 -167994 -35253 -215091 -33354
647c3354R1775k9011j89692k9841l3354J54957J84436j21364J3303j24999M5119
$$ -33354 58421 29410 -160282 -190123 -223477 -68520 115916 -5448 7855 -117144 -72025
636g2025J99445k7695j32378k85413L70345l6246j50161k2789k50780p8905K03723
$$ -72025 127420 99725 -32653 -318066 52279 16033 -134128 -156917 -407697 -486602 -282879
625b82879K08236k9101j67179J56883M5614J1125k01536P1548J65219n6079L8325
$$ -282879 -74643 -103744 -270923 -114040 -68426 -57301 -258837 -187289 -22070 -78149 -39824
614c9824k946o9496Q937j83816j34969j70908P9801K63604Q9211Q0577j08836
$$ -39824 -42770 -112266 -103329 -287145 -422114 -593022 -513221 -249617 -160406 -79829 -188665
603a88665j0093L11032L9697k51269l59290o59L21200k0757o3938p9125J85273
$$ -188665 -198758 112274 151971 -99298 -458588 -459247 -138047 -158804 -222742 -301867 -116594
592a16594L30302j70656j93953n4257J49940k3141K3350J75653K65932k72092
$$ -116594 213708 43052 -150901 -205158 -55218 -78359 -55009 120644 386576 114484
582A14484k62768K13696J465p5864j72108j27219P921P7888m7796J65975j57483
$$ 114484 -148284 65412 66877 -8987 -181095 -308314 -300393 -222505 -270301 -104326 -261809
571b61809j03048k65831J93619J24466J19093J66832J58587q8460j82756O3852
$$ -261809 -364857 -630688 -437069 -312603 -193510 -26678 131909 43449 -139307 -75455
561g5455K74279n8460k81300j56349l7687L21240M7982J21083j52081k7863k22475
$$ -75455 198824 140364 -140936 -297285 -334972 -13732 34250 155333 3252 -24611 -247086
550b47086J11318j31424K23356J81447N3129l061n32605j8053K85410k75241J10528
$$ -247086 -135768 -267192 -43836 137611 190740 187679 -344926 -362979 -77569 -352810 -242282
539b42282L4614J22466K67988l5816k92019J9293J19369n6373J01376k21164k8230
$$ -242282 -207668 -85202 182786 146970 -145049 -125756 -6387 -62760 38616 -182548 -210778
528b10778j28245J15J75242j6072j36725J17759k3925J42802n1398p6990J4058
$$ -210778 -339023 -338908 -163666 -179738 -316463 -198704 -222629 -79827 -131225 -208215 -194157
517a94157J10654l5308J5514J15168K1047r3223J79705J42295k01010L4752j32252
$$ -194157 -83503 -118811 -103297 11871 32918 -60305 119400 261695 60685 95437 -36815
506c6815j22901K61771j36636j28661j1188o1119O3698j86202L2338J99691j02400
$$ -36815 -159716 102055 -34581 -163242 -174430 -235549 -171851 -358053 -325715 -126024 -228424
495b28424j8307q7963J52586R3918K34930j09065m5820Q8345J8542j73891K5011
$$ -228424 -246731 -334694 -182108 -88190 146740 37675 -8145 80200 98742 -75149 -50138
484e0138J54590R7086q2824j97995P411K01247k86440R9490j96527j13220J34854
$$ -50138 104452 201538 118714 -79281 -71870 129377 -157063 -57573 -254100 -367320 -232466
473b32466j20230K02336J20090K29487o9710R433j82134k18319N2805r1193j06990
$$ -232466 -352696 -150360 -30270 199217 129507 138940 -43194 -261513 -208708 -299901 -406891
462d06891j1265n4322L81773p5794P1248r8230j5851r3129j10294o9137J68596
$$ -406891 -418156 -472478 -90705 -166499 -95251 -193481 -209332 -302461 -412755 -481892 -313296
451c13296P5592m7586J00431J90572p064k3301L279J62460j13737P4628j11423
$$ -313296 -237704 -285290 -184859 5713 -1351 -24652 -21373 141087 27350 101978 -9445
440i445j50977j81246K51862O5920j34234O4002r5861k1384k64888J77325L11077
$$ -9445 -160422 -341668 -89806 -23886 -158120 -94118 -189979 -211363 -476251 -298926 12151
429A2151q695l5315m4099L04530k6773k13945J37600j72888R2793j91061O0769
$$ 12151 3456 -31859 -75958 228572 201799 -12146 125454 -47434 45359 -145702 -84933
418h4933J60770J34889j70351r8374j53835Q5468k492R7289J69275j56673j89292
$$ -84933 75837 210726 40375 -57999 -211834 -126366 -128858 -31569 137706 -18967 -208259
407b08259k2046J05041L0742k30518j25438L05163K65941o2051P6266k28156J87871
$$ -208259 -230305 -125264 -94522 -325040 -450478 -145315 120626 58575 134841 -93315 94556
396I4556l4562k56895m138J87778M664k01847J98230L9926q6087r2238K09681
$$ 94556 59994 -196901 -201039 -13261 -8597 -210444 -12214 27712 -58375 -150613 59068
385E9068l7958j15119p7383j07555J92331r8897j21712L6408K12235r7099n9539
$$ 59068 21110 -94009 -171392 -278947 -86616 -185513 -307225 -270817 -58582 -155681 -215220
374b15220n3938Q2142J71323j58735Q2096K25456l04819J39463k34732j91424
$$ -215220 -269158 -187016 -15693 -174428 -92332 133124 -171695 -32232 -266964 -458388
364d58388M00144M5430J37562j92026l9151q7570j36201n1107Q3782J17863L73282
$$ -458388 -58244 -12814 124748 -67278 -106429 -193999 -330200 -381307 -297525 -179662 193620
353A93620k98532q1251K02067r1944m1375j17357K70469j20063q3928m2609k31385
$$ 193620 -104912 -186163 15904 -76040 -117415 -234772 35697 -84366 -168294 -210903 -442288
342d42288L19787j57915J832k4790L5052J95389m9123l3285M5408L0139K02400
$$ -442288 -122501 -280416 -278584 -303374 -268322 -72933 -122056 -155341 -109933 -79794 122606
331A22606k80281l7720Q5580P6515l3125n6125j07578J33613j18352k6775J00605
$$ 122606 -157675 -195395 -109815 -33300 -66425 -122550 -230128 -96515 -214867 -241642 -141037
320a41037R4427m05673L13356P5102j00858L18828k19040j22023j32532J00238
$$ -141037 -46610 -452283 -138927 -63825 -164683 154145 -64895 -186918 -319450 -219212
310b19212J94403r830j15786J91437o8671m7476l1858k2317J31160k22549j07151
$$ -219212 -24809 -34639 -150425 41012 -27659 -75135 -106993 -129310 1850 -220699 -327850
299c27850K88807K4968p1316q0666Q2667m3100q1534R2492q1620k20694K36899
$$ -327850 -39043 -14075 -85391 -166057 -83390 -126490 -208024 -115532 -197152 -417846 -180947
288a80947L96161Q0049k20107j20265r3513K1799J06079j57451J72371M7392l6320
$$ -180947 215214 295263 75156 -45109 -138622 -116823 -10744 -168195 4176 51568 15248
277A5248J88205m9991k25836o8645J83153p0824p0784r0829P3209n3232l6951
$$ 15248 203453 153462 -72374 -141019 42134 -28690 -99474 -190303 -117094 -170326 -207277
266b07277L0989K35430R7658k82134k3601J00531j82628J52800q6850n0405n4840
$$ -207277 -176288 59142 156800 -125334 -148935 -48404 -231032 -78232 -165082 -215487 -270327
255b70327k47531K4690K98891J07074l3235r6751k65506J28297L02523j83918
$$ -270327 -517858 -493168 -194277 -87203 -120438 -217189 -482695 -354398 -51875 -235793
245b35793J1149J32362j29143n3345J05033P226J29547k59778j2760Q2851l7830
$$ -235793 -224644 -92282 -221425 -274770 -169737 -162511 -32964 -292742 -305502 -222651 -260481
234b60481q6090J06593m4726j45014J9454L17674Q7974N2369k18793m12077J52877
$$ -260481 -346571 -239978 -284704 -429718 -410264 -92590 -4616 47753 -171040 -583117 -430240
223d30240K81827L9229J73608n5527N3643k12905k14864q7951J88118J159j34485
$$ -430240 -148413 -109184 64424 8897 62540 -150365 -365229 -453180 -265062 -263903 -398388
212c98388j02341M5764L06545l5210K4478Q4426k0574J13507J79022j14263j74822
$$ -398388 -500729 -454965 -148420 -183630 -159152 -74726 -95300 18207 197229 82966 -91856
201i1856Q9553J25640k21908Q6049J102K8859k76971J22291J95020j71240o5387
$$ -91856 -2303 123337 -98571 -12522 -11420 17439 -259532 -137241 57779 -113461 -178848
190a78848q7402j06789L15484J4811j48141q0761L86517k2999k73360m1995K05325
$$ -178848 -266250 -373039 -57555 -42744 -190885 -271646 114871 91872 -181488 -223483 -18158
179a8158p1625p0812k29357J69299L4411j92292n8762L12658k18895O5807J74208
$$ -18158 -89783 -160595 -389952 -220653 -186242 -378534 -437296 -124638 -343533 -277726 -103518
168a03518N2121q3304q3405m6546J76228j0816M1504j30245P7267p7993l9554
$$ -103518 -51397 -134701 -218106 -264652 -88424 -99240 -57736 -187981 -110714 -188707 -228261
157b28261M7302j75669J96457N1821N9292O5877K82804P9646p7956k18883j22972
$$ -228261 -180959 -356628 -160171 -108350 -49058 16819 299623 379269 301313 82430 -40542
146d0542k48547J00490j78293J15269J34654O6543j96910k5351j5027K41627R5007
$$ -40542 -289089 -188599 -366892 -251623 -116969 -50426 -247336 -272687 -287714 -46087 48920
135D8920k05190j81910o3262L15740M20k13307O6414k14264J4896J35935N0423
$$ 48920 -156270 -338180 -401442 -85702 -85282 -298589 -232175 -446439 -431543 -295608 -245185
124b45185K12167j45872j56326J1409J50256j0735q71L2419j15306J1993K18201
$$ -245185 -33018 -178890 -335216 -323807 -173551 -184286 -185157 -152738 -268044 -256051 -37850
113c7850R6869k01306o0280n3411P2618R4261j33579m0537K25037J0614l1412
$$ -37850 59019 -142287 -202567 -255978 -183360 -89099 -222678 -263215 -38178 -27564 -58976
102e8976o3585l63j46049j01328J05152O9522J19698M3491k20765q6843n6361
$$ -58976 -122561 -122924 -268973 -370301 -265149 -195627 -75929 -32438 -253203 -340046 -396407
91c96407M9445J89375P8796J11418Q8100j35481k35369J6418P9702l3682Q4025
$$ -396407 -346962 -157587 -78791 32627 120727 -14754 -250123 -233705 -154003 -187685 -103660
80a03660P2286j97053N889k71211J49271J55317p7356o8274P7350M4214r4500
$$ -103660 -31374 -228427 -222538 -493749 -344478 -189161 -266517 -334791 -257441 -213227 -307727
69c07727L4168P3730r638M8082J36167L819j29301o0503J28313M6576M7044j30287
$$ -307727 -273559 -199829 -209467 -161385 -25218 -21399 -150700 -211203 -82890 -36314 10730 -119557
57a19557j9744j0617Q146k7148m4736k9698R807L2554L3918l0555N679O1529m7549
$$ -119557 -139301 -149918 -141772 -168920 -213656 -243354 -233547 -200993 -167075 -197630 -191951 -130422 -177971
44a77971l9085o1755R3691j02557o8J00634P5167j15567K0819N819l9984P0225
$$ -177971 -217056 -278811 -185120 -287677 -287745 -187111 -111944 -227511 -206692 -200873 -240857 -170632
32a70632k18536n9260J51779N6507J67912J49082J4116j61029l39864K01096n7376
$$ -170632 -389168 -448428 -296649 -240142 -72230 76852 90968 -70061 -409925 -208829 -266205
21b66205m7229J17791p054J1108k1332N2025R687j10856J41882m76L5199k35967
$$ -266205 -313434 -195643 -202697 -191589 -212921 -160896 -151209 -262065 -120183 -120659 -85460 -321427
9c21427o9933K47520j52926o9810L24047J57136l00053j20700N8072
$$ -321427 -391360 -143840 -296766 -366576 -42529 114607 -185446 -306146 -248074
0b48074
$$ -248074
$$ Imaginary data points
##PAGE= N=2
##DATA TABLE= (X++(I..I)), XYDATA
16383d656298J09370J10975j77283J16199M3659J90700Q6007K2338L3499N754
$$ -4656298 -4546928 -4435953 -4613236 -4497037 -4453378 -4262678 -4176671 -4154333 -4120834 -4115080
16373d115080J63884P8106J28306k27174n3576K50149J63226k1553O2558O2534
$$ -4115080 -3951196 -3873090 -3744784 -3971958 -4025534 -3775385 -3612159 -3633712 -3571154 -3508620
16363c508620J89007J41307J40534j74339M7952J93511l5934R0854J30307P3556
$$ -3508620 -3319613 -3178306 -3037772 -3212111 -3164159 -2970648 -3006582 -2915728 -2785421 -2711865
16353b711865P9340O7785J77846N2881n5043K74744O1513j55063n360N0139N823
$$ -2711865 -2632525 -2564740 -2386894 -2334013 -2389056 -2114312 -2052799 -2207862 -2213222 -2163083 -2157260
16342b157260K27801p7754K08150K69100j58655J31874P7452O783o6070M2291
$$ -2157260 -1929459 -2007213 -1799063 -1529963 -1688618 -1556744 -1479292 -1472509 -1538579 -1496288
16332a496288J88538L15993l140k7684r1273P0751M5103J64061K5235j69980K58279
$$ -1496288 -1307750 -991757 -994897 -1022581 -1113854 -1043103 -998000 -833939 -808704 -978684 -720405
16321g20405J09829M6209r3921J25831K76047j04994J8216L16676l8393j20544
$$ -720405 -610576 -564367 -658288 -532457 -256410 -361404 -343188 -26512 -64905 -185449
16311a85449J15141J3436J35117J14533q4017M5776O8623r6672L3266J60791J48836
$$ -185449 -70308 -56872 78245 192778 108761 154537 223160 126488 159754 320545 469381
16300D69381J34244O1044J64659L8867L3122q3592N1135P8503q8154j11390K59085
$$ 469381 603625 664669 829328 868195 901317 817725 868860 947363 859209 747819 1006904
16289A006904L51676M5391k82968J29213K86697N2275m9397k9100r6685J43228
$$ 1006904 1358580 1403971 1121003 1250216 1536913 1589188 1539791 1510691 1414006 1557234
16279A557234K28532m2010j31462J8402J10796K00494J91516m3517j59575P5993
$$ 1557234 1785766 1743756 1612294 1630696 1741492 1941986 2133502 2089985 1930410 2006403
16269B006403q2653K57030j27363J25492l7924J43280J45968o0521L1563K0989
$$ 2006403 1923750 2180780 2053417 2178909 2140985 2284265 2430233 2369712 2401275 2422264
16259B422264K15772J65065K10248j00840j4947K4343j35745L5472J1285j92900
$$ 2422264 2638036 2803101 3013349 2912509 2897562 2921905 2786160 2821632 2832917 2640017
16249B640017J09752J53925J26604j0095J71265k55161J77443J27302l6946p6078
$$ 2640017 2749769 2903694 3030298 3020203 3191468 2936307 3113750 3241052 3204106 3128028
$$ [...]
##END NTUPLES=NMR SPECTRUM
##END=
