##TITLE=1H_CA-91B1-31
 CDCl3
 8 sc, 
 1.8.2023
##JCAMPDX= 6.0         $$ Bruker NMR JCAMP-DX V2.0
##DATA TYPE= NMR SPECTRUM
##DATA CLASS= NTUPLES
##ORIGIN= UXNMR, Bruker Analytische Messtechnik GmbH
##OWNER= root
$$ XWIN-NMR		Version 3.5
$$ Wed Aug  2 14:05:20 2023 Russian Standard Time (UT+4h)  she@DPX200
##.OBSERVE FREQUENCY= 200.13135
##.OBSERVE NUCLEUS= ^1H
##.ACQUISITION MODE= SIMULTANEOUS
##.ACQUISITION SCHEME= undefined
##.AVERAGES= 8
##.DIGITISER RES= 18
##SPECTROMETER/DATA SYSTEM= spect
##.PULSE SEQUENCE= zg30
##.SOLVENT NAME= D2O
##.SHIFT REFERENCE= (INTERNAL, D2O, 0, 15.7304)
##AUDIT TRAIL= $$ (NUMBER, WHEN, WHO, WHERE, WHAT)
$$ ##TITLE= Audit trail, XWIN-NMR		Version 3.5
$$ ##JCAMPDX= 5.01
$$ ##ORIGIN= Bruker BioSpin GmbH
$$ ##OWNER= she
$$ F:/spectra/data/she/nmr/H-F/1/pdata/1/auditp.txt
$$ ##AUDIT TRAIL=  $$ (NUMBER, WHEN, WHO, WHERE, WHAT)
(   1,<2023-08-02 14:04:03.70 +0400>,<she>,<DPX200>,
      <created by zg, POWCHK disabled, PULCHK disabled
       configuration hash MD5:
       00 E9 B6 7A A2 85 ED C7 34 08 36 98 17 FE 4E 26
       data hash MD5: 16K
       DB A1 67 30 74 46 F8 60 F4 0B 5D 82 E1 69 76 BA>)
(   2,<2023-08-02 14:04:06.28 +0400>,<she>,<DPX200>,
      <Start of raw data processing
       efp BC_mod = 2 LB = 0.24 FT_mod = 6 PKNL = 1 PHC0 = -21199.22 PHC1 = 14.45272 SI = 16K 
       data hash MD5: 16K
       D9 9B 9D 9D 53 3D 43 B9 A9 12 95 DD D2 F5 F2 1F>)
(   3,<2023-08-02 14:04:24.98 +0400>,<she>,<DPX200>,
      <pk PHC0 = 2.691739 PHC1 = -2.6 
       data hash MD5: 16K
       F8 54 69 24 1A 90 69 53 69 DA 39 25 97 98 E9 77>)
(   4,<2023-08-02 14:04:28.34 +0400>,<she>,<DPX200>,
      <abs ABSG = 5 
       data hash MD5: 16K
       61 91 04 54 39 47 5F 5B 76 E0 11 64 22 59 7C 06>)
$$ ##END=
$$ 
$$ hash MD5
$$ D1 39 96 15 A4 AA D0 1E 0A 03 A9 5C 5F A3 09 88
##$RELAX= 
##$RELAX= 
##$RELAX= 
##$RELAX= 
##$RELAX= 
##$RELAX= 
$$ Bruker specific parameters
$$ --------------------------
##$DU= <F:/spectra>
##$EXPNO= 1
##$NAME= <H-F>
##$PROCNO= 1
##$TYPE= <nmr>
##$USER= <she>
##$AMP= (0..31)
100 100 100 100 100 100 100 100 100 100 100 100 100 100 100 100 100 100 
100 100 100 100 100 100 100 100 100 100 100 100 100 100 
##$AQSEQ= 0
##$AQ_mod= 1
##$AUNM= <au_zg>
##$AUTOPOS= <>
##$BF1= 200.13
##$BF2= 200.13
##$BF3= 200.13
##$BF4= 200.13
##$BF5= 200.13
##$BF6= 200.13
##$BF7= 200.13
##$BF8= 200.13
##$BYTORDA= 1
##$CFDGTYP= 0
##$CFRGTYP= 5
##$CHEMSTR= <none>
##$CNST= (0..31)
1 1 145 1 1 1 1 1 1 1 1 1 1 1 1 1 1 1 1 1 1 1 1 1 1 1 1 1 1 1 1 1 
##$CPDPRG= <>
##$CPDPRG1= <>
##$CPDPRG2= <>
##$CPDPRG3= <>
##$CPDPRG4= <mlev>
##$CPDPRG5= <mlev>
##$CPDPRG6= <mlev>
##$CPDPRG7= <mlev>
##$CPDPRG8= <mlev>
##$CPDPRGB= <>
##$CPDPRGT= <>
##$D= (0..31)
0 1.2 0 0 0 0 0 0 0 0.06 0 0.03 0 0 0 0 0.0002 0 0 0 0 0 0 0 0 0 0 0 0 
0 0 0 
##$DATE= 1690970643
##$DBL= (0..7)
120 120 120 120 120 120 120 120 
##$DBP= (0..7)
150 150 150 150 150 150 150 150 
##$DBP07= 0
##$DBPNAM0= <>
##$DBPNAM1= <>
##$DBPNAM2= <>
##$DBPNAM3= <>
##$DBPNAM4= <>
##$DBPNAM5= <>
$$ [...]
##$SUBNAM3= <"">
##$SUBNAM4= <"">
##$SUBNAM5= <"">
##$SUBNAM6= <"">
##$SUBNAM7= <"">
##$SUBNAM8= <"">
##$SUBNAM9= <"">
##$SW= 18.05172834244
##$SWIBOX= (0..15)
0 0 2 0 0 0 0 0 0 0 0 0 0 0 0 0 
##$SW_h= 3612.71676300578
##$TD= 16384
##$TD0= 1
##$TE= 0
##$TE2= 300
##$TE3= 300
##$TEG= 300
##$TL= (0..7)
0 120 120 120 120 120 120 120 
##$TP= (0..7)
150 150 150 150 150 150 150 150 
##$TP07= 0
##$TPNAME0= <>
##$TPNAME1= <>
##$TPNAME2= <>
##$TPNAME3= <>
##$TPNAME4= <>
##$TPNAME5= <>
##$TPNAME6= <>
##$TPNAME7= <>
##$TPOAL= (0..7)
0.5 0.5 0.5 0.5 0.5 0.5 0.5 0.5 
##$TPOFFS= (0..7)
0 0 0 0 0 0 0 0 
##$TUNHIN= 0
##$TUNHOUT= 0
##$TUNXOUT= 0
##$USERA1= <user>
##$USERA2= <user>
##$USERA3= <user>
##$USERA4= <user>
##$USERA5= <user>
##$V9= 5
##$VALIST= <valist>
##$VCLIST= <CCCCCCCCCCCCCCC>
##$VD= 0
##$VDLIST= <DDDDDDDDDDDDDDD>
##$VPLIST= <PPPPPPPPPPPPPPP>
##$VTLIST= <TTTTTTTTTTTTTTT>
##$WBST= 1024
##$WBSW= 4
##$XGAIN= (0..3)
0 0 0 0 
##$XL= 0
##$YL= 0
##$YMAX_a= 100893
##$YMIN_a= -61555
##$ZGOPTNS= <>
##$ZL1= 120
##$ZL2= 120
##$ZL3= 120
##$ZL4= 120
##$ABSF1= 15.72596
##$ABSF2= -2.32589
##$ABSG= 5
##$ABSL= 3
##$ALPHA= 0
##$AQORDER= 0
##$ASSFAC= 0
##$ASSFACI= 0
##$ASSFACX= 0
##$ASSWID= 0
##$AUNMP= <proc_1d>
##$AZFE= 0.1
##$AZFW= 0.1
##$BCFW= 0
##$BC_mod= 2
##$BYTORDP= 0
##$COROFFS= 0
##$CY= -3
##$DATMOD= 1
##$DC= 0
##$DFILT= <>
##$DTYPP= 0
##$F1P= 0
##$F2P= 0
##$FCOR= 1
##$FTSIZE= 16384
##$FT_mod= 6
##$GAMMA= 0
##$GB= 0
##$INTBC= 1
##$INTSCL= 3.70164e-10
##$ISEN= 128
##$LB= 0.24
##$LEV0= 0
##$LPBIN= 0
##$MAXI= 10000
##$MC2= 0
##$MEAN= 0
##$ME_mod= 0
##$MI= 1.114404
##$NCOEF= 0
##$NC_proc= -10
##$NLEV= 6
##$NOISF1= 3.799351
##$NOISF2= 2.8
##$NSP= 0
##$NTH_PI= 0
##$NZP= 0
##$OFFSET= 15.73036
##$PC= 1
##$PHC0= -21196.53
##$PHC1= 11.85272
##$PH_mod= 1
##$PKNL= yes
##$PPARMOD= 0
##$PSCAL= 0
##$PSIGN= 0
##$REVERSE= no
##$SF= 200.130008241551
##$SI= 16384
##$SIGF1= 3
##$SIGF2= 2
##$SINO= 5.538805
##$SIOLD= 16384
##$SREGLST= <1H.CDCl3>
##$SSB= 0
##$STSI= 16384
##$STSR= 0
##$SW_p= 3612.71676300578
##$SYMM= 0
##$S_DEV= 0
##$TDeff= 16384
##$TDoff= 0
##$TI= <>
##$TILT= no
##$TM1= 0
##$TM2= 0
##$TOPLEV= 0
##$USERP1= <user>
##$USERP2= <user>
##$USERP3= <user>
##$USERP4= <user>
##$USERP5= <user>
##$WDW= 1
##$XDIM= 16384
##$YMAX_p= 409611928
##$YMIN_p= -2530907
$$ End of Bruker specific parameters
$$ ---------------------------------
##NTUPLES= NMR SPECTRUM
##VAR_NAME=  FREQUENCY,     SPECTRUM/REAL,   SPECTRUM/IMAG
##SYMBOL=    X,             R,               I
##VAR_TYPE=  INDEPENDENT,   DEPENDENT,       DEPENDENT
##VAR_FORM=  AFFN,          ASDF,            ASDF
##VAR_DIM=   16384,         16384,           16384
##UNITS=     HZ,            ARBITRARY UNITS, ARBITRARY UNITS
##FACTOR=    0.220516191357247, 1,           1
##FIRST=     3148.1170826722, 0,             0
##LAST=      -464.599680333583, 0,           0
##MIN=       -464.599680333583, -2530907,    0
##MAX=       3148.1170826722, 409611928,     0
$$ Real data points
##PAGE= N=1
##DATA TABLE= (X++(R..R)), XYDATA
$$ [...]
$$ plain form
5458 62428555 59437203 56252371 53239899 50416601 48296812 46048926 43278297 41267471
5450 41267471 39400534 38393618 37493465 36734317 35057396 34631546 33945912 33215591 32358577
5441 32358577 31852486 31261033 31626060 31941588 31265197 31387354 30725739 30427501 29661215
5432 29661215 29229694 29579510 29668548 29108905 28498712 28450070 28484542 29479712 29474289 29036834
5422 29036834 29198272 28117957 27635084 28482312 28262693 26502872 26177983 26013196 25166510
5413 25166510 26427459 26992891 26537506 26425112 26589360 26870948 26254402 25972211 25624894
5404 25624894 26294322 26572756 26574251 27423769 27447183 26781481 25958064 25957916 24859346 24991392
5394 24991392 25122771 25018264 25052446 25476273 26017431 25725293 25609133 24140317 23540962
$$ packed form
5458F2428555k991352l184832l012472k823298k119789k247886k770629k010826
5450D1267471j866937j006916r00153p59148j676921m25850o85634p30321q57014
5441C2358577n06091n91453L65027L15528o76391J22157o61615k98238p66286
5432B9661215m31521L49816Q9038n59643o10193m8642L4472R95170n423m37455
5422B9036834J61438j080315m82873Q47228k19619j759821l24889j64787q46686
5413B5166510J260949N65432m55385j12394J64248K81588o16546k82191l47317
5404B5624894O69428K78434J495Q49518K3414o65702q23417j48j098570J32046
5394B4991392J31379j04507L4182M23827N41158k92138j16160j468816n99355
$$ plain form
5385 23540962 24379802 23865803 23282153 22926130 24086253 22659271 22494943 23385327 23206118
5376 23206118 23460150 22919855 22983312 23644842 22686388 23231965 23493095 23720170 24123991 24417322
5366 24417322 24249252 24188482 23920973 23837604 24560315 24348200 24127962 24951116 26115520 26029435
5356 26029435 25662306 24924971 24927925 24538014 24426787 24223415 24626330 25088574 26287685 26155274
5346 26155274 27112849 27035112 26825174 26721117 27566230 27146402 27523564 27779066 27444252 27617638
5336 27617638 26653568 26418608 26130589 25849106 24840114 24503321 23746184 22463704 23197217
5327 23197217 24310778 24778729 25437443 25094190 24663045 25756626 25729083 24182373 25125692
5318 25125692 26065441 25838428 26083088 25165312 23949055 24198437 25441477 25729545 25421651
$$ packed form
5385B3540962Q38840n13999n83650l56023J160123j426982j64328Q90384j79209
5376B3206118K54032n40295O3457O61530r58454N45577K61130K27075M03821K93331
5366B4417322j68070o0770k67509q3369P22711k12115k20238Q23154J164404q6085
5356B6029435l67129p37335K954l89911j11227k03372M02915M62244J199111j32411
5346B6155274R57575p7737k09938j04057Q45113m19828L77162K55502l34814J73386
5336B7617638r64070k34960k88019k81483j008992l36793p57137j282480P33513
5327B3197217J113561M67951O58714l43253m31145J093581k7543j546710R43319
5318B5125692R39749k27013K44660r17776j216257K49382J243040K88068l07894
$$ plain form
5309 25421651 25648230 26108684 24862550 23322451 22882804 24098362 25390703 24789706 26365251
5300 26365251 26207108 25129365 24705962 24089361 22993621 22221362 21616298 21262852 21019928
5291 21019928 21038411 21152357 20570809 19845737 20014927 20210997 19302170 20587541 20243878
5282 20243878 18914985 18061566 18833797 19694137 20346963 20284841 18881409 19068774 19702692
5273 19702692 19856430 20444517 19661676 19974430 19935920 20073049 20188137 20272420 20583968 19954889
5263 19954889 19801499 18696160 18419737 18899922 18829818 17448061 17397280 17949306 18632936
5254 18632936 19070865 18125772 17887518 18745839 18350784 18072077 17629094 17027021 17485782
5245 17485782 17929590 18068807 17314388 17562962 17724966 18473466 19173559 19172987 19278794 19196869
$$ packed form
5309B5421651K26579M60454j246134j540099m39647J215558J292341o00997J575545
5300B6365251j58143j077743m23403o16601j095740p72259o05064l53446k42924
5291B1019928J8483J13946n81548p25072J69190J96070r08827J285371l43663
5282B0243878j328893q53419P72231Q60340O52826o2122j403432J87365O33918
5273A9702692J53738N88087p82841L12754l8510J37129J15088Q4283L11548o29079
5263A9954889j53390j105339k76423M80185p0104j381757n0781N52026O83630
5254A8632936M37929r45093k38254Q58321l95055k78707m42983o02073M58761
5245A7485782M43808J39217p54419K48574J62004P48500P00093n72J05807q1925
$$ plain form
5235 19196869 18500959 17563851 18471349 18117916 18757506 19402767 19556197 19289691 18182534
5226 18182534 18922463 18752176 19118134 18852430 18812556 19411506 18920082 18721547 17834790 18320027
5216 18320027 18305337 18501737 18907763 18648102 18872490 18729222 18356245 19326591 19828661 18052394
5206 18052394 17764028 18874862 18560186 18717493 19126842 19635748 19722178 19346575 20018672
5197 20018672 19471311 19197455 20228880 19359361 19093310 18822754 18763212 19387101 19551030
5188 19551030 19824593 19277418 20061859 19693712 20233999 20544378 20440161 19890960 19869196 20407041
5178 20407041 19955035 20342908 20902115 20657964 20624733 20418493 19568032 19918518 20641482 21340544
5168 21340544 21889356 21389560 21866296 22308539 21560748 22468378 21193932 20653955 21100757
$$ packed form
5235A9196869o95910r37108R07498l53433O39590O45261J53430k66506j107157
5226A8182534P39929j70287L65958k65704l9874N98950m91424j98535q86757M85237
5216A8320027j4690J96400M06026k59661K24388j43268l72977R70346N02070j776267
5206A8052394k88366J110834l14676J57307M09349N08906Q6430l75603O72097
5197B0018672n47361k73856J031425q69519k66051k70556n9542O23889J63929
5188A9551030K73563n47175P84441l68147N40287L10379j04217n49201k1764N37845
5178B0407041m52006L87873N59207k44151l3231k06240q50461L50486P22964O99062
5168B1340544N48812m99796M76736M42243p47791R07630j274446n39977M46802
$$ plain form
5159 21100757 20956209 20883136 20824619 20902909 20740129 21017822 21255498 20882547 20497037 20190896
5149 20190896 20462699 21016813 20986244 21017701 21466001 20975712 22036854 22784389 22705428 22374006
5139 22374006 22328644 23021423 23009366 23940198 24923737 26242344 25447392 25522435 25937732 25227679
5129 25227679 24470466 23563993 22980359 22910998 22621196 21744296 23217902 23418462 23027758
5120 23027758 22127529 22747344 23174153 23589899 22667325 22286312 22036334 21398581 21607153
5111 21607153 20996349 20478224 20132658 19562832 19346041 19370238 18497339 17265813 16547181
5102 16547181 16486163 15447116 15722334 15249054 16168096 15664780 16104313 16691540 16190558
5093 16190558 16286449 15887817 15652406 15874536 15172865 15541449 15742821 15780481 15111964 14106299
$$ packed form
5159B1100757j44548p3073n8517P8290j62780K77693K37676l72951l85510l06141
5149B0190896K71803N54114l0569L1457M48300m90289J061142P47535p8961l31422
5139B2374006m5362O92779j2057R30832R83539J318607p94952P5043M15297p10053
5129B5227679p57213r06473n83634o9361k89802q76900J473606K00560l90704
5120B3027758r00229O19815M26809M15746r22574l81013k49978o37753K08572
5111B1607153o10804n18125l45566n69826k16791K4197q72899j231526p18632
5102A6547181o1018j039047K75218m73280R19042n03316M39533N87227n00982
5093A6190558R5891l98632k35411K22130p01671L68584K01372L7660o68517j005665
$$ plain form
5083 14106299 14921550 15059414 15173572 14317505 14003248 14486526 15068045 14550666 14310541
5074 14310541 15268817 15120219 15863043 15723501 15896948 16327440 16358692 16259750 14857554 14738062
5064 14738062 15085995 14692358 15464275 15373335 14134933 14649470 14955805 14397610 14247674
5055 14247674 15741304 15820942 15956179 15591244 15684274 15493626 15546244 15980384 14074450 13519775
5045 13519775 13397701 13645992 13542758 13204452 13165939 14282992 13731163 13944943 14037100 14514730
5035 14514730 14595960 14267423 14165545 14251171 15203487 14744076 14330312 13257535 13457461 13181473
5025 13181473 12840022 13336356 12507191 12232035 13112576 12862856 12492317 13649541 12513788
5016 12513788 12899124 13774559 13496252 13165167 13680266 14254607 13591973 13089937 13214127
$$ packed form
5083A4106299Q15251J37864J14158q56067l14257M83278N81519n17379k40125
5074A4310541R58276j48598P42824j39542J73447M30492L1252r8942j402196j19492
5064A4738062L47933l93637P71917r0940j238402N14537L06335n58195j49936
5055A4247674J493630P9638J35237l64935R3030j90648N2618M34140j905934n54675
5045A3519775j22074K48291j03234l38306l8513J117053n51829K13780R2157M77630
5035A4514730Q1230l28537j01878Q5626R52316m59411m13764j072777J99926k75988
5025A3181473l41451M96334q29165k75156Q80541k49720l70539J157224j135753
5016A2513788L85336Q75435k78307l31085N15099N74341o62634n02036J24190
$$ plain form
5007 13214127 12821323 12741047 13269127 14062265 14986687 13943985 14237945 14770173 14347181
4998 14347181 14025566 13988279 13695818 12971612 12796376 13665213 14493754 14859232 13871180 13136058
4988 13136058 14066305 14397944 14549495 13540151 12214237 13509547 13654168 13865013 14017269
4979 14017269 13742734 13406747 13575410 14031747 14176066 14458008 14523410 14638718 14713479 14724474
4969 14724474 14167962 13350954 15013256 15110801 14275360 14739344 14307616 14362009 13953144 13889045
4959 13889045 13369629 14123878 14632148 14109577 14956704 14575042 14865311 15387733 15166228
4950 15166228 15910263 16020367 14826124 14190676 14166794 14943525 14656364 13617538 13956329
4941 13956329 15152037 14862393 15862810 16449066 16617350 17047561 16322544 15919154 16515288
$$ packed form
5007A3214127l92804q0276N28080P93138R24422j042702K93960N32228m22992
4998A4347181l21615l7287k92461p24206j75236Q68837Q28541L65478r88052p35122
4988A3136058R30247L31639J51551j009344j325914J295310J44621K10845J52256
4979A4017269k74535l35987J68663M56337J44319K81942O5402J15308P4761J0995
4969A4724474n56512q17008J662302R7545q35441M63984m31728N4393m08865o4099
4959A3889045n19416P54249N08270n22571Q47127l81662K90269N22422k21505
4950A5166228P44035J10104j194243o35448k3882P76731k87161j038826L38791
4941A3956329J195708k89644J000417N86256J68284M30211p25017m03390N96134
$$ plain form
4932 16515288 16179592 17052645 17028229 16033388 16292775 17436111 16288276 16348949 16356365 17077656
4922 17077656 17212693 17845723 19092871 18627168 17761409 17413636 18257122 17881605 18361896
4913 18361896 18004608 18061761 19016224 19832953 19544250 19874266 19275512 19837005 20145825 20395159
4903 20395159 20117009 19415621 20219767 20635211 20613161 21200816 20758796 21758248 23008666
4894 23008666 22365328 22375892 23128644 22512497 23189089 24372183 24601272 24243956 24536321
4885 24536321 25279770 24882524 24655173 25959291 26397723 26115250 25701696 26695139 27825906
4876 27825906 28077707 27871455 28666380 29159768 29421315 29442248 29896111 31464453 31488355 30647227
4866 30647227 30155805 29755700 29526006 29762955 30063278 30209527 31274282 31505341 30653578
$$ packed form
4932A6515288l35696Q73053k4416r94841K59387J143336j147835O0673P416P21291
4922A7077656J35037O33030J247148m65703q65759l47773Q43486l75517M80291
4913A8361896l57288N7153R54463Q16729k88703L30016n98754N61493L08820K49334
4903B0395159k78150p01388Q04146M15444k2050N87655m42020R99452J250418
4894B3008666o43338J0564P52752o16147O76592J183094K29089l57316K92365
4885B4536321P43449l97246k27351J304118M38432k82473m13554R93443J130767
4876B7825906K51801k06252P94925M93388K61547K0933M53863J568342K3902q41128
4866C0647227m91422m00105k29694K36949L00323J46249J064755K31059q51763
$$ plain form
4857 30653578 30783688 30213073 29585953 28808013 28977945 28713479 29551829 29661470 29980081
4848 29980081 31014831 30338328 30426930 30631667 30889800 31201206 31054503 32481809 32846541
4839 32846541 32485162 32677251 33100118 33615863 33704311 33802550 35767551 36713025 36204747 36858841
4829 36858841 37024643 38522568 39490641 39631104 39065887 39327870 39514334 38860187 40526528
4820 40526528 40146695 39623599 40726609 41228426 42452841 42906700 43294007 43592174 43929914
4811 43929914 44307060 45007433 45329767 46137560 45740443 45760177 46484237 46842108 46498838 47718633
4801 47718633 47360943 48086858 48223990 48596159 50384267 52094051 53333742 52905057 53571661
4792 53571661 55311125 57231377 58127816 58802600 58765367 57707362 56301055 55557600 54632565
$$ packed form
4857C0653578J30110n70615o27120p77940J69932k64466Q38350J09641L18611
4848B9980081J034750o76503Q8602K04737K58133L11406j46703J427306L64732
4839C2846541l61379J92089M22867N15745Q8448R8239J965001R45474n08278O54094
4829C6858841J65802J497925R68073J40463n65217K61983J86464o54147J666341
4820D0526528l79833n23096J103010N01817J224415M53859L87307K98167L37740
4811D3929914L77146P00373L22334Q07793l97117J9734P24060L57871l43270J219795
4801D7718633l57690P25915J37132L72169J788108J709784J239691m28685O66604
4792E3571661J739464J920252Q96439O74784l7233j058005j406307p43455r25035
$$ plain form
4783 54632565 54441389 54334387 54618323 55948426 56665480 56221083 57147722 57824356 59074259
4774 59074259 59764673 60328734 61492092 61467948 62782024 64012047 64126434 65214609 65882682
4765 65882682 67263053 68512693 68957213 69055860 68320943 67025158 66441163 66413224 66697763
4756 66697763 67022222 68102418 69475538 70337888 70850310 71922975 72640705 74442255 75454165
4747 75454165 78108915 80873911 81353805 82739446 85497373 85280189 85448740 86120841 85687688
4738 85687688 85423166 86201851 86777640 87038300 87062014 87111290 88334847 92058351 95078758
4729 95078758 99040882 102432701 107963242 115375413 121987028 129589425 137206285 142935147
4721 142935147 148406777 152321263 154256189 153029658 148796950 142295274 134209875 126341010
$$ packed form
4783E4632565j91176j07002K83936J330103P17054m44397R26639O76634J249903
4774E9074259O90414N64061J163358k4144J314076J230023J14387J088175O68073
4765F5882682J380371J249640M44520R8647p34917j295785n83995k7939K84539
4756F6697763L24459J080196J373120Q62350N12422J072665P17730J801550J011910
4747G5454165K654750K764996M79894J385641K757927k17184J68551O72101m33153
4738H5687688k64522P78685N75789K60660K3714M9276J223557L723504L020407
4729I5078758L962124L391819N530541P412171O611615P602397P616860N728862
4721A42935147N471630L914486J934926j226531m232708o501676q085399p868865
$$ plain form
4713 126341010 118231754 109806843 101951393 96586790 90418046 87008727 82366721 78439209
4705 78439209 75509953 72542576 69919579 67619009 65664287 65370143 63965909 63367246
4697 63367246 62102852 61059158 59787187 59083360 58546218 58201123 57450378 56985500 56701748
4688 56701748 56244401 55986683 55872171 56497420 57470874 57191720 56034174 56192217 56976887
4679 56976887 57005078 56537579 56648935 56945502 57284725 57148142 57077557 57658137 56773860 57572840
4669 57572840 58171329 58728217 59385546 59133134 59332550 59194768 60045209 60056943 59620886 60255434
4659 60255434 60775733 60601880 61193196 61814941 62266839 62934425 63494867 63262919 63677083
4650 63677083 63406895 65989672 67548320 67294774 68254097 68943708 69448988 70850393 70260920
$$ packed form
4713A26341010q109256q424911p855450n364603o168744l409319m642006l927512
4705G8439209k929256k967377k622997k300570j954722k94144j404234n98663
4697F3367246j264394j043694j271971p03827n37142l45095p50745m64878k83752
4688E6701748m57347k57718j14512O25249R73454k79154j157546J58043P84670
4679E6976887K8191m67499J11356K96567L39223j36583p0585N80580q84277P98980
4669E7572840N98489N56888O57329k52412J99416j37782Q50441J1734m36057O34548
4659F0255434N20299j73853N91316O21745M51898O67586N60442k31948M14164
4650F3677083k70188K582777J558648k53546R59323O89611N05280J401405n89473
$$ plain form
4641 70260920 71381680 72371808 72328885 74028739 74727534 75227329 75237980 76689882 77404982
4632 77404982 78787479 79515731 80050864 81752262 82068710 83336686 85409396 86654354 87179475
4623 87179475 88314760 89708096 91708125 92865807 94149447 96419554 98636083 99033551
4615 99033551 97226914 96334978 96926555 97360839 97692414 98456005 98150054 97988431 97882833
4606 97882833 98258011 96917074 97029780 98054468 99374595 100675148 102360031 103432541
4598 103432541 104604914 107048096 108201779 109216002 111470482 112971931 114397042 117233984
4590 117233984 119645810 120997125 123296002 126702162 129147955 130183561 131313623 129635447
4582 129635447 126027913 122999106 120715377 119670316 119314564 118345663 116763719 116001235
$$ packed form
4641G0260920J120760R90128m2923J699854O98795M99795J0651J451902P15100
4632G7404982J382497P28252N35133J701398L16448J267976K072710J244958N25121
4623H7179475J135285J393336K000029J157682J283640K270107K216529L97468
4615I9033551j806637q91936N91577M34284L31575P63591l05951j61623j05598
4606I7882833L75178j340937J12706J024688J320127J300553J684883J072510
4598A03432541J172373K443182J153683J014223K254480J501449J425111K836942
4590A17233984K411826J351315K298877L406160K445793J035606J130062j678176
4582A29635447l607534l028807k283729j045061l55752r68901j581944p62484
$$ plain form
4574 116001235 116785272 116288385 115349194 114977008 115001586 114702968 114684812 115051318 114561145 115017348
4564 115017348 115313588 115808179 117344016 119098090 119668754 123143539 125563277 127884321
4556 127884321 130887831 135399221 139357283 142778392 145086423 145047438 143799645 142638997
4548 142638997 141477859 139990711 139254613 139471373 141056890 143434602 143850325 143753754 142702667
4539 142702667 141440248 139254527 138571245 137336302 136781321 135157011 133735114 133005559
4531 133005559 131461936 130916093 130655022 130807351 130601629 130153035 131180034 132825974 133451559
4522 133451559 134879523 136661284 138642403 138342352 137885975 137168213 135899382 134854748
4514 134854748 135524213 134873247 135138369 136240459 136590558 135777431 134630663 131730303 127523820
$$ packed form
4574A16001235P84037m96887r39191l72186K4578k98618j8156L66506m90173M56203
4564A15017348K96240M94591J535837J754074N70664L474785K419738K321044
4556A27884321L003510M511390L958062L421109K308031l8985j247793j160648
4548A42638997j161138j487148p36098K16760J585517K377712M15723r6571j051087
4539A42702667j262419k185721o83282j234943n54981j624310j421897p29555
4531A33005559j543623n45843k61071J52329k05722m48594J026999J645940O25585
4522A33451559J427964J781761J981119l00051m56377p17762j268831j044634
4514A34854748O69465o50966K65122J102090L50099q13127j146768k900360m206483
$$ plain form
4505 127523820 123791724 120261369 117874469 114949034 111960964 109335968 105803579 104094801
4497 104094801 103633725 102143244 99934998 98694927 97323207 96678795 96845186 95538220
4489 95538220 96220069 95854844 95036306 94005287 93080801 93022232 92607343 91469896 91150013
4480 91150013 91863087 91288869 90261902 88408231 86269295 84431689 83073237 80768384
4472 80768384 78920286 77705417 76514806 74804196 74095531 72869164 72254220 71228121
4464 71228121 70253918 69245053 68126071 67460512 66090003 65317272 63690530 64436312 64712477
4455 64712477 63468267 63088460 63073965 61750374 60578265 61249816 62436593 62347812 61335209
4446 61335209 59902430 60808888 61294468 61213738 61295192 60958259 62115564 61904209 60652344
$$ packed form
4505A27523820l732096l530355k386900k925435k988070k624996l532389j708778
4497A04094801m61076j490481k208246j240071j371720o44412J66391j306966
4489I5538220O81849l65225q18538j031019r24486n8569m14889j137447l19883
4480I1150013P13074n74218j026967j853671k138936j837606j358452k304853
4472H0768384j848098j214869j190611j710610p08665j226367o14944j026099
4464G1228121r74203j008865j118982o65559j370509p72731j626742P45782K76165
4455F4712477j244210l79807j4495j323591j172109O71551J186777q8781j012603
4446F1335209j432779R06458M85580q0730Q1454l36933J157305k11355j251865
$$ plain form
4437 60652344 60542659 61599792 60874672 61353955 60387346 60225679 60755541 61997830 61432272
4428 61432272 61253341 61911885 61470687 62231736 61784327 61595733 61869402 61591687 61618376 62105361
4418 62105361 61179380 60717755 61151155 61612654 62496685 62507573 62355358 63684124 64472865
4409 64472865 63199269 63124113 63429785 63139086 64241161 63729479 63106318 62992078 63202742
4400 63202742 63243332 63752761 64081044 64145516 63884283 64703069 66132883 66603502 66960371 65940176
4390 65940176 66642816 68354406 68110766 68575858 69628124 70106588 70903852 71146573 71150247
4381 71150247 72316921 73489474 74600413 77009363 77860065 77202735 78518526 78765453 79647524
4372 79647524 81390902 82301271 83050381 84474995 86377957 87475826 88191514 88400602 88883457
$$ packed form
4437F0652344j09685J057133p25120M79283r66609j61667N29862J242289n65558
4428F1432272j78931O58544m41198P61049m47409j88594K73669k77715K6689M86985
4418F2105361r25981m61625M33400M61499Q84031J0888j52215J328766P88741
4409F4472865j273596p5156L05672k90699J102075n11682o23161j14240K10664
4400F3202742M0590N09429L28283O4472k61233Q18786J429814M70619L56869j020195
4390F5940176P02640J711590k43640M65092J052266M78464P97264K42721L674
4381G1150247J166674J172553J110939K408950Q50702o57330J315791K46927Q82071
4372G9647524J743378R10369P49110J424614J902962J097869P15688K09088M82855
$$ plain form
4363 88883457 89973588 91688964 93080797 94597090 95803615 96981908 97801024 97751331 97972292
4354 97972292 98864897 99136189 99196463 99731981 100571024 100078876 98229644 99040861 101519671
4345 101519671 102218112 101997645 102422482 103337659 104574992 106383801 107098531 107279317 108289132
4336 108289132 108974758 109535411 111445646 112271670 113300835 114595742 115053325 117827426 119702930
4327 119702930 120711318 122091328 124926443 128307972 131174885 133474106 135481823 138102052
4319 138102052 141731321 144832698 147706041 151627789 156714335 164599192 172638597 181189844
4311 181189844 191363554 200411823 205386645 207848463 207164485 203160256 197686314 189644969
4303 189644969 182026883 174522137 169714500 166172726 165396847 166882226 168178601 169563908
$$ packed form
4363H8883457J090131J715376J391833J516293J206525J178293Q19116m9693K20961
4354I7972292Q92605K71292O0274N35518Q39043m92148j849232Q11217K478810
4345A01519671O98441k20467M24837R15177J237333J808809P14730J80786J009815
4336A08289132O85626N60653J910235Q26024J029165J294907M57583K774101J875504
4327A19702930J008388J380010K835115L381529K866913K299221K007717K620229
4319A38102052L629269L101377K873343L921748N086546P884857Q039405Q551247
4311A81189844J0173710R048269M974822K461818o83978m004229n473942q041345
4303A89644969p618086p504746m807637l541774p75879J485379J296375J385307
$$ plain form
4295 169563908 173665405 178990736 183434152 189782371 197319245 205449700 215506455 226696652
4287 226696652 237923443 248836934 257082930 263333477 265808991 264472673 259055687 250933263
4279 250933263 243126825 234157838 223760952 213743518 204704624 197196179 189439191 183567973
4271 183567973 178531051 172928618 168834077 167226097 165759507 165547550 165905626 165552680
4263 165552680 167453491 167622749 168022907 169743882 172933791 176557014 181019990 186727046
4255 186727046 191632033 197669637 202761672 207316925 211151629 214980651 215522035 213244490
4247 213244490 208512141 202316190 194375725 184235860 174309069 164437713 154653282 145801399
4239 145801399 139337372 133592779 128327553 123027205 119310321 116322618 112940760 109311816
$$ packed form
4295A69563908M101497N325331M443416O348219P536874Q130455J0056755J1190197
4287B26696652J1226791J0913491Q245996O250547K475514j336318n416986q122424
4279B50933263p806438q968987j0396886j0017434r038894p508445p756988n871218
4271A83567973n036922n602433m094541j607980j466590k11957L58076l52946
4263A65552680J900811J69258M00158J720975L189909L623223M462976N707056
4255A86727046M904987O037604N092035M555253L834704L829022N41384k277545
4247B13244490m732349o195951p940465j0139865r926791r871356r784431q851883
4239A45801399o464027n744593n265226n300348l716884k987703l381858l628944
$$ plain form
4231 109311816 106699635 104079625 101244327 99742946 98094285 95314484 92090840 90766646
4223 90766646 89346742 87602719 86581772 85373388 83262721 82151852 80760125 79328652
4215 79328652 78099734 77083299 76754383 76022110 76167645 75021171 74334584 73776243 72929501
4206 72929501 72381047 72230959 71878259 70877513 70165594 70141355 69420042 69379516 69229554 67525127
4196 67525127 65367393 64299000 63701293 63677284 62081382 62012521 61258780 60033687 59039753
4187 59039753 57849136 57574025 57693069 58303173 58749421 58398695 57184295 56626614 56113078
4178 56113078 56921279 58019878 58158505 57428060 57422095 57250804 58143930 58589166 59369918 59742992
4168 59742992 60577137 61239577 63887232 64692806 65595406 65482554 64142247 61469178 58940815
$$ packed form
4231A09311816k612181k620010k835298j501381j648661k779801l223644j324194
4223I0766646j419904j744023j020947j208384k110667j110869j391727j431473
4215G9328652j228918j016435l28916p32273J45535j146474o86587n58341q46742
4206G2929501n48454j50088l52700j000746p11919k4239p21313m0526j49962j704427
4196F7525127k157734j068393n97707k4009j595902o8861p53741j225093r93934
4187E9039753j190617k75111J19044O10104M46248l50726j214400n57681n13536
4178E6113078Q08201J098599J38627p30445n965j71291Q93126M45236P80752L73074
4168E9742992Q34145O62440K647655Q05574R02600j12852j340307k673069k528363
$$ plain form
4159 58940815 57469456 56678896 56291957 55665448 55686542 54191004 52245263 53163688 54201207
4150 54201207 52511208 52868526 51998100 50944891 50175047 50282712 50219995 50551346 50341933
4141 50341933 50042794 49808404 49003148 49472422 49213995 48915182 48701579 48337519 47849105
4132 47849105 47966326 47038514 46729111 46487761 46451000 47601695 47688410 46596741 47758893
4123 47758893 48607113 47605127 47656419 47262292 46886389 47273334 47381115 47753935 47516433
4114 47516433 46866660 46682827 48534430 49202096 48557069 48649884 48336757 47615754 46751484
4105 46751484 47658596 47687648 46457906 46701151 47727980 49216926 50331000 50023245 50528757
4096 50528757 50441033 50633641 49525741 49566086 49911716 49374705 49906610 51092118 50914170
$$ packed form
4159E8940815j471359p90560l86939o26509K1094j495538j945741R18425J037519
4150E4201207j689999L57318q70426j053209p69844J07665o2717L31351k09413
4141E0341933k99139k34390q05256M69274k58427k98813k13603l64060m88414
4132D7849105J17221r27812l09403k41350l6761J150695Q6715j091669J162152
4123D7758893Q48220j001986N1292l94127l75903L86945J07781L72820k37502
4114D7516433o49773j83833J851603O67666o45027R2815l13127p21003q64270
4105D6751484R07112K9052j229742K43245J026829J488946J114074l07755N05512
4096E0528757q7724J92608j107900M0345L45630n37011N31905J185508j77948
$$ plain form
4087 50914170 50937542 50573068 50357090 50539700 51567068 51248895 51501025 51954215 52568234
4078 52568234 52581148 52520878 53106866 53789673 53577034 52711816 52797451 53498925 53162230 53339608
4068 53339608 53903093 53459080 53887602 53926911 54051273 54914753 54925062 54249404 54701908 54844301
4058 54844301 55362977 55634576 54554871 55423416 56294829 56176167 55783598 55930919 56135059
4049 56135059 55634294 55942207 55981911 55607331 55242491 54995670 55219120 54483987 53859421 53995990
4039 53995990 54600552 53793178 53293193 53653761 53277136 52097992 50957607 50757508 50868916
4030 50868916 50613679 49139749 49108066 48579009 47423301 47078630 46148492 45766842 45008040
4021 45008040 44538155 44339626 42749017 42174260 40858508 40298857 39423596 38456943 38161223
$$ packed form
4087E0914170K3372l64474k15978J82610J027368l18173K52130M53190O14019
4078E2568234J2914o0270N85988O82807k12639q65218Q5635P01474l36695J77378
4068E3339608N63485m44013M28522L9309J24362Q63480J0309o75658M52504J42393
4058E4844301N18676K71599j079705Q68545Q71413j18662l92569J47321K04140
4049E6135059n00765L07913L9704l74580l64840k46821K23450p35133o24566J36569
4039E3995990O04562q07374m99985L60568l76625j179144j140385k00099J11408
4030E0868916k55237j473930l1683n29057j155708l44671r30138l81650p58802
4021D5008040m69885j98529j590609n74757j315752n59651q75261r66653k95720
$$ plain form
4012 38161223 37698093 36692827 36073941 34737511 34180418 33484651 32842719 30566856 30000236
4003 30000236 29497266 29446754 28597641 27733505 27446739 27906167 26921680 27065408 27590033 27561028
3993 27561028 26888536 25188916 24412685 23649675 23594395 23466771 21913037 20830803 19712023
3984 19712023 20288829 20852409 20433851 20697055 19402124 19070974 18508972 18234003 18764547
3975 18764547 19168835 18370020 18380025 18368044 18343583 18571056 18324548 18290180 18361228 18742765
3965 18742765 18640826 17370593 16609417 16925499 16998613 15952900 15022995 14455353 14223385
3956 14223385 13996935 14177402 13836401 15423290 14419628 13979391 13056741 12904228 13183393
3947 13183393 13207023 12847314 13075187 13140003 12788774 13191289 13003954 12053614 12008582 12730875
$$ packed form
4012C8161223m63130j005266o18886j336430n57093o95767o41932k275863n66620
4003C0000236n02970n0512q49113q64136k86766M59428r84487J43728N24625k9005
3993B7561028o72492j699620p76231p63010n5280j27624j553734j082234j118780
3984A9712023N76806N63580m18558K63204j294931l31150n62002k74969N30544
3975A8764547M04288p98815J0005j1981k4461K27473k46508l4368P1048L81537
3965A8742765j01939j270233p61176L16082P3114j045713r29905n67642k31968
3956A4223385k26450J80467l41001J586889j003662m40237r22650j52513K79165
3947A3183393K3630l59709K27873O4816l51229M02515j87335r50340m5032P22293
$$ plain form
3937 12730875 12958931 13402647 13662929 13339767 12353295 12447185 11797083 12040692 12034031 12348770
3927 12348770 12454173 11791271 12336805 12654751 12431129 11809162 11069836 11823072 11251895
3918 11251895 10827600 10489627 10359474 10541679 10014995 9978573 10006357 9059777 9554772 10201660
3908 10201660 9403043 9619326 9383592 9256573 9215266 10095560 10613802 9458605 9230325
3899 9230325 9991406 9509220 9688429 10101436 9019477 8374057 8779020 9785463 9828827
3890 9828827 9003858 9398320 9804529 9434414 8923570 9506131 9445513 9097208 8722549 10117466
3880 10117466 10498945 9796629 9652129 9229225 10463235 10321102 10292605 9376588 9021635
3871 9021635 10004676 9872109 9746097 10076560 10550195 10427066 9614288 8809067 9090408 9777180
$$ packed form
3937A2730875K28056M43716K60282l23162r86472R3890o50102K43609o661L14739
3927A2348770J05403o62902N45534L17946k23622o21967p39326P53236n71177
3918A1251895m24295l37973j30153J82205n26684l6422K7784r46580M94995O46888
3908A0201660p98617K16283k35734j27019m1307Q80294N18242j155197k28280
3899I230325P61081m82186J79209M13007j081959o45420M04963J006443M3364
3890I828827q24969L94462M06209l70115n10844N82561o0618l48305l74659J394917
3880A0117466L81479p02316j44500m22904J234010j42133k8497r16017l54953
3871I021635R83041j32567j26012L30463M73635j23129q12778q05221K81341O86772
$$ plain form
3861 9777180 10051774 9639702 9669478 8816409 8808526 10212610 9786904 8638776 8457069 9421000
3851 9421000 10155838 9998409 9344964 9629319 9556084 9585570 9686496 9563354 9126461 9301879
3841 9301879 9174792 9904722 10798395 10116073 10547253 10893693 10029175 11195284 11728141
3832 11728141 10600514 10526636 9603708 10028339 10295810 10837090 10854127 10218164 10076284 10196751
3822 10196751 11290068 11637447 11780757 12391215 12055460 11082394 11042094 11535849 12149948
3813 12149948 11662675 11657259 12099969 11629983 10872431 11413864 12577181 12109536 11948185 12486658
3803 12486658 12498723 12768760 13321106 14136774 13727716 13180034 13021004 13593817 14137579 14500519
3793 14500519 13406382 13410857 14458610 14691320 13909744 14427092 15227689 15168543 15918688 15194068
$$ packed form
3861I777180K74594m12072K9776q53069p883J404084m25706j148128j81707R63931
3851I421000P34838j57429o53445K84355p3235K9486J00926j23142m36893J75418
3841I301879j27087P29930Q93673o82322M31180L46440q64518J166109N32857
3832A1728141j127627p3878r22928M24631K67471N41280J7037o35963j41880J20467
3822A0196751J093317L47379J43310O10458l35755r73066m0300M93755O14099
3813A2149948m87273n416M42710m69986p57552N41433J163317m67645j61351N38473
3803A2486658J2065K70037N52346Q15668m09058n47682j59030N72813N43762L62940
3793A4500519j094137M475J047753K32710p81576N17348Q00597n9146P50145p24620
$$ plain form
3783 15194068 15557084 16613900 16437067 15578798 16508390 16788925 17247269 17387961 17416640
3774 17416640 17352865 17021463 17441430 17243194 17645297 18063707 17772627 17252915 17533361 18331102
3764 18331102 18639157 17999448 18789736 18979600 19120982 18622140 18484422 18965720 19260123
3755 19260123 19622651 19237907 19766314 20906471 21138167 21887588 20629354 19861670 20606122
3746 20606122 20438312 20566632 20282666 21701396 22087647 23178798 23933937 22723894 23261235
3737 23261235 24228417 24302105 25917944 25451178 26059145 25873102 26072608 26824235 26283618
3728 26283618 26138377 27420139 27768067 28182118 29211675 29853578 29678735 29891493 30379772
3719 30379772 29404532 30368132 31546815 32976847 32444797 32421433 33214282 33962349 33852304
$$ packed form
3783A5194068L63016J056816j76833q58269R29592K80535M58344J40692K8679
3774A7416640o3775l31402M19967j98236M02103M18410k91080n19712K80446P97741
3764A8331102L08055o39709P90288J89864J41382m98842j37718M81298K94403
3755A9260123L62528l84744N28407J140157K31696P49421j258234p67684P44452
3746B0606122j67810J28320k83966J418730L86251J091151P55139j210043N37341
3737B3261235R67182P3688J615839m66766O07967j86043J99506P51627n40617
3728B6283618j45241J281762L47928M14051J029557O41903j74843K12758M88279
3719C0379772r75240R63600J178683J430032n32050k3364P92849P48067j10045
$$ plain form
3710 33852304 33654137 34291767 34141586 34570629 34831839 35336917 34500609 34320345 34549902
3701 34549902 34386428 34236970 33905800 34574683 34150288 34608051 34870516 34879163 34406130 35255524
3691 35255524 35172275 34276050 33667517 34589467 34990651 34677488 34993359 33687222 32137097
3682 32137097 34007656 35571487 35648940 35614142 34133037 34788145 36178749 37080389 36727923
3673 36727923 36714121 36947480 37722005 37536850 37855062 37939071 39288717 41045666 41372092
3664 41372092 40959463 41078923 40744259 40707725 41118061 41076822 41939795 42620075 42579363 43118090
3654 43118090 43381844 43199087 44092604 44567850 45392216 44199766 44767985 45307027 44798739
3645 44798739 46499907 47040028 46101316 46384693 47024662 48064045 48371496 48903132 49135996
$$ packed form
3710C3852304j98167O37630j50181M29043K61210N05078q36308j80264K29557
3701C4549902j63474j49458l31170O68883m24395M57763K62465Q647m73033Q49394
3691C5255524q3249q96225o08533R21950M01184l13163L15871j306137j550125
3682C2137097J870559J563831P7453l4798j481105O55108J390604R01640l52466
3673C6727923j3802K33359P74525j85155L18212Q4009J349646J756949L26426
3664D1372092m12629J19460l34664l6534M10336m1239Q62973O80280m0712N38727
3654D3118090K63754j82757Q93517M75246Q24366j192450N68219N39042n08288
3645D4798739J701168N40121r38712K83377O39969J039383L07451N31636K32864
$$ plain form
3636 49135996 49749116 50094923 50473815 51166166 52360741 53389958 52703964 52542650 52164376
3627 52164376 52346936 53172045 53598902 54284143 55594390 55765275 55353540 57489130 57952275
3618 57952275 57390268 57178388 57806732 58528529 58084592 58344217 59364205 59739782 59090423
3609 59090423 59210490 59743867 59236307 58632917 59088208 60303754 60770311 61176017 61394770
3600 61394770 60986532 60971564 60287016 60561892 60822137 60098705 60571926 60458359 59695946 59620454
3590 59620454 59771428 59767160 58910183 58529212 57920393 57107914 56063464 55087791 54586634 54647390
3580 54647390 53937977 54234970 52772706 53386698 53175666 53716564 54008084 53424457 52804758
3571 52804758 51685734 51666770 51929687 50545266 50277045 50646764 50497638 50316861 50593020
$$ packed form
3636D9135996O13120L45807L78892O92351J194575J029217o85994j61314l78274
3627E2164376J82560Q25109M26857O85241J310247J70885m11735K135590M63145
3618E7952275n62007k11880O28344P21797m43937K59625J019988L75577o49359
3609E9090423J20067N33377n07560o03390M55291J215546M66557M05706K18753
3600F1394770m08238j4968o84548K74876K60245p23432M73221j13567p62413p5492
3590E9620454J50974m268q56977l80971o08819q12479j044450r75673n01157O0756
3580E4647390p09413K96993j462264O13992k11032N40898K91520n83627o19699
3571E2804758j119024j8964K62917j384421k68221L69719j49126j80777K76159
$$ plain form
3562 50593020 50550501 51498887 52006316 50886207 51225701 50574663 50546125 51140999 52496319
3553 52496319 53445911 53930158 54155091 54772270 55251316 56145858 56308660 55836896 57185267
3544 57185267 58635750 58998170 59759071 60080560 61068623 62912390 63713784 63974105 65706207
3535 65706207 66519633 67476364 67787455 67903938 66803106 67653917 68847261 69122150 69729617
3526 69729617 70171255 71123952 70764122 70269767 71660477 73665367 74216347 75103901 75667583
3517 75667583 75952284 77198224 78192498 79071545 80143755 81370743 82234573 83567077 84507274
3508 84507274 84939893 85683935 87823971 88449303 87572496 89625762 91248710 91348728 91697718
3499 91697718 92979151 93735712 95076555 95164457 94564483 94570700 93522128 92761912 92852801 92910864
$$ packed form
3562E0593020m2519R48386N07429j120109L39494o51038k8538N94874J355320
3553E2496319R49592M84247K24933O17179M79046Q94542J62802m71764J348371
3544E7185267J450483L62420P60901L21489R88063J843767Q01394K60321J732102
3535F5706207Q13426R56731L11091J16483j100832Q50811J193344K74889O07467
3526F9729617M41638R52697l59830m94355J390710K004890N50980Q87554N63682
3517G5667583K84701J245940R94274Q79047J072210J226988Q63830J332504R40197
3508H4507274M32619P44042K140036O25332q76807K053266J622948J00018L48990
3499I1697718J281433P56561J340843Q7902n99974O217j048572p60216R0889N8063
$$ plain form
3489 92910864 92924503 92975414 92614178 92297201 91798081 91812903 91641577 91653861 91738515 92410522
3479 92410522 92303496 93062837 93338479 93497418 94238144 96004810 96887229 98077085 99263382
3470 99263382 99888352 101563565 102340772 102335853 103297711 103779354 103536108 104135689 104112840 103476267
3460 103476267 103733239 104660739 103529170 103076724 101780679 102673785 102705436 101834262 101552661
3451 101552661 102440323 103914184 105673984 106185483 106070032 106362946 105723346 107240650 107466996
3442 107466996 108197875 109926311 110288267 109915580 109623774 110100958 109734890 109235979 108872284
3433 108872284 108644508 110025058 110544119 110417414 110532761 110326242 110611644 111663522 111706054
3424 111706054 111895322 112047078 111755232 112154462 110964900 110370126 110110459 109854367 110769527
$$ packed form
3489I2910864J3639N0911l61236l16977m99120J4822j71326J2284Q4654O72007
3479I2410522j07026P59341K75642J58939P40726J766666Q82419J189856J186297
3470I9263382O24970J675213P77207m919R61858M81643k43246N99581k2849o36573
3460A03476267K56972R27500j131569m52446j296045Q93106L1651q71174k81601
3451A01552661Q87662J473861J759800N11499j15451K92914o39600J517304K26346
3442A07466996P30879J728436L61956l72687k91806M77184l66068m98911l63695
3433A08872284k27776J380550N19061j26705J15347k06519K85402J051878M2532
3424A11706054J89268J51756k91846L99230j189562n94774k59667k56092R15160
$$ plain form
3415 110769527 109514488 108863826 109522820 108983226 108341227 106954837 105702341 106549253 106788016
3406 106788016 107743670 107768019 108189069 108885446 109925628 111539471 112997494 113648980 114753757
3397 114753757 115634380 113560726 113824683 114064955 114048209 112261648 111406509 110718746 109254541
3388 109254541 107543813 105598194 104468334 103650254 102148953 102106384 100718878 99421744
3380 99421744 99060968 98218387 97949728 97166148 97457584 97038171 96736665 96434891 97429075
3371 97429075 97609313 97772867 97337783 97235302 98708857 98665881 98234864 98324577 99999559
3362 99999559 100169400 100267650 100855604 101647379 102233034 103368272 103777582 104840297 106026437
3353 106026437 108670000 110066529 112099463 114569453 116971305 120146979 123787010 126831859
$$ packed form
3415A10769527j255039o50662O58994n39594o41999j386390j252496Q46912K38763
3406A06788016R55654K4349M21050O96377J040182J613843J458023O51486J104777
3397A14753757Q80623k073654K63957K40272j6746j786561q55139o87763j464205
3388A09254541j710728j945619j129860q18080j501301m2569j387506j297134
3380I9421744l60776q42581k68659p83580K91436m19413l01506l01774R94184
3371I7429075J80238J63554m35084j02481J473555m2976m31017Q9713J674982
3362I9999559J69841R8250N87954P91775N85655J135238M09310J062715J186140
3353A06026437K643563J396529K032934K469990K401852L175674L640031L044849
$$ plain form
3345 126831859 129078213 131910407 133851048 136733822 138671985 141825859 143547420 145395106
3337 145395106 147871838 150025466 153158657 155099323 157706628 160355655 162354388 164529710
3329 164529710 165863767 167376913 169537103 171243088 171309696 172479399 173706988 174407502
3321 174407502 175273257 175831090 176014558 176583532 176762021 176943049 177716073 177949374 179766854
3312 179766854 180364398 181357242 183575161 184004329 186666703 187377366 189340391 190996566 192060448
3303 192060448 193951005 197098464 198336713 199521581 201583233 203143691 204121375 204932463
3295 204932463 207054146 208998327 211742973 213352349 214181106 215179104 217096029 218205657
3287 218205657 219636215 220609993 220582623 221467198 221094818 221742715 222033227 223042911 224050326
$$ packed form
3345A26831859K246354K832194J940641K882774J938163L153874J721561J847686
3337A45395106K476732K153628L133191J940666K607305K649027J998733K175322
3329A64529710J334057J513146K160190J705985O6608J169703J227589P00514
3321A74407502Q65755N57833J83468N68974J78489J81028P73024K33301J817480
3312A79766854N97544R92844K217919M29168K662374P10663J963025J656175J063882
3303A92060448J890557L147459J238249J184868K061652J560458R77684Q11088
3295B04932463K121683J944181K744646J609376Q28757R97998J916925J109628
3287B18205657J430558R73778k7370Q84575l72380O47897K90512J009684J007415
$$ plain form
3278 224050326 224929804 226281947 227396205 229320279 231017498 234159047 235880943 237613395
3270 237613395 240444474 242802435 245259005 248177367 252695717 257786926 261353454 264834768
3262 264834768 266832440 265350777 264738237 264480395 264733547 264770809 266373544 267911576 269743886
3253 269743886 271811227 273218716 274667524 276410858 279719587 280328401 280819295 280979518
3245 280979518 279690279 278003989 276033683 273260731 270935091 268984741 266788363 265210134
3237 265210134 264519527 263695462 262016005 261915766 263125887 264515645 264929919 263088909 254987363
3228 254987363 242792568 231235102 221174493 212801748 204495453 198245243 191716190 186677184
3220 186677184 182749491 179111316 176058996 173597393 170860178 167760773 165440186 163952557
$$ packed form
3278B24050326Q79478J352143J114258J924074J697219L141549J721896J732452
3270B37613395K831079K357961K456570K918362M518350N091209L566528L481314
3262B64834768J997672j481663o12540k57842K53152L7262J602735J538032J832310
3253B69743886K067341J407489J448808J743334L308729O08814M90894J60223
3245B80979518j289239j686290j970306k772952k325640j950350k196378j578229
3237B65210134o90607q24065j679457j00239J210121J389758M14274j841010q101546
3228B54987363j2194795j1557466j0060609q372745q306295o250210o529053n039006
3220A86677184l927693l638175l052320k461603k737215l099405k320587j487629
$$ plain form
3212 163952557 162078459 160822633 160120622 159202019 158636099 159935877 159664854 160321253 162037058
3203 162037058 164530868 166787462 171298703 176039000 179455274 182256027 184383505 182442653
3195 182442653 179142090 177745821 174886178 171712957 167484250 164247283 161148587 158212660
3187 158212660 154801887 152491342 153034433 152812171 152013297 153094624 154348525 154425055 154740877
3178 154740877 155537804 157676646 158306829 159087606 159866627 162697431 165871877 167931407 171494378
3169 171494378 174827583 179434293 184555782 190291312 193449369 195427471 196174116 197783353
3161 197783353 197234366 194478710 189134409 181089451 173350277 167009209 160976870 157340849
3153 157340849 154804235 151880255 149713967 147500347 146421014 144365558 142035687 140858789
$$ packed form
3212A63952557j874098j255826p02011r18603n65920J299778k71023O56399J715805
3203A62037058K493810K256594M511241M740297L416274K800753K127478j940852
3195A82442653l300563j396269k859643l173221m228707l236967l098696k935927
3187A58212660l410773k310545N43091k22262p98874J081327J253901P6530L15822
3178A54740877P96927K138842O30183P80777P79021K830804L174446K059530L562971
3169A71494378L333205M606710N121489N735530L158057J978102P46645J609237
3161A97783353n48987k755656n344301q044958p739174o341068o032339l636021
3153A57340849k536614k923980k166288k213620j079333k055456k329871j176898
$$ plain form
3145 140858789 140138816 139521473 137899113 137515064 138327554 138773683 137766326 138934333 140761729
3136 140761729 141950591 142658597 144221754 146073825 146880707 146907410 147315112 147166212 146562635
3127 146562635 145141376 142385998 138065329 134845014 131885092 129204638 127198503 125709169
3119 125709169 124464002 122155315 121529406 120458381 119335473 118390505 117855114 117580877 116224833
3110 116224833 115016983 115292410 114346902 113199756 113471591 112007257 111060421 110250665 108697118
3101 108697118 108600820 107856194 107648553 107341662 107441974 106687081 106963630 107074440 106911201
3092 106911201 107596625 107498642 106336925 106219154 105136925 104890614 105560801 105008764 104358349
3083 104358349 103874458 102025925 100600850 100429903 99633706 98081294 97528446 96321841 94648258
$$ packed form
3145A40858789p19973o17343j622360l84049Q12490M46129j007357J168007J827396
3136A40761729J188862P08006J563157J852071Q06882K6703M07702j48900o03577
3127A46562635j421259k755378m320669l220315k959922k680454k006135j489334
3119A25709169j245167k308687o25909j071025j122908r44968n35391k74237j356044
3110A16224833j207850K75427r45508j147146K71835j464334r46836q09756j553547
3101A08697118r6298p44626k07641l06891J00312p54893K76549J10810j63239
3092A06911201O85424r7983j161717j17771j082229k46311O70187n52037o50415
3083A04358349m83891j848533j425075j70947p96197j552412n52848j206605j673583
$$ plain form
3074 94648258 94379447 93240707 91464060 89901483 90079918 89776425 89389786 89507865 87618339
3065 87618339 86270211 86052714 84531487 82676407 80196224 79181397 77966128 76972182
3057 76972182 75121894 73523845 72339691 70352019 69016295 67031748 65852414 63934440
3049 63934440 62967917 61933993 61332181 60201052 59932494 59332528 58190209 58061988 57887780
3040 57887780 57581096 57518624 57672405 57672806 56864144 55157999 54589882 54972151 54941946 54044935
3030 54044935 53848361 53914316 53513579 52213440 51750432 52535346 52557284 51788181 51970222 52108240
3020 52108240 52470903 53455714 53810807 52939506 53027422 52987321 53240134 53640071 54950638 55413626
3010 55413626 55658289 55792364 56716212 55736192 56225058 57340091 57841915 57308451 57352449
$$ packed form
3074I4648258k68811j138740j776647j562577J78435l03493l86639J18079j889526
3065H7618339j348128k17497j521227j855080k480183j014827j215269r93946
3057G6972182j850288j598049j184154j987672j335724j984547j179334j917974
3049F3934440r66523j033924o01812j131129k68558n99966j142319j28221j74208
3040E7887780l06684o2472J53781M01q08662j706145n68117L82269l0205q97011
3030E4044935j96574O5955m00737j300139m63008P84914K1938p69103J82041J38018
3020E2108240L62663R84811L55093q71301Q7916m0101K52813L99937J310567M62988
3010E5413626K44663J34075R23848r80020M88866J115033N01824n33464M3998
$$ plain form
3001 57352449 57001891 57592253 58175706 58301879 59028655 59006570 58765216 59331265 60824907
2992 60824907 60110228 61070249 62231114 63242093 63280880 65322227 65653083 65461133 65724041
2983 65724041 66313584 66073706 65724989 66406445 66425305 65657674 66925615 68698717 68905243
2974 68905243 70220384 70991948 71394134 72903391 73719681 75589095 76714606 77500834 79614143
2965 79614143 81025557 82776432 84588158 86446091 88408044 91010925 93946835 95983508
2957 95983508 98425475 100743861 103208972 104977311 105319214 106945329 106723205 106505820 108894782
2948 108894782 109807726 110619054 112714486 115574317 118402696 121249924 124118949 127506028
2940 127506028 131211754 136130182 141630871 147634060 154441007 162211538 172417735 181046741
$$ packed form
3001E7352449l50558N90362N83453J26173P26776k2085k41354N66049J493642
2992F0824907p14679R60021J160865J010979L8787K041347L30856j91950K62908
2983F5724041N89543k39878l48717O81456J8860p67631J267941J773102K06526
2974F8905243J315141P71564M02186J509257Q16290J869414J125511P86228K113309
2965G9614143J411414J750875J811726J857933J961953K602881K935910K036673
2957I5983508K441967K318386K465111J768339L41903J626115k22124k17385K388962
2948A08894782R12944Q11328K095432K859831K828379K847228K869025L387079
2940A27506028L705726M918428N500689O003189O806947P770531J0206197Q629006
$$ plain form
2932 181046741 190379807 199194705 205179036 211759279 217325197 223977749 231825460 240563963
2924 240563963 251549891 260299461 265484726 267826033 266562571 263889988 260542083 255030116
2916 255030116 248648395 241242919 234667018 230158877 226277010 225142498 225587899 227589620
2908 227589620 230763755 234404302 240184396 246222530 252249389 260767317 269851081 278978893
2900 278978893 290270843 302165354 313159263 323551588 333597719 339491649 342276223
2893 342276223 339003408 332853049 327588791 320991767 315733312 312546454 312915844 315036152
2885 315036152 317780150 323600446 330247379 337012183 343895235 351661445 358651027 363959100
2877 363959100 368255742 371563099 374250759 376692043 379419687 381148993 380649917 378309788
$$ packed form
2932A81046741R333066Q814898N984331O580243N565918O652552P847711Q738503
2924B40563963J0985928Q749570N185265K341307j263462k672583l347905n511967
2916B55030116o381721p405476o575901m508141l881867j134512M45401K001721
2908B27589620L174135L640547N780094O038134O026859Q517928R083764R127812
2900B78978893J1291950J1894511J0993909J0392325J0046131N893930K784574
2893C42276223l272815o150359n264258o597024n258455l186858L69390K120308
2885C15036152K743998N820296O646933O764804O883052P766210O989582N308073
2877C63959100M296642L307357K687660K441284K727644J729306m99076k340129
$$ plain form
2869 378309788 374270412 368774309 364093563 357937655 352443841 345619802 340283328 334258549
2861 334258549 327532840 319462257 312595031 306434001 298190240 291223003 284392083 277068750
2853 277068750 269841056 262610557 254748631 247703954 241114036 236768352 231794881 226833333
2845 226833333 222528331 220032769 219512015 219106755 219157259 219682758 221108310 223763235 226982443
2836 226982443 230130447 232981167 234667567 233604132 230828088 225200219 217419210 208264843
2828 208264843 198348528 185425644 174751829 164823985 154603462 145979173 138103527 131034583
2820 131034583 124301847 118405552 114532607 109335230 104668506 100999841 96714056 93907976
2812 93907976 91513808 90138614 88116674 85648441 82765223 80604724 76998790 74615022
$$ packed form
2869C78309788m039376n496103m680746o155908n493814o824039n336474o024779
2861C34258549o725709q070583o867226o161030q243761o967237o830920p323333
2853B77068750p227694p230499p861926p044677o589918m345684m973471m961548
2845B26833333m305002k495562n20754m05260N0504N25499J425552K654925L219208
2836B26982443L148004K850720J686400j063435k776044n627869p781009r154367
2828B08264843r916315j2922884j0673815r927844j0220523q624289p875646p068944
2820A31034583o732736n896295l872945n197377m666724l668665m285785k806080
2812I3907976k394168j375194k021940k468233k883218k160499l605934k383768
$$ plain form
2804 74615022 73229093 70634257 67997724 65766738 64038322 62060595 59542650 57843842
2796 57843842 56025993 54069798 52652949 51468170 51390657 49993192 48674783 47134727
2788 47134727 45337236 43963974 43761585 43162878 41830709 41916269 40759395 39279098 38773295
2779 38773295 38145705 37438035 36552970 35686937 35833047 35111501 33994768 33262091 32312377
2770 32312377 32105534 31037202 30637386 31684432 30381823 29377490 28111885 28197289 27872704
2761 27872704 26314228 25365675 24896289 26003302 25418004 25630915 24877581 24545186 23335478
2752 23335478 22274488 22189361 22222485 21838937 19787729 19310949 19658461 19243407 20164208
2743 20164208 20808718 19535703 18805334 18348740 18510422 17592698 17532919 17261867 17203804 17536145
$$ packed form
2804G4615022j385929k594836k636533k230986j728416j977727k517945j698808
2796E7843842j817849j956195j416849j184779p7513j397465j318409j540056
2788D7134727j797491j373262k02389n98707j332169Q5560j156874j480297n05803
2779C8773295o27590p07670q85065q66033J46110p21546j116733p32677r49714
2770C2312377k06843j068332l99816J047046j302609j004333j265605Q5404l24585
2761B7872704j558476r48553m69386J107013n85298K12911p53334l32395j209708
2752B3335478j060990q5127L3124l83548k051208m76780L47512m15054R20801
2743B0164208O44510j273015p30369m56594J61682r17724n9779k71052n8063L32341
$$ plain form
2733 17536145 17963745 17789455 18574949 16637729 16451021 16076633 15675416 14972860 14361602
2724 14361602 16154801 16144312 15991362 15247634 14490468 14263098 14685526 13540758 13251311
2715 13251311 13965850 13733670 13851071 14137439 12973491 12331786 13002898 13016178 12509437
2706 12509437 12320309 12119838 11254799 11065463 11299848 11183379 11321853 10365364 11111870
2697 11111870 10750827 10783835 10836122 10737979 10879300 10116289 10471111 10521595 10834227 10148503
2687 10148503 10368488 10520945 10847059 10144992 9392890 9577324 9555485 9952756 9729255 9359924
2677 9359924 9869107 9174590 8257757 8241979 8098202 9062603 9683047 9250692 9047220 8967973
2667 8967973 8754951 8650256 8206397 7697120 8119344 7985887 8230117 8046924 7696733 7166401
$$ packed form
2733A7536145M27600j74290P85494j937220j86708l74388m01217p02556o11258
2724A4361602J793199j0489j52950p43728p57166k27370M22428j144768k89447
2715A3251311P14539k32180J17401K86368j163948o41705O71112J3280n06741
2706A2509437j89128k00471q65039j89336K34385j16469J38474r56489P46506
2697A1111870l61043L3008N2287r8143J41321p63011L54822N0484L12632o85724
2687A0148503K19985J52457L26114p02067p52102J84434k1839L97271k23501l69331
2677I359924N09183o94517r16833j5778j43777R64401O20444m32355k03472p9247
2667H967973k13022j04695m43859n09277M22224j33457K44230j83193l50191n30332
$$ plain form
2657 7166401 6439233 6791164 7583805 7326442 7504126 7362380 7760377 8720102 8374212 8456017
2647 8456017 8224042 8535329 8470276 8956420 8075326 7632954 7362363 7702426 8336960 7800007
2637 7800007 6930599 7647713 7342451 6854679 6678240 7370888 7810924 7739019 7094901 6220562
2627 6220562 5956218 5672357 6363097 7454590 7340426 7540903 6997189 6742543 7338165
2618 7338165 7783372 8366668 7450661 7689029 7441768 6834525 6200980 6402899 6318498 6723913
2608 6723913 6947324 6208729 5726701 6284786 6998221 6834134 6309877 6049055 7218441
2599 7218441 6187878 5487457 4964666 5178532 5402080 5696195 5816835 5643884 6145436
2590 6145436 5690373 5842899 5697648 6365637 6652198 5098152 4446327 4000206 4340729
$$ packed form
2657G166401p27168L51931P92641k57363J77684j41746L97997R59725l45890Q1805
2647H456017k31975L11287o5053M86144q81094m42372k70591L40063O34534n36953
2637G800007q69408P17114l05262m87772j76439O92648M40036p1905o44118q74339
2627F220562k64344k83861O90740J091493j14164K00477n43714k54646N95622
2618G338165M45207N83296r16007K38368k47261o07243o33545K01919q4401M05415
2608F723913K23411p38595m82028N58085P13435j64087n24257k60822J169386
2599G218441j030563p00421n22791K13866K23548K94115J20640j72951N01552
2590F145436m55063J52526j45251O67989K86561j554046o51825m46121L40523
$$ plain form
2581 4340729 4806483 5566095 5303127 3929034 4965556 5144060 5217998 6271819 6214449
2572 6214449 5954646 4304661 3588577 3859791 4539623 4891497 4358586 4811959 5122713
2563 5122713 5394953 4442197 4171302 3905997 4684392 5340141 5316099 5827440 5268958 3615321
2553 3615321 4063167 4944156 4771164 4938062 4523875 4229988 4017784 3773691 3006966 3482684
2543 3482684 4022952 4176768 4799606 4384472 3807637 3218904 2639785 2897901 3761403 2949509
2533 2949509 3081321 2957646 3225885 3494407 3970410 4483541 4315583 3738103 3581714 3126652
2523 3126652 2313885 2793276 2987374 3522207 4315589 3413847 3339503 3901411 2872246 3201037
2513 3201037 2481167 1817892 2337653 2430198 2744708 2721641 2790452 2756228 3028345 3029851 3454463
$$ packed form
2581D340729M65754P59612k62968j374093J036522J78504P3938J053821n7370
2572F214449k59803j649985p16084K71214O79832L51874n32911M53373L10754
2563E122713K72240r52756k70895k65305P78395O55749k4042N11341n58482j653637
2553C615321M47846Q80989j72992J66898m14187k93887k12204k44093p66725M75718
2543C482684N40268J53816O22838m15134n76835n88733n79119K58116Q63502q11894
2533B949509J31812j23675K68239K68522M76003N13131j67958n77480j56389m55062
2523C126652q12767M79391J94098N34833P93382r01742p4344N61908j029165L28791
2513C201037p19870o63275N19761R2545L14510k3067O8811l4224K72117J506M24612
$$ plain form
2502 3454463 2804296 2227555 2592574 2159597 2502371 3475420 3314398 2723816 2209676 2067131
2492 2067131 1669746 2624445 2913266 2596361 2571770 1686183 782714 951550 1568695 1040620
2482 1040620 1230130 817568 2452497 3214370 3250799 2339228 1917740 2195616 2239506 2331977
2472 2331977 2087422 2110640 1909283 2792063 2479971 1995963 1706970 1271442 1586988 2719668
2462 2719668 2336563 1943514 2885599 3060969 3064939 2747683 1246390 1205138 2152464 1764935
2452 1764935 1653902 1021043 868132 1339373 2254289 3642731 2423881 1404615 1410438
2443 1410438 1615422 1198726 1251574 1462282 1751045 1960679 1705465 2089063 2432818 1713405
2433 1713405 1889041 2554342 2320327 2060250 1601020 696382 1075371 1777433 2097441 3713277
$$ packed form
2502C454463o50167n76741L65019m32977L42774R73049j61022n90582n14140j42545
2492B067131l97385R54699K88821l16905k4591q85587r03469J68836O17145n28075
2482A040620J89510m12562J634929P61873L6429r11571m21488K77876M3890R2471
2472B331977k44555K3218k01357Q82780l12092m84008k88993m35528L15546J132680
2462B719668l83105l93049R42085J75370L970l17256j501293m1252R47326l87529
2452A764935j11033o32859j52911M71241R14916J388442j218850j019266N823
2443A410438K04984m16696N2848K10708K88763K09634k55214L83598L43755p19413
2433A713405J75636O65301k34015k60077m59230r04638L78989P02062L20008J615836
$$ plain form
2423 3713277 3125050 2101185 2094977 2064948 1329410 2530076 1878505 1990903 2175624 2319163
2413 2319163 2188040 1223144 853424 1579493 1497573 1455737 2409494 1951454 1829968 2092159
2403 2092159 1640785 1468320 1480189 1500045 2738116 2785557 2333626 2774957 2334469 1321902
2393 1321902 1567991 1706168 1331801 2225295 2200506 2012485 2296406 2165297 1981942 1544283
2383 1544283 342609 1298236 2241748 2469180 2533334 1480316 2018318 2300798 2419375
2374 2419375 2256611 2447106 3415459 3842935 2870606 1903536 2222614 1956264 1732858 1369008
2364 1369008 1175361 1094356 1399354 1584815 911138 1719467 1479936 329281 1140471 1440861
2354 1440861 1067800 941386 1378646 1167404 437498 1729101 696687 725945 1184228
$$ packed form
2423C713277n88227j023865o208l0029p35538J200666o51571J12398J84721J43539
2413B319163j31123r64896l69720P26069q1920m1836R53757m58040j21486K62191
2403B092159m51374j72465J1869J9856J238071M7441m51931M41331m40488j012567
2393A321902K46089J38177l74367Q93494k4789j88021K83921j31109j83355m37659
2383A544283j201674R55627R43512K27432O4154j053018N38002K82480J18577
2374B419375j62764J90495R68353M27476r72329r67070L19078k66350k23406l63850
2364A369008j93647q1005L04998J85461o73677Q08329k39531j150655Q11190L00390
2354A440861l73061j26414M37260k11242p29906J291603j032414K9258M58283
$$ plain form
2345 1184228 815531 1101591 993353 88383 542965 1506572 910572 1307355 1341378 751738
2335 751738 795561 304856 1382324 1098959 1396915 923052 1527869 1061095 1938736 1649843
2325 1649843 700619 1217133 994041 630546 611147 1908939 2040652 1480322 966313 554489
2315 554489 615744 1172138 966483 1161649 1292420 1987320 1013482 1112487 1950015 1916102
2305 1916102 1443981 2006787 1427367 913110 1331872 2074513 1527713 1651609 1743529 990146
2295 990146 1322794 1634336 1540079 1109575 1763986 1101419 649105 1503926 1684449 2842829
2285 2842829 2412635 2786784 2371057 2435330 1743325 1966996 1472420 956994 1488340 1866829
2275 1866829 3270692 2991577 3190495 2210607 2028931 2673942 2502932 2963675 2550423
$$ packed form
2345A184228l68697K86060j08238r04970M54582R63607n96000L96783L4023n89640
2335G51738M3823m90705J077468k83365K97956m73863O04817m66774Q77641k88893
2325A649843r49224N16514k23092l63495j9399J297792J31713n60330n14009m11824
2315E54489O1255N56394k05655J95166J30771O94900r73838R9005Q37528l3913
2305A916102m72121N62806n79420n14257M18762P42641n46800J23896R1920p53383
2295I90146L32648L11542r4257m30504O54411o62567m52314Q54821J80523J158380
2285B842829m30194L74149m15727O4273o92005K23671m94576n15426N31346L78489
2275A866829J403863k79115J98918r79888j81676O45011j71010M60743m13252
$$ plain form
2266 2550423 1396605 1308977 1195429 2079167 1977969 1990384 2081594 1846676 1966350 2998030
2256 2998030 3741044 3548265 2624706 2997054 2784098 2349656 2100970 2545061 2800122 2325205
2246 2325205 1767267 1902573 2138208 2560288 3069043 2724301 2383952 2577245 1943481 2658991
2236 2658991 2370151 1591029 1745964 1911328 2909609 2764107 2613573 1427336 2245872
2227 2245872 3441346 3422051 2591170 2163284 3016411 3100718 3483653 2581736 1247061 2142424
2217 2142424 2378074 2899264 2933236 3180850 2596276 1545522 2784167 2829559 3485808 3686356
2207 3686356 3856991 4714446 3923846 3952772 4607448 4158387 3645001 4978854 6160628
2198 6160628 6996722 6474547 6457291 6177432 6193128 5241731 5710420 5966404 6199709 7601798
$$ packed form
2266B550423j153818q7628j13548Q83738j01198J2415R1210k34918J19674J031680
2256B998030P43014j92779r23559L72348k12956m34442k48686M44091K55061m74917
2246B325205n57938J35306K35635M22080N08755l44742l40349J93293o33764P15510
2236B658991k88840p79122J54935J65364R98281j45502j50534j186237Q18536
2227B245872J195474j9295q30881m27886Q53127Q4307L82935r01917j334675Q95363
2217B142424K35650N21190L3972K47614n84574j050754J238645M5392O56249K00548
2207C686356J70635Q57455p90600K8926O54676m49061n13386J333853J181774
2198F160628Q36094n22175j7256k79859J5696r51397M68689K55984K33305J402089
$$ plain form
2188 7601798 6447771 6238118 6765848 7403868 7642735 7816297 7542394 8218500 7443904
2179 7443904 8058127 8531099 9029724 9542268 10448926 10177925 8731620 10058854 10831846
2170 10831846 10116208 10371948 10776547 10052184 10782801 10491814 11239617 12020103 12456559
2161 12456559 11912844 12088552 12302532 13137085 13850136 14752767 14727809 15716304 15298870 15441843
2151 15441843 16996923 16837231 17967155 18050739 18296242 19379816 20140480 20650161 21313921
2142 21313921 22663273 23687138 23731266 25228096 26846848 28496839 28655292 30070023 31218522
2133 31218522 32512005 34011808 35631954 37042337 39114232 42871802 44577525 47718505
2125 47718505 50941683 56270882 59911556 64318907 67316713 71608406 77155619 84236945
$$ packed form
2188G601798j154027k09653N27730O38020K38867J73562k73903O76106p74596
2179G443904O14223M72972M98625N12544R06658k71001j446305J327234P72992
2170A0831846p15638K55740M04599p24363P30617k90987P47803P80486M36456
2161A2456559n43715J75708K13980Q34553P13051R02631k4958R88495m17434J42973
2151A5441843J555080j59692J129924Q3584K45503J083574P60664N09681O63760
2142B1313921J349352J023865M4128J496830J618752J649991J58453J414731J148499
2133C1218522J293483J499803J620146J410383K071895L757570J705723L140980
2125D7718505L223178N329199L640674M407351K997806M291693N547213P081326
$$ plain form
2117 84236945 92684307 102869274 116751608 133584611 155797360 184618455 224177460
2110 224177460 282528304 353020768 409611928 407851387 329023902 244516121 189971682
2103 189971682 154339228 127624703 107143732 91609800 80812291 72837006 66429656
2096 66429656 61021393 57397200 56244795 55202295 52546427 46804132 41922109 38598191
2088 38598191 35960658 32468197 30136371 28699351 27726906 26832401 26397140 24641445 23096498
2079 23096498 22430478 20931874 20582182 19187918 18026045 16315250 16166762 15796015 15355297
2070 15355297 15056329 14939186 14091641 13370411 12555644 11870222 12194272 11757161 10994589
2061 10994589 10990196 10458660 9484835 8778025 8764048 8937634 8782643 8609726 7774041 9167081
$$ packed form
2117H4236945Q447362J0184967J3882334J6833003K2212749K8821095L9559005
2110B24177460N8350844P0492464N6591160j760541p8827485q4507781n4544439
2103A89971682l5632454k6714525k0480971j5533932j0797509p975285o407350
2096F6429656n408263l624193j152405j042500k655868n742295m882023l323918
2088C8598191k637533l492461k331826j437020r72445q94505m35261j755695j544947
2079B3096498o66020j498604l49692j394264j161873j710795j48488l70747m40718
2070A5355297k98968j17143q47545p21230q14767o85422L24050m37111p62572
2061A0994589m393n31536r73825p06810j3977J73586j54991j72917q35685J393040
$$ plain form
2051 9167081 9457046 9051925 9082939 8476879 7507692 6579018 6542225 6371834 5925785 6670741
2041 6670741 7570351 6843391 6241954 6827673 5702621 5330757 5078685 6023415 6008257 4506791
2031 4506791 4092343 3999480 4582210 4861190 4551624 4556892 4407546 3426373 3441475 4378457
2021 4378457 3961620 3927943 3678002 3974763 4412300 5077396 4692858 4905506 4602585 4507630
2011 4507630 3186176 2729017 2287054 2541956 1943200 2333820 2827261 2400975 2856270
2002 2856270 2443296 3002123 1783175 1580655 2790003 3456906 3198733 3371147 3252617
1993 3252617 3602910 2544687 2933259 3170819 2439584 2731992 2201597 1158096 1865709
1984 1865709 1242455 1234981 2420840 2180056 2239376 1299715 2029209 2106984 1850329 2211892
$$ packed form
2051I167081K89965m05121L1014o06060r69187r28674l6793j70391m46049P44956
2041F670741Q99610p26960o01437N85719j125052l71864k52072R44730j5158j501466
2031D506791m14448r2863N82730K78980l09566N268j49346r81173J5102R36982
2021D378457m16837l3677k49941K96761M37537O65096l84538K12648l02921r4955
2011D507630j321454m57159m41963K54902n98756L90620M93441m26286M55295
2002B856270m12974N58827j218948k02520J209348O66903k58173J72414j18530
1993C252617L50293j058223L88572K37560p31235K92408n30395j043501P07613
1984A865709o23254p474J185859k40784N9320r39661P29494P7775k56655L61563
$$ plain form
1974 2211892 1248716 1220264 1708801 1596726 1473728 2737361 3219382 1939891 1039021
1965 1039021 1412450 1969544 2654645 2053148 982298 1136978 1688147 2333193 2510541
1956 2510541 2706138 2151800 1324451 1921112 1882700 1834972 2103253 905545 1670853 2468529
1946 2468529 3376222 2094949 2535515 1763118 -75240 384577 658822 1678541 1681112
1937 1681112 1465253 610263 1373538 1458830 1578769 1643168 1711315 722446 412431 155357
1927 155357 741937 1805365 1896604 2491986 1753869 -74041 739091 1624932 1981001 1104833
1917 1104833 1612016 2276227 1739930 1486640 2411951 2372503 1690044 892699 757465 783985
1907 783985 1131561 1135648 248536 1054073 1485687 1041423 1167297 1503679 71382 629777
$$ packed form
1974B211892r63176k8452M88537j12075j22998J263633M82021j279491r00870
1965A039021L73429N57094O85101o01497j070850J54680N51169O45046J77348
1956B510541J95597n54338q27349N96661l8412m7728K68281j197708P65308P97676
1946B468529R07693j281273M40566p72397j838358M59817K74245J019719K571
1937A681112k15859q54990P63275Q5292J19939O4399O8147r88869l10015k57074
1927A55357N86580J063428R1239N95382p38117j827910Q13132Q85841L56069q76168
1917A104833N07183O64211n36297k53290R25311l9448o82459p97345j35234K6520
1907G83985L47576M087q87112Q05537M31614m44264J25874L36382j432297N58395
$$ plain form
1897 629777 1320263 823531 727441 477674 149131 720933 783944 885883 875291 1208872
1887 1208872 903232 1132183 1431011 993693 348428 198347 208521 320784 -582368 464246
1877 464246 -52941 612523 944688 654451 166649 540305 338768 -95602 370411 251766
1867 251766 87341 392872 844166 1393458 1594772 835106 961816 419251 -749712 246312
1857 246312 681062 728152 1364592 1020447 1796296 576553 -39220 756697 1473431 1143281
1847 1143281 1223036 716053 322631 1262127 1647261 814026 1096590 2212068 2247990 2150092
1837 2150092 2317792 1748926 1594851 1171360 1405670 426817 778599 641756 -308686 19881
1827 19881 257777 296135 1370955 1545423 951046 461468 342554 457002 106987 119099
$$ packed form
1897F29777O90486m96732r6090k49767l28543N71802O3011J01939j0592L33581
1887A208872l05640K28951K98828m37318o45265j50081J0174J12263r03152J046614
1877D64246n17187O65464L32165k90237m87802L73656k01537m34370M66013j18645
1867B51766j64425L05531M51294N49292K01314p59666J26710n42565j168963R96024
1857B46312M34750M7090O36440l44145P75849j219743o15773P95917P16734l30150
1847A143281P9755n06983l93422R39496L85134q33235K82564J115478L5922r7898
1837B150092J67700n68866j54075m23491K34310r78853L51782j36843r50442L28567
1827A9881K37896L8358J074820J74468n94377m89578j18914J14448l50015J2112
$$ plain form
1817 119099 431283 -233592 -566329 121866 254028 -161865 37576 447381 -665533 -1578301
1807 -1578301 -611495 233695 -2072 93167 897060 742578 299491 -183469 -343019 58049
1797 58049 31230 47739 1658170 1810317 837539 859652 319277 71473 578 1215517
1787 1215517 1276804 1114425 1765523 1545719 352364 -71781 301922 764622 2214496
1778 2214496 1571625 336999 289116 60740 -333825 257162 747596 118546 -727086 -205338
1768 -205338 529854 538307 -157039 133148 539095 525465 1076368 209088 279959 939634
1758 939634 1145363 658424 474760 797644 562013 119269 2059 161136 1009377 961512
1748 961512 455234 -872428 -1018043 185911 316337 -59143 -1326141 -1688878 -166738
$$ packed form
1817A19099L12184o64875l32737O88195J32162m15893J99441M09805j112914r12768
1807a578301R66806Q45190k35767R5239Q03893j54482m43087m82960j59550M01068
1797E8049k6819J6509J610431J52147r72778K2113n40375k47804p0895J214939
1787A215517O1287j62379O51098k19804j193355m24145L73703M62700J449874
1778B214496o42871j234626m7883k28376l94565N90987M90434o29050q45632N21748
1768b05338P35192Q453o95346K90187M05947j3630N50903q67280P0871O59675
1758I39634K05729m86939j83664L22884k35631m42744j17210J59077Q48241m7865
1748I61512n06278j327662j45615J203954J30426l75480j266998l62737J522140
$$ plain form
1739 -166738 333446 257444 432001 146547 259987 1065294 76083 -169166 -602788 -310361
1729 -310361 -294211 -494300 132189 579078 277833 284164 132914 866108 667955 328028
1719 328028 244340 45880 -183576 -1109783 116096 1385410 1338913 729074 221734 -149817
1709 -149817 -5757 146474 -559541 -766306 -454954 530626 439189 -163466 120229 1563006
1699 1563006 2206088 1160045 1278690 923030 1131793 973825 1445241 1193012 651360
1690 651360 1199358 -69324 -368315 -306118 -190538 -396679 470116 218429 266527 275811
1680 275811 546189 1080609 5358 -692001 -750565 871271 1111018 1073167 1198521 1053752
1670 1053752 296652 -60014 -234218 -349653 5921 133331 85341 33382 -1178999 220132
$$ packed form
1739a66738N00184p6002J74557k85454J13440Q05307r89211k45249m33622K92427
1729c10361J6150k00089O26489M46889l01245O331j51250P33194j98153l39927
1719C28028q3688j98460k29456r26207J225879J269314m6497o09839n07340l71551
1709a49817J44060J52231p06015k06765L11352R85580r1437o02655K83695J442777
1699A563006O43082j046043J18645l55660K08763j57968M71416k52229n41652
1690F51360N47998j268682k98991O2197J15580k06141Q66795k51687M8098R284
1680B75811K70378N34420j075251o97359n8564J621836K39747l7851J25354j44769
1670A053752p57100l56666j74204j15435L55574J27410m7990n1959j212381J399131
$$ plain form
1660 220132 -208031 -612414 -99665 525213 469918 547356 1042812 785688 982936 635460
1650 635460 905848 1096257 1492746 2203605 1841756 879729 666531 954543 1251316 876487
1640 876487 315217 642821 1070014 1638754 1620726 1068481 1173820 276432 -311832 -79745
1630 -79745 -170603 -174784 -567658 -742910 -539639 -323125 -264286 -130867 193917 1528943
1620 1528943 2032692 976841 737195 1630515 1168540 778375 -225748 267577 753502
1611 753502 -324262 -537669 -417531 217 -194149 404957 64395 -144041 378893 -469869
1601 -469869 -12280 -38606 -755089 -732036 89453 -307111 -485469 21481 -714796 -195964
1591 -195964 474508 43187 10298 -508575 -287398 108178 -151494 109083 -243135 -707290
$$ packed form
1660B20132m28163m04383N12749O24878n5295P7438M95456k57124J97248l47476
1650F35460K70388J90409L96489P10859l61849r62027k13198K88012K96773l74829
1640H76487n61270L27604M27193N68740j8028n52245J05339q97388n88264K32087
1630g9745r0858m181l92874j75252K03271K16514N8839J33419L24784J335026
1620A528943N03749j055851k39646Q93320m61975l90165j004123M93325M85925
1611G53502j077764k13407J20138M17748j94366N99106l40562k08436N22934q48762
1601d69869M57589k6326p16483K3053Q21489l96564j78358N06950p36277N18832
1591a95964O70472m31321l2889n18873K21177L95576k59672K60577l52218m64155
$$ plain form
1581 -707290 14280 -106559 -337354 -541551 -496106 209972 -347714 -122247 -297500 274542
1571 274542 143066 273847 174059 450406 121259 -124298 537850 -85615 -958861 188673
1561 188673 992921 120380 154659 142179 -380326 663378 294617 -305655 208426 354607
1551 354607 755758 -75780 -788158 -1265164 -1360219 -399190 192847 1446596 723184 346870
1541 346870 257165 -360115 -474156 363915 697485 -950190 -515768 625788 -211567 -427764
1531 -427764 -3324 1216466 1264321 632163 1757108 1734923 841047 680647 679053 673397
1521 673397 638070 770222 931100 489460 -298829 -345992 -103627 -131068 -198003 854166
1511 854166 1853137 915009 906135 907076 -136887 115644 55553 50899 -710065 -1281256 -487216
$$ packed form
1581g07290P21570j20839k30795k04197M5445P06078n57686K25467j75253N72042
1571B74542j31476J30781r9788K76347l29147k45557O62148o23465q73246J147534
1561A88673Q04248q72541L4279j2480n22505J043704l68761o00272N14081J46181
1551C54607M01151q31538p12378m77006r5055R61029N92037J253749p23412l76314
1541C46870q9705o17280j14041Q38071L33570j647675M34422J141556q37355k16197
1531d27764M24440J219790M7855o32158J124945k2185q93876j60400j594n656
1521F73397l5327J32152J60878m41640p88289m7163K42365k7441o6935J052169
1511H54166R98971r38128q874R41j043963K52531o0091m654p60964n71191P94040
$$ plain form
1500 -487216 -272278 -682964 -699723 -810727 -342815 -156015 -400921 -85270 3499 71461
1490 71461 28200 -643251 -293736 -465327 -505554 171468 429530 184317 -150440 -1116498
1480 -1116498 -1172687 57960 -198064 32796 -125981 -470697 -794731 -119625 -704249 -104736
1470 -104736 -54355 714952 1448219 -289122 25314 443837 -248358 533947 -513411 -561776
1460 -561776 1011677 968348 518443 685175 258632 349353 935836 722972 -574210 -126518
1450 -126518 685867 1013230 -65695 -168545 250417 -734794 -590331 -361984 -1298788 -194032
1440 -194032 138536 -409962 -53125 115220 147051 -1021447 -1275208 -1195048 -817821 175601
1430 175601 184103 -427957 -44581 1131428 817849 122358 296390 459421 42372 -204915
$$ packed form
1500d87216K14938m10686j6759j11004M67912J86800k44906L15651Q8769O7962
1490G1461m3261o71451L49515j71591m0227O77022K58062k45213l34757r66058
1480a116498n6189J230647k56024K30860j58777l44716l24034O75106n84624N99513
1470a04736N0381P69307P33267j737341L14436M18523o92195P82305j047358m8365
1460e61776J573453m3329m49905J66732m26543R0721N86483k12864j297182M47692
1450a26518Q12385L27363j078925j02850M18962r85211J44463K28347r36804J104756
1440a94032L32568n48498L56837J68345L1831j168498k53761Q0160L77227R93422
1430A75601Q502o12060L83376J176009l13579o95491J74032J63031m17049k47287
$$ plain form
1420 -204915 119660 1010795 10159 -441313 -687499 -1182733 -510636 500494 775874
1411 775874 39152 629711 -670522 -250767 -655364 36325 831855 1600847 1517613 792729
1401 792729 746739 857637 -442135 361709 631042 490773 417029 -445495 -434354 -366027
1391 -366027 -708521 -1021703 -847547 -499171 324871 -496622 -499616 1116055 1633936 632922
1381 632922 311883 621454 386292 -252532 77075 164791 -95263 -765875 -984265 -623031
1371 -623031 -1107393 -942741 466467 214122 632297 355513 -1008152 -524454 844218
1362 844218 814717 723672 459815 621675 807408 632994 666330 1001838 1426721 871668
1352 871668 -895045 -1033505 -535180 -1034960 -155069 817333 44049 318344 -9605 201043
$$ packed form
1420b04915L24575Q91135j000636m51472k46186m95234O72097J011130K75380
1411G75874p36722N90559j300233M19755m04597O91689P95530P68992q3234p24884
1401G92729m5990J10898j299772Q03844K69333j40269p3744q62524J1141O8327
1391c66027l42494l13182J74156L48376Q24042q21493k994J615671N17881j001014
1381F32922l21039L09571k35162o38824L29607Q7716k60054o70612k18390L61234
1371f23031m84362J64652J409208k52345M18175k76784j363665M83698J368672
1362H44218k9501r1045k63857J61860J85733j74414L3336L35508M24883n55053
1352H71668j766713j38460M98325m99780Q79891R72402p73284K74295l27949K10648
$$ plain form
1342 201043 -71259 -733661 -199024 -488968 -1146220 -1171671 -624169 -464865 -383625 -900635
1332 -900635 226234 628759 -43236 -849585 -185645 515582 146503 -93185 -550043 -488676
1322 -488676 -54142 -945923 363110 310938 -1288847 -1131207 -679423 -859614 -1446514 -1947753
1312 -1947753 -1613636 -1372706 -770775 -913147 -971957 -936495 -522019 -116842 267143 384915
1302 384915 177290 373367 893941 273424 -456588 111351 505418 -228808 -340957 -977377
1292 -977377 -1216141 -1009779 -1443892 -1694180 -762566 -178454 -58544 274717 -609513 -44098
1282 -44098 -356856 -152941 -612867 -801644 -1098897 -1393392 -435307 -645803 -731323 114828
1272 114828 705835 779179 231963 10715 -759189 -617769 145914 333748 -799521 -360455
$$ packed form
1342B01043k72302o62402N34637k89944o57252k5451N47502J59304Q1240n17010
1332i00635J126869M02525o71995q06349O63940P01227l69079k39688m56858O1367
1322d88676M34534q91781J309033n2172j599785J57640M51784j80191n86900n01239
1312a947753L34117K40930O01931j42372n8810L5462M14476M05177L83985J17772
1302C84915k07625J96077N20574o20517p30012N67939L94067p34226j12149o36420
1292i77377k38764K06362m34113k50288R31614N84112J19910L33261q84230N65415
1282d4098l12758K03915m59926j88777k97253k94495R58085k10496q5520Q46151
1272A14828N91007P3344n47216k21248p69904J41420P63683J87834j133269M39066
$$ plain form
1262 -360455 -364965 -651858 412427 908131 91874 -398634 -1648344 -1267689 -476812 -741578
1252 -741578 -269259 157685 -844998 -1080594 -779949 -145653 207773 -39599 -280360 323434
1242 323434 230922 -919719 -1001383 -1301543 -719312 -850868 -1196718 -1091795 11651 554076
1232 554076 293678 -430239 -1015062 519165 111762 -313889 -1057550 -282456 431750 1339830
1222 1339830 273171 -67200 52907 -1181502 -605872 -1407249 -1002681 -1570781 -932566
1213 -932566 -795728 -568497 -551048 -628968 -635380 -488661 -236364 295583 770696 262486
1203 262486 -59774 -779278 -1185400 -708223 -258634 123707 201146 860317 141958 -275883
1193 -275883 -141120 936352 599835 35480 328475 887729 839242 948029 501495 201621
$$ packed form
1262c60455m510k86893J064285M95704q16257m90508j249710L80655P90877k64766
1252g41578M72319M26944j002683k35596L00645O34296L53426k47372k40761O03794
1242C23434r2512j150641q1664l00160N82231j31556l45850J04923J103446N42425
1232E54076k60398p23917n84823J534227m07403m25651p43661P75094P14206R08080
1222A339830j066659l40371J20107j234409N75630q01377M04568n68100O38215
1213i32566J36838K27231J7449p7920o412J46719K52297N31947M75113n08210
1203B62486l22260p19504m06122M77177M49589L82341P7439O59171p18359m17841
1193b75883J34763J077472l36517n64355K92995N59254m8487J08787m46534k99874
$$ plain form
1183 201621 199639 -278762 -415905 -673262 -85867 -100668 242476 -328227 -496335 -357659
1173 -357659 -254965 -83992 -783821 -565139 82229 28367 776618 589378 121721 -9329
1163 -9329 -1236753 -590248 -210168 -551159 -273307 -87075 -390925 -485879 -854882 -1396689
1153 -1396689 -1572159 -420288 -750268 229767 404079 -467546 -686959 -886332 117678
1144 117678 541419 -318377 -909258 -11887 -410072 451200 316147 -376701 -40491 -225093
1134 -225093 -891646 -1113907 -1296074 -1390561 -731199 -287678 -485930 -825940 -275000 172556
1124 172556 508920 1554842 380655 9880 58929 -984495 -1426403 -779345 186470
1115 186470 -139736 -459942 -344719 365967 335969 111297 -600535 -752614 -579326 -571008
$$ packed form
1183B01621j982m78401j37143k57357N87395j4801L43144n70703j68108J38676
1173c57659J02694J70973o99829K18682O47368n3862P48251j87240m67657j31050
1163i329j227424O46505L80080l40991K77852J86232l03850r4954l69003n41807
1153a396689j75470J151871l29980R80035J74312q71625k19413j99373J004010
1144A17678M23741q59796n90881Q97371l98185Q61272j35053o92848L36210j84602
1134b25093o66553k22261j82167r4487O59362M43521j98252l40010N50940M47556
1124A72556L36364J045922j174187l70775M9049j043424m41908O47058R65815
1115A86470l26206l20206J15223P10686k9998k24672p11832j52079J73288Q318
$$ plain form
1105 -571008 -327101 -1301494 311091 -8564 -318577 -384241 -1118611 -817881 438528 64042
1095 64042 -424527 -823605 -334904 883957 1091444 508375 96430 -284967 -880525 -628479
1085 -628479 -623828 -13393 -65713 747994 233229 -224603 814323 153184 -620558 -610746
1075 -610746 -26943 -136596 45826 -437543 314006 907503 146265 318513 689254 423546
1065 423546 1050057 858613 1401581 917666 -803257 -1085813 -513128 -702346 -836827 -542716
1055 -542716 394867 248691 -1274625 -363146 261881 -114352 -525883 -1067103 -982215 67677
1045 67677 418140 1840375 1631518 1566265 1834048 1885220 45327 350170 -702833 -346003
1035 -346003 275009 597544 120107 -601027 713667 361591 -133803 215454 -173271 -1156220
$$ packed form
1105e71008K43907r74393J612585l19655l10013o5664p34370L00730J256409l74486
1095F4042m88569l99078M88701J218861K07487n83069m11945l81397n95558K52046
1085f28479M651O10435n2320Q13707n14765m57832J038926o61139p73742R812
1075f10746N83803j09653J82422m83369P51549N93497p61238J72248L70741k65708
1065D23546O26511j91444N42968m83915j720923k82556N72685j89218j34481K94111
1055e42716R37583j46176j523316R11479O25027l76233m11531n41220Q4888J049892
1045F7677L50463J422235k08857o5253K67783N1172j839893L04843j053003L56830
1035c46003O21012L22535m77437p21134J314694l52076m95394L49257l88725r82949
$$ plain form
1025 -1156220 -41903 468350 396665 683988 283001 -342098 -645133 -420184 -582650 -459444
1015 -459444 -978976 -1045355 -1367791 434653 871573 350821 382795 -307739 78739 163530
1005 163530 953842 567615 -313615 -362755 -629556 406732 311870 -1069257 -922335 -204401
995 -204401 -886335 -384741 -490088 -508818 27126 -714616 -288667 433606 -661961 -1335712
985 -1335712 38172 466442 979476 23600 -74083 -81563 372933 1177622 1253754 710930
975 710930 643578 327615 1186415 647178 268877 269976 653377 -1272554 -1407702 -1850960
965 -1850960 -1567526 261533 -369149 72695 1071221 -192089 -777297 67127 432880
956 432880 -279104 -68160 62297 -288872 689742 34655 -1038169 -671187 -78303 228904
$$ packed form
1025a156220J114317N10253p1685K87323m00987o25099l03035K24949j62466J23206
1015d59444n19532o6379l22436J802444M36920n20752L1974o90534L86478Q4791
1005A63530P90312l86227q81230m9140k66801J036288r4862j381127J46922P17934
995b04401o81934N01594j05347j8730N35944p41742M25949P22273j095567o73751
985a335712J373884M28270N13034r55876r7683p480M54496Q04689P6132n42824
975G10930o7352l15963Q58800n39237l78301J099L83401j925931j35148m43258
965a850960K83434J829059o30682M41844R98526j263310n85208Q44424L65753
956D32880p11984K10944J30457l51169R78614o55087j072824L66982N92884L07207
$$ plain form
946 228904 868509 -153500 -447433 -12228 801741 89527 -544256 4727 -361148 -339504
936 -339504 -506466 -310856 350441 -631571 -739926 58785 950098 607552 213587 -11099
926 -11099 -519055 -55159 567082 1008431 -233070 -781513 -1345961 -969661 -1332890 -1977514
916 -1977514 -12269 72629 -56935 -235677 40372 -105492 -147666 -499844 -609905 -414172
906 -414172 -317797 -1028764 186825 430171 -33055 -108208 532728 1038348 -985893 -1238108
896 -1238108 -421770 826138 1114786 495690 202936 -406111 403878 666950 -532564
887 -532564 61016 75189 128479 84776 420084 108065 -1326005 -202462 -499965 -254061
877 -254061 85100 -84017 1176627 1419909 702314 -180458 -374905 -268017 -337714 248736
$$ packed form
946B28904O39605j022009k93933M35205Q13969p12214o33783N48983l65875K1644
936c39504j66962J95610O61297r82012j08355P98711Q91313l42546l93965k24686
926a1099n07956M63896O22241M41349j241501n48443n64448L76300l63229o44624
916a977514J965245Q4898j29564j78742K76049j45864m2174l52178j10061J95733
906d14172R6375p10967J215589K43346m63226p5153O40936N05620k024241k52215
896a238108Q16338J247908K88648o19096k92754o09047Q09989K63072j199514
887e32564N93580J4173N3290m3703L35308l12019j434070J123543k97503K45904
877b54061L39161j69117J260644K43282p17595q82772j94447J06888o9697N86450
$$ plain form
867 248736 167453 -318681 44835 -773917 -308038 -871195 -1002528 549410 -14125 -790297
857 -790297 -1402462 -933300 340297 -212573 -111076 301638 329348 -216345 15797 212849
847 212849 -766276 -926265 425136 127527 634394 290161 -57098 -519946 -1448007 -554255
837 -554255 714700 954830 1161164 897198 -113797 -950844 -587990 -386895 -680964 -1258578
827 -1258578 -580463 -543517 1478 236994 517335 1195852 -157316 83622 412123 483713
817 483713 -106781 -585016 -1088310 300911 143664 116973 -506846 -687485 -650112 -356283
807 -356283 -47393 390732 286485 -126093 -573469 -417974 360580 323208 205923 1056898
797 1056898 849119 261659 -630914 509916 484272 -790711 -695571 -868863 -474411 -676514
$$ packed form
867B48736q1283m86134L63516q18752M65879n63157j31333J551938n63535p76172
857g90297o12165M69162J273597n52870J01497M12714K7710n45693K32142J97052
847B12849r79125j59989J351401k97609N06867l44233l47259m62848r28061Q93752
837e54255J268955K40130K06334k63966j010995q37047L62854K01095k94069n77614
827a258578O78115L6946N44995K35516K80341O78517j353168K40938L28501P1590
817D83713n90494m78235n03294J389221j57247k6691o23819j80639L7373K93829
807c56283L08890M38125j04247m12578m47376J55495P78554l7372j17285Q50975
797A056898k07779n87460q92573J140830k5644j274983R5140j73292L94452k02103
$$ plain form
787 -676514 -533908 -880846 -1572575 -474558 1270921 673382 496231 -431123 -360612 715014
777 715014 -218939 231293 1063182 671771 -398610 -754924 83140 177383 193066 -262838
767 -262838 616297 -72792 -796161 -1142243 -352093 334057 -72189 -16692 283402 1013744
757 1013744 897025 157036 -843356 -988607 -792794 -181148 -132794 -715876 -1776216 -1149399
747 -1149399 338855 133536 410981 232924 -548173 -696002 -625310 -141973 8024 100338
737 100338 -1012486 -209897 669525 960105 1428157 1451067 1063730 977212 267851 -783872
727 -783872 -1343830 -254554 414049 -436468 -753829 -908467 -1189686 -1128417 -1606139 -1138635
717 -1138635 -903774 -1265818 -287127 -600464 -289903 -431453 -503585 311068 379203 367461
$$ packed form
787f76514J42606l46938o91729J098017J745479n97539j77151r27354P0511J075626
777G15014r33953M50232Q31889l91411j070381l56314Q38064R4243J5683m55904
767b62838Q79135o89089p23369l46082P90150O86150m06246N5497L00094P30342
757A013744j16719p39989j000392j45251J95813O11646M8354n83082j060340O26817
747a149399J488254k05319K77445j78057p81097j47829P0692M83337J49997R2314
737A00338j112824Q02589Q79422K90580M68052K2910l87337q6518p09361j051723
727g83872n59958J089276O68603q50517l17361j54638k81219O1269m77722M67504
717a138635K34861l62044R78691l13337L10561j41550p2132Q14653O8135j1742
$$ plain form
707 367461 -550918 93790 983918 72464 -846209 -532895 -81563 -1176169 -927583 -150014
697 -150014 -159536 -475290 49344 105382 443749 -428061 -601264 -684830 272667 460276 -136411
686 -136411 -1363682 -811595 427139 653718 116455 -209185 508702 1140984 588425 386956
676 386956 155465 699102 966280 529703 781201 1031692 -412316 -898214 -632764 -406725
666 -406725 20898 521406 457901 316956 -496046 -778757 -587858 -821933 269168 -311168
656 -311168 469159 551606 394009 -64366 -839679 612806 1682467 479365 569604 1548928
646 1548928 912573 -93634 754263 456386 243225 -31906 67077 720996 47437 79144
636 79144 493562 405014 332936 1017110 434987 -915940 -1410373 -1441271 -1255505 -1343374 -868597
$$ packed form
707C67461r18379O44708Q90128r11454r18673L13314M51332j094606K48586P77569
697a50014r522l15754N24634N6038L38367q71810j73203q3566R57497J87609n96687
686a36411j227271N52087J238734K26579n37263l25640P17887O32282n52559k01469
676C86956k31491N43637K67178m36577K51498K50491j444008m85898K65450K26039
666d06725M27623N00508o3505j40945q13002k82711J90899k34075J091101n80336
656c11168P80327Q2447j57597m58375p75313J452485J069661j203102R0239R79324
646A548928o36355j006207Q47897k97877k13161k75131R8983O53919o73559L1707
636G9144M14418q8548p2078O84174n82123j350927m94433l0898J85766q7869M74777
$$ plain form
625 -868597 -67659 -152219 -241300 -769138 -1542927 -913858 -665497 69607 521649 -15316
615 -15316 -816566 -142533 176940 264639 651746 440808 -43881 -96069 -867726 -584427
605 -584427 298706 533498 346245 70647 -71702 -96495 -81209 253543 947982 240285
595 240285 245792 831064 -1015781 -164565 425564 -194047 -181830 484913 -372261 17913
585 17913 24886 -116036 -53455 -318315 -1161395 -1234897 -437712 -804865 -524200 -143086 -16599
574 -16599 -456197 238329 74590 628987 545529 -535790 -5889 301737 -106338 -249704
564 -249704 -200033 -227948 -459173 -437658 -456492 -326242 -572600 -911678 -583769 -1214365 -438697
553 -438697 -214777 -738061 -166330 -621136 -1154383 -1335055 -757483 -773473 -653694 -534530
$$ packed form
625h68597Q00938q4560q9081n27838p73789O29069K48361P35104M52042n36965
615a5316q01250O74033L19473Q7699L87107k10938m84689n2188p71657K83299
605e84427Q83133K34792j87253k75598j42349k4793J5286L34752O94439p07697
595B40285N507N85272j846845Q51216N90129o19611J2217O66743q57174L90174
585A7913O973j40922O2581k64860q43080p3502P97185l67153K80665L81114J26487
574a6599m39598O94526j63739N54397q3458j081319N29901L07626m08075j43366
564b49704M9671k7915k31225K1515j8834J30250k46358l39078L27909o30596P75668
553d38697K23920n23284N71731m54806n33247j80672N77572j5990J19779J19164
$$ plain form
543 -534530 -165900 -544586 -901830 -308693 -188980 -598766 -859500 -640343 386347 523049
533 523049 63075 -378814 344396 -438420 589418 521727 22962 272189 -180732 -823933
523 -823933 -983494 -834488 -776596 -1056372 -1000176 -1151689 -986033 -157354 -453481 -623922
513 -623922 -207982 414083 276470 374041 1300698 1028654 686582 387169 305535 -67555
503 -67555 420487 274895 -370611 -771149 -636575 -339502 -109546 -93459 -160340 -439741
493 -439741 -424270 639700 604832 -848430 -460266 85160 895006 -2653 -507934 -1116434
483 -1116434 -755330 6817 95023 381197 -191931 849088 693719 178511 -98538 712281
473 712281 651503 -409465 -1369918 -1014691 -1045739 -587224 -292915 -951423 -907382 -390910
$$ packed form
543e34530L68630l78686l57244N93137J19713m09786k60734K19157J026690J36702
533E23049m59974m41889P23210p82816J027838o7691m98765K49227m52921o43201
523h23933j59561J49006N7892k79776N6196j51513J65656Q28679k96127j70441
513f23922M15940O22065j37613R7571R26657k72044l42072k99413q1634l73090
503f7555M88042j45592o45506m00538J34574K97073K29956J6087o6881k79401
493d39741J5471J063970l4868j453262L88164N45426Q09846q97659n05281o08500
483a116434L61104P62147Q8206K86174n73128J041019j55369n15208k77049Q10819
473G12281o0778j060968r60453L55227l1048M58515K94309o58508M4041N16472
$$ plain form
463 -390910 194235 291796 -309427 -830385 -1213927 -602015 -1037259 -1795938 -2006366 -1479510
453 -1479510 -1820258 -797244 -75793 -199257 -731742 -253699 -664216 198496 286921 316976
443 316976 -42418 -612153 -548102 -712774 556358 1570671 1302143 -224675 -524534 -478142
433 -478142 -843986 -631887 -434493 186994 -215553 -372439 -372993 229274 -14206 104063
423 104063 2130 -1263878 -149575 692038 236903 19788 -50321 -199621 -1557861 -842175
413 -842175 48145 -369988 -12571 -1511693 -844486 -271976 -245582 -1086084 -859011 324623
403 324623 868430 827600 235822 908999 -619672 -805754 -58884 47685 -187824 -650538
393 -650538 -1214703 -1106535 -1107970 -1179597 -687412 -451321 -14351 249781 -6158 -1429742
$$ packed form
463c90910N85145R7561o01223n20958l83542O11912m35244p58679k10428N26856
453a479510l40748J023014P21451j23464n32485M78043m10517Q62712Q8425L0055
443C16976l59394n69735O4051j64672J269132J014313k68528j526818k99859M6392
433d78142l65844K12099J97394O21487m02547j56886n54O02267k43480J18269
423A04063j01933j266008J114303Q41613m55135k17115p0109j49300j358240P15686
413h42175Q90320m18133L57417j499122O67207N72510K6394q40502K27073J183634
403C24623N43807m0830n91778O73177j528671j86082P46870J06569k35509m62714
393f50538n64165J08168j435p1627M92185K36091M36970K64132k55939j423584
$$ plain form
383 -1429742 -1043915 -606672 -239779 -266858 336774 -144496 -822106 -273772 371416 132809
373 132809 -1183354 -1431217 -483690 -767616 -754810 -538741 -363692 -314509 -292765 -138718
363 -138718 205183 -452290 88479 508036 208721 -127837 439394 1143520 419168 -349474
353 -349474 -356476 -1541761 -644905 259928 97963 -562774 -748363 -952373 -767568 -312336
343 -312336 -55578 -736711 -702768 -233716 97115 514295 -210189 -76032 -321403 -181478
333 -181478 393073 835277 -120815 -182975 -519768 -892541 -684599 -688947 -1190964 -611692
323 -611692 -434649 -588097 -1077690 -946826 -1482600 -929989 68012 464405 -238305 -574354
313 -574354 -227008 846352 741525 487 -326370 -1986625 -1360397 -1842722 -793599
$$ packed form
383a429742L85827M37243L66893k7079O03632m81270o77610N48334O45188k38607
373A32809j316163k47863R47527k83926J2806K16069J75049M9183K1744J54047
363a38718L43901o57473N40769M19557k99315l36558N67231P04126p24352p68642
353c49474p002j185285Q96856R04833j61965o60737j85589k04010J84805M55232
343c12336K56758o81133L3943M69052L30831M17180p24484J34157k45371J39925
333a81478N74551M42204r56092o2160l36793l72773K07942m348n02017N79272
323f11692J77043j53448m89593J30864n35774N52611R98001L96393p02710l36049
313e74354L47346J073360j04827p41038l26857j660255O26228m82325J049123
$$ plain form
304 -793599 698814 -876676 -1490800 -828822 64538 -307910 -135862 -1122270 -1509067 -657886
294 -657886 -68648 -302992 -519184 -1264830 -177813 -203322 -2076250 -633762 480565
285 480565 180702 -253699 -694433 -779998 -452015 -185940 -919389 -717426 -85886 -44332
275 -44332 152785 -218492 -1208318 -1942251 -1130724 -554738 -879758 -666555 -451840 -244099
265 -244099 -1014489 -273995 -169255 -488746 -214227 -394178 -572915 -488574 -315236 -730236
255 -730236 -240323 -423284 -808436 -533314 75695 -125030 -293103 -828106 -356384 187988
245 187988 220063 231238 -145673 24739 49360 -1074556 -905972 -84195 -83681 456164 875799
234 875799 -828039 -482931 -595963 446808 -494136 160549 507370 -1135136 -797294
$$ packed form
304g93599J492413j575490o14124O61978Q93360l72448J72048r86408l86797Q51181
294f57886N89238k34344k16192p45646J087017k5509j872928J442488J114327
285D80565k99863m34401m40734q5565L27983K66075p33449K01963O31540M1554
275d4332J97117l71277r89826p33933Q11527N75986l25020K13203K14715K07741
265b44099p70390P40494J04740l19491K74519j79951j78737Q4341J73338m15000
255g30236M89913j82961l85152K75122O09009k00725j68073n35003M71722N44372
245A87988L2075J1175l76911J70412K4621j123916J68584Q21777N14N39845M19635
234H75799j703838L45108j13032J042771r40944O54685L46821j642506L37842
$$ plain form
225 -797294 -1434893 -1403734 -1523107 -986531 -1315090 -774641 274465 685516 388614 553336
215 553336 978767 114706 166925 -1109077 -1125367 -205509 -497723 -871717 -123381 -579059
205 -579059 -476512 -37598 433527 305435 -908465 60786 511813 -192072 -53664 -1466031
195 -1466031 -1114130 -740167 -710330 -478732 -786629 -174531 -563630 -586478 -567280 763158
185 763158 498440 407016 -494023 -850197 -525736 154211 28266 610198 892487 1293669
175 1293669 -80399 -675605 -745651 -1145733 -1122033 8133 -119439 -88490 -224629 -205960
165 -205960 -829543 -1200087 -145677 -1148240 -1045883 -1209500 -1067395 -928509 -933959 -838679
155 -838679 -1264935 -1165977 -424214 -327561 146654 52439 -624721 -1472806 -1363496 -438246
$$ packed form
225g97294o37599L1159j19373N36576l28559N40449J049106M11051k96902J64722
215E53336M25431q64061N2219j276002j6290R19858k92214l73994P48336m55678
205e79059J02547M38914M71125j28092j213900R69251M51027p03885J38408j412367
195a466031L51901L73963K9837K31598l07897O12098l89099k2848J9198J330438
185G63158k64718r1424r01039l56174L24461O79947j25945N81932K82289M01182
175A293669j374068n95206p0046m00082K3700J130166j27572L0949j36139J8669
165b05960o23583l70544J054410j002563J02357j63617J42105J38886n450R5280
155h38679m26256R8958P41763R6653M74215r4215o77160q48085J09310R25250
$$ plain form
145 -438246 -943290 -1122709 -1103223 -1137426 -427608 -361869 -727777 -658081 -847187 -424108 -1477815
134 -1477815 -802939 72814 -554300 -660780 -776232 -307571 -745029 -524640 -627078 -511341
124 -511341 -918318 -245502 -440156 -813149 -557981 -260470 -729976 37323 304445 -273601
114 -273601 -752079 -1062917 -872490 -631282 -385049 -894153 -1110365 -1530007 -1207394 -991523
104 -991523 -288875 -773789 -1092091 -1689124 -1533334 -938389 -825325 -320657 16383 -624749
94 -624749 -786963 -622484 -590505 27119 -276740 -207724 -97361 29237 -530337 -204171
84 -204171 164202 -157254 114421 -760686 -734994 -921268 -566563 -269658 -576430 -62802
74 -62802 -421284 -620447 -766361 -572776 -774589 -356030 -135750 -897135 -917876 -1206458
$$ packed form
145d38246n05044j79419J9486l4203P09818O5739l65908O9696j89106M23079j053707
134a477815O74876Q75753o27114j06480j15452M68661m37458K20389j02438J15737
124e11341m06977O72816j94654l72993K55168K97511m69506P67299K67122n78046
114b73601m78478l10838J90427K41208K46233n09104k16212m19642L22613K15871
104i91523P02648m84914l18302n97033J55790N94945J13064N04668L37040o41132
94f24749j62214J64479L1979O17624l03859O9016J10363J26598n59574L26166
84b04171L68373l21456K71675q75107K5692j86274L54705K96905l06772N13628
74f2802l58482j99163j45914J93585k01813M18559K20280p61385k0741k88582
$$ plain form
64 -1206458 -974669 -163733 -620412 -164024 -491845 -572015 85140 117980 -498993 -137084
54 -137084 -664568 -631207 -1273535 -1252556 -346727 -856745 -711028 -527525 -395657 -21441
$$ packed form
64a206458K31789Q10936m56679M56388l27821q0170O57155L2840o16973L61909
54a37084n27484L3361o42328K0979R05829n10018J45717J83503J31868L74216
$$ [...]
##END NTUPLES=NMR SPECTRUM
##END=
