##TITLE=1H_CA-9181-3
 CDCl3
 8 sc, 
 1.8.2023
##JCAMPDX= 6.0         $$ Bruker NMR JCAMP-DX V2.0
##DATA TYPE= NMR SPECTRUM
##DATA CLASS= NTUPLES
##ORIGIN= UXNMR, Bruker Analytische Messtechnik GmbH
##OWNER= root
$$ XWIN-NMR		Version 3.5
$$ Tue Aug  1 13:59:23 2023 Russian Standard Time (UT+4h)  she@DPX200
##.OBSERVE FREQUENCY= 200.13135
##.OBSERVE NUCLEUS= ^1H
##.ACQUISITION MODE= SIMULTANEOUS
##.ACQUISITION SCHEME= undefined
##.AVERAGES= 8
##.DIGITISER RES= 18
##SPECTROMETER/DATA SYSTEM= spect
##.PULSE SEQUENCE= zg30
##.SOLVENT NAME= CDCl3
##.SHIFT REFERENCE= (INTERNAL, CDCl3, 0, 15.7282)
##AUDIT TRAIL= $$ (NUMBER, WHEN, WHO, WHERE, WHAT)
$$ ##TITLE= Audit trail, XWIN-NMR		Version 3.5
$$ ##JCAMPDX= 5.01
$$ ##ORIGIN= Bruker BioSpin GmbH
$$ ##OWNER= she
$$ F:/spectra/data/she/nmr/H-F/1/pdata/1/auditp.txt
$$ ##AUDIT TRAIL=  $$ (NUMBER, WHEN, WHO, WHERE, WHAT)
(   1,<2023-08-01 13:58:15.45 +0400>,<she>,<DPX200>,
      <created by zg, POWCHK disabled, PULCHK disabled
       configuration hash MD5:
       00 E9 B6 7A A2 85 ED C7 34 08 36 98 17 FE 4E 26
       data hash MD5: 16K
       A4 4D 1B 96 40 BA 90 66 AC 0E CA 7F FE 61 21 A6>)
(   2,<2023-08-01 13:58:18.07 +0400>,<she>,<DPX200>,
      <Start of raw data processing
       efp BC_mod = 2 LB = 0.24 FT_mod = 6 PKNL = 1 PHC0 = -21187.77 PHC1 = -6.547279 SI = 16K 
       data hash MD5: 16K
       26 10 95 77 51 8C DB FC 2E FC 59 83 34 DF 17 13>)
(   3,<2023-08-01 13:58:39.35 +0400>,<she>,<DPX200>,
      <pk PHC0 = -8.524467 PHC1 = 11.6 
       data hash MD5: 16K
       81 15 9D 4B F3 4A D0 BA FA 34 CE 9C 01 39 34 5A>)
(   4,<2023-08-01 13:58:42.93 +0400>,<she>,<DPX200>,
      <abs ABSG = 5 
       data hash MD5: 16K
       1F 7D 1F DD 99 E6 A3 D0 66 D4 E7 0D B4 A9 D8 C3>)
$$ ##END=
$$ 
$$ hash MD5
$$ 5F 7D 1D E3 48 B8 18 35 53 6A 73 41 87 9C BD 53
##$RELAX= 
##$RELAX= 
##$RELAX= 
##$RELAX= 
##$RELAX= 
##$RELAX= 
$$ Bruker specific parameters
$$ --------------------------
##$DU= <F:/spectra>
##$EXPNO= 1
##$NAME= <H-F>
##$PROCNO= 1
##$TYPE= <nmr>
##$USER= <she>
##$AMP= (0..31)
100 100 100 100 100 100 100 100 100 100 100 100 100 100 100 100 100 100 
100 100 100 100 100 100 100 100 100 100 100 100 100 100 
##$AQSEQ= 0
##$AQ_mod= 1
##$AUNM= <au_zg>
##$AUTOPOS= <>
##$BF1= 200.13
##$BF2= 200.13
##$BF3= 200.13
##$BF4= 200.13
##$BF5= 200.13
##$BF6= 200.13
##$BF7= 200.13
##$BF8= 200.13
##$BYTORDA= 1
##$CFDGTYP= 0
##$CFRGTYP= 5
##$CHEMSTR= <none>
##$CNST= (0..31)
1 1 145 1 1 1 1 1 1 1 1 1 1 1 1 1 1 1 1 1 1 1 1 1 1 1 1 1 1 1 1 1 
##$CPDPRG= <>
##$CPDPRG1= <>
##$CPDPRG2= <>
##$CPDPRG3= <>
##$CPDPRG4= <mlev>
##$CPDPRG5= <mlev>
##$CPDPRG6= <mlev>
##$CPDPRG7= <mlev>
##$CPDPRG8= <mlev>
##$CPDPRGB= <>
##$CPDPRGT= <>
##$D= (0..31)
0 1.2 0 0 0 0 0 0 0 0.06 0 0.03 0 0 0 0 0.0002 0 0 0 0 0 0 0 0 0 0 0 0 
0 0 0 
##$DATE= 1690883894
##$DBL= (0..7)
120 120 120 120 120 120 120 120 
##$DBP= (0..7)
150 150 150 150 150 150 150 150 
##$DBP07= 0
##$DBPNAM0= <>
##$DBPNAM1= <>
##$DBPNAM2= <>
##$DBPNAM3= <>
##$DBPNAM4= <>
$$ [...]
##$SUBNAM3= <"">
##$SUBNAM4= <"">
##$SUBNAM5= <"">
##$SUBNAM6= <"">
##$SUBNAM7= <"">
##$SUBNAM8= <"">
##$SUBNAM9= <"">
##$SW= 18.05172834244
##$SWIBOX= (0..15)
0 0 2 0 0 0 0 0 0 0 0 0 0 0 0 0 
##$SW_h= 3612.71676300578
##$TD= 16384
##$TD0= 1
##$TE= 0
##$TE2= 300
##$TE3= 300
##$TEG= 300
##$TL= (0..7)
0 120 120 120 120 120 120 120 
##$TP= (0..7)
150 150 150 150 150 150 150 150 
##$TP07= 0
##$TPNAME0= <>
##$TPNAME1= <>
##$TPNAME2= <>
##$TPNAME3= <>
##$TPNAME4= <>
##$TPNAME5= <>
##$TPNAME6= <>
##$TPNAME7= <>
##$TPOAL= (0..7)
0.5 0.5 0.5 0.5 0.5 0.5 0.5 0.5 
##$TPOFFS= (0..7)
0 0 0 0 0 0 0 0 
##$TUNHIN= 0
##$TUNHOUT= 0
##$TUNXOUT= 0
##$USERA1= <user>
##$USERA2= <user>
##$USERA3= <user>
##$USERA4= <user>
##$USERA5= <user>
##$V9= 5
##$VALIST= <valist>
##$VCLIST= <CCCCCCCCCCCCCCC>
##$VD= 0
##$VDLIST= <DDDDDDDDDDDDDDD>
##$VPLIST= <PPPPPPPPPPPPPPP>
##$VTLIST= <TTTTTTTTTTTTTTT>
##$WBST= 1024
##$WBSW= 4
##$XGAIN= (0..3)
0 0 0 0 
##$XL= 0
##$YL= 0
##$YMAX_a= 154107
##$YMIN_a= -109401
##$ZGOPTNS= <>
##$ZL1= 120
##$ZL2= 120
##$ZL3= 120
##$ZL4= 120
##$ABSF1= 15.77444
##$ABSF2= -2.27741
##$ABSG= 5
##$ABSL= 3
##$ALPHA= 0
##$AQORDER= 0
##$ASSFAC= 0
##$ASSFACI= 0
##$ASSFACX= 0
##$ASSWID= 0
##$AUNMP= <proc_1d>
##$AZFE= 0.1
##$AZFW= 0.1
##$BCFW= 0
##$BC_mod= 2
##$BYTORDP= 0
##$COROFFS= 0
##$CY= -3
##$DATMOD= 1
##$DC= 0
##$DFILT= <>
##$DTYPP= 0
##$F1P= 0
##$F2P= 0
##$FCOR= 1
##$FTSIZE= 16384
##$FT_mod= 6
##$GAMMA= 0
##$GB= 0
##$INTBC= 1
##$INTSCL= 3.70164e-10
##$ISEN= 128
##$LB= 0.24
##$LEV0= 0
##$LPBIN= 0
##$MAXI= 10000
##$MC2= 0
##$MEAN= 0
##$ME_mod= 0
##$MI= 1.114404
##$NCOEF= 0
##$NC_proc= -8
##$NLEV= 6
##$NOISF1= 3.799351
##$NOISF2= 2.8
##$NSP= 0
##$NTH_PI= 0
##$NZP= 0
##$OFFSET= 15.72816
##$PC= 1
##$PHC0= -21196.29
##$PHC1= 5.052722
##$PH_mod= 1
##$PKNL= yes
##$PPARMOD= 0
##$PSCAL= 0
##$PSIGN= 0
##$REVERSE= no
##$SF= 200.130008682365
##$SI= 16384
##$SIGF1= 3
##$SIGF2= 2
##$SINO= 5.538805
##$SIOLD= 16384
##$SREGLST= <1H.CDCl3>
##$SSB= 0
##$STSI= 16384
##$STSR= 0
##$SW_p= 3612.71676300578
##$SYMM= 0
##$S_DEV= 0
##$TDeff= 16384
##$TDoff= 0
##$TI= <>
##$TILT= no
##$TM1= 0
##$TM2= 0
##$TOPLEV= 0
##$USERP1= <user>
##$USERP2= <user>
##$USERP3= <user>
##$USERP4= <user>
##$USERP5= <user>
##$WDW= 1
##$XDIM= 16384
##$YMAX_p= 279834228
##$YMIN_p= -457682
$$ End of Bruker specific parameters
$$ ---------------------------------
##NTUPLES= NMR SPECTRUM
##VAR_NAME=  FREQUENCY,     SPECTRUM/REAL,   SPECTRUM/IMAG
##SYMBOL=    X,             R,               I
##VAR_TYPE=  INDEPENDENT,   DEPENDENT,       DEPENDENT
##VAR_FORM=  AFFN,          ASDF,            ASDF
##VAR_DIM=   16384,         16384,           16384
##UNITS=     HZ,            ARBITRARY UNITS, ARBITRARY UNITS
##FACTOR=    0.220516191357247, 1,           1
##FIRST=     3147.6767782412, 0,             0
##LAST=      -465.039984764577, 0,           0
##MIN=       -465.039984764577, -457682,     0
##MAX=       3147.6767782412, 279834228,     0
$$ Real data points
##PAGE= N=1
##DATA TABLE= (X++(R..R)), XYDATA
$$ [...]
5682E655619n7143n228j2941J10944k00963j97866j17698P3562m8845p3131R3816
5671E220126o542j94p0516k41737J15523k9343j72810O375j8687r2334O37O446
5659D716944N3485j03168j07758r4753R4666J33909q1026n9598J0248q2881r5755
5648D384313R2801m7319M8540j64374J9378l9124L189j8755K4181j01909j03149
5637D097772K2950J11005K2259m5472J8601n0896j04043J6729J14701L4467j19275
5626D118798j01770n5937O7980J72973p4015J5917j967o7429J6339o0919M0837
5615D070807R6843R2429M4943j63068J6612P8423k5554q3206l1707Q5517J3388
5604D195427j31802M6k8025N3240J76274P6654j23285O0621j2146j20480l5718
$$ y = [5655619, 5598476, 5593248, 5580307, 5691251, 5490288, 5292422, 5174724, 5248286, 5199441, 5126310, 5220126, 5213584, 5213390, 5142874, 4901137, 5016660, 4987317, 4814507, 4820882, 4802195, 4709861, 4710498, 4716944, 4770429, 4667261, 4559503, 4464750, 4559416, 4693325, 4612299, 4552701, 4562949, 4480068, 4384313, 4477114, 4429795, 4478335, 4313961, 4333339, 4294215, 4297404, 4278649, 4302830, 4200921, 4097772, 4120722, 4231727, 4253986, 4208514, 4227115, 4176219, 4072176, 4088905, 4203606, 4238073, 4118798, 4017028, 3961091, 4029071, 4202044, 4128029, 4143946, 4141979, 4074550, 4090889, 4029970, 4070807, 4167650, 4260079, 4305022, 4141954, 4158566, 4236989, 4211435, 4128229, 4096522, 4182039, 4195427, 4063625, 4063671, 4035646, 4088886, 4265160, 4341814, 4218529, 4279150, 4267004, 4146524, 4110806]
5593D110806j30178J49616N4823j48885J27290J3662R0739n7131L7301Q2354r0872
5582D239525J31682R1358j15066P3759P2768k9108m6371n6979l343J77923N0145
5571D586293j48054J64016M8848q6937K5580O3684n808J19620R3319l0500J884
5560D831945P8689q4143P538J70915R4020m6825l012K2768Q9232Q6104J1743P4925
5548E333899Q0470L1407Q4009J39905k3772R8731L7876l5298j003P9485L1913
5537E857622n7491M2767J38444J21958L7841q646q6044m486J27501N5199J38978
5526F363643P4259j5487J04196q5783K8140R6866l2625M7173J24554J2261J59322
5515F876519K8296M8058m985J27428R6437P610J7255J4086J85727J69418j4786
$$ y = [4110806, 3980628, 4130244, 4185067, 4036182, 4163472, 4177134, 4267873, 4210742, 4248043, 4330397, 4239525, 4371207, 4462565, 4347499, 4421258, 4494026, 4464918, 4418547, 4361568, 4358225, 4536148, 4586293, 4438239, 4602255, 4651103, 4564166, 4589746, 4653430, 4647622, 4767242, 4860561, 4830061, 4831945, 4910634, 4826491, 4834029, 5004944, 5098964, 5052139, 5049127, 5071895, 5161127, 5247231, 5258974, 5333899, 5414369, 5445776, 5529785, 5669690, 5645918, 5744649, 5782525, 5747227, 5746224, 5825709, 5857622, 5800131, 5842898, 5981342, 6103300, 6141141, 6132495, 6046451, 6041965, 6169466, 6224665, 6363643, 6437902, 6422415, 6526611, 6440828, 6468968, 6565834, 6533209, 6580382, 6704936, 6717197, 6876519, 6904815, 6952873, 6947888, 7075316, 7171753, 7179363, 7196618, 7210704, 7396431, 7565849, 7551063]
5504G551063K71333q379O1505l864M7455j0891p4159j2832O0503J10695J40807
5493H133236O3920n7370K46324p4439K4635K79669N3609m7409J84976J22330J11926
5482I041407J03630J71378J29283K15677K60899K04598K46456L55916L54953K82562
5472A1366759L30670Q312n7981J56641M3755K14864J96753J49249K05095K31230
5462A2845347L77452M15795M29386N14902M37646M83690N44523P17457O87008
5453A7453206R56209J145758J211782J230396J444808J817828J868290K039901
5445B9168178K188016K195697K294432K146495K012939J912517J707252Q64058
5437D4489584K64291m08021j340229j875166k145660k385375k409043k362216
$$ y = [7551063, 7822396, 7814017, 7875522, 7871658, 7919113, 7908222, 7834063, 7821231, 7881734, 7992429, 8133236, 8197156, 8139786, 8386110, 8311671, 8336306, 8615975, 8669584, 8622175, 8807151, 8929481, 9041407, 9145037, 9316415, 9445698, 9661375, 9922274, 10126872, 10373328, 10729244, 11084197, 11366759, 11697429, 11705741, 11647760, 11804401, 11848156, 12063020, 12259773, 12409022, 12614117, 12845347, 13222799, 13638594, 14067980, 14582882, 15020528, 15504218, 16048741, 16766198, 17453206, 18409415, 19555173, 20766955, 21997351, 23442159, 25259987, 27128277, 29168178, 31356194, 33551891, 35846323, 37992818, 40005757, 41918274, 43625526, 44489584, 44753875, 44345854, 43005625, 41130459, 38984799, 36599424, 34190381, 31828165]
5429C1828165k388600k155039j898470j901420j537358j535755j391055r59452
5421A8061016r14995q19952o45335n69984n56998n32708k59243l60587l55574
5412A3045640k61399k22284j47629l65096j73182j57444j65780j39520j32402
5403A1280904r7392j45390j95062l3491n7829j35340o4501o6385j55331l3759
5393A0296424j42990j58444O7058j46848j33630P6874k4029r9191q3737n7989
5383I593498O0961n7321j82980p8194k20977O116N8394p0658r2351K1681l8164
5372I000005J28817q9441J43947J23801k0533J7156J63098M4971l1744Q2649K56106
5361I818832J96477K30565L61320K65404L83083L05406M54509N78118N09689M55734
$$ y = [31828165, 29439565, 27284526, 25386056, 23484636, 21947278, 20411523, 19020468, 18061016, 17146021, 16326069, 15680734, 15110750, 14553752, 14021044, 13761801, 13401214, 13045640, 12784241, 12561957, 12414328, 12049232, 11876050, 11718606, 11552826, 11413306, 11280904, 11183512, 11038122, 10843060, 10809569, 10751740, 10616400, 10551899, 10485514, 10330183, 10296424, 10153434, 9994990, 10062048, 9915200, 9781570, 9858444, 9834415, 9735224, 9651487, 9593498, 9654459, 9597138, 9414158, 9335964, 9114987, 9121103, 9179497, 9108839, 9016488, 9038169, 9000005, 9128822, 9039381, 9183328, 9307129, 9286596, 9303752, 9466850, 9511821, 9480077, 9562726, 9818832, 10015309, 10245874, 10607194, 10872598, 11255681, 11561087, 12015596, 12593714, 13103403, 13559137]
5351A3559137N04879L74308M81497K87858J26178M8313k6287O9184r961j19851
5341A5295255n039N0396j37459j58375P8425j24432j52002J05633J49587Q5982
5331A5187971Q2815J76868K11970J71784J91267M58857K36106O20502O03501M14992
5321A8356633M09195L92888N63211K65725J28866P8694J09911L1225J06144L0239
5311B0472731P4049o3201M3445j09324l85950n62813o68446o82355p24225p79461
5301A6614450o80021o06981o69168m56393k93089l84762j89520k05731j10093
5292A3018692Q3088K70854J36018J90939K01411J89481R0483q9052O8684J79940
5282A4340538P0762J01287J85250o2928j52536l11791m63024o35730o40772o82389
$$ y = [13559137, 14064016, 14438324, 14919821, 15207679, 15333857, 15382170, 15355883, 15425067, 15415106, 15295255, 15290216, 15340612, 15203153, 15044778, 15123203, 14998771, 14846769, 14952402, 15101989, 15187971, 15270786, 15447654, 15659624, 15831408, 16022675, 16481532, 16717638, 17338140, 17941641, 18356633, 18765828, 19158716, 19721927, 19987652, 20116518, 20195212, 20305123, 20336348, 20442492, 20472731, 20546780, 20483579, 20527024, 20417700, 20031750, 19468937, 18800491, 18118136, 17393911, 16614450, 15934429, 15327448, 14658280, 14201887, 13908798, 13524036, 13334516, 13128785, 13018692, 13101780, 13372634, 13508652, 13699591, 13901002, 14090483, 14180966, 14091914, 14160598, 14340538, 14411300, 14512587, 14697837, 14634909, 14482373, 14170582, 13707558, 13071828, 12431056, 11748667]
5272A1748667o40295p02491n22704n06030l68776l57258m29930k58984k02739
5263G759460l24855o8639k82960j62351m3587j28861j79493q8887j83072l3867
5253F262888p5345j83464J3088j48326k26237k0104j04387k5243k9440j11213
5243E352217p0148O4610O8322j87647P3098p3256r0665n7868k7211r7814r2066
5232D861572R1485j64239N3832J36006j7342j2124J13558L7306O6637M6346k5492
5221E187545J94235j41267o4708j18306j8930j98546j262O6376k0290N607K4630
5210D915084j03835p2899p500l1295q6393J090N1226L6826q2384l8328k6685n6942
5198D497965M0610J67999m2535r1634L3229k7399J824O8758p1658p5532n0204
$$ y = [11748667, 11108372, 10405881, 9883177, 9377147, 9008371, 8651113, 8221183, 7962199, 7759460, 7434605, 7365966, 7083006, 6920655, 6877068, 6748207, 6568714, 6479827, 6296755, 6262888, 6187543, 6004079, 6017167, 5868841, 5642604, 5622500, 5518113, 5492870, 5463430, 5352217, 5282069, 5346679, 5415001, 5227354, 5300452, 5227196, 5136531, 5078663, 5051452, 4953638, 4861572, 4953057, 4788818, 4842650, 4978656, 4961314, 4949190, 5062748, 5100054, 5166691, 5213037, 5187545, 5381780, 5240513, 5175805, 5057499, 5038569, 4840023, 4838761, 4905137, 4884847, 4890454, 4915084, 4811249, 4738350, 4730850, 4699555, 4613162, 4614252, 4665478, 4702304, 4619920, 4581592, 4554907, 4497965, 4538575, 4706574, 4664039, 4572405, 4605634, 4578235, 4580059, 4648817, 4577159, 4501627, 4451423]
5187D451423J5314l1062J49110K42555j11002p3805M9255P5736k7366m0370j36698
5176D563090Q5452m6939k21227r417J1514K31834K69127l8986O379j19504q5228
5165D646095n9662O1951J00079m5790N2468M8407k9872j8306J10598J00570r893
5154D956645m0838N6652J47793J12878J37931O6551j87057n8427N2064N8554k0285
5143E282461J6946P2549Q2895J38463P8914J58465J11899k0760m2142K69895K3200
5132F172785q213n0173N6659K26424l3671P7254J7355K903N0722p9428J97655
5121F630272J26973M3064j82356O447Q9023J804n0407r566j1593P6813O6254O0866
5109F847594l9243R327K00706q7711J24670K9466R4805Q6232l2241J47396J24103
$$ y = [4451423, 4466737, 4435675, 4584785, 4827340, 4716338, 4642533, 4691788, 4767524, 4740158, 4699788, 4563090, 4648542, 4601603, 4380376, 4370959, 4382473, 4614307, 4883434, 4844448, 4850827, 4731323, 4646095, 4586433, 4648384, 4748463, 4702673, 4755141, 4803548, 4773676, 4755370, 4865968, 4966538, 4956645, 4915807, 4972459, 5120252, 5233130, 5371061, 5437612, 5250555, 5192128, 5244192, 5302746, 5282461, 5299407, 5371956, 5454851, 5593314, 5672228, 5830693, 5942592, 5921832, 5879690, 6149585, 6172785, 6164572, 6114399, 6171058, 6397482, 6363811, 6441065, 6458420, 6461323, 6512045, 6432617, 6630272, 6757245, 6800309, 6617953, 6624400, 6713423, 6715227, 6664820, 6655254, 6643661, 6720474, 6786728, 6847594, 6808351, 6817678, 7018384, 6930673, 7055343, 7084809, 7179614, 7265846, 7233605, 7381001, 7505104]
5098G505104J41277K36933k8734o1818L90759J49074K10572M81873L81205L03320
5088I709565N72685N41538O23890O31364N46310O14567O36040N51799L65652P4156
5078A4867566o8542o5168k41113j99040k19407j91321j54310j49729k91691o6592
5068A3220653r4660j62930j29152n484P6633J46339K48811M02874L82451N16343
5058A4601878N25465O25064O10640O22634M51534M50178J52305P4156q7217j19416
5048A7907221q9591R3597q454k23281j53783k35657K0562n3920j23308l40920
5038A6792466l80401m76946m49545l89598n04051n06951m40105k79450k03669
5029A3161750k27157k01937k26622L1892m9063J09878J42160P8078q06P7007j9708
$$ y = [7505104, 7646381, 7883314, 7854580, 7792762, 8183521, 8332595, 8543167, 9025040, 9406245, 9709565, 10282250, 10823788, 11447678, 12079042, 12625352, 13239919, 13875959, 14427758, 14793410, 14867566, 14799024, 14733856, 14492743, 14293703, 14074296, 13882975, 13728665, 13578936, 13287245, 13220653, 13125993, 12963063, 12833911, 12828427, 12905060, 13051399, 13300210, 13703084, 14085535, 14601878, 15127343, 15752407, 16363047, 16985681, 17437215, 17887393, 18039698, 18113854, 18026637, 17907221, 17817630, 17911227, 17902773, 17679492, 17525709, 17290052, 17310614, 17256694, 17133386, 16792466, 16412065, 15935119, 15485574, 15095976, 14591925, 14084974, 13644869, 13365419, 13161750, 12934593, 12732656, 12506034, 12537926, 12488863, 12598741, 12740901, 12818979, 12818173, 12895180, 12875472]
5018A2875472L9229J02375k7176J70571l7744k23073j98152m97656o21248n52811
5008A1029787o66952m65298m16751m97240m91000l71152l80201l38587k02290
4999G200316k24547j98857k28900j22550o1806j56379j07522k9679j18295j09321
4989E842460j63273j30685l5136n6949J62081Q1804j70604p5012L0538m234j22574
4978E358416J24816R1310m1646K5705p1918J12533K06573N2017j20214p1927j15330
4967E550335m580m0301R3837l1021Q8665j09491O327j10683j33126p0772j18074
4956E121116j0230j14693J62693n1081j04925j17922j60524j32161m1558q1831
4946D468884J9969n0288o0751Q2230j00883q0778P6773N5144j5616M3022J698
$$ y = [12875472, 12914701, 13017076, 12989900, 13160471, 13122727, 12899654, 12701502, 12203846, 11582598, 11029787, 10362835, 9897537, 9480786, 8983546, 8492546, 8121394, 7741193, 7402606, 7200316, 6975769, 6776912, 6548012, 6425462, 6363656, 6207277, 6099755, 6070076, 5951781, 5842460, 5679187, 5548502, 5513366, 5456417, 5618498, 5700302, 5529698, 5454686, 5485224, 5480990, 5358416, 5483232, 5574542, 5532896, 5558601, 5486683, 5599216, 5805789, 5857806, 5737592, 5665665, 5550335, 5545755, 5505454, 5599291, 5568270, 5656935, 5547444, 5553771, 5443088, 5309962, 5239190, 5121116, 5110886, 4996193, 5158886, 5107805, 5002880, 4884958, 4724434, 4592273, 4550715, 4468884, 4488853, 4438565, 4377814, 4460044, 4359161, 4278383, 4355156, 4410300, 4394684, 4437706, 4439404]
4935D439404j54707k1018J77724R130p0296k5157o8661j45040n4704J22175j70007
4924D038843j5184p4682M5738J29752M8984J18188K1650j62835j7393R5526r9784
4913D128803K26566O9675o6134L5305m1893N4438m5341j2558j07164Q9050J37891
4902D468638K3029o365k7659l2857j2266L3062j3622Q5397r76O1828l2775O1795
4890D607229J39100j34494M2912M6348J14478l202k4242J62748J03298o2354j27162
4879D864659P9612J34726K5519r581p3681J10627J59606q8138l6525Q5690R611
4868E262125J26066Q2366P4524J58786N7500j09109J11548J847J01445j541m2823
4857E822734p4470J15976N7283j19839N3638J00825J84872j1475K3431j8455J86226
$$ y = [4439404, 4284697, 4263679, 4441403, 4450533, 4380237, 4355080, 4286419, 4141379, 4086675, 4208850, 4038843, 4023659, 3948977, 3994715, 4124467, 4173451, 4291639, 4313289, 4150454, 4133061, 4228587, 4128803, 4355369, 4425044, 4358910, 4394215, 4352322, 4406760, 4361419, 4348861, 4241697, 4330747, 4468638, 4491667, 4485302, 4457643, 4424786, 4412520, 4445582, 4431960, 4517357, 4516381, 4578209, 4545434, 4607229, 4746329, 4611835, 4654747, 4701095, 4815573, 4812371, 4788129, 4950877, 5054175, 4991821, 4864659, 4944271, 5078997, 5104516, 5094935, 5021254, 5131881, 5291487, 5203349, 5166824, 5252514, 5262125, 5388191, 5470557, 5545081, 5703867, 5761367, 5652258, 5763806, 5765653, 5867098, 5865557, 5822734, 5748264, 5864240, 5921523, 5801684, 5855322, 5956147, 6141019, 6129544, 6152975, 6134520, 6320746]
4846F320746M7662n8502J2599J00524j15808J92664R3264J24756J94713k7952
4836F884666J39694J77624O217n4996Q3712P4247j2033M2772r4272P6402Q2716
4825G406749J97643Q3138l2659N1074J20639J02784K28270o433l6141J51337J782
4814H268183O3308J75778J8141R3481M8273R7081J8091K31129J23680j0131N9654
4803I186668J36485P7084J04270J95221J65422J47594k8012J91295J67002K00585
4793A0543614J97362J74792K26603Q8585J54392L60314K55625K48343K51915L19757
4783A2821302K25952K67523K61440L69910L30435M06083L01750K54712L60582
4774A5599689L17455J17426J91372L1770K58800k9712J11934O2373K8784K71394
$$ y = [6320746, 6368408, 6309906, 6322505, 6423029, 6307221, 6499885, 6593149, 6717905, 6912618, 6884666, 7024360, 7201984, 7208201, 7153205, 7236917, 7311164, 7299131, 7341903, 7247631, 7324033, 7406749, 7604392, 7687530, 7654871, 7705945, 7826584, 7929368, 8157638, 8151205, 8115064, 8266401, 8268183, 8331491, 8507269, 8525410, 8618891, 8667164, 8764245, 8782336, 9013465, 9137145, 9127014, 9186668, 9323153, 9400237, 9504507, 9699728, 9865150, 10012744, 9984732, 10176027, 10343029, 10543614, 10740976, 10915768, 11142371, 11230956, 11385348, 11745662, 12001287, 12249630, 12501545, 12821302, 13047254, 13314777, 13576217, 13946127, 14276562, 14682645, 14984395, 15239107, 15599689, 15917144, 16034570, 16225942, 16257712, 16516512, 16486800, 16598734, 16661107, 16689891, 16961285]
4764A6961285L35272K99243J82742K95776J75153L20899L89990M17615L27298
4755A9705273N17769M23280M39379L70505M10145N76158K76707M84230M29637
4746B3633083M26257L58811J74184J24077J86700j45874r0177k60825k43170n8880
4736B4104186j39503J22363J78048N1194J13033L33748J67773L96092M69553K96526
4726B6093013M52569N07099M05699N73513M26093N64715N09475L90474M82868
4717C0405518M59653L51509K82600J27483J79452J22980J22876J85693J49168
4708C2386932K72059N37755N90987O37943N71397P69652J026709J312199J411111
4699C9516744J505703J741127K184174K540709K789892L594812L857608M074268
$$ y = [16961285, 17296557, 17595800, 17778542, 18074318, 18249471, 18570370, 18960360, 19377975, 19705273, 20223042, 20646322, 21085701, 21456206, 21866351, 22442509, 22719216, 23203446, 23633083, 24059340, 24418151, 24592335, 24716412, 24903112, 24757238, 24667061, 24406236, 24163066, 24104186, 23964683, 24087046, 24265094, 24316288, 24429321, 24763069, 24930842, 25326934, 25796487, 26093013, 26545582, 27052681, 27458380, 28031893, 28457986, 29022701, 29532176, 29922650, 30405518, 30865171, 31216680, 31499280, 31626763, 31806215, 31929195, 32052071, 32237764, 32386932, 32658991, 33196746, 33787733, 34425676, 34997073, 35766725, 36793434, 38105633, 39516744, 41022447, 42763574, 44947748, 47488457, 50278349, 53873161, 57730769, 61805037]
4691F1805037M457164M391728M186661L615862L045286K551172J643274P15712
4683H6411896n51816j606412k653973l380937l704375l984254l975840l731769
4675F2822520l661409l487086k919599k704042k421430j979456k073582j741393
4667D1834523j487168j364897j340164j215869r23977j050010p81221o91786p35222
4658C2244209n18414n18617n10678m44255l67110l65864l62622m20081k98459
4649B8438109j73710l05969k32572q4637q2166j81482k27540k36139N0951n9930
4639B6904915k6634P3934J5073L1346k2619J4536j28815q6168M9803j8342K5399
4628B6832428m372j0222K2752K81457J00890L6242K61991J43148Q6665J28278
$$ y = [61805037, 66262201, 70653929, 74840590, 78456452, 81501738, 84052910, 85696184, 86411896, 85860080, 84253668, 81599695, 78218758, 74514383, 70530129, 66554289, 62822520, 59161111, 55674025, 52754426, 50050384, 47628954, 45649498, 43575916, 41834523, 40347355, 38982458, 37642294, 36426425, 35502448, 34452438, 33671217, 32979431, 32244209, 31725795, 31207178, 30696500, 30252245, 29885135, 29519271, 29156649, 28736568, 28438109, 28264399, 27958430, 27725858, 27641221, 27559055, 27377573, 27150033, 26913894, 26964845, 26904915, 26878281, 26952215, 26967288, 26998634, 26976015, 26990551, 26861736, 26775568, 26825371, 26807029, 26832428, 26828056, 26817834, 26840586, 27122043, 27222933, 27259175, 27521166, 27664314, 27750979, 27879257]
4618B7879257L05043K00128N2007P4325J83473J35888L14083R2669J62495K67940
4608B9667308K32928L73423L43967M17898M95693O39935N29956O51553P19880
4599C4072541O64267M30966L52383J09445j6227j74206j79647n2794M3733Q0891
4589C5331352J52718K68133M45599M14312M72400N00643M16044M57779M38129
4580C8897109M13083M19445N08904N49228P09588P60918N34545O61999O64947
4571D4119766P09013J318984J428345J463070J725251J474744J076240K09590
4563E3525003r02656j650461j729713j581746j219932p81903o60155m03834p3110
4554D4521493L87336M72980M42785O52060Q62919R83325J026587J014794R67389
$$ y = [27879257, 28184300, 28384428, 28436435, 28510760, 28694233, 28830121, 29144204, 29236873, 29399368, 29667308, 29900236, 30273659, 30617626, 31035524, 31531217, 32171152, 32701108, 33352661, 34072541, 34736808, 35167774, 35520157, 35629602, 35613375, 35439169, 35259522, 35206728, 35250461, 35331352, 35484070, 35752203, 36197802, 36612114, 37084514, 37585157, 38001201, 38458980, 38897109, 39310192, 39729637, 40238541, 40787769, 41497357, 42258275, 42792820, 43454819, 44119766, 44828779, 46147763, 47576108, 49039178, 50764429, 52239173, 53315413, 53525003, 52622347, 50971886, 49242173, 47660427, 46440495, 45658592, 44998437, 44594603, 44521493, 44908829, 45381809, 45824594, 46476654, 47339573, 48322898, 49349485, 50364279, 51331668]
4545E1331668Q00655R90371P62497O73052O44356L56879K83592M11015M23451
4536E6677536J006415J329832J383502J221823M33529n04240j298798k021846
4528E8227753k002243j639686j141755r36615o94749k98671j44743j68978J60116
4519E1360429J41714J33700K05374O7490K3090j65558K736P274p5588m2497l37826
4508E1320338m22161p11460q30336p75617o34251n60247l29640j7402k47967n16061
4498D6275196n48909r22616q45620r41296j071648p07684o48699o12160o59159
4489C9317405n93681m34828l93762l84073m26877m87715j97501m47057l30318
4480C5621593l91194l09665l57564l70443l95936m27922l84148n58747o12662
$$ y = [51331668, 52132323, 53122694, 53885191, 54558243, 55202599, 55559478, 55843070, 56254085, 56677536, 57683951, 59013783, 60397285, 61619108, 62052637, 61548397, 60249599, 58227753, 56225510, 54585824, 53444069, 52507454, 51812705, 51514034, 51369291, 51200313, 51360429, 51502143, 51635843, 51841217, 51908707, 51931797, 51766239, 51768975, 51776249, 51700661, 51658164, 51320338, 50898177, 50186717, 49356381, 48580764, 47946513, 47386266, 47056626, 47039224, 46791257, 46275196, 45726287, 44803671, 43958051, 43016755, 41945107, 41237423, 40588724, 39976564, 39317405, 38723724, 38288896, 37895134, 37511061, 37084184, 36596469, 36398968, 35951911, 35621593, 35230399, 34920734, 34563170, 34192727, 33796791, 33368869, 32984721, 32425974, 31813312]
4471C1813312n33925m24039j47370k47247j08324o3163o6480o973l437J24974
4461C0337328j44672k79900j62261k68479k69943k31528k09974l02822j00829
4452B8366920j44058k22797k73779n4647q4455m4338j33370r0681l4846j08773
4442B7175176j31091k7175q2937j52566O898l7543m4117j64201j93048j00560
4432B6248836j17213j38067M8780p1070K7696q3100r8892j61300j40953m7951
4422B5466766L5071O4814k1383O8573M1444j07558j52788J24225J47551J41654
4412B5808369P2354L2446K7946p696P2870O1727n4093L870M3346p7232p756j7465
4400B5958686j24186k11158j4441M576j90954l5136J21964m0377j02858p4916
$$ y = [31813312, 31279387, 30855348, 30707978, 30460731, 30352407, 30289244, 30222764, 30215791, 30212354, 30337328, 30192656, 29912756, 29750495, 29482016, 29212073, 28980545, 28770571, 28467749, 28366920, 28222862, 28000065, 27726286, 27671639, 27587184, 27542846, 27409476, 27318795, 27283949, 27175176, 27044085, 27016910, 26933973, 26781407, 26788305, 26750762, 26706645, 26542444, 26349396, 26248836, 26131623, 25993556, 26042336, 25971266, 25998962, 25915862, 25816970, 25655670, 25514717, 25466766, 25501837, 25566651, 25545268, 25613841, 25655285, 25547727, 25394939, 25519164, 25666715, 25808369, 25880723, 25913169, 25941115, 25933419, 26006289, 26068016, 26013923, 26017793, 26061139, 25983907, 25976151, 25958686, 25834500, 25623342, 25608901, 25613477, 25422523, 25387387, 25509351, 25468974, 25366116, 25291200]
4390B5291200k919j622R3205J51851P9880J48106j6792o6043J42920n3509m6924
4379B5719353J60075p4932o0245n0370J44654K96275k0590M5954L6043Q9203J24295
4368B6409715J76335J7184J43898K07121K00744L04699K70350J31161K12541K68399
4358B8342147K14119L56623M18748J36386L69888M69862L78932L01415M94259
4349C1482379M04866M84481N70164M81281M78415N47273O59551L18357M12257
4340C5839024M64842M48616N62450N77229M03049N44442O82349O70605N68388
4331D0760994N89135O91973O99510O71510R10688Q20971R91736J024236R01585
4322D8062338J280400J203095J362255J517616J927482K067598K107654K496532
$$ y = [25291200, 25288281, 25286659, 25379864, 25531715, 25611595, 25759701, 25742909, 25676866, 25819786, 25766277, 25719353, 25879428, 25804496, 25744251, 25693881, 25838535, 26134810, 26114220, 26160174, 26196217, 26285420, 26409715, 26586050, 26603234, 26747132, 26954253, 27154997, 27459696, 27730046, 27861207, 28073748, 28342147, 28556266, 28912889, 29331637, 29468023, 29837911, 30307773, 30686705, 30988120, 31482379, 31887245, 32371726, 32941890, 33423171, 33901586, 34448859, 35108410, 35426767, 35839024, 36303866, 36752482, 37314932, 37892161, 38295210, 38839652, 39522001, 40192606, 40760994, 41350129, 42042102, 42741612, 43413122, 44323810, 45144781, 46136517, 47160753, 48062338, 49342738, 50545833, 51908088, 53425704, 55353186, 57420784, 59528438, 62024970]
4314F2024970K693764L111571L512987L868801M381591N218662O522188P301288
4306I8635822P629904P228247N711633L520449R74914k034086m458626o359893
4298A10848364p372801p003835n842044m447580k971628j774906p71401L00382
4290H0964551J024813J804677K336388K887804L037707K622168J821607J104040
4282I7603755j97466j286086k058493k647868k873281k931367k853717k798067
4274G9957410k637758k453610k123536j852069j599868j428318r61270p32970
4266F6168011p17250m00736j07934J54812K26425O03810O55967P58603R62156
4257F8303864J173788J146569J276117J566688J749583J571692J440038P67378
$$ y = [62024970, 64718734, 67830305, 71343292, 75212093, 79593684, 84812346, 91334534, 98635822, 106265726, 113493973, 119205606, 122726055, 123700969, 121666883, 117208257, 110848364, 103475563, 96471728, 90629684, 86182104, 83210476, 81435570, 80664169, 80964551, 81989364, 83794041, 86130429, 89018233, 92055940, 94678108, 96499715, 97603755, 97406289, 96120203, 94061710, 91413842, 88540561, 85609194, 82755477, 79957410, 77319652, 74866042, 72742506, 70890437, 69290569, 67862251, 66900981, 66168011, 65450761, 65050025, 64942091, 65096903, 65323328, 65927138, 66583105, 67341708, 68303864, 69477652, 70624221, 71900338, 73467026, 75216609, 76788301, 78228339, 78995717]
4249G8995717M7276q65850j739690k525058l196975l417526l612381l290786l070610
4240E7324117k713317k372392k266678k052464j751775j660640j504676j359336
4232D1642839j220564j054689j007882q92036p96780p12478o36294o64188o17589
4223C4040339o90362n87148n57266m96896m32099n68554m59516k93068l38740
4214B9616690m95747l15174l88787m99254l39970k69339k72513k93021k14307
4205B6528578k79646l10839k27094k61777l87667k81158k05631k38490k05442
4196B4130834K5489j19544q4239k24094k83132k18063l80103j21871j52530n3333
4186B2519414k09563r4721j33125j03129J8343l2506o7995r589o4087R242Q7881
$$ y = [78995717, 79042993, 78177143, 76437453, 73912395, 70715420, 67297894, 63685513, 60394727, 57324117, 54610800, 52238408, 49971730, 47919266, 46167491, 44506851, 43002175, 41642839, 40422275, 39367586, 38359704, 37467668, 36670888, 35958410, 35322116, 34657928, 34040339, 33349977, 32762829, 32205563, 31708667, 31276568, 30708014, 30248498, 29955430, 29616690, 29120943, 28805769, 28416982, 27917728, 27577758, 27308419, 27035906, 26742885, 26528578, 26248932, 25938093, 25710999, 25449222, 25061555, 24780397, 24574766, 24336276, 24130834, 24156323, 24036779, 23952540, 23728446, 23445314, 23227251, 22847148, 22725277, 22572747, 22519414, 22309851, 22215130, 22082005, 21978876, 21997219, 21964713, 21896718, 21887129, 21823042, 21832284, 21920165]
4175B1920165o5248k9753J33561J05158k5605J23129P6600K25259K70609l785
4165B2730090K34279K38694K23878L51013L93942N19608N41088O90150M96126
4156B6418868M58735L45443k37052r31990j039566j046748p87835n71233m22099
4147B2186523m46982j85918j69663r1582j67226n177k07194k53561l10429k98796
4137B0049995l55021l68721l36744m64968k79633k82838l92875j26986j68714
4128A7273495j55155j76074j67216j74632j9465L483l62581J6423k43435q9788
4118A5905055J6742o2058K0233j38603o1419n0962k1687J56949n2971M0765J50332
4107A5902376R7005R7706K12064O6579K0542k7601k11322J01160K00047J36972
$$ y = [21920165, 21854917, 21825164, 21958725, 22063883, 22038278, 22161407, 22238007, 22463266, 22733875, 22730090, 22964369, 23203063, 23426941, 23777954, 24171896, 24691504, 25232592, 25922742, 26418868, 26877603, 27223046, 26985994, 26054004, 25014438, 23967690, 23179855, 22608622, 22186523, 21739541, 21553623, 21383960, 21292378, 21125152, 21119975, 20912781, 20659220, 20348791, 20049995, 19694974, 19326253, 18989509, 18524541, 18244908, 17962070, 17569195, 17442209, 17273495, 17118340, 16942266, 16775050, 16600418, 16580953, 16584436, 16221855, 16238278, 15994843, 15905055, 15921797, 15859739, 15879972, 15741369, 15679950, 15628988, 15607301, 15764250, 15711279, 15752044, 15902376, 15999381, 16097087, 16309151, 16375730, 16396272, 16368671, 16157349, 16258509, 16458556, 16595528]
4097A6595528J07295N6836P9395k3304L7344O6960O1013K8442J75645K90754R2478
4086A7568386K62974L21874K51537L17928K34887K51931K17239M37195L36071
4077B0200022L69819M49586L19207M10197L49039N39961M60921M26190O75011
4068B4199953N89743L36897K72190L81301L17617L28651K74945L86951L07198
4059B7395446L13016M75625M87691M38807L35529K28174L97618K6713l5648J0875
4049C0073846O1781J97097J4722k17737j65360L6288o7918M4039L6861j80429
4039B9833190k40618j45300l11769l53591m14368m63763k81008l39222m71911
4030B6811640n59351l90364o48734m41576l47502n46024m04472n16500n72044
$$ y = [16595528, 16702823, 16759659, 16839054, 16815750, 16853094, 16920054, 16981067, 17009509, 17185154, 17475908, 17568386, 17831360, 18153234, 18404771, 18722699, 18957586, 19209517, 19426756, 19863951, 20200022, 20569841, 21019427, 21338634, 21748831, 22097870, 22637831, 23098752, 23524942, 24199953, 24789696, 25126593, 25398783, 25780084, 26097701, 26426352, 26701297, 27088248, 27395446, 27708462, 28184087, 28671778, 29110585, 29446114, 29674288, 30071906, 30098619, 30062971, 30073846, 30135627, 30332724, 30347446, 30129709, 29964349, 30000637, 29932719, 29976758, 30013619, 29833190, 29592572, 29447272, 29135503, 28781912, 28367544, 27903781, 27622773, 27283551, 26811640, 26252289, 25861925, 25213191, 24771615, 24424113, 23878089, 23473617, 22957117, 22385073]
4021B2385073m95341m33331m99404m30353n75668n55529o27749o05920m70439
4012A7691339l56205m35600n30823m29763n51314m16264m11987m66668n00271
4003A3592444l61972l44135l72033l29035k66458l04778l04768l20915l37440
3994A0650910l60164l23629k12821k46307k72296j42161q7618k45437k27167k62433
3984H270877j17984l11008j42300j93433k05098j21832k28403j00344k25331j31837
3974F493307P920j90625j71992j53036j27218j24872P5906j17042n4539j11496
3964E526313j2613p6641j17917j32665o5151K2827j96609j74616j06303j60412
3954D506213j345l4931j14345l2908K3982n5340k06303n837P8519Q5137j24654
$$ y = [22385073, 21889732, 21456401, 20956997, 20526644, 19950976, 19395447, 18767698, 18161778, 17691339, 17335134, 16899534, 16368711, 15938948, 15387634, 14971370, 14559383, 14092715, 13592444, 13230472, 12886337, 12514304, 12185269, 11918811, 11614033, 11309265, 10988350, 10650910, 10290746, 9967117, 9754296, 9507989, 9235693, 9093532, 9005914, 8760477, 8533310, 8270877, 8152893, 7841885, 7699585, 7506152, 7301054, 7179222, 6950819, 6850475, 6625144, 6493307, 6501227, 6310602, 6138610, 5985574, 5858356, 5733484, 5809390, 5692348, 5637809, 5526313, 5513700, 5437059, 5319142, 5186477, 5121326, 5144153, 4947544, 4772928, 4666625, 4506213, 4504868, 4469937, 4355592, 4322684, 4346666, 4291326, 4085023, 4079186, 4157705, 4242842, 4118188]
3943D118188j36618k29313P2696K3090o0844J24581m5185r5133j5180q1017k19452
3932C455813q6202P6935K9689l7913j46219m1087j8933o0507j79332J7094Q8211
3921C097549m7349l8475K7371N3623O1038L3064j30789Q3317j74174l3718J27124
3910C058581o7660O7982l2674K2297J03307j44207j6665J01252j63343K8442L4359
3899B991671n7006j04654j5117j72059n1041J70360Q5194m097r3992P704j8725
3888B738238Q950Q1814J32836r6946p1059J0892j75567r8161Q3718n6862M7270
3877B605123j6712P2622j6333j15931o7087j12195Q518J6104n0007J13413J52826
3866B590341j9302j1913o8553J31906o7520r1011M976O1784J9410j34042r0392
$$ y = [4118188, 3981570, 3752257, 3824953, 3848043, 3787199, 3911780, 3866595, 3771462, 3756282, 3675265, 3455813, 3369611, 3446546, 3476235, 3438322, 3292103, 3251016, 3232083, 3171576, 2992244, 3009338, 3097549, 3050200, 3011725, 3039096, 3092719, 3153757, 3186821, 3056032, 3139349, 2965175, 2931457, 3058581, 2990921, 3058903, 3026229, 3048526, 3151833, 3007626, 2990961, 3092213, 2928870, 2957312, 2991671, 2934665, 2830011, 2814894, 2642835, 2591794, 2762154, 2847348, 2843251, 2749259, 2756963, 2738238, 2747188, 2829002, 2961838, 2864892, 2793833, 2804725, 2629158, 2530997, 2614715, 2557853, 2605123, 2588411, 2661033, 2644700, 2528769, 2461682, 2349487, 2358005, 2374109, 2324102, 2437515, 2590341, 2571039, 2559126, 2490573, 2622479, 2554959, 2463948, 2468924, 2530708, 2550118, 2416076, 2325684]
3855B325684P8363J09207J14207k8940l9746j34146L5347J65977j50750j12985
3845B362218l7621O7065P6325L0692r3505p1522J2474J9454J00764j16286m935
3834B345123l0351R0533P2569j42631k8399l2848Q646j3812m4884l077M2558J21724
3822B385151R6982o5161J12955j91015q6794O7975L7503n0680M2519l5308J05052
3811B419179O4931J9774J29348j19529Q0757p3514o7324J00464J00847O3275M4315
3800B762523l7000J34827K0932l0803j37053M3323J8941R3909J29516R743O4217
3789C073075J03954r940j36539L0463P6423j53624o2702O2713M5097J90549q3173
3778C136296J5642J19553j47087Q5602K4587j56081L6408j6971J5397J52876R5603
$$ y = [2325684, 2404047, 2513254, 2627461, 2598521, 2558775, 2424629, 2459976, 2625953, 2475203, 2362218, 2324597, 2391662, 2467987, 2498679, 2405174, 2333652, 2346126, 2365580, 2466344, 2350058, 2345123, 2314772, 2405305, 2477874, 2335243, 2306844, 2273996, 2282642, 2268830, 2223946, 2220869, 2263427, 2385151, 2482133, 2416972, 2529927, 2338912, 2252118, 2320093, 2357596, 2306916, 2349435, 2314127, 2419179, 2484110, 2503884, 2633232, 2513703, 2594460, 2520946, 2453622, 2554086, 2654933, 2718208, 2762523, 2725523, 2860350, 2881282, 2850479, 2713426, 2756749, 2775690, 2869599, 2999115, 3008858, 3073075, 3177029, 3167089, 3030550, 3061013, 3137436, 2983812, 2921110, 2983823, 3028920, 3219469, 3136296, 3151938, 3271491, 3124404, 3210006, 3234593, 3078512, 3114920, 3097949, 3113346, 3266222, 3361825]
3767C361825J08762k4409j32170O8921j708J33882j02774J8299Q5744L6538o7901
3756C485009J12434J62842K9421O4983N5983J48485M2904j9502n5328J72843K71288
3745D471362j05569L2779L3216J15737J37397P4297J1235K4485J44173j3464R3818
3734E019466J38112L6140K6930O0935J38402J79885R7689L2660J7469L1503J00360
3723E879551j04445O6253J3999m8450J37779j5163p274p3279J35534J03683o414
3712F081774j62253n4221R7960J22525k9508M3133j92589m1375R2242L5605p9271
3701E914022k3417j0905o8695K43639n9401J0837Q6050k0607N8019q724r4758
3690F026060J18730K44658L8649o6333J2468J08190M7693J02378J49192K40961
$$ y = [3361825, 3470587, 3446178, 3314008, 3382929, 3381221, 3515103, 3412329, 3430628, 3516372, 3552910, 3485009, 3597443, 3760285, 3789706, 3854689, 3910672, 4059157, 4102061, 4082559, 4027231, 4200074, 4471362, 4365793, 4398572, 4431788, 4547525, 4684922, 4759219, 4770454, 4794939, 4939112, 4925648, 5019466, 5157578, 5193718, 5220648, 5281583, 5419985, 5599870, 5697559, 5730219, 5747688, 5779191, 5879551, 5775106, 5841359, 5855358, 5806908, 5944687, 5929524, 5922250, 5848971, 5984505, 6088188, 6081774, 5919521, 5865300, 5963260, 6085785, 6056277, 6099410, 5906821, 5865446, 5957688, 5993293, 5914022, 5890605, 5879700, 5811005, 6054644, 5995243, 6006080, 6092130, 6071523, 6129542, 6120818, 6026060, 6144790, 6389448, 6428097, 6361764, 6374232, 6482422, 6530115, 6632493, 6781685, 7022646]
3680G022646P0049n2210Q6732J57912L7873K14237J13553K01028M0752K8626J47821
3669H069019l2636N6681M2537K01267R4993j25000p0878L2470J1821J56224K1335
3658H457833q2587r30o5384N5881k0277n1926N5689n37j247q2606j09595P3226
3646H227540J64218o0773L2760o1736O8513k8078J9333j26244O3394m4983p0973
3635H182971j81113O7161J41357k1949J99870J76085k9469k23721J34897L6701
3625H482790l98Q7571M7773P2029J51593J77536J27903k8434Q3103J46121J16698
3614I464285J51320O1282Q3999J58188K12008k548q4030J85827K29397J90180
3604A0649908J50892K69729K24691M0887K1225O5175J86725K18230J59498R6768
$$ y = [7022646, 7092695, 7040485, 7127217, 7285129, 7323002, 7537239, 7650792, 7851820, 7892572, 7921198, 8069019, 8036383, 8093064, 8135601, 8336868, 8431861, 8306861, 8235983, 8268453, 8280274, 8436498, 8457833, 8375246, 8374316, 8308932, 8364813, 8344536, 8292610, 8348299, 8347762, 8346515, 8263909, 8154314, 8227540, 8391758, 8330985, 8363745, 8302009, 8370522, 8342444, 8361777, 8235533, 8298927, 8253944, 8182971, 8001858, 8069019, 8210376, 8188427, 8388297, 8564382, 8534913, 8311192, 8446089, 8482790, 8482392, 8569963, 8617736, 8689765, 8841358, 9018894, 9146797, 9118363, 9201466, 9347587, 9464285, 9615605, 9676887, 9760886, 9919074, 10131082, 10128534, 10044504, 10230331, 10459728, 10649908, 10800800, 11070529, 11295220, 11336107, 11357332, 11422507, 11609232, 11827462, 11986960, 12083728]
3594A2083728m9223K25049J2266J41131K02764N1627O1726Q5706o1930J8471N2725
3583A2824040J9725J56484Q5469N2331R625M9270N2879Q9579J32549J4639p1332
3572A3415258J59385J54055J43632R931J63551K21416J75599N8627J79309K55151
3562A4935914j9303J48308J40886K97950J29827K24202K98378K41198L85967K00771
3552A6984098K52986L88838L38593L43563L13176L73145L27980L80255L32122
3543B0034756L34872N59000M97610N54890N75774L26700N38757N81355N83589
3534B4587303N46503N03908N68079K06477K18142N69735N19652L34836K41632
3525B8296267K71690M20910L29526K30741J97461p8375J350K26884N6505O8262
$$ y = [12083728, 12034505, 12259554, 12271820, 12412951, 12615715, 12667342, 12729068, 12814774, 12752844, 12771315, 12824040, 12843765, 13000249, 13085718, 13138049, 13147674, 13196944, 13249823, 13339402, 13471951, 13486590, 13415258, 13574643, 13728698, 13872330, 13882261, 14045812, 14267228, 14442827, 14501454, 14680763, 14935914, 14916611, 15064919, 15205805, 15503755, 15633582, 15857784, 16156162, 16397360, 16783327, 16984098, 17237084, 17625922, 17964515, 18308078, 18621254, 18994399, 19322379, 19702634, 20034756, 20369628, 20928628, 21426238, 21981128, 22556902, 22883602, 23422359, 24003714, 24587303, 25133806, 25637714, 26205793, 26412270, 26630412, 27200147, 27719799, 28054635, 28296267, 28567957, 28988867, 29318393, 29549134, 29746595, 29668220, 29669570, 29896454, 29952959, 30021221]
3515C0021221k7274J3594J25265J85583J00157l5921M0449J39351o3664J5789
3505C0514550o966N2534R3850K9203l07j56457j30025P2506n5528j89209k85214
3494B9938937j9122p5742k0400j24112j57915m1133p5240n0865k1671K5265l7642
3483B9340360n3197j79905q4073j66465p8549n9528l42403q2600M5733n0419o902
3472B8282052j24579J556J46016J39891J3823K79730K69609J20927L78789K96223
3462B9804037K82299K92232O02216M87875K94506L53675L02262K41957K83294
3453C2944353M72341J47244O1950N1811M7769N5334N6579K5001O0294r0868j2133
3442C3819675j9534l1938o3109Q6206J9179J3280m7391j1958R5256P1326M8460
$$ y = [30021221, 29993947, 30007541, 30132806, 30318389, 30418546, 30382625, 30423074, 30562425, 30498761, 30514550, 30507584, 30560118, 30653968, 30683171, 30682864, 30526407, 30396382, 30468888, 30413360, 30224151, 29938937, 29919815, 29844073, 29823673, 29699561, 29541646, 29500513, 29425273, 29374408, 29352737, 29378002, 29340360, 29287163, 29107258, 29023185, 28856720, 28778171, 28718643, 28376240, 28293640, 28339373, 28288954, 28282052, 28157473, 28159029, 28305045, 28444936, 28458759, 28738489, 29008098, 29129025, 29507814, 29804037, 30086336, 30378568, 30980784, 31468659, 31763165, 32116840, 32419102, 32661059, 32944353, 33416694, 33563938, 33625888, 33677699, 33725468, 33780802, 33837381, 33862382, 33922676, 33831808, 33819675, 33800141, 33768203, 33705094, 33791300, 33810479, 33823759, 33776368, 33764410, 33859666, 33930992, 33979452]
3431C3979452N4566L7823M9130L8258J47960n2859k22371o6485K5597J40613j96123
3420C3935561j29045k00461k86257j60243j21919J7525l7377r1035l1872l6333
3410C2858544M9634K03470L1963J16552K07613K04505K97828J33861J85534L75365
3400C4664869L19987J38153M04962M29773K97873L57866L29681M10282N02814
3391C7856260N53575P13371O61382O27445R42121J101877J049436J173344J098974
3382D5777785J395132J304740J169427J335619J202201J036329R14670N91273
3374E4727176M43578M56862K68072N3642J85919K29766J88018L39325L26445M85707
3364E7704510M75945L56362M30350K71943J09300r4962k76886m11674m79237l36970
$$ y = [33979452, 34034018, 34071841, 34120971, 34159229, 34307189, 34254330, 34031959, 33965474, 33991071, 34131684, 33935561, 33806516, 33606055, 33319798, 33159555, 33037636, 33055161, 33017784, 32926749, 32894877, 32858544, 32908178, 33111648, 33143611, 33260163, 33467776, 33672281, 33970109, 34103970, 34289504, 34664869, 34984856, 35123009, 35527971, 35957744, 36255617, 36613483, 36943164, 37353446, 37856260, 38409835, 39123206, 39784588, 40412033, 41354154, 42456031, 43505467, 44678811, 45777785, 47172917, 48477657, 49647084, 50982703, 52184904, 53221233, 54135903, 54727176, 55170754, 55627616, 55895688, 55949330, 56135249, 56365015, 56553033, 56892358, 57218803, 57704510, 58180455, 58536817, 58967167, 59239110, 59348410, 59253448, 58976562, 58564888, 58085651, 57748681]
3354E7748681l47733l80035m52646k53617r5301P4717M8200L2793K20467M30794
3344E7026320M41277M33997N26362P45418Q98476Q85643J064458J190077J113599
3335F4325627J324431J476389J451675J352688J531291J513757J437756J433813
3327G5847427J335942J220263R43152J103229Q82505P79286L85805J64353J9989
3318H2681951J55457J80943m6013q2703L043K22188J65317J28163L02032M43113
3308H4153491M40371N64259M31055M97179N41334N03357M04533L99590L42916
3299H8278085M20376M84068M88454N68969O21925N43661P47934P61808R01180
3290I3816460J109043J122078J418749J493114J646607J707487J662317J810123
$$ y = [57748681, 57400948, 57020913, 56568267, 56314650, 56219349, 56294066, 56342266, 56375059, 56595526, 57026320, 57467597, 57901594, 58427956, 59173374, 60071850, 60957493, 62021951, 63212028, 64325627, 65650058, 67126447, 68578122, 69930810, 71462101, 72975858, 74413614, 75847427, 77183369, 78403632, 79346784, 80450013, 81332518, 82111804, 82497609, 82661962, 82681951, 82837408, 83018351, 82972338, 82889635, 82892678, 83114866, 83280183, 83408346, 83710378, 84153491, 84593862, 85158121, 85589176, 86086355, 86627689, 87131046, 87535579, 87935169, 88278085, 88698461, 89182529, 89670983, 90239952, 90861877, 91405538, 92153472, 92915280, 93816460, 94925503, 96047581, 97466330, 98959444, 100606051, 102313538, 103975855, 105785978]
3282A05785978J820623J939829J774717J606122J599747J536029J875999J910379
3274A19849423J820206K090647K320709K460378K663920K779970L131937L046242
3266A40163432L173055L186637L108597K881388K841169K281161J829194J678407
3258A61143040J271998P00732O58898M53905K87696O52755P90623J057174J366722
3249A68383543J700666J368811P26827o19127k302680l949944n055070n707146
3241A54545880n656058n507785n199268n120716m704670m296891l854352l405665
3233A16800475l205103k882120k689204k552214k306873j986085j827771j476551
3225I7874554j075191j020692n84227p3633K68957N56150J382625K193481K949606
$$ y = [105785978, 107606601, 109546430, 111321147, 112927269, 114527016, 116063045, 117939044, 119849423, 121669629, 123760276, 126080985, 128541363, 131205283, 133985253, 137117190, 140163432, 143336487, 146523124, 149631721, 152513109, 155354278, 157635439, 159464633, 161143040, 162415038, 163115770, 163774668, 164228573, 164516269, 165169024, 165959647, 167016821, 168383543, 170084209, 171453020, 172179847, 171560720, 169258040, 165308096, 160253026, 154545880, 148889822, 143382037, 138182769, 133062053, 128357383, 124060492, 120206140, 116800475, 113595372, 110713252, 108024048, 105471834, 103164961, 101178876, 99351105, 97874554, 96799363, 95778671, 95194444, 95120811, 95389768, 95945918, 97328543, 99522024, 102471630]
3216A02471630L844812L642252K206486m84560l262437n204001n679618n150196
3208I2384368m151052l393351k771576k001426j482691j003426o16988k12753
3200G6751105R4582L35836N24654Q74462R61207J293476J449762J261135R97400
3191H4543619R36187J033415J323655J690729K150420K448019K738947L112680
3183I9977671K999195K410671J883673Q88297m26719j168814j612121j576736
3175A03375117j412092j175678r72047p70685q23945p47242o41135m38356l57939
3166I6035998k20262m11669k71883j83945m69481j378469k211678l343324l980566
3157H3564721l897321l466638l203073k759184k388567j990248j660181j531726
$$ y = [102471630, 106316442, 109958694, 112165180, 111680620, 108418183, 103214182, 97534564, 92384368, 88233316, 84839965, 82068389, 80066963, 78584272, 77580846, 76963858, 76751105, 76845687, 77181523, 77706177, 78580639, 79541846, 80835322, 82285084, 83546219, 84543619, 85479806, 86513221, 87836876, 89527605, 91678025, 94126044, 96864991, 99977671, 102976866, 105387537, 107271210, 108159507, 107732788, 106563974, 104951853, 103375117, 101963025, 100787347, 99815300, 99044615, 98220670, 97473428, 96832293, 96393937, 96035998, 95815736, 95404067, 95132184, 94948239, 94478758, 93100289, 90888611, 87545287, 83564721, 79667400, 76200762, 72997689, 70238505, 67849938, 65859690, 64199509, 62667783]
3149F2667783j316084j267938j117163q50615r77898j016518o79611p18841p36158
3140E3986957n76122l56857j60682j42192J54530K07915L25367N85267P15435
3131E4739618Q93297P13733P32570O18854J58393O3309q9173j81283Q1863J7871
3121E7749052K43719K60600O09103O60247O48515N82043O70559O48808N67611
3112F2640257P22961N00285M89862M92097O35795P00806O85249O41109L89557
3103F7897978M98707K12382L8184j18471m88230p98443q00295r39509j038205
3094F4464098j128362j053535q33539q52870q53198p20633n65330n37247o28847
3085E7290537n05562m67205n64800o19108o41141o28387q32468r67576j000848
$$ y = [62667783, 61351699, 60083761, 58966598, 58115983, 57138085, 56121567, 55441956, 54723115, 53986957, 53410835, 53053978, 52893296, 52751104, 52905634, 53113549, 53438916, 54024183, 54739618, 55632915, 56346648, 57079218, 57698072, 57856465, 57919774, 57830601, 57649318, 57731181, 57749052, 57992771, 58253371, 58862474, 59522721, 60171236, 60753279, 61423838, 62072646, 62640257, 63363218, 63863503, 64353365, 64845462, 65481257, 66182063, 66867312, 67508421, 67897978, 68396685, 68609067, 68647251, 68528780, 68040550, 67242107, 66441812, 65502303, 64464098, 63335736, 62282201, 61448662, 60595792, 59742594, 59021961, 58456631, 57919384, 57290537, 56784975, 56317770, 55752970, 55133862, 54492721, 53864334, 53031866, 52064290, 51063442]
3076E1063442j202835j431245j330925j380913j413726j350962j401211j358011
3068D0193614j212875r73180j140292r51117r53167j032636q79006q08411o50863
3059C1592067p76665p13881n08169o82421m33711m78647m52245l32167o17634
3050B6596527l26841l80516l20227l89439m13895q4747k95032j79414k58712k33462
3040B3714242j84932j19182J8274J0192j74509l6454N4342n9548O8819p9430q5339
3029B3126475q3794K4760Q1823J54872j79133q6310j65353K0939J4101k74223
3019B2634157l27836q2519j99008j78949k10562k12587k79195j95931j49832j01321
3009B0696417p414p3992j40162J8440K9052P925R8241j06683K3028o4684N0599
$$ y = [51063442, 49860607, 48429362, 47098437, 45717524, 44303798, 42952836, 41551625, 40193614, 38980739, 38007559, 36867267, 35916150, 34962983, 33930347, 33051341, 32242930, 31592067, 30815402, 30101521, 29593352, 28910931, 28477220, 27998573, 27546328, 27214161, 26596527, 26269686, 25889170, 25568943, 25179504, 24765609, 24680862, 24385830, 24206416, 23947704, 23714242, 23529310, 23410128, 23428402, 23438594, 23264085, 23227631, 23281973, 23222425, 23291244, 23211814, 23126475, 23042681, 23067441, 23149264, 23304136, 23125003, 23038693, 22873340, 22894279, 22908380, 22634157, 22306321, 22223802, 22024794, 21845845, 21635283, 21422696, 21143501, 20947570, 20797738, 20696417, 20689003, 20615011, 20474849, 20493289, 20522341, 20530266, 20628507, 20521824, 20544852, 20480168, 20530767]
2998B0530767l2304o8621K6391J60597K86829j9490J3313L8372Q5032K20087L63394
2987B1604367K63973R6686K35483K87143M04388J77434K84037M07000L32419K51129
2977B4344059K30752L42315M02532M02738L37642K75019M23148L94999M95550
2968B7648754M29126M18389O29081N53094N54843P67564R10748O73185P60260
2959C3345044P85194P01584Q51845J016552R64636J102215J237399Q70922J086046
2950D1961437Q47356O79973O56464M83977K66130M45278N73901P13354Q36980
2941D7464850R32886J059639J117573J342931J731864K006095K169284K415671
2933F0240793K726362L040745L498017L775038L923967L823115K990160K407193
$$ y = [20530767, 20498463, 20429842, 20456233, 20616830, 20903659, 20884169, 20897482, 20935854, 21020886, 21240973, 21604367, 21868340, 21965026, 22200509, 22487652, 22892040, 23069474, 23353511, 23760511, 24092930, 24344059, 24574811, 24917126, 25319658, 25722396, 26060038, 26335057, 26758205, 27153204, 27648754, 28077880, 28496269, 29125350, 29678444, 30233287, 31000851, 31911599, 32584784, 33345044, 34130238, 34831822, 35683667, 36700219, 37664855, 38767070, 40004469, 40875391, 41961437, 42808793, 43488766, 44145230, 44629207, 44895337, 45340615, 45914516, 46627870, 47464850, 48397736, 49457375, 50574948, 51917879, 53649743, 55655838, 57825122, 60240793, 62967155, 66007900, 69505917, 73280955, 77204922, 81028037, 84018197, 86425390]
2925H6425390J449032M58625O541l52926m14687j65500m9907J7845r9915k99488
2915H6975010o84531j149063j391152j642346j810466j494694j360658q12832
2907G6629268m19089j92767J03554P63941J077565J277724J478681J804479J945903
2898H4469259K232110K584368K677755K829429L204896L690967L556276L604532
2890A08849592L611620L321993L324659L061111L165474L880921M600122N085710
2882A38901202O294439P553219Q493675J0013987J1729986J3367229J5424326
2875B11778063J6924357J7217324J5772278J1927672O168931M5603m415299p415296
2867B68003633q808671r528767r858175r952954r421600q854284p870307o885989
$$ y = [86425390, 87874422, 88333047, 88339588, 87986662, 87571975, 87406475, 87356568, 87374413, 87274498, 86975010, 86290479, 85141416, 83750264, 82107918, 80297452, 78802758, 77442100, 76629268, 76210179, 76017412, 76120966, 76884907, 77962472, 79240196, 80718877, 82523356, 84469259, 86701369, 89285737, 91963492, 94792921, 97997817, 101688784, 105245060, 108849592, 112461212, 115783205, 119107864, 122168975, 125334449, 129215370, 133815492, 138901202, 145195641, 152748860, 161242535, 171256522, 182986508, 196353737, 211778063, 228702420, 245919744, 261692022, 273619694, 279788625, 279834228, 275418929, 268003633, 259194962, 249666195, 239808020, 229855066, 220433466, 211579182, 203708875, 196822886]
2859A96822886n873394m903752m079076l591068l346612k951252k520015k446494
2851A67111223k549224l359243m227554n448159o872299p744391p930606p889036
2843A21090711p557345p090765o486439n774526n225938m681248m292521l864945
2835G6116984l595389l383011l134224k903510k748354k252545k354819k051982
2827E3693150j956149j845779j742807j820836j604740j710510j613606j505323
2819C9893400j491831j327380j329338j211535j029703j076008q24782q84982
2811C0717841r99845j073190q92936p93656r81551q11657p63317n39286p27522
2802B3134881o56345m60354o18895m95083o76642o43262m99515n25965m33856
$$ y = [196822886, 190949492, 186045740, 181966664, 178375596, 175028984, 172077732, 169557717, 167111223, 164561999, 161202756, 156975202, 151527043, 144654744, 136910353, 128979747, 121090711, 113533366, 106442601, 99956162, 94181636, 88955698, 84274450, 79981929, 76116984, 72521595, 69138584, 66004360, 63100850, 60352496, 58099951, 55745132, 53693150, 51737001, 49891222, 48148415, 46327579, 44722839, 43012329, 41398723, 39893400, 38401569, 37074189, 35744851, 34533316, 33503613, 32427605, 31602823, 30717841, 29717996, 28644806, 27751870, 26958214, 25976663, 25165006, 24401689, 23862403, 23134881, 22478536, 22018182, 21399287, 20904204, 20227562, 19584300, 19084785, 18558820, 18124964]
2793A8124964m49232m71088k36007n36954m25584k94146m06294k58542m98403
2784A4548714k43079m01797k82531k89717l37565l56156k93435j81340m07332
2775A1755762j64123l61548j99029k99240k21852m7655k42359j95099p0395k65808
2765I688654j66574r1055k37715p1531j70512j71397j67507j52624j81468k74599
2755H003672k25912q4560q8962n5918j53738k29054j49155j93734r1989q7909
2745F642741k59779j14331m1236j98426r1114j4160l082j10941j9162j73570m165
2734E612775m016j36344q784m1390j48569k4765j3987k45138j8567j73469Q7625
2723D885371k46677j08317P9011K7025q6001k51723J02044P2558o1539o8911j25457
$$ y = [18124964, 17675732, 17204644, 16968637, 16431683, 16006099, 15711953, 15305659, 15047117, 14548714, 14305635, 13903838, 13621307, 13331590, 12994025, 12637869, 12344434, 12163094, 11755762, 11591639, 11230091, 11031062, 10731822, 10509970, 10462315, 10219956, 10024857, 9954462, 9688654, 9522080, 9431025, 9193310, 9121779, 8951267, 8779870, 8612363, 8459739, 8278271, 8003672, 7777760, 7693200, 7604238, 7548320, 7394582, 7165528, 7016373, 6822639, 6730650, 6642741, 6382962, 6268631, 6227395, 6028969, 5937855, 5923695, 5920613, 5809672, 5790510, 5616940, 5612775, 5608759, 5472415, 5463631, 5422241, 5273672, 5248907, 5234920, 4989782, 4971215, 4797746, 4885371, 4638694, 4530377, 4609388, 4636413, 4550412, 4298689, 4400733, 4473291, 4411752, 4342841, 4217384]
2712D217384R341j18833j02667O040K5284n4225j34185j09909J18657q8985k24090
2701C543812l792n1925o8445P1217m1379k7173j24412l7765j51785k1077L4601
2690C121877j92364l3460K4573J09460R030o2876p8455m6471j07009q0605K5060
2679B688760k673p6239P4202o1344j05785n1794r0913l4600J12095K6781j29194
2668B349296k9686k8929j17431l4437J17880j7236K2039k5053r4393P0965p6831
2657B136184M3091j37724q5775J16855j49748j4186J19387K5896P3751o7771J23386
2646B183346j0967j21304j8123J2626j78634P8096p2783p276L5543o8892P582
2635A839214O6301J0583K9984K8212k8558j18311j44005k9291P634j2659k041
$$ y = [4217384, 4226725, 4107892, 4005225, 4011265, 4036549, 3982324, 3848139, 3738230, 3856887, 3767902, 3543812, 3540020, 3488095, 3419650, 3490867, 3449488, 3422315, 3297903, 3260138, 3108353, 3087276, 3121877, 2929513, 2896053, 2920626, 3030086, 3039116, 2976240, 2897785, 2851314, 2744305, 2663700, 2688760, 2686087, 2609848, 2684050, 2622706, 2516921, 2465127, 2374214, 2339614, 2451709, 2478490, 2349296, 2319610, 2290681, 2173250, 2138813, 2256693, 2239457, 2261496, 2236443, 2142050, 2213015, 2136184, 2179275, 2041551, 1955776, 2072631, 1922883, 1908697, 2028084, 2053980, 2127731, 2059960, 2183346, 2172379, 2051075, 2032952, 2045578, 1866944, 1945040, 1872257, 1864981, 1900524, 1831632, 1839214, 1905515, 1916098, 1946082, 1974294, 1945736, 1827425, 1683420, 1654129, 1661763, 1649104, 1647063]
2624A647063j03605p6430o756K29013R6720j82387k4895O699p4565m570J5283
2613A521570P096N7792J02761O8333n390r7269m8492n9023l2470J73470j33012
2602A555366p7778J16327J29520l5406m4754J06729J5622M5977K19736J5085O6838
2591B113262P5506M1556J10195R695q3549n6138J1051k8644k8379j26008l2310
2580B006237j3666r6484q0790k1678m9289j30596M4194K5926j0272j25685L4879
2569A582776O4685M1754j04176j04036l0310L8666p8887j40850L9061L1339j59763
2558A180259n8478j22378J10022N5114n6705j21268r3705Q2154L2866k3961j1044
2547I72876R090O1038j01655j30455p2026K2760n3974n505R4337k1964o3223J1543
$$ y = [1647063, 1543458, 1467028, 1460272, 1689285, 1786005, 1603618, 1578723, 1585422, 1510857, 1506287, 1521570, 1528666, 1586458, 1689219, 1757552, 1752162, 1654893, 1606401, 1547378, 1514908, 1688378, 1555366, 1477588, 1593915, 1723435, 1688029, 1643275, 1750004, 1765626, 1811603, 2031339, 2046424, 2113262, 2188768, 2230324, 2340519, 2350214, 2266665, 2210527, 2221578, 2192934, 2164555, 2038547, 2006237, 1992571, 1896087, 1815297, 1793619, 1744330, 1613734, 1657928, 1683854, 1673582, 1547897, 1582776, 1647461, 1689215, 1585039, 1481003, 1450693, 1489359, 1410472, 1269622, 1308683, 1340022, 1180259, 1121781, 999403, 1109425, 1164539, 1107834, 986566, 892861, 975015, 1007881, 983920, 972876, 981966, 1043004, 941349, 810894, 738868, 761628, 707654, 702149, 796486, 774522, 711299, 722842]
2535G22842Q9922n5623M2333r9426k6813J19772j28608j40240J77604L5452n2339
2524F84876j07157K7393J13069n3566q6199J69780L1664k2242L0982N6080k69940
2513E74740o4071J3728o5779J36297k21950j9150P5037J8113Q6084k1062j25880
2502C86107P5851P454Q6654J4958j10426O0204k7222o1546R6047n8125M5702M434
2490E20092j96609m5892J06896J18006k7557j2574p7145r4992J9951J56951P3951
2479E41078j35345Q3827l6416p3278p6888j19919N2885N8266J45489l3821L6236
2468D42114R08o7232L0329P736J0568N8567q3078j25722O8657N2218j10825L6380
2456C20620m3941m7931m4392M4320p026M6285Q091j15052q6829l0683L3873L7601
$$ y = [722842, 812764, 757141, 799474, 700048, 673235, 793007, 664399, 524159, 701763, 737215, 684876, 577719, 605112, 718181, 664615, 578416, 748196, 779860, 757618, 788600, 844680, 574740, 510669, 524397, 458618, 594915, 372965, 353815, 428852, 446965, 533049, 511987, 386107, 461958, 469412, 556066, 571024, 460598, 520802, 493580, 432034, 528081, 469956, 515658, 520092, 323483, 277591, 384487, 502493, 474936, 462362, 385217, 290225, 310176, 467127, 541078, 405733, 489560, 453144, 379866, 302978, 183059, 235944, 294210, 439699, 405878, 442114, 443022, 375790, 406119, 413855, 424423, 482990, 399912, 274190, 342847, 395065, 284240, 320620, 276679, 228748, 184356, 228676, 221650, 267935, 276026, 160974, 74145, 43462, 77335, 114936]
2444A14936K0192r1387J33783N0408n2595o3469p7537l1325P0675J23393n9651
2433A37423N4106J09564n6378j34440n4356J47845k8048J66459O4569K9791j34448
2422C02087j09480L9467l5329r3562j401Q1193j11608J34057p8009J6412p9523
2411F4304l8288P4228o4531M9394R5630r5686J26831N011R7241q8595P9621m787
2399C00373p0659m363p9069l4993k3018K60062L5635j70082n3113j02104J34580
2388A93249L0102j18048l0973Q7100L1957j25220K4749O0961J03391R1491Q1854
2377D30613n934o7670k5401J65183j32939p3063j31745j35761l1952M4751M2154
2366G8236Q4288p065o9872k6811k3211N4937L5315j09074N82l9785P2963J22979
$$ y = [114936, 135128, 43741, 177524, 227932, 175337, 111868, 34331, 3006, 73681, 197074, 137423, 191529, 301093, 244715, 110275, 55919, 203764, 175716, 342175, 406744, 436535, 302087, 192607, 232074, 196745, 103183, 101782, 182975, 71367, 205424, 127415, 143827, 64304, 26016, 100244, 35713, 85107, 180737, 85051, 211882, 216893, 314134, 225539, 305160, 300373, 229714, 225351, 146282, 111289, 88271, 348333, 383968, 213886, 160773, 58669, 193249, 223351, 105303, 74330, 161430, 193387, 68167, 92916, 153877, 257268, 348759, 430613, 424679, 357009, 331608, 496791, 363852, 290789, 159044, 23283, -8669, 36082, 78236, 162524, 155459, 85587, 58776, 35565, 90502, 125817, 16743, 17325, -22460, 50503, 173482]
2354A73482o4837j5284R7401l3056J07763j11962m6250p190L7533r180o3600r1423
2342b6603j03725J19582P2688n6305n640p3749N1700m1901j09166J20610Q2387
2331B9878j6281J52465n2963N4129q8712j78911J33466M8155j29349r9908J28031
2320b0000N2203J2554J8279o954L9227O0146j08583J6066n6712j6351M848K3842
2308A8565n0447j5531n583J40550r9909M1330K9049k6851k4821n8787k242J74252
2296A19575O1454j26263J9632m3947o8318P405K16122K9320m4180p0346j08959
2285h505L870O2663P7866j6991r1074O8301K9151r74j47807K5723J09328p0887
2273D0664R1371R440Q707r3940m931J41163k6567M9899k562n9759l4841m5963
$$ y = [173482, 108645, 93361, 190762, 157706, 265469, 153507, 107257, 100067, 137600, 128420, 64820, -26603, -130328, -10746, 61942, 5637, -3, -73752, -22052, -63953, -173119, -52509, 29878, 13597, 166062, 113099, 167228, 78516, -100395, 33071, 81226, -48123, -148031, -20000, 32203, 44757, 63036, 56082, 95309, 155455, 46872, 62938, 6226, -10125, -5277, 18565, -31882, -47413, -52996, 87554, -12355, 28975, 58024, 31173, 6352, -52435, -54677, 119575, 181029, 54766, 74398, 30451, -37867, -30462, 185660, 214980, 170800, 100454, -8505, -4635, 58028, 135894, 118903, 27829, 96130, 125281, 124307, -23500, 2223, 111551, 40664, 132035, 141475, 150182, 56242, 51311, 192474, 165907, 215806, 213244, 153485, 118644, 72681]
2261G2681K00745j5389R044o8755j47983k7727M9106N7461K0034o1707M5269p5420
2249E7359M3140k0480k8682k6561p7169J79895J11808J92357n8419j30627O5201
2238C07822N3971j79707n2667N2032k7095m7229K0628j6009n1164Q9297K1374
2227A71253j03514J3948Q3912k221L4498O8948j52742j19055J22120N3839p0963
2216A00023K8274K05172o0959l1268Q6255o7372m2160J32235J03461j00228l9013
2205C14420L2175K8572n8398o4437M0518O986J41396J5105n4818J91151o2500
2194E30170P658M6257K23750j3396j20140j01643l9282J15616n1265K6331M4687
2183F68743M0288J7214P1541m1699J9693K52909J2330o0911L938L9669J52058
$$ y = [72681, 273426, 258037, 267081, 198326, 50343, 22616, 71722, 129183, 149217, 87510, 132779, 57359, 100499, 80019, 51337, 24776, -52393, 127502, 239310, 431667, 373248, 242621, 307822, 361793, 182086, 129419, 181451, 154356, 107127, 127755, 111746, 60582, 149879, 171253, 67739, 81687, 165599, 163378, 197876, 266824, 114082, -4973, 117147, 170986, 100023, 128297, 333469, 272510, 241242, 327497, 260125, 217965, 350200, 453661, 353433, 314420, 346595, 375167, 316769, 252332, 292850, 299836, 441232, 456337, 401519, 592670, 530170, 537828, 584085, 807835, 794439, 674299, 572656, 533374, 648990, 597725, 624056, 668743, 709031, 726245, 797786, 756087, 775780, 1028689, 1041019, 980108, 984046, 1023715, 1175773]
2172A175773K020j11411P4596J44033m0891k22134O9760J67003Q0825J1854l2334
2161A319094l8560M0611j2834J6394N8025L3260P6875J56024Q5543l3510N2579
2150A753501M4019K07552J53512J88965k2025J93152J45620o6918J86621J60202
2140B944201J75709P9178J17427N4556K16297K12114K20508K12233M0068J75267
2130D447558L13106K77518K24864M15382M07701N11705M89814N70122M04244M01479
2120H463493P21538R85212J079928J320119J543639K149107K475424L502007M713604
2111B6954071O799373P031334N794138J255326n805866q516257p586223n162088
2103B0763808l914511k853067k207628j652253j371078q55524m70936l45223l84333
$$ y = [1175773, 1177793, 1066382, 1140978, 1285011, 1244120, 1021986, 1091746, 1258749, 1339574, 1351428, 1319094, 1280534, 1321145, 1308311, 1324705, 1382730, 1415990, 1492865, 1648889, 1734432, 1700922, 1753501, 1797520, 2005072, 2158584, 2347549, 2325524, 2518676, 2664296, 2597378, 2783999, 2944201, 3119910, 3199088, 3316515, 3371071, 3587368, 3799482, 4019990, 4232223, 4272291, 4447558, 4760664, 5038182, 5263046, 5678428, 6086129, 6597834, 7087648, 7657770, 8062014, 8463493, 9185031, 10170243, 11250171, 12570290, 14113929, 16263036, 18738460, 22240467, 26954071, 33753444, 40784778, 46578916, 47834242, 42028376, 33512119, 25925896, 20763808, 16849297, 13996230, 11788602, 10136349, 8765271, 7909747, 7438811, 7093588, 6709255]
2094F709255l75820m69694n18736n01828k68893l22946l27942k68368k10840q6099
2084C358089j72770k28683j94623k70511J7046l8875j94343k18116j63828K0790
2074A914176p7234q0263o2428o7011j91370k04325J53110o3089n5932J53545q6952
2063A332227j30278o0645q1156j40520J19187r8945R2102r654m1583j52077n9685
2052G68973j08536m6754R3633K1140N927p8383j47387J31055K6166j60979j32898
2041C71957m1040J20539o6277j22307J25245M8215k2227L6406o8689j25520J933
2030B58235N1406k96115R0061J91042j24229k3832K0839m1440J67241l3524K748
2019B62432K24043k26266j60420O7865j02474J7534J59095J02589j987r3207l3146
$$ y = [6709255, 6333435, 5863741, 5345005, 4843177, 4574284, 4251338, 3923396, 3655028, 3444188, 3358089, 3185319, 2956636, 2762013, 2491502, 2508548, 2469673, 2275330, 2057214, 1893386, 1914176, 1836942, 1756679, 1694251, 1627240, 1435870, 1231545, 1384655, 1321566, 1265634, 1419179, 1332227, 1201949, 1141304, 1060148, 919628, 1038815, 939870, 1031972, 1022318, 980735, 828658, 768973, 660437, 613683, 707316, 728456, 734383, 656000, 508613, 639668, 665834, 504855, 371957, 330917, 451456, 385179, 262872, 388117, 436332, 414105, 450511, 381822, 256302, 258235, 309641, 13526, 103587, 294629, 170400, 146568, 167407, 125967, 293208, 259684, 262432, 486475, 260209, 99789, 167654, 65180, 82714, 241809, 344398, 342411, 249204, 216058]
2008B16058K3373m3823k07140r5181J60133m2211K1457J7800r5812o7525k9282
1997a42153O2369J08464M0461P5779k14905n913J0968k3929N9596J4203J27043
1986A11983j31939k46451Q9758J17567M9208J0005J1675m9632N0416K8592r8538
1975e7356N30n2951l9053J30502M8799k4064l9084j3775J14427k1281r1120j7202
1963f1628J86073j24849L9172N9128P2442k7781n0967q6629p1483M9553R2171
1952G5202l0526o5368m336m4709o6043p4641m7374K21730J12660j26200N51O8351
1940A9297j60904j0123m2089N4414N2437M1485P2850m5015K5464l2701k8723j39904
1928a93512o9388R0607J8256p4883q600j6835J8594J16435J20063j3474l0174
$$ y = [216058, 239431, 195608, -11532, -106713, 53420, 11209, 32666, 50466, -45346, -112871, -142153, -79784, 28680, 69141, 144920, -69985, -75898, -64930, -88859, -29263, -15060, 111983, -19956, -266407, -176649, -59082, -9874, 131, 11806, -37826, 12590, 41182, -57356, -56826, -109777, -148830, -18328, 30471, 6407, -32677, -46452, 67975, 46694, -44426, -61628, 124445, -404, 38768, 97896, 170338, 142557, 91590, 4961, -66522, -16969, 75202, 44676, -20692, -25028, -69737, -135780, -210421, -257795, -36065, 76595, -49605, -49054, 19297, -141607, -151730, -193819, -139405, -86968, -45483, 27367, -17648, 7816, -24885, -53608, -193512, -262900, -172293, -154037, -228920, -237520, -254355, -235761, -119326, 737, -12737, -42911]
1917d2911m4492J2380q0896J0272o9221P2779P5945m3922o100J7420j26479r3162
1905c18387J14029J06578J3665k2462k7383J23373q0660J11747Q6781j15743r2165
1894a00627l2884L0916K8367r51R8114j07593q1943Q4974J02740L0658k1864J7568
1882D7475R591O568n9574j05139r6756J31229L093j35060P8772k0445M218J50282
1870A4254p1546o875O2178J40141j24434J3003j1470o3637o7581O9007k5706n1011
1858a23677o8154O3776M9419j71471o230K2815K7381K0950l9350P7568o2760J76662
1846c3071Q8027N880J0752M8884k5591m1467P9949k456m7196j23077J31293n1336
1834D0591q5829l6734O9556M029N8543P1532n1530j52277J42516m4622r7831N29
$$ y = [-42911, -87403, -75023, -155919, -145647, -214868, -142089, -66144, -110066, -116166, -98746, -225225, -318387, -204358, -97780, -84115, -106577, -133960, -10587, -91247, 20500, 107281, -8462, -100627, -133511, -102595, -74228, -75179, 22935, -84658, -166601, -81627, 21113, 51771, 29907, 47475, 57066, 63634, 4060, -101079, -197835, -66606, -63513, -198573, -119801, -140246, -136028, 14254, -57292, -64167, -1989, 138152, 13718, 26721, 15251, -48386, -115967, -46960, -72666, -123677, -191831, -128055, -78636, -250107, -256337, -233522, -206141, -185191, -224541, -146973, -209733, -33071, 54956, 60836, 71588, 120472, 94881, 53414, 133363, 130907, 83711, -39366, 91927, 40591, -45238, -81972, -12416, -8387, 50156, 121688, 70158, -82119, 60397, 15775, -82056, -81527]
1822h1527J5719M4688q06p8907l0131O063p7326j6475J08240O6315J0077J30233
1810I6163m8672R723L6336m2529l4698l0033J47051r9839j07398n8499J30089
1799b306r7507M0191O0898r9533K3224L679j5313j5391Q4455j35450L2983L4288
1787h5782o3855l9383j9442Q5396p2810m6650K15579j02807M0232l5508J14152
1776a0878o5716M159n7615Q9714j0553l7189k4558p9640R9576L7572M3942l4557
1764d5743L4631n7249o3440r3062L7539j6138J6186m8270j5191j513J6199R2132
1752a43919J8548J13150J8871o4526J2943M879K8215j2164N3695J5626r2117l6539
1740h3338M886n4542q522M0823J1225J1158J24097j10062l1309J01015l0040N653
$$ y = [-81527, -65808, -21120, -21926, -100833, -130964, -124901, -202227, -218702, -110462, -44147, -34070, 96163, 47491, 57214, 93550, 51021, 16323, -13710, 133341, 33502, -73896, -132395, -2306, -99813, -59622, 1276, -98257, -75033, -71354, -86667, -102058, -17603, -153053, -120070, -85782, -149637, -189020, -208462, -123066, -195876, -242526, -26947, -129754, -89522, -125030, -10878, -76594, -72435, -130050, -40336, -50889, -88078, -112636, -192276, -92700, -55128, -11186, -45743, -11112, -68361, -131801, -224863, -187324, -203462, -187276, -235546, -250737, -252250, -236051, -143919, -125371, -12221, 6650, -57876, -44933, -40054, -11839, -24003, 29692, 45318, -46799, -83338, -78452, -132994, -141516, -100693, -89468, -78310, 45787, -64275, -95584, 5431, -24609, -18956]
1728a8956j16946j45213J65136M0047K4367j20927j18994K1374K3388J15986L7432
1717i3306K4431J3150j15251M9963J14241j0987k2529K8930l8616j64677N6977
1706a57674O7667j70953P1596m4338N2775K7147m0569O8271p4878p1265J18079
1695a54142J19072o9196o3020o4690M4318n4153J36769l022J22258j47312k8115
1684a61233q3637P4769l537R154O1131J50371K0690j89306l5532j06538J25991
1673a37677K3303k4861m0767J07500J12268r9670q5799m4674r5399L5424o0L9649
1661b10763R2689p9276P9433Q4915m0142L9826p4145j08042P0427J72560j2650
1650A4832m5922j10759m2082K6250k622N4972J556p8934M7890j0571J02882L5670
$$ y = [-18956, -135902, -281115, -115979, -75932, -51565, -172492, -291486, -270112, -246724, -130738, -93306, -68875, -55725, -170976, -121013, -6772, -17759, -40288, -11358, -49974, -214651, -157674, -90007, -260960, -189364, -233702, -180927, -153780, -194349, -126078, -200956, -272221, -154142, -35070, -104266, -167286, -231976, -187658, -241811, -105042, -108064, 14194, -133118, -161233, -244870, -170101, -173638, -164484, -103353, 47018, 67708, -121598, -157130, -263668, -137677, -114374, -139235, -180002, -72502, 39766, -59904, -145703, -190377, -285776, -250352, -250412, -210763, -118074, -197350, -117917, -33002, -73144, -33318, -107463, -215505, -145078, 27482, 14832, -31090, -141849, -183931, -157681, -160303, -105331, -103775, -182709, -134819, -145390, -42508, -6838]
1638f838q3329m7352K7465q8658k4904J10683Q7813j43913K8957l0789N6931n9876
1626a73810o1517K12313n0044N2165J9554j24487p6280l4478k9919J30414m5278
1615a81367J48296O3159r7409l0277M8215L1439Q1242R1434r6979k52624J08723
1604h6148N9929n6333j08014l7496J47142J74772k08352j05473L6577j3074J48339
1593d8131j38954J02254n5029p8896P3564P5035j38639O1582L4083k8002M1021
1582a00112J0835r21j5180k8193k7578r8697Q3630l9715K03424l6236k26186L1219
1570b43710J15813O7629J5244k3789j38393J59995J3896r9728j6049o7738r9894
1559c16724P2254J04454J7302R3596N2256j16932n4705Q9786N5443p103l5693
$$ y = [-6838, -90167, -137519, -110054, -198712, -223616, -112933, -25120, -169033, -140076, -170865, -113934, -173810, -235327, -23014, -73058, -20893, -1339, -125826, -202106, -236584, -266503, -136089, -181367, -33071, 30088, -67321, -97598, -49383, -17944, 63298, 154732, 57753, -194871, -86148, -26219, -82552, -190566, -228062, -80920, 93852, -114500, -219973, -183396, -196470, -48131, -187085, -84831, -139860, -218756, -145192, -70157, -208796, -147214, -113131, -141133, -100112, -89277, -90198, -105378, -133571, -161149, -259846, -176216, -215931, -12507, -48743, -274929, -243710, -127897, -60268, -45024, -68813, -207206, -47211, -33315, -133043, -149092, -216830, -316724, -244470, -140016, -122714, -29118, 23138, -93794, -148499, -58713, -3270, -10373, -46066]
1548d6066m7105j18071L0439O6525K43q475n4743J27046m307j43596M9058N0591
1536i8461o0528J35069j29910J1669J822O0739p5338j7723m8904O8434P1916J11365
1524C0150n6644j8186j38928j35K708j9807j1341M0774J54401J0932p1349K5208
1512e2217j5966p1141R9196P270l6183o094P7227j35700K0338M4183k0960r9406
1500a89453R0141o6522m9718k3308j23360P5833K5580P9115J6889K4734m2763
1489a82832j37232r6709O8747R4454M6815M0148K0078J17046j35016M2878k9489
1478a51112m7271J22229Q4649j36891O2574k5417k8928J29802m0614p430k4752
1467f3161M2114N5787K5568L9748j568p0989j66617J14230r669N572M4891m9164
$$ y = [-46066, -93171, -211242, -180803, -114278, -114035, -122510, -177253, -50207, -54514, -198110, -149052, -98461, -158989, -23920, -153830, -142161, -140339, -79600, -154938, -172661, -221565, -153131, -81215, 30150, -26494, -44680, -183608, -183743, -181035, -200842, -212183, -171409, -17008, -6076, -77425, -52217, -68183, -139324, -40128, -32858, -69041, -75135, 2092, -133608, -113270, -69087, -90047, -189453, -99312, -165834, -215552, -238860, -362220, -286387, -260807, -181692, -164803, -140069, -182832, -320064, -416773, -348026, -253572, -206757, -166609, -146531, -29485, -164501, -121623, -151112, -198383, -76154, 8495, -128396, -65822, -91239, -120167, 9635, -30979, -38409, -63161, -21047, 34740, 60308, 100056, 98488, 27499, -139118, -24888, -34557, -28985, 15906, -33258]
1455c3258M6125R4497r2204q168J7657l9840o9732J265Q503j2686N9991J02767
1443G4917j09604M4395j00316o9613R2449l7702m8968j1240r0386k3176J6071
1432b63173K9990P1164M9082J0554o236K0862J37359j4646j42910n5018l8154
1421b01126q057l2150J29673J26293k661m4717j11349j18670J23865M9867K8064
1410f0968n2263K5089n8054J16728R331M3286l895k2613J94607J3477j35625M7044
1398A16144j99392j96162Q2851M2923l171O9026l7338r228j17019Q2436N2644
1387a16286k6310J09919P0528j08425j3871P5345M8996k4329L200j04411M1948
1376d3696O3424k41640n8957O7017j7026J0207l2210J08903N203m94j8441j1666
$$ y = [-33258, 12867, 107364, 15160, 6992, 24649, -15191, -84923, -83658, -75155, -87841, -27850, 74917, -34687, 9708, -90608, -160221, -67772, -105474, -154442, -165682, -256068, -279244, -263173, -233183, -162019, -112937, -102383, -108619, -87757, 49602, 34956, -107954, -162972, -201126, -209183, -241333, -111660, 14633, 11972, -32745, -144094, -262764, -138899, -89032, -60968, -113231, -88142, -146196, -29468, -20137, 23149, 19254, -3359, 191248, 204725, 69100, 116144, -83248, -279410, -196559, -153636, -156807, -87781, -125119, -134347, -251366, -168930, -116286, -142596, -32677, 37851, -70574, -84445, -9100, 39896, 15567, 18767, -85644, -43696, 19728, -221912, -280869, -213852, -230878, -220671, -252881, -143978, -138775, -139269, -157710, -169376]
1364a69376N1541R9721p109j56864N3500J05287j35033K646N5635k2471n20n7743
1352a80786l7204K7212J20997j17219o57R8404N4266N269O775n1535M7926K4894
1340a658J20566J2722r0384j27284p9403J02373P1298j19517q7058J56659L4716
1329f970p5155J80825l8712J8556m1595j39047P9547m6355m8586J3049M3453r4172
1317a55162j9993k2682k5822J02119m0772J17703k1837m3371Q935M3636p2110
1306a29356l8781O7963Q5721k29154k6442J70756k3405N1066R798j18549J03738
1295g6645j5900P8798P2546j62849P4232J08888k7020j22859P8209j8634k5573
1284c6807m3242Q9041r591K6504L642J1266J4565j43964j6525Q4916M5064l0927
$$ y = [-169376, -117835, -18114, -25223, -182087, -128587, -23300, -158333, -155687, -100052, -122523, -123043, -180786, -217990, -190778, -69781, -187000, -187657, -89253, -34987, -29718, -22943, -74478, -26552, -1658, 118908, 131630, 41246, -86038, -165441, -63068, 8230, -111287, -198345, -41686, -6970, -82125, 98700, 59988, 78544, 36949, -102098, -22551, -68906, -117492, -104443, -60990, -155162, -175155, -197837, -223659, -121540, -162312, -44609, -66446, -109817, -100882, -57246, -129356, -168137, -100174, -14453, -243607, -270049, -99293, -122698, -71632, -61834, -180383, -76645, -92545, -13747, 58799, -104050, -29818, 79070, 52050, -70809, 7400, -11234, -36807, -80049, 8992, -599, 25905, 29547, 40813, 55378, -88586, -105111, -20195, 24869, -6058]
1272f058r9635L9691J16105j35961O3540P3558Q3419j93976K260Q1013R7298K9880
1260A51134J1100n1466J3536j5094o6452q0374j93346K58679j6458M4086J8055
1249G3400m3204k2518j1723J5884L323J2985l0387J27206j3542q9605L1977o2187
1237h391L7599L6396k8828L4242j75852p4490J6628Q1963j3305l9657K0686j6060
1225a29069Q7027K3894L941j1236q1389p3641j4269o0471K62678o7630q7955p2380
1213b20500p1115K4932J08621l8507Q8670J44954k2353l0962n7055k7532r1028
1202a91875P5905J46326M7250J3293j43863L9561J08744j85788O80J52790j9742
1191D3281l8576r2125Q3117P1195j06583r5084j446J20132J3137j41739M7082
$$ y = [-6058, -105693, -66002, 50103, -85858, -22318, 51240, 134659, -59317, -57057, 23956, 121254, 151134, 162234, 110768, 124304, 109210, 42758, -37616, -230962, 27717, 11259, 55345, 73400, 30196, 7678, -4045, 11839, 15162, 28147, -2240, 124966, 111424, 21819, 53796, -8391, 29208, 65604, 36776, 71018, -104834, -179324, -162696, -80733, -94038, -133695, -113009, -129069, -42042, -18148, -14207, -25443, -106832, -180473, -194742, -255213, 7465, -60165, -148120, -220500, -291615, -266683, -158062, -196569, -107899, 37055, 14702, -16260, -73315, -100847, -191875, -115970, 30356, 77606, 90899, -52964, -13403, 95341, -90447, -89767, 63023, 43281, 4705, -87420, -4303, 66892, -39691, -134775, -136221, -16089, -2952, -144691, -97609]
1180i7609M6632K1038j5446l6764J34570j7490L4622K5218n7276n7029k7509k1449
1168f8492j7178Q8510O6952j03758o0735n7835P4983L7665J20884j02195k1026
1157d2225J444m8507k5662j14396Q0387m1858J35196K6081o7216J701N1156M0086
1145c813P3492o6818l8946N1218n6585j37545J03696O7229r2482J13637K6587
1134C9670r9007O4322R5631L0842r0790k14307J12172m5388P0989J21497n39N5870
1122A40962r1906q2954j3302R5952K8029j34192j4001K9669J33375L0809m8896
1111G3545m399J4908r4166j1898j10413K5247p931J9553N3497J36498j8912j78060
1099a02531j42976l2165K40623O284O1535q2334n3643j05794M283j1378o5688
$$ y = [-97609, -50977, -29939, -45385, -82149, 52421, 34931, 69553, 94771, 37495, -19534, -47043, -68492, -85670, 2840, 69792, -33966, -94701, -152536, -77553, -39888, 80996, -21199, -42225, -40781, -89288, -114950, -229346, -148959, -190817, -55621, -29540, -96756, -95055, -43899, -3813, 69679, 2861, -36085, 15133, -41452, -178997, -75301, -8072, -100554, 13083, 39670, -59337, 4985, 100616, 131458, 40668, -173639, -61467, -106855, -35866, 85631, 85092, 140962, 49056, -33898, -47200, 48752, 76781, -57411, -71412, -41743, 91632, 122441, 73545, 69146, 84054, -10112, -22010, -132423, -107176, -115107, -95554, -42057, 94441, 75529, -102531, -245507, -277672, -37049, -30765, 30770, -51564, -105207, -211001, -206718, -218096, -283784]
1088b83784Q0771n577J20449L6052J59229p8115o5134p7771L2431j3820k8622
1077a23891N7370Q62R8427j6777R763j1641P4014k9223p0466n6670J11003r201
1065C3570l3025k1422o922K7687p8494r028K4656J4586o0893j0840M7200K40980
1053A68055j3051k1877l9458l4999j17181O6632J29234o2844j17879l2287J33684
1042E8029k4315R0570N7703K2127j11443n5802l8408K260R4879n3734r4509J18195
1030F5552j18273O6294n0332K4405L9258J18856j46014j19840J64863M4261k9369
1019E9661k0938L5842N6958Q9937l8417j26541p9247j2157R3699p1350p1374K4073
1007e9854O0778J6081J25041k4020r1175J5456L1447L400p5369P6982j23333J07281
$$ y = [-283784, -203013, -208590, -88141, -52089, 107140, 29025, -36109, -113880, -81449, -95269, -123891, -66521, -65659, 32768, 15991, 25754, 14113, 88127, 58904, -11562, -68232, 42771, 33570, 545, -20877, -27799, -112, -78606, -87634, -62978, -48392, -109285, -120125, -72925, 168055, 155004, 133127, 93669, 58670, -58511, 8121, 137355, 74511, -43368, -75655, 58029, 33714, 124284, 181987, 204114, 92671, 36869, -1539, 721, 95600, 41866, -52643, 65552, -52721, 13573, -36759, -12354, 26904, 145760, -254, -120094, 44769, 89030, 59661, 38723, 74565, 131523, 221460, 183043, 56502, -22745, -34902, 58797, -12553, -83927, -59854, 924, 17005, 142046, 118026, 26851, 42307, 73754, 77154, 1785, 78767, -44566, 62715]
995F2715K3550Q740m8239K1005K685P197M2724J6859K4866L2442n3643r6581j2967
982C1353O9908L597r8881P3058N2243p3446K1271p5513j7719M6571J7718p0577
970b0417n4517M4495j0065K4812P4355k3463o9306N504n023n656J33355K6929
958A21003j12386J56770j02636j65811n3349R4538J25712j19833p7018L5007N5798
947d2205j9941J32259q173O8105P037j67006j6509J6743j2726p577k5545k12659
935b88197J68517J34871j29753o9457J24500N1795J04636K9239r3480J951o9339
924c4717n804J00283l7346j32527K8126J14882N0168r0598j03622O4035l5208
913h2328J9256J60423r8415K014q5713P8905P1565J8229r700l9691q3306J04690
$$ y = [62715, 86265, 95005, 46766, 67771, 70456, 77653, 120377, 137236, 162102, 194544, 140901, 44320, 31353, 101261, 104858, 5977, 79035, 131278, 57832, 79103, 3590, -14129, 32442, 50160, -20417, -74934, -30439, -40504, -15692, 58663, 35200, -34106, -28602, -33625, -39281, 94074, 121003, 8617, 165387, 62751, -103060, -156409, -61871, 63841, -55992, -133010, -98003, -42205, -62146, 70113, 61940, 130045, 137082, -29924, -46433, -29690, -42416, -49993, -75538, -288197, -119680, 15191, -114562, -184019, -59519, -7724, 96912, 126151, 32671, 34622, -34717, -40521, 59762, 22416, -110111, -81985, 32897, 83065, -7533, -111155, -47120, -82328, -63072, 97351, -1064, 950, -84763, -5858, 65707, 83936, 74236, 34545, -48761, 55929]
901E5929O055Q4051P4504o1406j38683r4564J05350j7465L8194K633k4407j02391
889g2200J39833N1721K5979j3621L904Q1712j76265j17472L085m2725J16835L5263
877C6049L2503L6440J3164j5976L4079o8755r7316J0143Q9803l3392K994k4343
865A5393q8480J6416K9034J35356J3904n7722K4135l7109o8071m4398l6568P2301
853b5809J5598k4357l0173L35j702j29056O4409K1065Q8388J47347n5411K9282
841I9916j59337J01444J001o0083l396J22524k0816O9758j17949P3134O8940n2749
829A22387k2549j38503q0304m0299J48917j2442m0637j9983M8873k1448R2582
818C6594J0177K8964n0540n9041l2940K2253K6467J40473J2187l3452l198o3591
$$ y = [55929, 61984, 146035, 220539, 159133, 20450, -74114, 31236, 13771, 51965, 54598, 30191, -72200, 67633, 119354, 145333, 131712, 135616, 217328, 41063, -76409, -73324, -116049, 786, 36049, 68552, 104992, 118156, 102180, 136259, 67504, -29812, -19669, 70134, 36742, 39736, 15393, -73087, -56671, -27637, 107719, 121623, 63901, 88036, 50927, -17144, -61542, -98110, -25809, -10211, -34568, -64741, -64406, -66108, -195164, -130755, -109690, -21302, 126045, 70634, 99916, -59421, 42023, 43024, -17059, -20455, 102069, 81253, 151011, 33062, 106196, 175136, 122387, 99838, -38665, -118969, -159268, -10351, -22793, -63430, -83413, -34540, -55988, 36594, 46771, 75735, 25195, -33846, -66786, -44533, -18066, 122407, 134594, 101142, 97944, 34353]
806C4353m7540J23580O3514j18387j11905O9306q1699j17282J55080L0590J49302
795A48912p8558R2867n5147j59176Q9483J05489j00142K7295J26657o7364K6586
784A56902l058j43960r3282p4584o0662K27434j1440r7681K5511L4229P8690l3110
772D989q0959k6330L5062R0003R1704L5799j23052L1194l9622j0125J3356N4424
760G6443K6264l1971l6157M0134O5636n4195r8777L930l2024L5487J26124m3709
748G7185p0146m9861J03316k1444m230p2809K384O1369J06091j20644L6271O6792
736A14274p2840j8532o2711J35449O3292j45638j92172P4397Q8248k7251N3961
725A0477j0757p7963J08498P0349K7092j36161K8879N9589l9213Q9390M5201q2637
$$ y = [34353, -13187, 110393, 173907, 55520, -56385, 12921, -68778, -186060, -30980, -390, 148912, 70354, 163221, 108074, -51102, 38381, 143870, 43728, 71023, 197680, 130316, 156902, 153844, 9884, -83398, -157982, -218644, 8790, -2650, -100331, -74820, -40591, 38099, 4989, -75970, -102300, -67238, 22765, 114469, 150268, 27216, 58410, 18788, 8663, 22019, 76443, 102707, 70736, 34579, 74713, 140349, 86154, -12623, -8693, -40717, -5230, 120894, 77185, 7039, -42822, 60494, 39050, 34820, -37989, -35605, 25764, 131855, 11211, 47482, 114274, 41434, 22902, -39809, 95640, 158932, 13294, -178878, -104481, -16233, -43484, 10477, -280, -78243, 30255, 100604, 127696, -8465, 20414, 80003, 40790, 130180, 175381, 92744]
713I2744k8149j6064O4091o949j46849K2293J23497l6784j09037k526R7331P2544
701A26142o4539L810P3555N3080n4695j9075J444p330N3408l4100q7961n4723
689a0984R117q467L5931M9251k8322N7012k9884m4573j4468L5401O7774j04690
677A3098r1318j07967N9102P9277M2978m1971O2822P306m0824O5980n3763M5679
665D0399R6091q7434n7126K32276K3035k6987O8595j52448m0219K7578k9726K9519
653A23553j6201o277N0838j94970j1648K13128r5329L647N2364k1351o2092J4601
641E0263r161p6269l48j7481k7525J7333P5717K8978K437k4081n9100O2933J03344
628A27040J859p2611m3801m5213Q4495n7472P1186Q806O3973q179j5593r5770
$$ y = [92744, 64595, 48531, 112622, 105673, -41176, -18883, 104614, 67830, -41207, -43733, 53598, 126142, 61603, 65413, 138968, 192048, 137353, 118278, 119722, 112392, 165800, 131700, 43739, -10984, -1867, -10334, 25597, 74848, 46526, 103538, 73654, 29081, 14613, 50014, 117788, 13098, -78220, -186187, -127085, -47808, -4830, -46801, 16021, 23327, -17497, 48483, -5280, 40399, 136490, 49056, -8070, 224206, 247241, 220254, 288849, 136401, 96182, 123760, 94034, 123553, 107352, 101075, 151913, -43057, -54705, 158423, 63094, 66741, 119105, 97754, 35662, 50263, 41102, -35167, -35515, -52996, -80521, -63188, 12529, 41507, 43944, 19863, -39237, 23696, 127040, 128899, 56288, 12487, -32726, 51769, -5703, 65483, 74289, 138262, 130083, 114490, 18720]
616A8720O8672j36179L4969L6635P22M4149n233n9389J4689Q6720j77754j3122
604h6401R6002K7101L1834n8792K3798J21360j98477N8703J89610J34756j21253
593B18241k88680j46424Q6856R1638Q7412O3337j2785q1289n1337K2164l9331
582e0198J43544k2392j24737N2241n290N6644j08773O4363J34013K5069k04665
571d0181j7318L6741m0611Q0033R336P5306L7910k814J24124q0930j38387R9218
559A42427j7403m6254O1231m631j51378q0928L5719N0506O9688r6447O2269l4977
547a0178o7427o0090J01888N2270q2627N8629J74785j86086J6655M7104L0909
536G5832O5421k977N1489j32760l6229n5515l74m7430K4240j5358K0571l9275
$$ y = [18720, 87392, -48787, -13818, 22817, 23539, 67688, 62455, 3066, 17755, 104475, -73279, -86401, 9601, 36702, 68536, 9744, 33542, 154902, -43575, 15128, 204738, 339494, 218241, -70439, -216863, -130007, -38369, 49043, 112380, 99595, 18306, -33031, -10867, -50198, 93346, 70954, -53783, -1542, -6832, 49812, -58961, 5402, 139415, 164484, -40181, -57499, -20758, -61369, 18664, 28000, 103306, 141216, 138402, 262526, 181596, 43209, 142427, 125024, 78770, 140001, 135370, -16008, -96936, -61217, -10711, 58977, -37470, 24799, -10178, -77605, -137695, -35807, 16463, -66164, -7535, 167250, -18836, -2181, 44923, 75832, 141253, 138276, 189765, 57005, 20776, -34739, -35113, -82543, -58303, -73661, -53090, -92365]
524i2365K8832N2752K3014O573N8546m4859J8162O1814P3057P0942j08198m947
512A43323p8042k9229j25575R5746N2775l5477l5327M515J32596L4586r594o039
500A44258n9991j0164j5039o5614o4396o1293J59526Q5241Q118k4890n4921j37176
488i6341N3276O7401O2134N059n3039J29173J2536l5745p9965j07990P588J72493
476A36580Q0647k1590n557p8428r079q4260M7504l156l1263Q2976k0131k3782
464G0461J28381j63653o4359J33935M1188O1641m7792r9190j0312n7433m2093
453d9226Q1474p3102o5066J27397J04944r9903N1364M5934J9184K0277j9455l9666
441A04156q4619L2319n9612O4177J11183M0269q306o2225o1063J0091k55118Q2902
$$ y = [-92365, -63533, -10781, 12233, 18806, 77352, 32493, 50655, 112469, 185526, 256468, 148270, 143323, 65281, 36052, -89523, 6223, 58998, 23521, -11806, -7291, 125305, 159891, 150297, 144258, 84267, 74103, 59064, -6550, -70946, -132239, 27287, 112528, 120646, 95756, 40835, -96341, -43065, 24336, 86470, 91529, 38490, 167663, 180199, 144454, 64489, -43501, -35913, 136580, 217227, 195637, 190080, 111652, 102573, 18313, 65817, 62661, 31398, 114374, 94243, 70461, 198842, 35189, -29170, 104765, 145953, 207594, 159802, 60612, 50300, -7133, -49226, 32248, -40854, -105920, 21477, 126421, 26518, 77882, 123816, 143000, 163277, 143822, 104156, 19537, 51856, -7756, 56421, 167604, 207873, 199567, 137342, 76279, 86370, -168748, -85846]
429h5846K8210J66744M5485q3502M3515M1854n7366q8606J63101j0325l8836r007
417A15421J060j6610P0205J5735o0384l0515N2287l7947l9237r889k1779m7029
405h682P6328r0320L7576o8320N9761N643R8893p5689r4976J14175Q2223p6993
393E9619j12740Q2899N1961L998r9032q5148Q1218O2238j50350M7460J20150o774
381E5499N0226K8239j45561J4668k9454l1544k4777J26851M9929J10318j49087
370E5307q9973N1981J05474l1899j0482J17145r0614l0120J1149P6044K4147o4123
358A24036k3767J22499j62958n398N3809K25769r5006k54769p9812k6017J24476
347B862Q4617q9735j18389j441J80682P9720j31703l5447O9767K0264j35341M4724
$$ y = [-85846, -57636, 109108, 154593, 71091, 114606, 156460, 99094, 10488, 173589, 163264, 124428, 115421, 116481, 99871, 170076, 185811, 125427, 94912, 147199, 109252, 70015, 60126, 38347, -8682, 67646, -22674, 14902, -53418, 6343, 11986, 110879, 35190, -59786, 54389, 136612, 59619, -53121, 29778, 81739, 85737, -13295, -98443, -17225, 45013, -105337, -57877, 62273, 55499, 105725, 133964, -11597, 3071, -26383, -57927, -82704, 44147, 94076, 204394, 55307, -34666, 17315, 122789, 90890, 80408, 197553, 106939, 76819, 87968, 164012, 188159, 124036, 100269, 222768, 59810, 54412, 108221, 333990, 238984, -15785, -95597, -121614, 2862, 87479, -2256, -120645, -122086, 58596, 138316, 6613, -28834, 40933, 61197, -74144, -29420]
335b9420K4792o9922m3315K03689N2718j3058j4128j08475j08285R423k4729O04
323a20106Q7192N5383r803m2249M0059J40596l4930j20837K5853K746J10584r4014
311D0474M908M5224k2892l2308J2818J37538n0239q2800N4330k8584o1810k699
299A3960J7443j0585K3899P1906O7553j7868j14084k4239J3835R980j95325l5716
287a79241K42739m5368m5585M1503j6114p9955P2617N3350j7615Q531l257j06512
275g4907J84518K22831m9499j13579K4830R3126j42550j23189q0027J46628R5928
264A84110j6224j27344j3168J6267J5764J34841k5051j71745q3106J4103M8309
253b3244O9746n2182Q5342o8112k16455K3392J90683K0557j8117J22132O5486
$$ y = [-29420, -4628, -74550, -117865, 85824, 138542, 125484, 111356, 2881, -105404, -95981, -120710, -120106, -32914, 22469, 12666, -29583, 10476, 151072, 116142, -4695, 21158, 23904, 134488, 40474, 45382, 90606, 67714, 35406, 48224, 185762, 135523, 52723, 107053, 78469, 16659, 13960, 31403, 20818, 44717, 116623, 184176, 166308, 52224, 27985, 41820, 51800, -143525, -179241, 63498, 18130, -27455, 14048, -2066, -82021, -9404, 43946, 26331, 34862, 31605, -74907, 109611, 332442, 282943, 169364, 194194, 287320, 144770, 21581, -58446, 88182, 184110, 167886, 40542, 27374, 43641, 59405, 194246, 169195, -2550, -85656, -71553, -23244, 46502, -5680, 79662, 11550, -204905, -181513, 9170, 29727, 11610, 133742, 199228]
242A99228J3751q0067q5997j6743J9524j8710p5395R4656K8764n8750N9144m5112
230C4293J4748N5142j39344J01181K3006o8123L6457m6409J31895Q7442j24668
219A05620o8944j00406j2893l0726O538K16758J0309n3236o1786n7723K0741J58959
207A33211N2758j20661n5093J09672K0145j10322Q374O7519q596j7820L195k7773
195E4609K3231o6569O0218l688L7535q0788J468Q7230l4052k4221n8076L9973
183C6870o2869N3522m6699R1711M6448p4656q2072Q1342m5596P1263R106M1282
171A19652k8833k5311j08232n8151l146O3961P6016k4155N6485o9791p6645n3149
159a31299J99767Q2326o3341j3142L1517J12793q5044j25165L7069j9694M5953
$$ y = [199228, 212979, 132912, 46915, 30172, 49696, 30986, -44409, 50247, 79011, 20261, 79405, 34293, 49041, 104183, -35161, 66020, 89026, 20903, 57360, 10951, 142846, 230288, 105620, 36676, -63730, -76623, -107349, -100811, 115947, 126256, 73020, 11234, -46489, -25748, 133211, 185969, 65308, 10215, 119887, 140032, 29710, 38084, 105603, 97007, 79187, 82382, 54609, 77840, 11271, 71489, 67801, 105336, 24548, 26016, 113246, 79194, 54973, -3103, 36870, -25999, 27523, -19176, 72535, 118983, 44327, -37745, 43597, -1999, 69264, 78370, 119652, 90819, 65508, -42724, -100875, -104021, -40060, 35956, 11801, 68286, -1505, -78150, -131299, 68468, 150794, 87453, 74311, 105828, 218621, 133577, 8412, 45481, 25787, 71740]
148G1740P9762K1129o7735K6099r731q8639J8827N9440N845K1274j4114j2236
136A11661K2571l7851l4897J22421n6380l5400n9052M9050j3474k9894Q896m8519
124h68Q4122J11491M6418j42724k5869n1188L894j7331L8770l1812k4495Q789
112h03M0388N0985L9589p605k4201k7107m8994K7335l7697q898J45058L4535j02530
99H0055m8700M6481K1157l4527L6083o3255N4332O6901r4472l9407R4584q867
87A10365l6132p2784M6982L683o7146J2311J42416J06015k4919m2627p1737k0416
75H6011j1595m5231J4960p7701N7298K3040J1624O4650m2636P256J9279l4258
63G2697J2549o8802J05007k1046p4585q489J3171n7252p6736J69100k3811o5980
$$ y = [71740, 151502, 172631, 104896, 130995, 121264, 32625, 51452, 110892, 116737, 138011, 123897, 111661, 134232, 96381, 61484, 183905, 127525, 92125, 33073, 82123, 68649, 38755, 47651, -868, 83254, 194745, 241163, 98439, 72570, 21382, 25276, 7945, 46715, 14903, -9592, -803, 39585, 90570, 130159, 122554, 98353, 71246, 22252, 49587, 11890, 2992, 148050, 182585, 80055, 31355, 77836, 98993, 64466, 100549, 37294, 91626, 158527, 64055, 24648, 119232, 110365, 74233, 1449, 48431, 52114, -15032, -2721, 139695, 245710, 220791, 178164, 106427, 86011, 74416, 29185, 44145, -33556, 23742, 46782, 58406, 123056, 80420, 87676, 106955, 72697, 85246, 16444, 121451, 100405, 25820, 17331, 30502, -26750, -103486, 65614, 41803, -24177]
51b4177P8497m6457L0015R346K6307r100l290M7903J0589j02667K4979M9381j124
38I0202q7323J1971K651O7680M5388l734j23029K4504J989P0688L9019j07415
26C2591l2943K7305J07242j2129J3482j5707k9283r874R605J6384R7802j34182
14G0293J06783O7234m9471n1102r6971l7661J19069n1649p874o7122k7569Q644
2a7396J68681o4241
0H7044
$$ y = [-24177, 54320, 7863, 37878, 47224, 73531, 64431, 61141, 109044, 119633, 16966, 41945, 91326, 90202, 2879, 14850, 17501, 85181, 130569, 126835, 3806, 28310, 30299, 100987, 140006, 32591, -352, 26953, 134195, 122066, 135548, 119841, 90558, 80684, 90289, 106673, 204475, 70293, 177076, 244310, 194839, 143737, 46766, 9105, 128174, 76525, 68651, 1529, -26040, -17396, 151285, 87044]
$$ Imaginary data points
##PAGE= N=2
##DATA TABLE= (X++(I..I)), XYDATA
16383b904141O0473J63608q049J58370k1464m360o0732P6763J91287J7328j03324
16372b434241K0665J13825M0995K9386M7216j0728N2216k4572J2601Q9127M1993
16361b021517J01497j645L1595Q1038l248L1457Q7721J0656R538Q0458J5243l5241
16349a612448O4064J59345N241J08901J5167o3357L3214K1874L3844R8874Q1987
16338a053294r1688M098N5917M2200J5550O249J87636l144K8535l3240m07J4123
16326h27465K04630M850k1829M6301O4656n418Q6143J22180k0228K9637j10351
16315d26894K5396P2299P5392K9109J761J32750p1244P9700M4322R4969O6364
16304A23924n8978k4262l4505R5693J66013p8764M8007j6837J00741m0848P205
$$ y = [-2904141, -2843668, -2680060, -2688109, -2529739, -2551203, -2555563, -2616295, -2539532, -2348245, -2330917, -2434241, -2413576, -2299751, -2258756, -2229370, -2182154, -2192882, -2140666, -2165238, -2152637, -2063510, -2021517, -1920020, -1921665, -1890070, -1809032, -1812280, -1780823, -1693102, -1682446, -1672908, -1592450, -1577207, -1612448, -1548384, -1389039, -1383798, -1274897, -1259730, -1323087, -1289873, -1267999, -1234155, -1135281, -1053294, -1144982, -1140884, -1084967, -1042767, -1027217, -1020968, -833332, -836476, -807941, -841181, -841588, -827465, -622835, -617985, -639814, -593513, -528857, -534275, -448132, -325952, -346180, -316543, -426894, -401498, -329199, -253807, -224698, -222937, -90187, -161431, -81731, -37409, 57560, 123924, 64946, 40684, 6179, 101872, 267885, 189121, 237128, 220291, 321032, 280184, 287389]
16293B87389R3081o740J08321L6117m7766o2780n9509o260J21960J45860m267
16282F05406O4816Q0764m0369N7611R7302N4412M683L4487o943L4247n4428J21255
16270A053243N2913P5078m2307k9732k5601J65994L9893J6324M6216M8649n4264
16259A346406P2267N8301n6349k6259k246j6574N2265M7675k0619P3669J63267
16248A691803p2237m8817J38730O553J026p6226L5739N1520J2963P3097o3817
16237A750334n603J22623P4080k4292P9126m4891j6767o6484p7449J76065n7679
16226A909063p295M2292L1656Q0116J34131n779n6709m7235r3753Q6504L789J13399
16214B190179L9092n376J06691j7496j31746J6761M0707l5557K2018O1855J41595
$$ y = [287389, 380470, 373730, 482051, 518168, 470402, 407622, 348113, 341853, 463813, 609673, 605406, 670222, 750986, 710617, 768228, 865530, 919942, 924625, 959112, 952169, 986416, 931988, 1053243, 1106156, 1181234, 1138927, 1109195, 1083594, 1249588, 1289481, 1305805, 1352021, 1400670, 1346406, 1418673, 1476974, 1420625, 1394366, 1392120, 1375546, 1427811, 1475486, 1454867, 1528536, 1691803, 1619566, 1570749, 1709479, 1716032, 1717058, 1640832, 1676571, 1728091, 1741054, 1814151, 1750334, 1744731, 1867354, 1941434, 1917142, 1996268, 1951377, 1934610, 1868126, 1790677, 1966742, 1909063, 1901768, 1944060, 1975716, 2055832, 2189963, 2184184, 2127475, 2080240, 1986487, 2072991, 2076780, 2190179, 2229271, 2223895, 2330586, 2313090, 2181344, 2198105, 2238812, 2203255, 2225273, 2287128, 2428723]
16203B428723J3558J43970o675o5064O5807j42877r2692L7796P7068j7875p2247
16192B369492L2971K51797r7324q336Q7152O6574J0726r9557N4080J18050j02312
16181B683313m6543J18417L696j74758M2461K7628o5165P7615J34015Q0913j65788
16170B715804J56389j03015j6509j14996k5067J37640k8825l2345J46143Q3823
16160B919042L4341n0082J9279J7954j83718J17545O3419P2691O2207p1041j35366
16149B866271J15867P7767j29679p0410N623L6637R1856K74338o9768j48615l0471
16138C019416P8251Q6995j12701l6721K7749n7869n2320O5893J39393o4711l0206
16127C063169J51886j41761j38019J8255J04965Q0825J4489m1013L4982j78j14571
$$ y = [2428723, 2442281, 2586251, 2579576, 2514512, 2580319, 2437442, 2344750, 2382546, 2459614, 2441739, 2369492, 2402463, 2654260, 2556936, 2548600, 2635752, 2702326, 2713052, 2613495, 2667575, 2785625, 2683313, 2636770, 2755187, 2758883, 2584125, 2626586, 2654214, 2589049, 2666664, 2800679, 2881592, 2715804, 2872193, 2769178, 2752669, 2637673, 2612606, 2750246, 2721421, 2689076, 2835219, 2919042, 2953383, 2903301, 2922580, 2940534, 2756816, 2874361, 2937780, 3010471, 3072678, 3001637, 2866271, 2982138, 3059905, 2930226, 2859816, 2865439, 2902076, 2993932, 3268270, 3198502, 3049887, 3019416, 3097667, 3184662, 3071961, 3035240, 3062989, 3005120, 2952800, 3018693, 3158086, 3093375, 3063169, 3215055, 3073294, 2935275, 2953530, 3058495, 3139320, 3153809, 3112796, 3147778, 3147600, 3033029]
16116C033029r0072L9620R3138m7381K9875O2402P0992p5640M541j61726J15850
16105C074628J03251o2900n476r1674L047M4701j4678J1889N9927k4141N2866
16094C151440L3807k246o8810J04639K4496J4023l5500j1707J1171M3347J41934
16083C406594Q632j01311j22700N8066J11007j02062j47728N0608M6169K4090
16073C231365M5340K6512r917K4036r1912O8312O4720j78410r604K4005Q151J3530
16061C216128n3990J00177j2173q2866L0091K8246Q464N2606J8308j05576k2368
$$ y = [3033029, 2942957, 2982577, 3075715, 3028334, 3058209, 3120611, 3191603, 3115963, 3120504, 2958778, 3074628, 3177879, 3114979, 3109503, 3017829, 3020876, 3065577, 3050899, 3062788, 3122715, 3098574, 3151440, 3185247, 3183001, 3114191, 3218830, 3243326, 3257349, 3221849, 3210142, 3221313, 3264660, 3406594, 3415226, 3313915, 3191215, 3249281, 3360288, 3258226, 3110498, 3161106, 3207275, 3231365, 3276705, 3303217, 3293300, 3317336, 3225424, 3293736, 3358456, 3180046, 3170442, 3194447, 3202598, 3216128, 3162138, 3262315, 3250142, 3167276, 3197367, 3225613, 3234077, 3286683, 3304991, 3199415, 3177047]
$$ [...]
##END NTUPLES=NMR SPECTRUM
##END=
