##TITLE=1H_CA-9181-2
 CDCl3
 8 sc, 
 1.8.2023
##JCAMPDX= 6.0         $$ Bruker NMR JCAMP-DX V2.0
##DATA TYPE= NMR SPECTRUM
##DATA CLASS= NTUPLES
##ORIGIN= UXNMR, Bruker Analytische Messtechnik GmbH
##OWNER= root
$$ XWIN-NMR		Version 3.5
$$ Tue Aug  1 13:45:09 2023 Russian Standard Time (UT+4h)  she@DPX200
##.OBSERVE FREQUENCY= 200.13135
##.OBSERVE NUCLEUS= ^1H
##.ACQUISITION MODE= SIMULTANEOUS
##.ACQUISITION SCHEME= undefined
##.AVERAGES= 8
##.DIGITISER RES= 18
##SPECTROMETER/DATA SYSTEM= spect
##.PULSE SEQUENCE= zg30
##.SOLVENT NAME= CDCl3
##.SHIFT REFERENCE= (INTERNAL, CDCl3, 0, 15.7248)
##AUDIT TRAIL= $$ (NUMBER, WHEN, WHO, WHERE, WHAT)
$$ ##TITLE= Audit trail, XWIN-NMR		Version 3.5
$$ ##JCAMPDX= 5.01
$$ ##ORIGIN= Bruker BioSpin GmbH
$$ ##OWNER= she
$$ F:/spectra/data/she/nmr/H-F/1/pdata/1/auditp.txt
$$ ##AUDIT TRAIL=  $$ (NUMBER, WHEN, WHO, WHERE, WHAT)
(   1,<2023-08-01 13:43:38.00 +0400>,<she>,<DPX200>,
      <created by zg, POWCHK disabled, PULCHK disabled
       configuration hash MD5:
       00 E9 B6 7A A2 85 ED C7 34 08 36 98 17 FE 4E 26
       data hash MD5: 16K
       57 AB 85 9B 86 2D AA 87 02 BF C9 1C 0D A7 F2 74>)
(   2,<2023-08-01 13:43:40.37 +0400>,<she>,<DPX200>,
      <Start of raw data processing
       efp BC_mod = 2 LB = 0.24 FT_mod = 6 PKNL = 1 PHC0 = -21042.61 PHC1 = 8.05272 SI = 16K 
       data hash MD5: 16K
       E6 8E 3C 1F 44 02 70 82 D3 6A C8 8C 9D 80 88 15>)
(   3,<2023-08-01 13:43:58.87 +0400>,<she>,<DPX200>,
      <pk PHC0 = -0.7729348 PHC1 = 5.6 
       data hash MD5: 16K
       3A 1E A7 8E B8 EB 1D 7D A6 F5 8D 34 1E D2 E1 9B>)
(   4,<2023-08-01 13:44:01.81 +0400>,<she>,<DPX200>,
      <abs ABSG = 5 
       data hash MD5: 16K
       FF B1 72 59 A6 41 99 72 3C C1 8E 36 14 83 99 E7>)
$$ ##END=
$$ 
$$ hash MD5
$$ 0C 45 73 A1 33 7C 83 0A 0B 53 1B 47 75 57 35 19
##$RELAX= 
##$RELAX= 
##$RELAX= 
##$RELAX= 
##$RELAX= 
##$RELAX= 
$$ Bruker specific parameters
$$ --------------------------
##$DU= <F:/spectra>
##$EXPNO= 1
##$NAME= <H-F>
##$PROCNO= 1
##$TYPE= <nmr>
##$USER= <she>
##$AMP= (0..31)
100 100 100 100 100 100 100 100 100 100 100 100 100 100 100 100 100 100 
100 100 100 100 100 100 100 100 100 100 100 100 100 100 
##$AQSEQ= 0
##$AQ_mod= 1
##$AUNM= <au_zg>
##$AUTOPOS= <>
##$BF1= 200.13
##$BF2= 200.13
##$BF3= 200.13
##$BF4= 200.13
##$BF5= 200.13
##$BF6= 200.13
##$BF7= 200.13
##$BF8= 200.13
##$BYTORDA= 1
##$CFDGTYP= 0
##$CFRGTYP= 5
##$CHEMSTR= <none>
##$CNST= (0..31)
1 1 145 1 1 1 1 1 1 1 1 1 1 1 1 1 1 1 1 1 1 1 1 1 1 1 1 1 1 1 1 1 
##$CPDPRG= <>
##$CPDPRG1= <>
##$CPDPRG2= <>
##$CPDPRG3= <>
##$CPDPRG4= <mlev>
##$CPDPRG5= <mlev>
##$CPDPRG6= <mlev>
##$CPDPRG7= <mlev>
##$CPDPRG8= <mlev>
##$CPDPRGB= <>
##$CPDPRGT= <>
##$D= (0..31)
0 1.2 0 0 0 0 0 0 0 0.06 0 0.03 0 0 0 0 0.0002 0 0 0 0 0 0 0 0 0 0 0 0 
0 0 0 
##$DATE= 1690883017
##$DBL= (0..7)
120 120 120 120 120 120 120 120 
##$DBP= (0..7)
150 150 150 150 150 150 150 150 
##$DBP07= 0
##$DBPNAM0= <>
##$DBPNAM1= <>
##$DBPNAM2= <>
##$DBPNAM3= <>
##$DBPNAM4= <>
$$ [...]
##$SUBNAM3= <"">
##$SUBNAM4= <"">
##$SUBNAM5= <"">
##$SUBNAM6= <"">
##$SUBNAM7= <"">
##$SUBNAM8= <"">
##$SUBNAM9= <"">
##$SW= 18.05172834244
##$SWIBOX= (0..15)
0 0 2 0 0 0 0 0 0 0 0 0 0 0 0 0 
##$SW_h= 3612.71676300578
##$TD= 16384
##$TD0= 1
##$TE= 0
##$TE2= 300
##$TE3= 300
##$TEG= 300
##$TL= (0..7)
0 120 120 120 120 120 120 120 
##$TP= (0..7)
150 150 150 150 150 150 150 150 
##$TP07= 0
##$TPNAME0= <>
##$TPNAME1= <>
##$TPNAME2= <>
##$TPNAME3= <>
##$TPNAME4= <>
##$TPNAME5= <>
##$TPNAME6= <>
##$TPNAME7= <>
##$TPOAL= (0..7)
0.5 0.5 0.5 0.5 0.5 0.5 0.5 0.5 
##$TPOFFS= (0..7)
0 0 0 0 0 0 0 0 
##$TUNHIN= 0
##$TUNHOUT= 0
##$TUNXOUT= 0
##$USERA1= <user>
##$USERA2= <user>
##$USERA3= <user>
##$USERA4= <user>
##$USERA5= <user>
##$V9= 5
##$VALIST= <valist>
##$VCLIST= <CCCCCCCCCCCCCCC>
##$VD= 0
##$VDLIST= <DDDDDDDDDDDDDDD>
##$VPLIST= <PPPPPPPPPPPPPPP>
##$VTLIST= <TTTTTTTTTTTTTTT>
##$WBST= 1024
##$WBSW= 4
##$XGAIN= (0..3)
0 0 0 0 
##$XL= 0
##$YL= 0
##$YMAX_a= 543053
##$YMIN_a= -472652
##$ZGOPTNS= <>
##$ZL1= 120
##$ZL2= 120
##$ZL3= 120
##$ZL4= 120
##$ABSF1= 15.75571
##$ABSF2= -2.29614
##$ABSG= 5
##$ABSL= 3
##$ALPHA= 0
##$AQORDER= 0
##$ASSFAC= 0
##$ASSFACI= 0
##$ASSFACX= 0
##$ASSWID= 0
##$AUNMP= <proc_1d>
##$AZFE= 0.1
##$AZFW= 0.1
##$BCFW= 0
##$BC_mod= 2
##$BYTORDP= 0
##$COROFFS= 0
##$CY= -3
##$DATMOD= 1
##$DC= 0
##$DFILT= <>
##$DTYPP= 0
##$F1P= 0
##$F2P= 0
##$FCOR= 1
##$FTSIZE= 16384
##$FT_mod= 6
##$GAMMA= 0
##$GB= 0
##$INTBC= 1
##$INTSCL= 3.70164e-10
##$ISEN= 128
##$LB= 0.24
##$LEV0= 0
##$LPBIN= 0
##$MAXI= 10000
##$MC2= 0
##$MEAN= 0
##$ME_mod= 0
##$MI= 1.114404
##$NCOEF= 0
##$NC_proc= -7
##$NLEV= 6
##$NOISF1= 3.799351
##$NOISF2= 2.8
##$NSP= 0
##$NTH_PI= 0
##$NZP= 0
##$OFFSET= 15.72485
##$PC= 1
##$PHC0= -21043.38
##$PHC1= 13.65272
##$PH_mod= 1
##$PKNL= yes
##$PPARMOD= 0
##$PSCAL= 0
##$PSIGN= 0
##$REVERSE= no
##$SF= 200.130009343534
##$SI= 16384
##$SIGF1= 3
##$SIGF2= 2
##$SINO= 5.538805
##$SIOLD= 16384
##$SREGLST= <1H.CDCl3>
##$SSB= 0
##$STSI= 16384
##$STSR= 0
##$SW_p= 3612.71676300578
##$SYMM= 0
##$S_DEV= 0
##$TDeff= 16384
##$TDoff= 0
##$TI= <>
##$TILT= no
##$TM1= 0
##$TM2= 0
##$TOPLEV= 0
##$USERP1= <user>
##$USERP2= <user>
##$USERP3= <user>
##$USERP4= <user>
##$USERP5= <user>
##$WDW= 1
##$XDIM= 16384
##$YMAX_p= 407371922
##$YMIN_p= -709546
$$ End of Bruker specific parameters
$$ ---------------------------------
##NTUPLES= NMR SPECTRUM
##VAR_NAME=  FREQUENCY,     SPECTRUM/REAL,   SPECTRUM/IMAG
##SYMBOL=    X,             R,               I
##VAR_TYPE=  INDEPENDENT,   DEPENDENT,       DEPENDENT
##VAR_FORM=  AFFN,          ASDF,            ASDF
##VAR_DIM=   16384,         16384,           16384
##UNITS=     HZ,            ARBITRARY UNITS, ARBITRARY UNITS
##FACTOR=    0.220516191357247, 1,           1
##FIRST=     3147.01431757234, 0,            0
##LAST=      -465.702445433445, 0,           0
##MIN=       -465.702445433445, -709546,     0
##MAX=       3147.01431757234, 407371922,    0
$$ Real data points
##PAGE= N=1
##DATA TABLE= (X++(R..R)), XYDATA
$$ [...]
5553A8556340N4702k7321J08661r8386L4265N1505Q0800p8854J15906j36977P2473
$$ 18556340 18611042 18583721 18692382 18593996 18628261 18679766 18760566 18681712 18797618 18660641 18733114
5542A8733114j38355j03570K19581o0078J94519J95185J49845o8354m2978J24596
$$ 18733114 18594759 18491189 18710770 18650692 18845211 19040396 19190241 19121887 19078909 19203505
5532A9203505K91999Q5447L40404J26003J24054j08612m8691L8753r7449j1061
$$ 19203505 19495504 19580951 19921355 20047358 20171412 20062800 20014109 20052862 19955413 19944352
5522A9944352n5660l38071L4153O4845Q5169k6248K59601J7900O341J08352j19378
$$ 19944352 19888692 19550621 19584774 19649619 19734788 19708540 19968141 19986041 19992382 20100734 19981356
5511A9981356K03845p3020J06131J52060J7887l6383N5455K79271J57503k28591
$$ 19981356 20185201 20112181 20218312 20370372 20388259 20351876 20407331 20686602 20844105 20615514
5501B0615514j7101k03968p8356J00543J6548J32631k9726j48665j03151k0209
$$ 20615514 20598413 20394445 20316089 20416632 20433180 20565811 20536085 20387420 20284269 20264060
5491B0264060O4949j49067k03429K3761j05890J72228J93183M0473J46269J57321
$$ 20264060 20329009 20179942 19976513 20000274 19894384 20066612 20259795 20300268 20446537 20603858
5481B0603858O0561O174K8141P2512K2695q4047J73689O7358j09381j34795N8795
$$ 20603858 20664419 20670593 20698734 20771246 20793941 20709894 20883583 20950941 20841560 20706765 20765560
5470B0765560k08821L1356K75027J87159j8817k9797L0304J86124L22830K51058
$$ 20765560 20556739 20588095 20863122 21050281 21031464 21001667 21031971 21218095 21540925 21791983
5460B1791983j00744j85074O9870j87060k86363l9533J50836J378N4659J60932
$$ 21791983 21691239 21506165 21576035 21388975 21102612 21063079 21213915 21215293 21269952 21430884
5450B1430884L15750K64662K907K91202K18222o2707j92500l08025o9008J08988
$$ 21430884 21746634 22011296 22014203 22305405 22523627 22460920 22268420 21960395 21891387 22000375
5440B2000375J16086Q8443o5718L38280n7965L11945N5653N1823k09041k16992
$$ 22000375 22116461 22204904 22139186 22477466 22419501 22731446 22787099 22838922 22629881 22412889
5430B2412889p3029r6417k80082l67922J77893J11370m1591J24899O2006J01867
$$ 22412889 22339860 22243443 21963361 21595439 21773332 21884702 21843111 21968010 22030016 22131883
5420B2131883K04081L10201M06629K51864K35383k7539p6756k48326J06106j72547
$$ 22131883 22335964 22646165 23052794 23304658 23540041 23512502 23435746 23187420 23293526 23120979
5410B3120979j53327J29068K3699j54702k01438p4687j1056K14499J04247j7162
$$ 23120979 22967652 23096720 23120419 22965717 22764279 22689592 22678536 22893035 22997282 22980120
5400B2980120k92406l3493q9983m84858m52684l96386m26143m34372k24677k38884
$$ 22980120 22687714 22654221 22564238 22079380 21626696 21230310 20804167 20369795 20145118 19906234
5390A9906234k39531Q2760j30562L5001l2562j20098n6534j53890J51197M2286
$$ 19906234 19666703 19749463 19618901 19653902 19621340 19501242 19444708 19290818 19442015 19484301
5380A9484301P7848N5441J45574J04988J07074P7799M14001L73067L19324O4808
$$ 19484301 19562149 19617590 19763164 19868152 19975226 20053025 20467026 20840093 21159417 21224225
5370B1224225J74516M04815M31985M99215K64109M11804L76897P4066J14017K42405
$$ 21224225 21398741 21803556 22235541 22734756 22998865 23410669 23787566 23861632 23975649 24218054
5360B4218054P68965N68162N58502M33268J40500k03602m44083k76835l40891
$$ 24218054 24987019 25555181 26113683 26546951 26687451 26483849 26039766 25762931 25422040
5351B5422040l24487m20825J46082K04381K18895P14812M31456P17578R01200
$$ 25422040 25097553 24676728 24822810 25027191 25246086 25960898 26392354 27109932 28011132
5342B8011132J091707Q86494P52811Q88593R21464O62473N48828J77575j45372
$$ 28011132 29102839 29989333 30742144 31630737 32552201 33214674 33763502 33941077 33795705
5333C3795705j20607m58167l56542o34837j186323q08712p41797p02086l65267
$$ 33795705 33675098 33216931 32860389 32225552 31039229 30230517 29488720 28786634 28421367
5324B8421367O7355O9018L34404M81670O42401N38993M51594J38679N93667L61850
$$ 28421367 28488722 28557740 28892144 29373814 30016215 30555208 31006802 31145481 31739148 32100998
5314C2100998O00418N97406K14946n9070p2822k08515J29087M72720N50032L99492
$$ 32100998 32701416 33298822 33513768 33454698 33381876 33173361 33302448 33775168 34325200 34724692
5304C4724692r3930k27037r30866j180031j440915j521677j711621j568593j062355
$$ 34724692 34630762 34403725 33472859 32292828 30851913 29330236 27618615 26050022 24987667
5295B4987667j000071r71935r03107m33384k08860l70654j54429l78024k53400
$$ 24987667 23987596 23015661 22112554 21679170 21470310 21099656 20945227 20567203 20313803
5286B0313803j95908J49195j36556l61441m6926K25177j40568O2126j41462L15416
$$ 20313803 20117895 20267090 20130534 19769093 19722167 19947344 19806776 19868902 19727440 20042856
5276B0042856J80427L333J11759O5866j17131m96706p16134k86232k44691k86700
$$ 20042856 20223283 20226616 20338375 20404241 20287110 19790404 19074270 18788038 18543347 18256647
5266A8256647k89052j04142m92705k46579l18770l78139k56912j99254j32167
$$ 18256647 17967595 17863453 17370748 17124169 16805399 16427260 16170348 15971094 15838927
5257A5838927m1780n6150J95769J66853k70484j05074J75255j01361j68015J15288
$$ 15838927 15797147 15740997 15936766 16103619 15833135 15728061 15903316 15801955 15633940 15749228
5247A5749228j9486l71870p5872j55298k5485j95948l19217m8921K16810K56183
$$ 15749228 15729742 15357872 15282000 15126702 15101217 14905269 14586052 14537131 14753941 15010124
5237A5010124L05544L20296j05920J39103L99552N38436M03293M13998K53919
$$ 15010124 15315668 15635964 15530044 15669147 16068699 16607135 17010428 17424426 17678345
5228A7678345N26967M68533M50044K90317k10147k19005l01181l47793l91410
$$ 17678345 18205312 18673845 19123889 19414206 19204059 18985054 18683873 18336080 17944670
5219A7944670n55816k08954m45969l77048k37168k57748J73502K49635j03439
$$ 17944670 17388854 17179900 16733931 16356883 16119715 15861967 16035469 16285104 16181665
5210A6181665J08706r243J05295J90472L8595M0077K43118J19988j29941K06971
$$ 16181665 16290371 16281128 16386423 16576895 16615490 16655567 16898685 17018673 16888732 17095703
5200A7095703j1838M3671P669Q0367M73988K62728L44148J80148k3412m24301
$$ 17095703 17083865 17127536 17135205 17215572 17689560 17952288 18296436 18476584 18453172 18028871
5190A8028871l52181j64641l79875m63658p0668J6797J068k35724k35346k3637
$$ 18028871 17676690 17512049 17132174 16668516 16597848 16614645 16615713 16379989 16144643 16121006
5180A6121006j27760l341J15826L64908J55798P8244J37735K07213R1868R6406
$$ 16121006 15993246 15989905 16105731 16470639 16626437 16704681 16842416 17049629 17141497 17237903
5170A7237903O0813K4815K04111K47794L72399M14049M72115L06703N41645M44848
$$ 17237903 17298716 17323531 17527642 17775436 18147835 18561884 19033999 19340702 19882347 20327195
5160B0327195M01422K00202L9246k15269k78595n05798l23870j99706o0309k66003
$$ 20327195 20728617 20928819 20968065 20752796 20474201 19968403 19644533 19444827 19384518 19118515
5150A9118515k09734j15071J13476L59932K30594K37092M54060K86696L57147
$$ 19118515 18908781 18793710 18907186 19267118 19497712 19734804 20188864 20475560 20832707
5141B0832707O26861M18843L62894J78843K66549J78933J27822M8236N3927J4120
$$ 20832707 21459568 21878411 22241305 22420148 22686697 22865630 22993452 23041688 23095615 23109735
5131B3109735J63106R5003l25130j82914k73568o10693n06180n69785l44708m36600
$$ 23109735 23272841 23367844 23042714 22859800 22586232 21975539 21469359 20899574 20554866 20118266
5121B0118266o63250m45371o58282n94001m90030n96806m22391j91930k59759
$$ 20118266 19455016 19009645 18351363 17757362 17267332 16670526 16248135 16056205 15796446
5112A5796446l94667j44012k33713j90732l88126l32598l72950k4554l47100l24899
$$ 15796446 15401779 15257767 15024054 14833322 14445196 14112598 13739648 13715094 13367994 13043095
5102A3043095k28779j79098k78836k22848q7500l06630k08398l99578m00761K6965
$$ 13043095 12814316 12635218 12356382 12133534 12046034 11739404 11531006 11131428 10730667 10757632
5092A0757632L7785k98525j22162P7771L8817l51345j57684J09179j09547l5284
$$ 10757632 10795417 10496892 10374730 10452501 10491318 10139973 9982289 10091468 9981921 9946637
5082I946637O8907j22380j31020r1090K7948j68775m0871J78234N061j7423j08337
$$ 9946637 10015544 9893164 9762144 9671054 9699002 9530227 9489356 9667590 9672651 9655228 9546891
5071I546891j18946j67083m6795q9345j03903j09547J915R462j11285N8914J540
$$ 9546891 9427945 9260862 9214067 9124722 9020819 8911272 8913187 8922649 8811364 8870278 8871818
5060H871818M3765p4672J06565N125o9668n3616j05719n3790l38151L3523J39946
$$ 8871818 8915583 8840911 8947476 8952601 8882933 8829317 8723598 8669808 8331657 8365180 8505126
5049H505126m0721K12686r3049j32608j31606q4970l1552l5449J54997O2378n0951
$$ 8505126 8464405 8677091 8584042 8451434 8319828 8234858 8203306 8167857 8322854 8385232 8334281
5038H334281k89186N9609P1424m8096j78488Q3463j36538O576J55733j88683K5879
$$ 8334281 8045095 8104704 8176128 8128032 7949544 8033007 7896469 7903045 8058778 7870095 7895974
5027G895974L0489P4764Q9443j36828k41947J07331P1362j28716m0439o8663N5293
$$ 7895974 7926463 8001227 8090670 7953842 7711895 7819226 7890588 7761872 7721433 7652770 7708063
5016G708063K78848j16368k92056J55634K81798L6246L3118j05348o1679j48096
$$ 7708063 7986911 7870543 7578487 7734121 8015919 8052165 8085283 7979935 7918256 7770160
5006G770160k3559K61863j2340r2891L2645p1010o4239M3035J2921M3571Q3692
$$ 7770160 7746601 8008464 7996124 7903233 7935878 7864868 7800629 7843664 7856585 7900156 7983848
4995G983848j15460l3244J75078R3902o2698q9305m6755L0821k6239J34139K80163
$$ 7983848 7868388 7835144 8010222 8104124 8041426 7952121 7905366 7936187 7909948 8044087 8324250
4984H324250r0325r9456M7717J50774q1279l4765J7184o8825J84J22403R5163
$$ 8324250 8233925 8134469 8182186 8332960 8251681 8216916 8234100 8165275 8165459 8287862 8383025
4973H383025L2736n5080J03508R8943P3405M1904k18899R6058K09576k4107K14963
$$ 8383025 8415761 8360681 8464189 8563132 8636537 8678441 8459542 8555600 8765176 8741069 8956032
4962H956032N3204k81525j34290j04985K71957K99904J52044O7927j20945o2658
$$ 8956032 9009236 8727711 8593421 8488436 8760393 9060297 9212341 9280268 9159323 9096665
4952I096665k02052q4779L4272J50704O2665m512K24532J79894P4930O1503m3786
$$ 9096665 8894613 8809834 8844106 8994810 9057475 9052963 9277495 9457389 9532319 9593822 9550036
4941I550036J43195J96384j53180j08853L7682K03522j22888J71236J98179J87589
$$ 9550036 9693231 9889615 9736435 9627582 9665264 9868786 9745898 9917134 10115313 10302902
4931A0302902o5012j24243J1230J20464J48859J42145j23544O8506K9479n4434
$$ 10302902 10237890 10113647 10124877 10245341 10394200 10536345 10412801 10481307 10510786 10456352
4921A0456352J25791j039J36171j01102k1784J21490L6673m5277J16987J69173
$$ 10456352 10582143 10581104 10717275 10616173 10594389 10715879 10752552 10707275 10824262 10993435
4911A0993435K8590j55674R3466J22601J91545Q0370L0426Q9953J4992p709O1756
$$ 10993435 11022025 10866351 10959817 11082418 11273963 11354333 11384759 11474712 11489704 11481995 11543751
4900A1543751J46427K7242P810J30467J33401J39431J66088p5889j86526M31412
$$ 11543751 11690178 11717420 11725230 11855697 11989098 12128529 12294617 12218728 12032202 12463614
4890A2463614J72128J51177J1385K41637J80065R9868L03911J01814J68326q5507
$$ 12463614 12635742 12786919 12798304 13039941 13220006 13319874 13623785 13725599 13893925 13808418
4880A3808418K30072J28604P5191J10411K9688J24110O4116N4005K8478K18277
$$ 13808418 14038490 14167094 14242285 14352696 14382384 14506494 14570610 14624615 14653093 14871370
4870A4871370J83826N1386j02795N6446m1432L3975K59773K90581K23671j46557
$$ 14871370 15055196 15106582 15003787 15060233 15018801 15052776 15312549 15603130 15826801 15680244
4860A5680244K99602J27264p0167N6540R2091J41940L77462K11795r3453J72791
$$ 15680244 15979846 16107110 16036943 16093483 16185574 16327514 16704976 16916771 16823318 16996109
4850A6996109L87545M8248K31886K96165K09580Q2196M2487O2571L42028J00315
$$ 16996109 17383654 17431902 17663788 17959953 18169533 18251729 18294216 18356787 18698815 18799130
4840A8799130K65259l0609L10239M15772J38810J10229R8770K48676j9125L17361
$$ 18799130 19064389 19033780 19344019 19759791 19898601 20008830 20107600 20356276 20337151 20654512
4830B0654512N6477K80910K02940J71840L51790L7243J69109K20888K26344N05076
$$ 20654512 20710989 20991899 21194839 21366679 21718469 21755712 21924821 22145709 22372053 22877129
4820B2877129L55836L63479K76460L86838K49524M28102L80936L10356M31695
$$ 22877129 23232965 23596444 23872904 24259742 24509266 24937368 25318304 25628660 26060355
4811B6060355N03886K11501K10279P76570O07370M99599M73671P12814P32436
$$ 26060355 26564241 26775742 26986021 27762591 28369961 28869560 29343231 30056045 30788481
4802C0788481R30692O96037M69885O96771Q59139Q54648J033777R37410J049842
$$ 30788481 31719173 32415210 32885095 33581866 34441005 35295653 36329430 37266840 38316682
4793C8316682R73382J059818J230103J125432R64740Q92555J110762J374534J245608
$$ 38316682 39290064 40349882 41579985 42705417 43670157 44562712 45673474 47048008 48293616
4784D8293616J581073J611860J859890K430487K464972L101556L977366M863485
$$ 48293616 49874689 51486549 53346439 55776926 58241898 61343454 65320820 70184305
4776G0184305O132018Q580014R762505Q573118L804449j412649o926262r619500
$$ 70184305 76316323 84896337 94658842 103231960 107036409 105623760 98697498 89077998
4768H9077998q393870o084685l898185k162918j424281o40197l73927l90147l27129
$$ 89077998 80684128 74599443 70701258 68538340 67114059 66473862 66099935 65709788 65382659
4759F5382659l91052j58334o65653o82473m79074l96539k21402j05699J57056
$$ 65382659 64991607 64833273 64167620 63485147 63006073 62609534 62388132 62282433 62439489
4750F2439489k6116O7227K37441m0296o6496l47176k39956m82678o78761k12344
$$ 62439489 62413373 62480600 62718041 62677745 62611249 62264073 62024117 61541439 60862678 60650334
4740F0650334l79928j6202J45987J86304L10939M14497O31050P02970M52119L89411
$$ 60650334 60270406 60254204 60400191 60586495 60897434 61311931 61942981 62645951 63098070 63487481
4730F3487481K07839K0062L39628Q64558P25150J053183J661691K142533K992840
$$ 63487481 63695320 63715382 64055010 64919568 65644718 66697901 68359592 70502125 73494965
4721G3494965L969540N369271O888816Q232837O392455J868012q94032m212535
$$ 73494965 77464505 82833776 89722592 97955429 104347884 106215896 105321864 101109329
4713A01109329q532011r607213q366727o101815m414619l034491k434518k247083
$$ 101109329 92577318 82970105 74603378 68501563 64086944 61052453 58617935 56370852
4705E6370852j713475j171867j073684r70441n34259n62284m00226l54898m56260
$$ 56370852 54657377 53485510 52411826 51441385 50907126 50344842 49944616 49589718 49133458
4696D9133458l70579j61648l4608q6214k00439k23104j34066k61004J4328j85432
$$ 49133458 48762879 48601231 48566623 48480409 48279970 48056866 47922800 47661796 47676124 47490692
4686D7490692j86318k21169j15163j29977Q8862P8193M76138N21900M84156M55472
$$ 47490692 47304374 47083205 46968042 46838065 46926927 47005120 47481258 48003158 48487314 48942786
4676D8942786J8055m08392m16996n95468m96429m92568j56995j34249j30341J16578
$$ 48942786 48960841 48552449 48135453 47539985 47043556 46550988 46393993 46259744 46129403 46245981
4666D6245981K09293J41365K40111N76200N43797M70814N18394J99983K40977
$$ 46245981 46455274 46596639 46836750 47412950 47956747 48427561 48945955 49145938 49386915
4657D9386915J43630j327j88719j29554J65470Q0810K84805M5532Q5353L26709
$$ 49386915 49530545 49529218 49340499 49210945 49376415 49457225 49742030 49787562 49872915 50199624
4647E0199624L47824K78747J93892L32136N44007M08119M11153M58571M51757
$$ 50199624 50547448 50826195 51020087 51352223 51896230 52304349 52715502 53174073 53625830
4638E3625830L80150M45641O22315M35885L83055N44874N94500N15723P25443
$$ 53625830 54005980 54451621 55073936 55509821 55892876 56437750 57032250 57547973 58273416
4629E8273416P31102O83598R71624J087401J000941P20500R44326Q47600Q14298
$$ 58273416 59004518 59688116 60659740 61747141 62748082 63468582 64412908 65260508 66074806
4620F6074806Q33770P48701N67169M94508P43795N96268N89087Q41190N19366
$$ 66074806 66908576 67657277 68224446 68718954 69462749 70059017 70648104 71489294 72008660
4611G2008660O76074L38731L92222N33121P19180O58787M83650L86135O76023
$$ 72008660 72684734 73023465 73415687 73948808 74667988 75326775 75810425 76196560 76872583
4602G6872583L10888O43928N78259L62969N79493L66991O58626P08839Q14752
$$ 76872583 77183471 77827399 78405658 78768627 79348120 79715111 80373737 81082576 81897328
4593H1897328O07013Q87179P32040M65762O14654M19313N02342O33889N23025
$$ 81897328 82504341 83391520 84123560 84589322 85203976 85623289 86125631 86759520 87282545
4584H7282545M05853J48711J34051m4723k48611r2557q0042o0539q7477J33033
$$ 87282545 87688398 87837109 87971160 87926437 87677826 87585269 87505227 87444688 87357211 87490244
4574H7490244K11454J39565L838L37888M82721P04239J126790P99952P14526O86275
$$ 87490244 87701698 87841263 87845101 88182989 88665710 89369949 90496739 91296691 92011217 92697492
4564I2697492R27766R62558J052353J061946J457292J906787J903456K418341
$$ 92697492 93625258 94587816 95640169 96702115 98159407 100066194 101969650 104387991
4556A04387991K569550K868391K878465K532774K311179K294720J534331P72153
$$ 104387991 106957541 109825932 112704397 115237171 117548350 119843070 121377401 122149554
4548A22149554J17526L50861J3843m09304n38163q45363j283575j520077j270951
$$ 122149554 122267080 122617941 122631784 122222480 121684317 120838954 119555379 118035302 116764351
4539A16764351p42795r14721n13732l42159m32964l21392k66347k90681m77123
$$ 116764351 116021556 115106835 114593103 114250944 113817980 113496588 113230241 112939560 112462437
4530A12462437k63319k18486L55810N21360O18378Q75712J611026J417148J751029
$$ 112462437 112199118 111980632 112336442 112857802 113476180 114351892 115962918 117380066 119131095
4521A19131095J889365J798570J941728J079093K5719o34270j665332j951230
$$ 119131095 121020460 122819030 124760758 125839851 125865570 125231300 123565968 121614738
4513A21614738j907441k080531k349395k646879l126396k981756k767956k145731
$$ 121614738 119707297 117626766 115277371 112630492 109504096 106522340 103754384 101608653
4505A01608653j876425j556041j405065j360018r56469p70987j000530j212891
$$ 101608653 99732228 98176187 96771122 95411104 94454635 93683648 92683118 91470227
4497I1470227j491411j318700j039778p39820n45211o16050n72779n36583n38795
$$ 91470227 89978816 88660116 87620338 86880518 86335307 85719257 85146478 84609895 84071100
4488H4071100k10580j35908j55156n52902o86556j097732j225162j360049j327346
$$ 84071100 83860520 83724612 83569456 83016554 82329998 81232266 80007104 78647055 77319709
4479G7319709j448422j420153j259758j519052r92618j058830j043439o23520
$$ 77319709 75871287 74451134 73191376 71672324 70679706 69620876 68577437 67953917
4471F7953917o50235o24445k92577k18349l03911k47301J29161j7869k99719l94313
$$ 67953917 67303682 66679237 66386660 66168311 65864400 65617099 65746260 65728391 65428672 65034359
4461F5034359l36249p12497m01545n28828l86892l63113l87128m36030m29957
$$ 65034359 64698110 63985613 63584068 63055240 62668348 62305235 61918107 61482077 61052120
4452F1052120l53098k9768l27142p40011l91722l49131l46038l68312k83133l54457
$$ 61052120 60699022 60669254 60342112 59602101 59210379 58861248 58515210 58146898 57863765 57509308
4442E7509308L420j86922j94241j27882Q4697j40516j5334o9496k24257l6962
$$ 57509308 57512728 57325806 57131565 57003683 57088380 56947864 56932530 56863034 56638777 56601815
4432E6601815q8446K39451r4423j54236m6627M1875j83974p193L4721M8658m6420
$$ 56601815 56513369 56752820 56658397 56504161 56457534 56499409 56315435 56308242 56342963 56391621 56345201
4421E6345201R1630J32669L46057J70081J3195j89609J90844K84232Q6795m5841
$$ 56345201 56436831 56569500 56915557 57085638 57098833 56909224 57100068 57384300 57471095 57425254
4411E7425254R3619K30185K85151P3853K71344K60557m8515J95246j86872Q4146
$$ 57425254 57518873 57749058 58034209 58108062 58379406 58639963 58591448 58786694 58599822 58683968
4401E8683968n4319j54120l37771l99984o5842j51726m7818K8429j23320K74755
$$ 58683968 58629649 58475529 58137758 57737774 57671932 57520206 57472388 57500817 57377497 57652252
4391E7652252L87216M13889M25336L29911L32023J29650K46846L20929R7484O2400
$$ 57652252 58039468 58453357 58878693 59208604 59540627 59670277 59917123 60238052 60335536 60397936
4381F0397936K1768Q9577N10529K23079j5950J21602K39871K73935K28988N63499
$$ 60397936 60419704 60509281 61019810 61242889 61226939 61348541 61588412 61862347 62091335 62654834
4371F2654834K82880M9235J82206K4804J52466L25692L21165L73181M76275P94154
$$ 62654834 62937714 62986949 63169155 63193959 63346425 63672117 63993282 64366463 64842738 65636892
4361F5636892O67793P89703P98715R90114P84660J274588J056362Q85911J022004
$$ 65636892 66304685 67094388 67893103 68883217 69667877 70942465 71998827 72884738 73906742
4352G3906742Q87993Q50346N77842N81031L52588K62016P6360K49866J04881J46142
$$ 73906742 74794735 75645081 76222923 76803954 77156542 77418558 77494918 77744784 77849665 77995807
4342G7995807K21473K09384P09288M83909O75650R34048Q18029J077710J141830
$$ 77995807 78217280 78426664 79135952 79619861 80295511 81229559 82047588 83125298 84267128
4333H4267128R06066J103119J135253J071907J105270J034651J041866J020496
$$ 84267128 85173194 86276313 87411566 88483473 89588743 90623394 91665260 92685756
4325I2685756J264393J095223P90441Q68174J087186J034843J049994J311120
$$ 92685756 93950149 95045372 95835813 96703987 97791173 98826016 99876010 101187130
4317A01187130J189429R04613J111882R83764Q40838Q91238Q39436J133012J064045
$$ 101187130 102376559 103281172 104393054 105376818 106217656 107108894 107948330 109081342 110145387
4308A10145387J050602J496184J501802J569757J788049J986490K454958K991914
$$ 110145387 111195989 112692173 114193975 115763732 117551781 119538271 121993229 124985143
4300A24985143L103822L427683L837136L946337M126751M416064M896243N881256
$$ 124985143 128088965 131516648 135353784 139300121 143426872 147842936 152739179 158620435
4292A58620435O836551Q014168Q971188R132595Q901585P458298N697185L267511
$$ 158620435 165456986 173471154 182442342 191574937 200476522 207934820 213632005 216899516
4284B16899516M85591k217012m739423o365476p500214p881863p898263p635616
$$ 216899516 217385107 215168095 210428672 204063196 196562982 188681119 180782856 173147240
4276A73147240p266736o585811n782871m790748l908602l028250k309898j835348
$$ 173147240 165880504 159294693 153511822 148721074 144812472 141784222 139474324 137638976
4268A37638976r83900l29641J12325O87024J302248J925195K264383L069215L684728
$$ 137638976 136655076 136325435 136437760 137124784 138427032 140352227 142616610 145685825 149370553
4259A49370553L936269M409907N462344O298910O110284O092941N600583L799216
$$ 149370553 153306822 157716729 163179073 169477983 175588267 181681208 187281791 191081007
4251A91081007J525897j474441m044449o840809q662694r513249j0046269r573580
$$ 191081007 192606904 191132463 187088014 180247205 171584511 162071262 152024993 142451413
4243A42451413q417653p352382o739741n848966n194745m719129m241345m105969
$$ 142451413 134033760 126681378 119941637 114092671 108897926 104178797 99937452 95831483
4235I5831483l624962k987844k671932k414979k291722k317954k079430j991139
$$ 95831483 92206521 89218677 86546745 84131766 81840044 79522090 77442660 75451521
4227G5451521j998031j570663j702732j737874j305986j003817j227384j300953
$$ 75451521 73453490 71882827 70180095 68442221 67136235 66132418 64905034 63604081
4219F3604081j005147r76012r96412j120440r45951q33979j056036j066664p03563
$$ 63604081 62598934 61622922 60626510 59506070 58560119 57726140 56670104 55603440 54899877
4210E4899877o59249p33372q81139p99381m36633p13937l98745n54889n44806
$$ 54899877 54240628 53507256 52626117 51826736 51390103 50676166 50277421 49722532 49177726
4201D9177726o56271l59926k59936n65077o60288p97989n60133n22891o68874
$$ 49177726 48521455 48161529 47901593 47336516 46676228 45878239 45318106 44795215 44126341
4192D4126341m08669o03484n12522r6236j81170r7662j07979j91092q651r5732
$$ 44126341 43717672 43114188 42601666 42505430 42324260 42226598 42118619 41927527 41918876 41823144
4182D1823144O104k383K4813K52093K69579K52675J55096K81159Q076p0971L28433
$$ 41823144 41829248 41826865 41851678 42103771 42373350 42626025 42781121 43062280 43070356 42999385 43327818
4171D3327818k7896m5616K9518J83095L7195L46083O19749O94103R98963J120629
$$ 43327818 43299922 43254306 43283824 43466919 43504114 43850197 44469946 45164049 46163012 47283641
4161D7283641R63966Q94971Q80571K410r37046j251494j052341j128042r31798
$$ 47283641 48247607 49142578 50023149 50025559 49088513 47837019 46784678 45656636 44724838
4152D4724838m52874m95553j29852l05379n30047l28233j14305j4655j59168j95911
$$ 44724838 44271964 43776411 43646559 43341180 42811133 42482900 42368595 42353940 42194772 41998861
4142D1998861l38207l3331K09833Q9358j05816l01045k92463k79245k83792k57521
$$ 41998861 41660654 41627323 41837156 41926514 41820698 41519653 41227190 40947945 40664153 40406632
4132D0406632n06372k60911l21423j54419j96835n9745n130m1627L6081J059j81749
$$ 40406632 39900260 39639349 39317926 39163507 38966672 38906927 38901797 38860170 38896251 38897310 38715561
4121C8715561k31142j33282k89548j31601j73932n6226M1962j59401R6583J54882
$$ 38715561 38484419 38351137 38061589 37929988 37756056 37699830 37741792 37582391 37678974 37833856
4111C7833856N04584J83514J2145L10112J1532l63028k16792k25261m85010j94818
$$ 37833856 38338440 38521954 38534099 38844211 38855743 38492715 38275923 38050662 37565652 37370834
4101C7370834j90603K45890k0640k96712k137L5525J67158J23302j33887J44877
$$ 37370834 37180231 37426121 37405481 37108769 37106632 37142157 37309315 37432617 37298730 37443607
4091C7443607O0502L2167J2443m9426J34639J28380J05659J19608M93765M10416
$$ 37443607 37504109 37536276 37548719 37499293 37633932 37762312 37867971 37987579 38481344 38891760
4081C8891760N29489M77526J58030L43930M92611L91482L41740J61003M45080
$$ 38891760 39421249 39898775 40056805 40400735 40893346 41284828 41626568 41787571 42232651
4072D2232651L01605M92766J63889M68493M80207P64252O25517L73456O17640
$$ 42232651 42534256 43027022 43190911 43659404 44139611 44903863 45529380 45902836 46520476
4063D6520476O12524L76881K63597K16688L41188O83585n3931K39466N11715K05361
$$ 46520476 47133000 47509881 47773478 47990166 48331354 49014939 48961008 49200474 49712189 49917550
4053D9917550J86835K33733M09444K66608K98666J21332l0903K0453R070k79705
$$ 49917550 50104385 50338118 50747562 51014170 51312836 51434168 51403265 51423718 51432788 51153083
4043E1153083j66818J44621l34960j56554k89381k13049k69113k94858k14862
$$ 51153083 50986265 51130886 50795926 50639372 50349991 50136942 49867829 49572971 49358109
4034D9358109l86819m74918q00802n19124o43877o47967m57356p72043r85187
$$ 49358109 48971290 48496372 47695570 47176446 46532569 45884602 45427246 44655203 43670016
4025D3670016o52305o00605q27075o63861p33252p69387q72224p21313r09711
$$ 43670016 43017711 42417106 41590031 40926170 40192918 39423531 38551307 37829994 36920283
4016C6920283n93861o72418p50150o73731p36966n45931p15018r36567p80726
$$ 36920283 36326422 35654004 34903854 34230123 33493157 32947226 32232208 31295641 30514915
4007C0514915l55972n25681o64178n09425q74468p02058q42677o21269o12622
$$ 30514915 30158943 29633262 28969084 28459659 27585191 26883133 26040456 25419187 24806565
3998B4806565l67886n79982o52916o73421m59272m80087p67999n27857l89558
$$ 24806565 24438679 23858697 23205781 22532360 22073088 21593001 20825002 20297145 19907587
3989A9907587l30349k52781m53737j87166j18719o32679n19470n72986k40937
$$ 19907587 19577238 19324457 18870720 18683554 18564835 17932156 17412686 16839700 16598763
3980A6598763j27786k98434m55651k68056l19368l51180K7342r3820j69648m27642
$$ 16598763 16470977 16172543 15716892 15448836 15129468 14778288 14805630 14711810 14542162 14114520
3970A4114520j95437j36859k66912j25705j35097j46079j95062p3577k64282p9096
$$ 14114520 13919083 13782224 13515312 13389607 13254510 13108431 12913369 12839792 12575510 12496414
3960A2496414l8666r2641o6329k91899m13646j53250k17865k93947k13932k40222
$$ 12496414 12457748 12365107 12298778 12006879 11593233 11439983 11222118 10928171 10714239 10474017
3950A0474017j3252r6967k53478j28516o1854o9227j80212M5543L3812k08391
$$ 10474017 10460765 10363798 10110320 9981804 9919950 9850723 9670511 9716054 9749866 9541475
3940I541475l66616K4494L5033j57292o0579j28150j2139J14552j22972n6278
$$ 9541475 9174859 9199353 9234386 9077094 9016515 8888365 8876226 8990778 8867806 8811528
3930H811528j74827j95775j72032K47769P6806j24342l516j07252R7478j70405
$$ 8811528 8636701 8440926 8268894 8516663 8593469 8469127 8465611 8358359 8455837 8285432
3920H285432k01744j12421K35806m1224o4312r4953O8990j7592r0185j45194J0194
$$ 8285432 8083688 7971267 8207073 8165849 8101537 8006584 8075574 8057982 7967797 7822603 7832797
3909G832797r2126k6046K20007N8882L8417j08634Q978J1127l8769j13803r1765
$$ 7832797 7740671 7714625 7934632 7993514 8031931 7923297 7932275 7943402 7904633 7790830 7699065
3898G699065j50036j63314k76007m795K63444M0891j85770j10205r2386k3990
$$ 7699065 7549029 7385715 7109708 7104913 7368357 7409248 7223478 7113273 7020887 6996897
3888F996897m5842o1589M2062J24786j20298j1410J7830K18884j93811m2398J6959
$$ 6996897 6951055 6889466 6931528 7056314 6936016 6924606 6942436 7161320 6967509 6925111 6942070
3877F942070j18312j08218n3209J72375p7145j41038n2418k8079R5528K5481q4964
$$ 6942070 6823758 6715540 6662331 6834706 6757561 6616523 6564105 6536026 6631554 6657035 6572071
3866F572071p4362o3452J6272R6638j45076J13020j62515k41159J30033J19677
$$ 6572071 6497709 6434257 6450529 6547167 6402091 6515111 6352596 6111437 6241470 6361147
3856F361147J9903r3334k1181N3400j52822j04734O5533K41054J63749p3654L5082
$$ 6361147 6381050 6287716 6266535 6319935 6167113 6062379 6127912 6368966 6532715 6459061 6494143
3845F494143M4672n1903r5647N4438L4874N176j13996Q0896j22128L9489J14126
$$ 6494143 6538815 6486912 6391265 6445703 6480577 6485753 6371757 6452653 6330525 6370014 6484140
3834F484140K10950n5147q6471n4785J00086j11365j78430J05685k02056J5967
$$ 6484140 6695090 6639943 6553472 6498687 6598773 6487408 6308978 6414663 6212607 6228574
3824F228574K72759K16168J43221L9774j58317J21279L71245j07828o4154J31436
$$ 6228574 6501333 6717501 6860722 6900496 6742179 6863458 7234703 7126875 7062721 7194157
3814G194157j21289J31104L2953j42271J78506J97132r1733k8504Q2773J43536
$$ 7194157 7072868 7203972 7236925 7094654 7273160 7470292 7378559 7350055 7432828 7576364
3804G576364L0685k3871J39474J17495J22731l79198J18310J00246J54328J47938
$$ 7576364 7607049 7583178 7722652 7840147 7962878 7583680 7701990 7802236 7956564 8104502
3794H104502N1036K7947J24607j33109M084q6995P412L65972K02050J71636p4227
$$ 8104502 8155538 8183485 8308092 8174983 8179067 8092072 8099484 8465456 8667506 8839142 8764915
3783H764915J48208k3597J84972n1639J04807O5239J07322O6379j3117L34031
$$ 8764915 8913123 8889526 9074498 9022859 9127666 9192905 9300227 9366606 9353489 9687520
3773I687520Q1722J34632Q8159L89155O9579q3167J31589K8110K19634J77393
$$ 9687520 9769242 9903874 9992033 10381188 10450767 10367600 10499189 10527299 10746933 10924326
3763A0924326K19761K6924K6647L01263K09666p83J99460K47665J30639K15781
$$ 10924326 11144087 11171011 11197658 11498921 11708587 11707804 11907264 12154929 12285568 12501349
3753A2501349K73248J30038K72948p3961J01789J93974K21443L07729L46569K11094
$$ 12501349 12774597 12904635 13177583 13103622 13205411 13399385 13620828 13928557 14275126 14486220
3743A4486220J44748J38212J00632N1618K78312L04797P8588L38232J77799L59839
$$ 14486220 14630968 14769180 14869812 14921430 15199742 15504539 15583127 15921359 16099158 16458997
3733A6458997L14112j9794Q4273K86069M83376M74953K73149J72059K13004N33968
$$ 16458997 16773109 16753315 16837588 17123657 17607033 18081986 18355135 18527194 18740198 19274166
3723A9274166M62178L75535O12197O11014N2339L73132P11089M59256J28776K50072
$$ 19274166 19736344 20111879 20724076 21335090 21387429 21760561 22471650 22930906 23059682 23309754
3713B3309754N57165K40495N9151K16503L78568M86685J92434O70388P07055P05521
$$ 23309754 23866919 24107414 24166565 24383068 24761636 25248321 25440755 26111143 26818198 27523719
3703B7523719Q47250N76031R90627M99105M62583O70972M03566n9897p3584J34051
$$ 27523719 28370969 28947000 29937627 30436732 30899315 31570287 31973853 31913956 31840372 31974423
3693C1974423j75475k56713k96499p6161k64585k60895p9736j54718p4627J62021
$$ 31974423 31798948 31542235 31245736 31169575 30904990 30644095 30564359 30409641 30335014 30497035
3683C0497035j03397l00172k1129k7806l16137k18306l25468l81518l75599n11430
$$ 30497035 30393638 30093466 30072337 30044531 29728394 29510088 29184620 28803102 28427503 27916073
3673B7916073k85883k29272m58606m62665m59943m06286j09079j44802m0725r7520
$$ 27916073 27630190 27400918 26942312 26479647 26019704 25613418 25504339 25359537 25318812 25221292
3663B5221292j58733J84134K67483M9165J13498K5331n8247J21696k4500K5579
$$ 25221292 25062559 25246693 25514176 25563341 25676839 25702170 25643923 25765619 25741119 25766698
3653B5766698K01812J41124j3489K55613K85258l8891R4333K39404N3402k58630
$$ 25766698 25968510 26109634 26096145 26351758 26637016 26598125 26692458 26931862 26985264 26726634
3643B6726634Q2670k01210k97422j05964p7748l92386j39629m3990j07781j88715
$$ 26726634 26809304 26608094 26310672 26204708 26126960 25734574 25594945 25550955 25443174 25254459
3633B5254459k08902N1295j81805l7012J81982L9067k19573n9365l28825k28093
$$ 25254459 25045557 25096852 24915047 24878035 25060017 25099084 24879511 24820146 24491321 24263228
3623B4263228L2547k57207j83575l43993J06273k67340k50159r2256j63910J7547
$$ 24263228 24295775 24038568 23854993 23511000 23617273 23349933 23099774 23007518 22843608 22861155
3613B2861155K69551j4746P6420K18167m6462R9026J78444N2400M57411J92798
$$ 22861155 23130706 23115960 23192380 23410547 23364085 23463111 23641555 23693955 24151366 24344164
3603B4344164K35777L30156J75296K05510K96544J99996L41459J57295O7965L95177
$$ 24344164 24579941 24910097 25085393 25290903 25587447 25787443 26128902 26286197 26354162 26749339
3593B6749339K53242K89303L08960J96670J95098K54028K48285M30396O9215J36959
$$ 26749339 27002581 27291884 27600844 27797514 27992612 28246640 28494925 28925321 28994536 29131495
3583B9131495L93208L29704N2806O32708J69885K71026L37288K22570M58343L47604
$$ 29131495 29524703 29854407 29907213 30539921 30709806 30980832 31318120 31540690 31999033 32346637
3573C2346637L25572M43389L36185M26139K67474M68404M20225K17846O59531
$$ 32346637 32672209 33115598 33451783 33877922 34145396 34613800 35034025 35251871 35911402
3564C5911402N28073N37843O37557N54380O94321N00412Q93602Q60176J002347
$$ 35911402 36439475 36977318 37614875 38169255 38863576 39363988 40257590 41117766 42120113
3555D2120113R78013J279572J039206J199538J218486J176592J428438J427453
$$ 42120113 43098126 44377698 45416904 46616442 47834928 49011520 50439958 51867411
3547E1867411J337907J225854J249241J242021J230298J267731J080670J184306
$$ 51867411 53205318 54431172 55680413 56922434 58152732 59420463 60501133 61685439
3539F1685439J343197J121797J149021J186757J094600J154704J372019J012738
$$ 61685439 63028636 64150433 65299454 66486211 67580811 68735515 70107534 71120272
3531G1120272J172467J086269Q64171R77945Q49688O62793P17090P53775N17503
$$ 71120272 72292739 73379008 74243179 75221124 76070812 76733605 77450695 78204470 78721973
3522G8721973M45004M78946L53541P28304N12972P66167O70566M41984L63494
$$ 78721973 79166977 79645923 79999464 80727768 81240740 82006907 82677473 83119457 83482951
3513H3482951N16585J74016k1191j02228k99305j03788l41558l16035k2298K19948
$$ 83482951 83999536 84173552 84152361 84050133 83750828 83647040 83305482 82989447 82967149 83187097
3503H3187097L39286N88582R92666J381193J418979J584639J652347J879954J838211
$$ 83187097 83526383 84114965 85107631 86488824 87907803 89492442 91144789 93024743 94862954
3494I4862954J647538J696989J550367J575263J214359J055338L38584L58602
$$ 94862954 96510492 98207481 99757848 101333111 102547470 103602808 103941392 104299994
3486A04299994j29278q29055q75616j125957r47989j033020j041943j139241j220094
$$ 104299994 104170716 103341661 102466045 101340088 100392099 99359079 98317136 97177895 95957801
3477I5957801j134949r76154o69482n28526o40576l76685j12185k68527K3730
$$ 95957801 94822852 93846698 93177216 92648690 92008114 91631429 91519244 91250717 91274447
3468I1274447m5684L94414O18470M29749N23371Q04664N93541J22750M5190l16971
$$ 91274447 91228763 91623177 92241647 92671396 93194767 93999431 94592972 94715722 94760912 94443941
3458I4443941j58634m56263q80441j282931j161645j058374j114548j142979j410685
$$ 94443941 94285307 93829044 92948603 91665672 90504027 89445653 88331105 87188126 85777441
3449H5777441j256631p91297j092915r46116r19073q74699r84857j011201o44169
$$ 85777441 84520810 83729513 82636598 81690482 80771409 79896710 78911853 77900652 77256483
3440G7256483q34299r16462p32193r08086r28484p27875p74954q29548o77908
$$ 77256483 76422184 75505722 74773529 73865443 72936959 72209084 71434130 70604582 69926674
3431F9926674n37508j006952n89253p45834n07327m01617o74384p25719l57640
$$ 69926674 69389166 68382214 67792961 67047127 66539800 66138183 65463799 64738080 64380440
3422F4380440k96894l95970m00921l08125j64236n38579k23061j13017P7383J2840
$$ 64380440 64083546 63687576 63286655 62978530 62814294 62275715 62052654 61939637 62017020 62029860
3412F2029860k74820j27753k46248J04873n9572j30532j66358l6114J7922N164
$$ 62029860 61755040 61627287 61381039 61485912 61426340 61295808 61129450 61093336 61111258 61116422
3402F1116422J06464j39398J55622K04546K15656J26930L16177L42649J79454
$$ 61116422 61222886 61083488 61239110 61443656 61659312 61786242 62102419 62445068 62624522
3393F2624522L64607N84881K18486M39207M46633L08057M90646L08831L10265
$$ 62624522 62989129 63574010 63792496 64231703 64678336 64986393 65477039 65785870 66096135
3384F6096135L04030M25663L67432M07976L90569M77625O45380N94064O15345
$$ 66096135 66400165 66825828 67193260 67601236 67991805 68469430 69114810 69708874 70324219
3375G0324219P22015O74564Q17317R11581R65483R68199J163152J033955J222125
$$ 70324219 71046234 71720798 72538115 73449696 74415179 75383378 76546530 77580485 78802610
3366G8802610J394395J215120J391603J550531J475446J651834J491837J761860
$$ 78802610 80197005 81412125 82803728 84354259 85829705 87481539 88973376 90735236
3358I0735236J635212J362333J816902J660130K012335J730371K229729K268498
$$ 90735236 92370448 93732781 95549683 97209813 99222148 100952519 103182248 105450746
3350A05450746J804301K554586K716235K979378L197033L497245L819943M090977
$$ 105450746 107255047 109809633 112525868 115505246 118702279 122199524 126019467 130110444
3342A30110444M743193N052800N436805N581719N728145N858990N340351M789055
$$ 130110444 134853637 139906437 145343242 150924961 156653106 162512096 167852447 172641502
3334A72641502M229945L471613K784050J776517R14655L12140k9879m77421l04606
$$ 172641502 176871447 180343060 183127110 184903627 185818282 186130422 186100543 185623122 185318516
3325A85318516n0028J02234K71873N76154N71055L87385j50875l95730q30531
$$ 185318516 185268488 185370722 185642595 186218749 186789804 187177189 187026314 186630584 185800053
3316A85800053r87930j629212j956267j961618j771953j748451j089641n39532
$$ 185800053 184812123 183182911 181226644 179265026 177493073 175744622 174654981 174115449
3308A74115449k36203L35423N22075R07877J423940J776850J998194K221341K468693
$$ 174115449 173879246 174214669 174736744 175644621 177068561 178845411 180843605 183064946 185533639
3299A85533639K452785K492436K578358K499500K683667K807252K878530K936307
$$ 185533639 187986424 190478860 193057218 195556718 198240385 201047637 203926167 206862474
3291B06862474L256770L517135M016812L796343L865452L631266L642116L253220
$$ 206862474 210119244 213636379 217653191 221449534 225314986 228946252 232588368 235841588
3283B35841588K506027K157527J898570J240836J236960P54180O96909J135637
$$ 235841588 238347615 240505142 242403712 243644548 244881508 245635688 246332597 247468234
3275B47468234J409970J690620K015838K199342K449623K797482K169660J981889
$$ 247468234 248878204 250568824 252584662 254784004 257233627 260031109 262200769 264182658
3267B64182658J753359J058185O74950J39746l02060l73994p39640o97950q72050
$$ 264182658 265936017 266994202 267669152 267808898 267506838 267132844 266393204 265695254 264823204
3258B64823204n27391m16679p07644n71844m77384o21784r83249j262154j765757
$$ 264823204 264295813 263879134 263171490 262599646 262122262 261500478 260517229 259255075 257489318
3249B57489318k041625k503365k831595l131560l557790l470668l552970l955570
$$ 257489318 255447693 252944328 250112733 246981173 243423383 239952715 236399745 232444175
3241B32444175l926832m392345m327889m474851m775346m763786m826523n054309
$$ 232444175 228517343 224124998 219797109 215322258 210546912 205783126 200956603 195902294
3233A95902294m805589m631722m907427m439915m094202m054749l828658l565023
$$ 195902294 191096705 186464983 181557556 177117641 173023439 168968690 165140032 161575009
3225A61575009l691765l579590l176617k772024k436360j986422j948281k240382
$$ 161575009 157883244 154303654 151127037 148355013 145918653 143932231 141983950 139743568
3217A39743568j810249j338669j124252j069980r80656q49531n72187p53386m67259
$$ 139743568 137933319 136594650 135470398 134400418 133419762 132570231 131998044 131244658 130777399
3208A30777399m17976J19787J67621M27485P08479P70442J525426J787019K053809
$$ 130777399 130359423 130479210 130646831 131074316 131782795 132553237 134078663 135865682 137919491
3199A37919491J827282J043009J54090j282834k093418k514809l328391k492084
$$ 137919491 139746773 140789782 140943872 139661038 137567620 135052811 131724420 129232336
3191A29232336k358163j926224r44207m12343j61013K87219N17410R45839J184538
$$ 129232336 126874173 124947949 124003742 123591399 123430386 123717605 124235015 125180854 126365392
3182A26365392J174281J434945J370492R48548L39525O35382J018598J240625
$$ 126365392 127539673 128974618 130345110 131293658 131633183 132268565 133287163 134527788
3174A34527788J589530J913823K388089L292664L941219M624049N469634N280410
$$ 134527788 136117318 138031141 140419230 143711894 147653113 152277162 157746796 163027206
3166A63027206M455083K612551J04070l082670n538459o255125o074100m997484
$$ 163027206 167482289 170094840 170198910 167116240 161577781 155322656 149248556 144251072
3158A44251072m089884l119643k429287k088378j900979j687353j506240j253825
$$ 144251072 140161188 137041545 134612258 132523880 130622901 128935548 127429308 126175483
3150A26175483j253410j431351j446669j462324j731839j550005j467619j455979
$$ 126175483 124922073 123490722 122044053 120581729 118849890 117299885 115832266 114376287
3142A14376287j031731o31562J48767N59701J024863J408878J878213J972286
$$ 114376287 113344556 112712994 112861761 113421462 114446325 115855203 117733416 119705702
3134A19705702K198017J886394J033640r8202o94945j400730j587119j361874
$$ 119705702 121903719 123790113 124823753 124725551 124030606 122629876 121042757 119680883
3126A19680883j016848r69767l29660k83458j95207j33474k1067J3568j90466
$$ 119680883 118664035 117694268 117364608 117081150 116885943 116752469 116731402 116744970 116554504
3117A16554504q726k13371m08960n18510m47181m29678n63493p03872k71287m36430
$$ 116554504 116545778 116332407 115923447 115404937 114957756 114528078 113964585 113260713 112989426 112552996
3107A12552996m99402j98667l88287l73849o58509p43059o26048p14514n96801
$$ 112552996 112053594 111854927 111466640 111092791 110434282 109691223 109065175 108350661 107753860
3098A07753860p81807n82063m99860m00227q30538o64506o34886r10157o68632
$$ 107753860 106972053 106389990 105890130 105489903 104659365 103994859 103359973 102449816 101781184
3089A01781184j006346j120629r36112j334585j282901j237956j286695j290963
$$ 101781184 100774838 99654209 98718097 97383512 96100611 94862655 93575960 92284997
3081I2284997j254539j129140r59369r14186j061752j184589q24241r79395j043280
$$ 92284997 91030458 89901318 88941949 88027763 86966011 85781422 84957181 83977786 82934506
3072H2934506j032152j073242j356527j354183j406505j267225j474370j771279
$$ 82934506 81902354 80829112 79472585 78118402 76711897 75444672 73970302 72199023
3064G2199023j557458j507310j589274j384472j226509j656977j384289j032157
$$ 72199023 70641565 69134255 67544981 66160509 64934000 63277023 61892734 60860577
3056F0860577q79557r35095j062307q29826p45815o87534q68896r09889p45158
$$ 60860577 59981020 59045925 57983618 57153792 56407977 55720443 54851547 53941658 53196500
3047E3196500m88614o39576l19173m29956p53196q4851m10870k65440l72119j99416
$$ 53196500 52707886 52068310 51749137 51319181 50565985 50481134 50070264 49804824 49432705 49233289
3037D9233289l93346k08398j36799m36372k53805o5453p2308k73979j70355j78594
$$ 49233289 48839943 48631545 48494746 48058374 47804569 47739116 47666808 47392829 47222474 47043880
3027D7043880k18733k02336j8817j6479j2006j42131q5188J33291J10883k6185
$$ 47043880 46825147 46622811 46603994 46587515 46575509 46433378 46348190 46481481 46592364 46566179
3017D6566179K81631J59540J75376K67992J07420K59284J28330K08335L5632K69764
$$ 46566179 46847810 47007350 47182726 47450718 47558138 47817422 47945752 48154087 48189719 48459483
3007D8459483N02686K37096L58556L18422j4950K6212L74332J39261O5671N2444
$$ 48459483 48962169 49199265 49557821 49876243 49861293 49887505 50261837 50401098 50466769 50519213
2997E0519213J24013L15004K90521L63128O14190M91517P03290R09344Q56413
$$ 50519213 50643226 50958230 51248751 51611879 52226069 52717586 53420876 54330220 55186633
2988E5186633J210468J100031R39294Q41871O48801O77000M87995N24236Q9499
$$ 55186633 56397101 57497132 58436426 59278297 59927098 60604098 61092093 61616329 61705828
2979F1705828M22033O05255O79127O39676K25107P01702P10683O97290P53644
$$ 61705828 62127861 62733116 63412243 64051919 64277026 64978728 65689411 66386701 67140345
2970F7140345Q27336O93263Q02090J061348R68545J181947J284267J276896J542567
$$ 67140345 67967681 68660944 69463034 70524382 71492927 72674874 73959141 75236037 76778604
2961G6778604J939483K048017K299860K576172K825202L072696L085472L120537
$$ 76778604 78718087 80766104 83065964 85642136 88467338 91540034 94625506 97746043
2953I7746043K575285J765271J270339J295250J153070J185481J031209P11999
$$ 97746043 100321328 102086599 103356938 104652188 105805258 106990739 108021948 108733947
2945A08733947Q98046P49153O08455O88537N87438P89589J107905J356301J724113
$$ 108733947 109631993 110381146 110989601 111678138 112265576 113055165 114163070 115519371 117243484
2936A17243484K091082K275505K923449L443417L887534M483348N216076N488053
$$ 117243484 119334566 121610071 124533520 127976937 131864471 136347819 141563895 147051948
2928A47051948O718641P291336Q104773R030694R929258J1106229J2446364J4129429
$$ 147051948 153770589 161061925 169166698 178197392 188126650 199232879 211679243 225808672
2920B25808672J5723001J6973474J7169822J5089807R641106Q41721q453072j4737636
$$ 225808672 241531673 258505147 275674969 290764776 300405882 301247603 292794531 278056895
2912B78056895j7379462j6621179j3972089j0684697p837304n194799k943379
$$ 278056895 260677433 244056254 230084165 219399468 211562164 206367365 203423986
2905B03423986j516546k61904J016270J956007L089917M539823N524066P028323
$$ 203423986 201907440 201645536 202661806 204617813 207707730 212247553 217771619 224799942
2897B24799942Q409794R298838R947422Q974950P329671M525618J438418o18567
$$ 224799942 233209736 242508574 252455996 261430946 268760617 273286235 274724653 274106086
2889B74106086j480758j099209R55545K887519M902049O529709Q126183R003027
$$ 274106086 272625328 271526119 272481664 275369183 280271232 286800941 294927124 303930151
2881C03930151R298626J0072304J0512517J0998558J1229729J1308860J1072174
$$ 303930151 313228777 323301081 333813598 344812156 356041885 367350745 378422919
2874C78422919J0706024J0090698P034129J118152n953128j1853902j4350921
$$ 378422919 389128943 399219641 406253770 407371922 401418794 389564892 375213971
2867C75213971j4525473j3563451j2235438j1151122r870552q776203q329325
$$ 375213971 360688498 347125047 334889609 323738487 313867935 305091732 296762407
2860B96762407p548960p252539p014864o680821o613012o183885n818096m938099
$$ 296762407 289213447 281960908 274946044 268265223 261652211 255468326 249650230 244712131
2852B44712131m857663m682677m134622l832887l587872k981294j992147j337062
$$ 244712131 239854468 235171791 231037169 227204282 223616410 220635116 218642969 217305907
2844B17305907p44138k98092o87028j535277l084884n175016p112252q574170
$$ 217305907 216561769 216263677 215576649 214041372 210956488 205781472 198669220 190095050
2836A90095050r649696r765968r402615q996856q198556p172408o339902n670512
$$ 190095050 180445354 170679386 161276771 152279915 144081359 136908951 130569049 124898537
2828A24898537n359850m657632m160766l885616l720805l606285l568384l688437
$$ 124898537 119538687 114881055 110720289 106834673 103113868 99507583 95939199 92250762
2820I2250762l938329l853165l667478l572853l153568k792072k726854k310969
$$ 92250762 88312433 84459268 80791790 77218937 74065369 71273297 68546443 66235474
2812F6235474k084765k359516k232377j881663j730160j863372j583129j473713
$$ 66235474 64150709 61791193 59558816 57677153 55946993 54083621 52500492 51026779
2804E1026779j250014j195557j343068j222610j098213j161809j000165j006716
$$ 51026779 49776765 48581208 47238140 46015530 44917317 43755508 42755343 41748627
2796D1748627p30510q98187o46710o52717q56549r04309n93712j055240p18250
$$ 41748627 41018117 40119930 39473220 38820503 37963954 37059645 36465933 35410693 34692443
2787C4692443q61287q33247o84153q55258q20834q05429o80617o08353p49920
$$ 34692443 33831156 32997909 32313756 31458498 30637664 29832235 29151618 28543265 27793345
2778B7793345q25036n47291o54547m25946m29734l61297n20320l62032n57487
$$ 27793345 26968309 26421018 25766471 25340525 24910791 24549494 24029174 23667142 23109655
2769B3109655l44481m66082n73611m58851l73063l56927j98639k76485l92899
$$ 23109655 22765174 22299092 21725481 21266630 20893567 20536640 20338001 20061516 19668617
2760A9668617m31225k19758k23358m79431k41977m82649k67082k59678n7607k22336
$$ 19668617 19237392 19017634 18794276 18314845 18072868 17590219 17323137 17063459 17005852 16783516
2750A6783516m33997j48237m85453k48303j15473j78072M91l38615k41897k06908
$$ 16783516 16349519 16201282 15715829 15467526 15352053 15173981 15174472 14835857 14593960 14387052
2740A4387052J54194k58969j03992k67512j29887M2144k83476j77461j60955k78408
$$ 14387052 14541246 14282277 14178285 13910773 13780886 13823030 13539554 13362093 13201138 12922730
2730A2922730j32591j27154j40286j076j86066k08228l21025j13672o8200O8958
$$ 12922730 12790139 12662985 12522699 12521623 12335557 12127329 11806304 11692632 11624432 11693390
2720A1693390j28280k23296k29598j93855j35960Q0164k22473j94151p6963l4778
$$ 11693390 11565110 11341814 11112216 10918361 10782401 10862565 10640092 10445941 10368978 10334200
2710A0334200p8880j06050j76298j42994m0096K29622j59901n4927R29j15566
$$ 10334200 10255320 10149270 9972972 9829978 9789882 10019504 9859603 9804676 9805605 9690039
2700I690039r7893N9697k23309l0739k05141j99390r4879l58669L9472j77201
$$ 9690039 9592146 9651843 9428534 9397795 9192654 8993264 8898385 8539716 8579188 8401987
2690H401987k21524m2388j14107K5436j67284j93051j30964r8678o285j23853
$$ 8401987 8180463 8138075 8023968 8049404 7882120 7689069 7558105 7459427 7453142 7329289
2680G329289J07627n1477q5452l5739p1491k52824j27464J7497j71973k9534J78778
$$ 7329289 7436916 7385439 7299987 7264248 7192757 6939933 6812469 6829966 6657993 6628459 6807237
2669F807237J14125o9898j00436q7271P2294r400j11070k41490j95881J3157o1296
$$ 6807237 6921362 6851464 6751028 6663757 6736051 6726651 6615581 6374091 6178210 6191367 6130071
2658F130071M6679j97031k67011N3865k13628j34040K16673k00159J38192J0914
$$ 6130071 6176750 5979719 5712708 5766573 5552945 5418905 5635578 5435419 5573611 5584525
2648E584525j15866q6822J15062p365k01528j30585J00914j86935J1867J4107
$$ 5584525 5468659 5381837 5496899 5489534 5288006 5157421 5258335 5071400 5083267 5097374
2638E097374N1357K71123m5105L8117K36313j7630O1981N3275l52659M6675j47137
$$ 5097374 5148731 5419854 5374749 5412866 5649179 5631549 5693530 5746805 5394146 5440821 5293684
2627E293684m41901j47481J54133j51424l6437P1956l4151j142N5208j62733j281
$$ 5293684 4851783 4704302 4858435 4707011 4670574 4742530 4708379 4707237 4762445 4599712 4598431
2616D598431M9m8459n9995l3667L2117j25904J17196J97614K14052j30375J9089
$$ 4598431 4598480 4550021 4490026 4456359 4488476 4362572 4479768 4677382 4891434 4761059 4780148
2605D780148m0494l20051O0789K01799Q381J2640k35605j23417Q9029L38758J14088
$$ 4780148 4739654 4419603 4480392 4682191 4690572 4703212 4467607 4344190 4433219 4771977 4886065
2594D886065J3423q5541N4198o1653q9432J58323J04135q9815j75158l1455P091
$$ 4886065 4899488 4813947 4868145 4806492 4717060 4875383 4979518 4889703 4714545 4683090 4690181
2583D690181m762l53704j27551q1126L5483o4604j59801J72955J02217k24624
$$ 4690181 4685419 4331715 4204164 4123038 4158521 4093917 3934116 4107071 4209288 3984664
2573C984664o1639k3880M0549j90735j21930r1329r8982P5087N2585k01355m5803
$$ 3984664 3923025 3899145 3939694 3748959 3627029 3535700 3436718 3511805 3564390 3363035 3317232
2562C317232n1958j01660R8309J33793j41418j09740Q6439M0231j56620j20414
$$ 3317232 3265274 3163614 3261923 3395716 3254298 3144558 3230997 3271228 3114608 2994194
2552B994194L1911o0973q0623N0255j04482j01021N466k6044J5525q0563K4868
$$ 2994194 3026105 2965132 2884509 2934764 2830282 2729261 2734727 2708683 2724208 2643645 2668513
2541B668513k7414k58692J55193M4579k06200P79j0997O4684n4110k3089r1788
$$ 2668513 2641099 2382407 2537600 2582179 2375979 2376758 2365761 2430445 2376335 2353246 2261458
2530B261458j3260L4403l7369j56360q5368j88695L7012R6298J18294l2160j81052
$$ 2261458 2248198 2282601 2245232 2088872 2003504 1814809 1851821 1948119 2066413 2034253 1853201
2519A853201j29412P315M8851J67235J1546j20387J6959j49663k88981K99671
$$ 1853201 1723789 1731104 1779955 1947190 1958736 1838349 1855308 1705645 1416664 1716335
2509A716335m6073j00927M3729O0308O8116k94605K5304J9900m9595K21794M5346
$$ 1716335 1670262 1569335 1613064 1673372 1741488 1446883 1472187 1492087 1442492 1664286 1709632
2498A709632j22768k7255k79608J75333M3581N37L2398k53830J12719J11994l008
$$ 1709632 1586864 1559609 1280001 1455334 1498915 1499452 1531850 1278020 1390739 1502733 1499725
2487A499725o1180j26588J10685J32795r7799j65339L5824j71675Q6711O837j40345
$$ 1499725 1438545 1311957 1422642 1555437 1457638 1292299 1328123 1156448 1243159 1249996 1109651
2476A109651K42339R6845k23325K0546N5059J82953p8888j19223R0057j78584
$$ 1109651 1351990 1448835 1225510 1246056 1301115 1484068 1405180 1285957 1376014 1197430
2466A197430m8458N3191K75430j46882n5268j5475n6668q315l3231q702k26056
$$ 1197430 1148972 1202163 1477593 1330711 1275443 1259968 1203300 1194985 1161754 1153052 926996
2455I26996K15377q6008N8217K15670N0030j71051M8150l5129l8730j38319J0843
$$ 926996 1142373 1056365 1114582 1330252 1380282 1209231 1257381 1222252 1183522 1045203 1056046
2444A056046j0044N0331O4655j45108j9532j99407M976J06391q0283m5474L15001
$$ 1056046 1046002 1096333 1160988 1015880 996348 796941 801917 908308 828025 782551 1097552
2433A097552j76907n9127O6221N8635R1126j78105J42012j37713m3101J2616L8770
$$ 1097552 920645 861518 927739 986374 1077500 899395 1041407 903694 860593 873209 911979
2422I11979J80441m244o1785q7656K00702k8798j42532m6054K69886m5529r6201
$$ 911979 1092420 1088176 1026391 938735 1139437 1110639 968107 922053 1191939 1146410 1050209
2411A050209o6979j93793O2555J49005J65325n5522q4860m7543j20850M1901J4457
$$ 1050209 983230 789437 851992 1000997 1166322 1110800 1025940 978397 857547 899448 913905
2400I13905l9511L0894j8168k31853P9096o2617O5311K9607J81216J89783Q4709
$$ 913905 874394 905288 887120 655267 734363 671746 737057 766664 947880 1137663 1222372
2389A222372j59253j33877J23653J07711o9061K3176p0217L6343M2945j59202
$$ 1222372 1063119 929242 1052895 1160606 1091545 1114721 1044504 1080847 1123792 964590
2379I64590m7488j21491J15050l1915j11825j13256n166o0117K06679j45551J276
$$ 964590 917102 795611 910661 878746 766921 653665 648499 588382 795061 649510 650786
2368F50786K3883p6934L5222m7104r5362k9422J52225n5127j25030r8035J14337
$$ 650786 674669 597735 632957 585853 490491 461069 613294 558167 433137 335102 449439
2357D49439K00990J5923k19676k1363J79109Q3623Q451O6586k34495P4564j03053
$$ 449439 650429 666352 446676 425313 604422 688045 696496 763082 528587 603151 500098
2346E00098j16315J64221J26901r7890K6754K2112j24446K88465j66390j75590
$$ 500098 383783 548004 674905 577015 603769 625881 501435 789900 623510 447920
2336D47920j5999K02419K24590R430j91421k7506j2234k4836m4138J52468p2008
$$ 447920 431921 634340 858930 868360 676939 649433 637199 612363 568225 720693 648685
2325F48685q1588p3066m3253P2793j22920N9530p9098J76226n3320M9447m8033
$$ 648685 567097 494031 450778 523571 400651 460181 381083 557309 503989 553436 505403
2314E05403n8613n5278L7063K38019j06735l5454j19757K3616K6500J01759J05217
$$ 505403 446790 391512 428575 666594 559859 524405 404648 428264 454764 556523 661740
2303F61740p6106j16046o9671J13598J29900j04973L3550k38235J26723L2405
$$ 661740 585634 469588 399917 513515 643415 538442 571992 333757 460480 492885
2293D92885j213O806k20p7152J1233K44780N5439j86694j34878k124r393m0678
$$ 492885 491672 498478 498258 421106 432339 677119 732558 545864 410986 408862 399469 358791
2281C58791J52769J34422k21562o9069J6024J06242m6101j5689L4746M3970R8540
$$ 358791 511560 645982 424420 355351 371375 477617 431516 415827 450573 494543 593083
2270E93083j62962m6212J07983L41311J34999l75071k1958j9740o0786p735j4266
$$ 593083 430121 383909 491892 833203 968202 593131 571173 551433 490647 482912 468646
2259D68646p0147m4574J43200O4329j35277L7780j6428l5464K9640L4568l9189
$$ 468646 398499 353925 497125 561454 426177 463957 447529 412065 441705 476273 437084
2248D37084K3137K06099Q9388j24215j82433J79099J00509j85961j66181o0364
$$ 437084 460221 666320 755708 631493 449060 628159 728668 542707 376526 316162
2238C16162K15278J43733Q3510j94730j13866k4858R4913j4125J58014L2042O7044
$$ 316162 531440 675173 758683 563953 450087 425229 520142 506017 664031 696073 763117
2227G63117K8642J45199n2821l6229M1037n0188O6682k7552m9525p9307j1051
$$ 763117 791759 936958 884137 847908 888945 838757 905439 877887 828362 749055 738004
2216G38004P2698l1842q501n0517o8222J92979k4401j48716O8533K71531l9565
$$ 738004 810702 778860 770359 719842 651620 844599 820198 671482 740015 1011546 971981
2205I71981m4165j42258Q4464O2363o5930k7111O2678J86462J9369j73908J41876
$$ 971981 927816 785558 870022 932385 866455 839344 902022 1088484 1107853 933945 1075821
2194A075821j57854M6298N552J29184Q8501j16164K41510J31801J30709J39916
$$ 1075821 917967 964265 969817 1099001 1187502 1071338 1312848 1444649 1575358 1715274
2184A715274M0302j8939O5690l2010k03616o0049r924L8955M4740l2716J32736
$$ 1715274 1755576 1736637 1802327 1770317 1566701 1506652 1496728 1535683 1580423 1547707 1680443
2173A680443L5256r6582n3407K71566J85336R2036m6188k6086j16163l2941J00266
$$ 1680443 1715699 1619117 1565710 1837276 2022612 2114648 2068460 2042374 1926211 1893270 1993536
2162A993536K29921J1936J26096N6287l287p1862Q2146K88112K04536J90263j22900
$$ 1993536 2223457 2235393 2361489 2417776 2414489 2342627 2424773 2712885 2917421 3107684 2984784
2151B984784Q3911k732L11169J10040J4412J05421K74403L96242K16611J35859
$$ 2984784 3068695 3065963 3377132 3487172 3501584 3607005 3881408 4277650 4494261 4630120
2141D630120J82802M7292M410J90895K55325L18594K39688K41945J13723M80041
$$ 4630120 4812922 4860214 4864624 5055519 5310844 5629438 5869126 6111071 6224794 6704835
2131F704835L25142M12679O97890R39945P84625O56778N15687O24659O64121P60028
$$ 6704835 7029977 7442656 8140546 9080491 9865116 10521894 11037581 11662240 12326361 13086389
2121A3086389J096512J439866J622464K405611L134407M338243N424251P491267
$$ 13086389 14182901 15622767 17245231 19650842 22785249 27123492 32547743 40039010
2113D0039010J0386055J1815287K487519r694983j2370463j1040071o579230m552341
$$ 40039010 50425065 62240352 64727871 55032888 42662425 31622354 25043124 20490783
2105B0490783l369332k612557j790449j424387r90728q36651m72877l47799l57339
$$ 20490783 17121451 14508894 12718445 11294058 10303330 9466679 8993802 8646003 8288664
2096H288664k01145m82615o85311o58689m13117m79175m10308k95800o1634j0455
$$ 8288664 8087519 7604904 6919593 6260904 5847787 5368612 4958304 4662504 4600870 4590415
2086D590415l50373m41384j92765k48074n2389P1038j77647j19686p9080P552
$$ 4590415 4240042 3798658 3605893 3357819 3305430 3376468 3198821 3079135 3000055 3007607
2076C007607j60070j21196j34114j20697k4899p8841k21804J0171L8705n0844
$$ 3007607 2847537 2726341 2592227 2471530 2446631 2367790 2145986 2156157 2194862 2144018
2066B144018m9579j20668k13996k01805K36165P6570l55744r373J50240j93532
$$ 2144018 2094439 1973771 1759775 1557970 1794135 1870705 1514961 1505588 1655828 1462296
2056A462296j26949J00456m1920k9722j10432j00067j2349q1856j66812J0128
$$ 1462296 1335347 1435803 1393883 1364161 1253729 1153662 1141313 1059457 892645 902773
2046I02773O6002j04950J47963J71003M8639k90345J03673j95552J84893M1026
$$ 902773 968775 863825 1011788 1182791 1231430 941085 1044758 849206 1034099 1075125
2036A075125l4015j38051j30995J68460n5876j22511J16258n6163l6337k12086
$$ 1075125 1041110 903059 772064 940524 884648 762137 878395 822232 785895 573809
2026E73809J3899J16052j49233O796K72653m3406m7313j633j48019l1529J66100
$$ 573809 587708 703760 554527 561323 833976 790570 743257 741624 593605 562076 728176
2015G28176J71917j31626j81126J54760j27214j09732K1666n2443P0554j04076
$$ 728176 900093 768467 587341 742101 614887 505155 526821 474378 544932 440856
2005D40856j17912o8980P0910J68264j7452n8861o7201P6460j4074r4803N4399
$$ 440856 322944 253964 324874 493138 475686 416825 349624 426084 412010 317207 371606
1994C71606J74687m570k212K6330k48338q7173Q19K09626j73478L1686j06047
$$ 371606 546293 541723 539511 565841 317503 230330 231149 440775 267297 298983 192936
1983A92936n1987L09265m128k02599P228J74346J98160n0091j01607m6273L5523
$$ 192936 140949 450214 446086 243487 250715 425061 623221 573130 471523 425250 460773
1972D60773k2296m7559j00707q0918n2739j7962Q3105J56470J55566j46797j73056
$$ 460773 438477 390918 290211 209293 156554 138592 221697 378167 533733 386936 213880
1961B13880j3978J29274K9804r0836m7465j36300J60320n8328K51763J14153o2491
$$ 213880 199902 329176 358980 268144 220679 84379 244699 186371 438134 552287 489796
1950D89796r7256j41138K14734k8497k39048L5603R0081J06864q3061j85864j9925
$$ 489796 392540 251402 466136 437639 198591 234194 324275 431139 348078 162214 142289
1939A42289K69697k43972j31074R6992j0693R7009j94260k3392K09104J45189
$$ 142289 411986 168014 36940 133932 123239 220248 25988 2596 211700 356889
1929C56889j16921J6496K1455k8403N655j20564j70627J89725J8903o9586Q9661
$$ 356889 239968 256464 277919 249516 255171 134607 -36020 153705 172608 103022 192683
1918A92683N450p938K6956l7967K6897o2683m2434J33411j11456L1832R4393R0169
$$ 192683 198133 190195 217151 179184 206081 143398 100964 234375 122919 154751 249144 339313
1906C39313j64360O0892l7520k98872M7645p3684K5058J89265j0225k8084K63257
$$ 339313 174953 235845 198325 -100547 -52902 -126586 -101528 87737 77512 49428 312685
1895C12685K2659k87625K6617o1067k69117J61175J44962L9685M1842q9558J87259
$$ 312685 335344 47719 74336 13269 -255848 -94673 50289 89974 131816 42258 229517
1884B29517J42664k09890J2512q1582P1093K4820o4983M0833K8502j20801O5873
$$ 229517 372181 162291 174803 93221 164314 189134 124151 164984 193486 72685 138558
1873A38558j47272p0278J41230o630n8956O8910l3187J16565j72248J03374J29901
$$ 138558 -8714 -78992 62238 55608 -3348 65562 32375 148940 -23308 80066 209967
1862B09967j22443P542q2962K77739k7875o4725J6421K1260O4004p9195M4573
$$ 209967 87524 95066 12104 289843 261968 197243 213664 234924 298928 219733 264306
1851B64306m1346Q728J12967j52058J44743q1039o0380R2950J70962K21620j09059
$$ 264306 222960 231688 344655 192597 337340 256301 195921 288871 459833 681453 572394
1840E72394m2543k78465j50708M7741O7381j0451o0297K4922o4095j5801R9634
$$ 572394 529851 251386 100678 148419 215800 205349 145052 169974 105879 90078 189712
1829A89712J6139m4647m3775k66683J7661R09J47850J41586J01402l79944k9926
$$ 189712 205851 161204 117429 -149254 -131593 -130684 17166 158752 260154 -119790 -149716
1818a49716J76080J95596O3469k74815p438M1397J27656M8977j63225m6724R3588
$$ -149716 26364 221960 285429 10614 3176 44573 172229 221206 57981 11257 104845
1807A04845q5776j38734o4210J63961j14891J8630R0862N4624j67886L0715O5533
$$ 104845 19069 -119665 -183875 -19914 -134805 -116175 -25313 29311 -138575 -107860 -42327
1796d2327p1987K7308K1997L8510p3883L7185N8730j2700K9284m7723L3673L5948
$$ -42327 -114314 -87006 -65009 -26499 -100382 -63197 -4467 -17167 12117 -35606 -1933 34015
1784C4015j8832k41379L6250K00374K20184L6478M9873j08584o4213J27423N5172
$$ 34015 15183 -226196 -189946 10428 230612 267090 316963 208379 144166 271589 326761
1773C26761j50491j83167l4402j20399K5438R5334P7596K5113k4304j3601k06487
$$ 326761 176270 -6897 -41299 -161698 -136260 -40926 36670 61783 37479 23878 -182609
1762a82609L8538Q6078j05651M8019J46740J34579N5961J51543j27479j21146
$$ -182609 -144071 -57993 -163644 -115625 31115 165694 221655 373198 245719 124573
1752A24573k18258P0873L2973j84318J05984K04641r5992Q0653Q454L5861k7119
$$ 124573 -93685 -22812 10161 -174157 -68173 136468 40476 121129 129583 165444 138325
1741A38325o5639J84541K3773k11243J2733P9397J2765m4998J71947N8330J23557
$$ 138325 72686 257227 281000 69757 82490 161887 174652 129654 301601 359931 483488
1730D83488j85785k43345n9955P2630J50424o5557j49203n1253M9474j50381Q5516
$$ 483488 297703 54358 -5597 67033 217457 151900 2697 -48556 918 -149463 -63947
1719f3947J34836J48260j15655j08771J21143k47645J00963K04268k59j30329
$$ -63947 70889 219149 103494 -5277 115866 -131779 -30816 173452 173193 42864
1709D2864M0236r2763L2360Q9481J8143K9221j5542O0853o2628l6655K5842j10569
$$ 42864 83100 -9663 22697 112178 130321 159542 144000 204853 142225 105570 131412 20843
1697B0843j54028J76016M3898N1894j30994j08942K31696L7186r7870p993O8672
$$ 20843 -133185 42831 86729 138623 7629 -101313 130383 167569 69699 61706 130378
1686A30378p6603n8864N4775l4270k49276j80567K09847P6536l7114k5198J08963
$$ 130378 53775 -5089 49686 15416 -233860 -414427 -204580 -128044 -165158 -190356 -81393
1675h1393M0486J73613q8509j62150J41354M163l02657J50774Q2680Q5350o4340
$$ -81393 -40907 132706 44197 -117953 23401 27564 -275093 -124319 -41639 43711 -20629
1664b0629k3597R7350j7551L9102j6909j24L3508j78499Q138j06105N7855L1030
$$ -20629 -44226 53124 35573 74675 57766 57642 91150 -87349 -79211 -185316 -127461 -96431
1652i6431m424K0207k4422Q2345J22961k01923J77607J14884j64006j94011J0677
$$ -96431 -100855 -80648 -105070 -22725 100236 -101687 75920 190804 26798 -167213 -156536
1641a56536P5779j3070j37116j2849K31071j14030O5343J64557R2628o9883K829
$$ -156536 -80757 -93827 -230943 -243792 -12721 -126751 -61408 103149 195777 125894 128723
1630A28723j70646j6917j57112m1245J03690N253k3674R7440J0816L7010M9019
$$ 128723 -41923 -58840 -215952 -257197 -153507 -148254 -171928 -74488 -63672 -26662 22357
1619B2357K2749K8081q2444p0112Q7080l0449n1750K89034J1944k97417M4613
$$ 22357 45106 73187 -9257 -79369 7711 -22738 -74488 214546 226490 -70927 -26314
1608b6314o9990P3543J44024Q291r4809J28715N5976m0632J76963l22641n2275
$$ -26314 -96304 -22761 121263 129554 34745 163460 219436 178804 355767 33126 -19149
1597a9149J64734j25246j8621l7259m3447l8060J1893l7027K42737J25616j52138
$$ -19149 145585 20339 1718 -35541 -78988 -117048 -105155 -142182 100555 226171 74033
1586G4033j2752J97087J2070j27986j66246j56559K30530K26248k67861p7103
$$ 74033 61281 258368 270438 142452 -23794 -180353 50177 276425 8564 -68539
1576f8539o0647m0169R197M1883K1860J12293J16187j26740l6608J51354p5088
$$ -68539 -129186 -169355 -160158 -118275 -96415 15878 132065 5325 -31283 120071 44983
1565D4983J6028l4032R855K05710n6965j52848L1769J73613k27069q4843M0388
$$ 44983 61011 26979 36834 242544 185579 32731 64500 238113 11044 -73799 -33411
1554c3411j10164J36502J42773L6967l3701j51345J3341j9733R0042N1263q3272
$$ -33411 -143575 -7073 135700 172667 138966 -12379 962 -18771 71271 122534 39262
1543C9262L1633O1727n5901j70301p1713m410k1620R3546J18173j47079n5746
$$ 39262 70895 132622 76721 -93580 -165293 -169703 -191323 -97777 20396 -126683 -182429
1532a82429J62059Q109j60052L2063R2161j44837J49261k8665j43970J67642J17524
$$ -182429 -20370 -12261 -172313 -140250 -48089 -192926 -43665 -72330 -216300 -48658 68866
1521F8866k40159j18991J66933K45769J25995p4776r5910K2608o0490K7756l4927
$$ 68866 -171293 -290284 -123351 122418 248413 173637 77727 100335 39845 67601 32674
1510C2674J30771q1751k7013p3575k6634O7233l0937j35600J971M6609O2608J44557
$$ 32674 163445 81694 54681 -18894 -45528 21705 -9232 -144832 -142861 -96252 -33644 110913
1498A10913n2656K9337q4735P9233J02935q5178p3729k0656R853J15476j63350
$$ 110913 58257 87594 2859 82092 185027 99849 26120 5464 15317 130793 -32557
1487c2557J33136R7735j88191P0861P5391q1048l9241Q5618j19262q4664K93433
$$ -32557 100579 198314 10123 80984 156375 75327 36086 121704 2442 -82222 211211
1476B11211j56502l0461J45706k91487N4587k8587N5668J22376q4403Q9227j89499
$$ 211211 54709 24248 169954 -121533 -66946 -95533 -39865 82511 -1892 87335 -102164
1465a02164p7025j3569N0638J20205n8055Q3871M531j0151m0754k592l3832p1364
$$ -102164 -179189 -192758 -142120 -21915 -79970 3901 8432 -1719 -42473 -45065 -78897 -150261
1453a50261J6830M8913p4762J56833N2510l1251r2614k02689N8297K98970n2467
$$ -150261 -133431 -84518 -159280 -2447 50063 18812 -73802 -276491 -218194 80776 28309
1442B8309M5453q0198j19091J12504k1868k44520L436M70852j10523k08304M1429
$$ 28309 73762 -6436 -125527 -13023 -34891 -279411 -275975 194877 84354 -123950 -82521
1431h2521R321R4474J47200q2298o5374k12506L78140j1623r1918j8014j9173
$$ -82521 -73200 21274 168474 86176 20802 -191704 186436 174813 82895 64881 45708
1420D5708p2173P2845J96052j77739o7207J83368j67332M9107J33047r6500j47576
$$ 45708 -26465 46380 242432 64693 -2514 180854 13522 62629 195676 99176 -48400
1409d8400k4179J08575O7168k43459j43979K27291K44379j9274p9735j52518j40935
$$ -48400 -72579 35996 103164 -140295 -284274 -56983 187396 168122 88387 -64131 -205066
1398b05066m2420p3886J18182Q29K78707j3461n3309N8374J22304L2783L378k0662
$$ -205066 -247486 -321372 -203190 -202361 76346 62885 9576 67950 190254 223037 226415 205753
1386B05753n8015k73674k23987J14517L18116k2695p8044K36430l1293l08575
$$ 205753 147738 -125936 -349923 -235406 82710 60015 -18029 218401 187108 -121467
1376a21467K16222Q2765k11704j03999K39254P3507j3637j66948k41685J31384
$$ -121467 94755 177520 -34184 -138183 101071 174578 160941 -6007 -247692 -116308
1366a16308j2692l6577K67353Q3018J3831j66234P3436n2028J1127o8280n7849
$$ -116308 -129000 -165577 101776 184794 198625 32391 105827 53799 64926 -3354 -61203
1355f1203L0871J08654p8355j57150n4020J29496J8403o3247K12351p5168r667
$$ -61203 -30332 78322 -33 -157183 -211203 -81707 -63304 -126551 85800 10632 965
1344I65p38q3348K286J9931n9483j38913k02714L29737J06677n20M2240o4108
$$ 965 227 -83121 -80835 -60904 -120387 -259300 -462014 -132277 -25600 -26120 16120 -47988
1332d7988j40553J01846j34199J67156j1390l4894k15132M0512n533j97146K44531
$$ -47988 -188541 -86695 -220894 -53738 -65128 -100022 -315154 -274642 -280175 -477321 -232790
1321b32790J61787K63435p8727n2350P099K9772L5421m2077k8648j29793j34118
$$ -232790 -71003 192432 113705 61355 68454 98226 133647 91570 62922 -66871 -200989
1310b00989J5970N2471p2780j4035P7223J03897m1292N9144Q576J68928k24119
$$ -200989 -185019 -132548 -205328 -219363 -142140 -38243 -79535 -20391 -11815 157113 -67006
1299f7006n5343k07955j7403Q8127J75253R1835k86o0670k36993M1376J47517
$$ -67006 -122349 -330304 -347707 -259580 -84327 7508 7222 -53448 -290441 -249065 -101548
1288a01548j065n0830o438q2400J69679j04727R6923o2820J10972J49349m7759
$$ -101548 -102613 -153443 -159881 -242281 -72602 -177329 -80406 -143226 -32254 117095 69336
1277F9336j80605Q9112J50588q7440J3230Q6733R9800K9022k68949j05143M7378
$$ 69336 -111269 -22157 128431 40991 54221 140954 240754 269776 827 -104316 -56938
1266e6938N3522l8797J17735k8816K6807K4809l3619J0173n0378J4621R4220o3098
$$ -56938 -3416 -42213 75522 46706 73513 98322 64703 74876 24498 39119 133339 70241
1254G0241j59143j87122O308j6749J08152o688P2006J61040k03359J7911o0027
$$ 70241 -88902 -276024 -269716 -286465 -178313 -185001 -112995 48045 -155314 -137403 -197430
1243a97430j05428J78356O4238j07652J26100N3590j37354K7231Q5262j01002
$$ -197430 -302858 -124502 -60264 -167916 -41816 11774 -125580 -98349 -13087 -114089
1233a14089J30348J20713m9q9998M6273p3560l5203N7034q5930J59462p4480j3302
$$ -114089 16259 136972 136923 46925 93198 19638 -15565 41469 -44461 115001 40521 27219
1221B7219N8964k45671L6505k1443K5384j5380p9967Q2960M2760J44088K2484
$$ 27219 86183 -159488 -122983 -144426 -119042 -134422 -214389 -131429 -88669 55419 77903
1210G7903p6146Q0494m2692j66424l6237J9401J52507J6568l5183p8733J07757
$$ 77903 1757 82251 39559 -126865 -163102 -143701 8806 25374 -9809 -88542 19215
1199A9215J2404n7739J18926L5625K4j04137j03948k06424K30576Q7857j16693
$$ 19215 31619 -26120 92806 128431 128455 24318 -79630 -286054 -55478 32379 -84314
1188h4314j17136K11157l8237O2114M8127J4815j6758o0807J4128j71466K56158
$$ -84314 -201450 9707 -28530 33584 81711 96526 79768 18961 33089 -138377 117781
1177A17781j25465L0481J594R3328N5790n2650j36738j07385K07972N5478M8776
$$ 117781 -7684 22797 24391 117719 173509 120859 -15879 -123264 84708 140186 188962
1166A88962q2662L6012j25230j3012R2243j35017J02313j59888j76639p3203M5190
$$ 188962 106300 142312 17082 4070 96313 -38704 63609 -96279 -272918 -346121 -300931
1155c00931K06491J31966J4991O3154j75665J5908J29340j7239n2111o2192j08009
$$ -300931 -94440 37526 52517 115671 -59994 -44086 85254 68015 15904 -46288 -154297
1144a54297K4924K26838j55110M6875j53071R3128J18843j05758O2524M2621P6607
$$ -154297 -129373 97465 -57645 -10770 -163841 -70713 48130 -57628 4896 47517 124124
1133A24124j69014J65002j68812L8104K7029l1491k2190L7514L1250j56185J9464
$$ 124124 -44890 120112 -48700 -10596 16433 -15058 -37248 266 31516 -124669 -105205
1122a05205K2672K11818q6959p8966p2522o6227j21098P3538J55337n0975o6342
$$ -105205 -82533 129285 42326 -36640 -109162 -175389 -296487 -222949 -67612 -118587 -184929
1111a84929k3866n3241J54904o4263P2257M7502j00214J07787J7899J51455j90444
$$ -184929 -208795 -262036 -107132 -171395 -99138 -51636 -151850 -44063 -26164 125291 -65153
1100f5153q6976J37781j17283R2742K8380N8253l9124j47661m215J03849J13116
$$ -65153 -152129 -14348 -131631 -38889 -10509 47744 8620 -139041 -143256 -39407 73709
1089G3709k27427m5049J4637Q5040j25144r3406K52740l1796J68838l2076k3904
$$ 73709 -153718 -198767 -184130 -99090 -224234 -317640 -64900 -96696 72142 40066 16162
1078A6162J26170n8641o9385O2436j07855J17205N2981j10J96209k76740k11260
$$ 16162 142332 83691 14306 76742 -31113 86092 139073 138963 335172 58432 -152828
1067a52828j03646K80139K09208k7752j06835j29256N1261j05379M795L7211N5310
$$ -152828 -256474 23665 232873 205121 98286 -30970 20291 -85088 -80293 -43082 12228
1056A2228j59032k7296M4874k9213Q7352r9664L5928K54044O6632k24035j27542
$$ 12228 -146804 -174100 -129226 -158439 -71087 -170751 -134823 119221 185853 -38182 -165724
1045a65724J7654M0847M3628j7867J61352R307n6371j76336J92551L6290j42909
$$ -165724 -148070 -107223 -63595 -81462 79890 89197 32826 -143510 49041 85331 -57578
1034e7578m2613n5080J48146l5615J15064n504Q5862K1740k88484o3965J30510
$$ -57578 -100191 -155271 -7125 -42740 72324 66820 152682 174422 -114062 -178027 -47517
1023d7517L8581m2937J88247K4045O0494r752k32961j00566R7588J60182q7054
$$ -47517 -8936 -51873 136374 160419 220913 211161 -21800 -122366 -24778 135404 48350
1012D8350K4117j2335P0382l2926n8761k51648J67312j3417j1926k1075P8234
$$ 48350 72467 60132 130514 97588 38827 -212821 -45509 -58926 -70852 -91927 -13693
1001a3693J12455j69379k0083J67339M4111n7991q6712q078q4462N0178q4545
$$ -13693 98762 -70617 -90700 76639 120750 62759 -23953 -32031 -116493 -66315 -150860
990a50860l6879j50129J05270K07397r0003O4040p7950K3640j5183K40870K8287
$$ -150860 -187739 -337868 -232598 -25201 -115204 -51164 -129114 -105474 -120657 120213 148500
979A48500k59433p2945o8732l3626J05839J30417r9140L0640N2213J30457q1408
$$ 148500 -110933 -183878 -252610 -286236 -180397 -49980 -149120 -118480 -66267 64190 -17218
968a7218r5112K3251j09207J27339M0592P8531j4273J09866k10636J17792k5137
$$ -17218 -112330 -89079 -198286 -70947 -30355 48176 33903 143769 -66867 50925 25788
957B5788l2938k50736j240N9805J6770p1823N1980J55598l5468N7576p8600j3371
$$ 25788 -7150 -257886 -259126 -199321 -182551 -254374 -202394 -46796 -82264 -24688 -103288 -116659
945a16659R2896K23891r2328j75735p360J88667j02507r211k0847q6240J93616
$$ -116659 -23763 200128 107800 -67935 -75295 113372 10865 1654 -19193 -105433 88183
934H8183p717j47916j03902L9990M1612p343j168O4924j6457j08434j23448J19438
$$ 88183 80466 -67450 -171352 -131362 -89750 -97093 -98261 -33337 -49794 -158228 -281676 -162238
922a62238m0326p4468K38903J91478k8693m01523K08233k6180K2642j16167r8826
$$ -162238 -202564 -277032 -38129 153349 124656 -276867 -68634 -94814 -72172 -188339 -287165
911b87165L60255J41981j5980k67608r9430J27934j9286j11720j839J63500j86306
$$ -287165 73090 215071 199091 -68517 -167947 -40013 -59299 -171019 -172858 -9358 -195664
900a95664J46931R522k75761L8628r4797J22749k9546K6009K01493k1549j6895
$$ -195664 -48733 -39211 -314972 -276344 -371141 -248392 -277938 -251929 -50436 -71985 -88880
889h8880Q9426r688o051j97090J38916K4346J15001q2094j63945J87718R5896
$$ -88880 546 -9142 -15193 -212283 -73367 -49021 65980 -16114 -180059 7659 103555
878A03555j93372j08046N3017K02430O3014k15170L5846M1511k1161J19852l5260
$$ 103555 -89817 -197863 -144846 57584 120598 -94572 -58726 -17215 -38376 81476 46216
867D6216k4417m0969j19984j7261k9444L2336R0766N7384n5923o9969j74241J91358
$$ 46216 21799 -19170 -139154 -156415 -185859 -153523 -62757 -5373 -61296 -131265 -305506 -114148
855a14148J30289k25695N7035j9525l4123O1450p0341k2404J10822l8691j8668
$$ -114148 16141 -209554 -152519 -172044 -206167 -144717 -215058 -237462 -126640 -165331 -183999
844a83999K12902q435K5574k12225J27136l7007j17251j4013O8539q9420L0600
$$ -183999 28903 20468 46042 -166183 -39047 -76054 -193305 -207318 -138779 -228199 -197599
833a97599K42736n0023J6974J465j91959j0484J46871O5309p732q2807K48724
$$ -197599 45137 -4886 12088 13553 -178406 -188890 -42019 23290 15558 -67249 181475
822A81475q8209j32768O3160j7262r608N2035j2440m4555O1629m6411k52337J55584
$$ 181475 93266 -39502 23658 6396 -3212 48823 36383 -8172 53457 7046 -245291 -89707
810h9707Q1537j22156O7406J54445j82608j01038J03199k02940J53691K40143
$$ -89707 -8170 -130326 -62920 91525 -91083 -192121 -88922 -291862 -138171 101972
800A01972l1087n8944j63804p167J24544J9673j32404M4067K13675P5442N340
$$ 101972 70885 11941 -151863 -159030 -34486 -14813 -147217 -103150 110525 185967 191307
789A91307p5751j92558j96527l3887M3850J91179K01311k34043K2555J03499N093
$$ 191307 115556 -77002 -273529 -307416 -263566 -72387 128924 -105119 -82564 20935 26028
778B6028P1400n9880r5717K8321P850j74770M7802k24385O9476N1908o8084K34508
$$ 26028 97428 37548 -58169 -29848 -21998 -196768 -148966 -373351 -303875 -251967 -320051 -85543
766h5543K65917p7409j73020n3513P6045J5568j72207J37779J57255j6253n2086
$$ -85543 180374 102965 -70055 -123568 -47523 -31955 -204162 -66383 90872 74619 22533
755B2533j56591P0557M1486l0329O0194O0238L2078q5164j8178L8081k04246l3845
$$ 22533 -134058 -63501 -22015 -52344 7850 68088 100166 15002 -3176 34905 -169341 -203186
743b03186m578r3364J18288O8224j13932j26144O1686J46216j36937J04243K36956
$$ -203186 -207764 -301128 -182840 -114616 -228548 -354692 -293006 -146790 -283727 -179484 57472
732E7472k4238J14659p8502j63526K23968o561k54511J93869J9681j84932j60997
$$ 57472 33234 147893 69391 -94135 129833 123272 -131239 62630 82311 -102621 -263618
721b63618M6666J51524n1934P6310m2753m8704l7701k8222J61483K228L833J7119
$$ -263618 -216952 -65428 -117362 -41052 -83805 -132509 -170210 -198432 -36949 -34721 -30888 -13769
709a3769R6530J16610j50314j16668k05816J03971K47983j89845k35513J90286
$$ -13769 82761 199371 49057 -67611 -273427 -169456 78527 -111318 -346831 -156545
699a56545K14616J5971J1292l3549M2201P812j04185J03980q5109r0257N0160
$$ -156545 58071 74042 85334 51785 93986 101798 -2387 101593 16484 -73773 -23613
688b3613M3027J7280j71579j22453l2372L80423L3299j28994j3027q74O5746o3039
$$ -23613 19414 36694 -134885 -257338 -289710 90713 124012 -4982 -18009 -18883 46863 -16176
676a6176r1369J77094j44964p4639q5293j6499J27895R5416r3308J3182o0374
$$ -16176 -107545 69549 -75415 -150054 -235347 -251846 -123951 -28535 -121843 -108661 -169035
665a69035J07752J576R1833j68597j9431J49629L1341J61639j58654M7962Q0375
$$ -169035 -61283 -59707 32126 -136471 -155902 -6273 25068 186707 28053 76015 156390
654A56390M0971l19306K2732k9708j89283J31852n2867J03566R3417J07734j64134
$$ 156390 197361 -121945 -99213 -128921 -318204 -186352 -239219 -135653 -42236 65498 -98636
643i8636j46355O1188l6168J00268J83056j29811k2381N6237n1214j2593n7912
$$ -98636 -244991 -183803 -219971 -119703 63353 -66458 -88839 -32602 -83816 -96409 -154321
632a54321J55413N9473j15114j52989K44388M9841o293k7422j68866k5417K49983
$$ -154321 1092 60565 -54549 -207538 36850 86691 80398 52976 -115890 -141307 108676
621A08676j20590k80651K5493K12910J06612j08802l4830j90164N0038L77974
$$ 108676 -11914 -292565 -267072 -54162 52450 -56352 -91182 -281346 -231308 146666
611A46666J82211j19878o4997j18389k54705j24661J19746J2570K46436K28709
$$ 146666 328877 208999 144002 25613 -229092 -353753 -234007 -221437 24999 253708
601B53708j16600l824q1659J00882k70102j35786M5364K09296p9914j44479m1748
$$ 253708 137108 133284 51625 152507 -117595 -253381 -208017 1279 -78635 -223114 -264862
590b64862j7421K58321K22139j34884m3023j25058R8372j18523k00374O7476q6103
$$ -264862 -282283 -23962 198177 63293 20270 -104788 -6416 -124939 -325313 -257837 -343940
579c43940J28459j02282M5379N6564J27633J00894p3237L6026K9057j39198j1559
$$ -343940 -215481 -317763 -272384 -215820 -88187 12707 -60530 -24504 4553 -134645 -146204
568a46204K18166o0036n2143k28173K4718J25419M261J37533j57143l9698K39216
$$ -146204 71962 11926 -40217 -268390 -243672 -118253 -113992 23541 -133602 -173300 65916
557F5916n5511L9699M6801k17965N9441L4816J37685j17878K648J46059j42486
$$ 65916 10405 50104 96905 -121060 -61619 -26803 110882 -6996 -4348 141711 -775
546g75q2282K4051p2796J80246k4983k20664J87818J75619k6967P1979R5750k31274
$$ -775 -83057 -59006 -131802 48444 23461 -197203 -9385 166234 139267 211246 306996 75722
534G5722l65835l8201J40199k1111K9709M4277J8369p6975J53396J4724j5418
$$ 75722 -290113 -328314 -188115 -209226 -179517 -135240 -116871 -193846 -40450 -25726 -41144
523d1144j57294j66863J58714K7414K48708j87263l30218K33108l2608Q4277j07664
$$ -41144 -198438 -365301 -206587 -179173 69535 -117728 -447946 -214838 -247446 -163169 -270833
512b70833J10755J30169j65226J44313l8152K2945P5251q8944L924j8283j38735
$$ -270833 -160078 -29909 -195135 -50822 -88974 -66029 9222 -79722 -75798 -94081 -232816
501b32816o91J28632M0550j8616J38006k27995k2091O5255J46263N1497k06256
$$ -232816 -233507 -104875 -64325 -82941 55065 -172930 -195021 -129766 16497 67994 -138262
490a38262L4967P0324L3828R0634k55522K2989P2933j36031J68096J71731p3055
$$ -138262 -103295 -32971 857 91491 -164031 -141042 -68109 -204140 -36044 135687 62632
479F2632j15055j2908K5828j022Q6286q8184p2373J77494j62185Q0830l8506n4243
$$ 62632 -52423 -65331 -39503 -40525 45761 -42423 -114796 62698 -99487 -18657 -57163 -111406
467a11406J16346l08957N8629L2042J54001j02927l743R2243J9188k2998l02197
$$ -111406 4940 -304017 -245388 -213346 -59345 -162272 -166015 -73772 -54584 -77582 -379779
456c79779P0972P3303N8059K55584j28381j07338M4627n2513J4187J70257J29851
$$ -379779 -308807 -235504 -177445 78139 -50242 -157580 -112953 -165466 -151279 18978 148829
445A48829J22117m06788O5997O1475K1534M8171o4726j09742o8337J66438j6787
$$ 148829 270946 -135842 -69845 -8370 13164 61335 -3391 -113133 -181470 -15032 -31819
434c1819o9326k3497J13329n7705P244j83784N0714K48815j78266J793R5241j45272
$$ -31819 -101145 -124642 -11313 -69018 -61774 -245558 -194844 53971 -124295 -122502 -27261 -172533
422a72533K56480K21420j08558k68216M2239O7189R279M8640q8260J9391M6096
$$ -172533 83947 305367 196809 -71407 -29168 38021 47300 95940 7680 27071 73167
411G3167j23563N464k78282m392J3701P4864J75154K6884j83735O4895j5730o484
$$ 73167 -50396 -44932 -323214 -327606 -313905 -239041 -63887 -37003 -220738 -155843 -171573 -178057
399a78057k6909J21905N8895m8257r541n1430J25983r8373j77603K22350M5012
$$ -178057 -204966 -83061 -24166 -72423 -81964 -133394 -7411 -105784 -283387 -61037 -16025
388a6025l41110Q6373J74367l9028K5138k9206j3811k842J74505j34460j24737
$$ -16025 -357135 -270762 -96395 -135423 -110285 -139491 -153302 -156144 18361 -116099 -240836
377b40836k69795J39567K25271j2482M8377P0950J9536r8660L4403J22519j21203
$$ -240836 -510631 -371064 -145793 -158275 -109898 -38948 -19412 -118072 -83669 38850 -82353
366h2353p0767j16013O8943O0526r0531J59432L5775O6353j19946j68504o7731
$$ -82353 -153120 -269133 -200190 -139664 -230195 -70763 -34988 31365 -88581 -257085 -324816
355c24816J93151J095J33985q0280p9048J48089o9520o3957J05791o3112k1805
$$ -324816 -131665 -130570 3415 -76865 -155913 -7824 -77344 -141301 -35510 -98622 -120427
344a20427O4182J25695k80557j44823J70913L8430O5674M9681p2715j63504k9559
$$ -120427 -56245 69450 -211107 -355930 -185017 -146587 -80913 -31232 -103947 -267451 -297010
333b97010J2238J27315q9839P9313j53593j66399K61489p3048M3623J33478m3321
$$ -297010 -284772 -157457 -247296 -167983 -321576 -487975 -226486 -299534 -255911 -122433 -165754
322a65754J77478R2740J05705j10050j83862k52396Q358J56919M4369j00131J29768
$$ -165754 11724 104464 210169 100119 -83743 -336139 -327781 -170862 -126493 -226624 -96856
311i6856R5427k26436l6242L8702K01700r0812J6294J5709K5146r7708Q6843k53085
$$ -96856 -1429 -227865 -264107 -225405 -23705 -114517 -98223 -82514 -57368 -155076 -68233 -321318
299c21318N4276p9360J11760J15397L0289j63364J39543J21848J3163j22867j35458
$$ -321318 -267042 -346402 -234642 -119245 -88956 -252320 -112777 9071 22234 -100633 -236091
288b36091r113n7223J03226q4535Q0196P8520p3218m8126O663k3047j7581l5216
$$ -236091 -245204 -302427 -199201 -283736 -203540 -125020 -198238 -246364 -239701 -262748 -280329 -315545
276c15545K6621r6405J30813J30591p9858l7379J73488O4464l69336L51547K06187
$$ -315545 -288924 -385329 -254516 -123925 -203783 -241162 -67674 -3210 -372546 -20999 185188
265A85188k25387r5278j12959n7178N8696K04654K01834j27060k46087J30571
$$ 185188 -40199 -135477 -248436 -305614 -246918 -42264 159570 32510 -213577 -83006
255h3006n7746j56715l1395J35161j1997J99888J32443l064r6295M7773l2832
$$ -83006 -140752 -297467 -328862 -193701 -205698 -5810 126633 123569 27274 75047 42215
244D2215J8091j78265m2653J06061j26867o0582m8516K30454j58194j90433L4232
$$ 42215 60306 -117959 -160612 -54551 -181418 -242000 -290516 -60062 -218256 -408689 -374457
233c74457j10314j5399J25801J10708O0351k648R4065K89184j06544j80460k81356
$$ -374457 -484771 -500170 -374369 -263661 -203310 -205958 -111893 177291 70747 -109713 -391069
222c91069J13749j24611O2113L46948N3262k68221k1225O4565K1868k2829k78597
$$ -391069 -277320 -401931 -339818 7130 60392 -207829 -229054 -164489 -142621 -165450 -444047
211d44047K02039J62942n6856J28285J82653q7402j79062L4564P3618j35014j20408
$$ -444047 -242008 -79066 -135922 -7637 175016 87614 -91448 -56884 16734 -118280 -238688
200b38688L9508Q6510P4473k01981k6895j56057p4771J97648J87771N4560j13089
$$ -238688 -199180 -112670 -38197 -240178 -267073 -423130 -497901 -300253 -112482 -57922 -171011
189a71011j02189L2173K37648J45389k09396j43514M9164L5721k17801q7240J18149
$$ -171011 -273200 -241027 -3379 142010 -67386 -210900 -161736 -126015 -343816 -431056 -312907
178c12907J46670O7739l2239J29388r9293r1942M5536R7866P0862r3726l4638
$$ -312907 -166237 -98498 -130737 -1349 -100642 -192584 -147048 -49182 21680 -72046 -106684
167a06684O4090n376j01827N2428J32872q4949L3250l5055l3174k4559m0995J0525
$$ -106684 -42594 -47970 -149797 -97369 35503 -49446 -16196 -51251 -84425 -108984 -149979 -139454
155a39454N531j24654n70j1998J17574m1161J5453K37862Q041q8033j29936q8093
$$ -139454 -133923 -258577 -259147 -271145 -153571 -194732 -179279 58583 66624 -21409 -151345 -239438
143b39438J01967j73316j81850J71924Q2797o7404J23367j03280o3885J68027
$$ -239438 -137471 -310787 -492637 -320713 -237916 -305320 -181953 -285233 -349118 -181091
133a81091J9141Q3969k2870O0699k2679K2361j75316j06828J0170R2497L5589
$$ -181091 -161950 -77981 -100851 -40152 -62831 -40470 -215786 -322614 -312444 -219947 -184358
122a84358j46488J52895R7028J7570K0073m2735l3334R7871o1796O9783j17252
$$ -184358 -330846 -177951 -80923 -63353 -43280 -86015 -119349 -21478 -83274 -13491 -130743
111a30743k4001p4152K3251J00851O9474m9675r2905J04699L2962j49621o2151
$$ -130743 -154744 -228896 -205645 -104794 -35320 -84995 -177900 -73201 -40239 -189860 -252011
100b52011k9525J05656j1400k2894P22k3539N8589l8957o8560j819J29829j0545
$$ -252011 -281536 -175880 -187280 -210174 -209452 -232991 -174402 -213359 -281919 -283738 -153909 -164454
88a64454R628K9134J2159l0367l8210N3419r29J06566k5796p5140m4615Q6896
$$ -164454 -154826 -125692 -113533 -143900 -182110 -128691 -129620 -23054 -48850 -123990 -168605 -81709
76h1709k7343j847r1975j48305J54761m5518J47359j07785Q4632J8434j44599
$$ -81709 -109052 -110899 -202874 -351179 -196418 -241936 -94577 -202362 -117730 -99296 -243895
65b43895l2475J57801j1387J64065o2439r5917J7857k6935j09291j10415K06276
$$ -243895 -276370 -118569 -129956 34109 -28330 -124247 -106390 -133325 -242616 -353031 -146755
54a46755n0001j43238N9654Q6520j23261R6922n5471J02461N0762r5410L1438
$$ -146755 -196756 -339994 -280340 -193820 -317081 -220159 -275630 -173169 -122407 -217817 -186379
43a86379K8097J3161o9510J43106O8993Q4986j74244j54999J7164R8949P2683
$$ -186379 -158282 -145121 -214631 -71525 -2532 82454 -91790 -246789 -229625 -130676 -57993
32e7993m208j01479n3388J5549M5179p1269o8721R2108k0933N8090l5011J3449
$$ -57993 -62201 -163680 -217068 -201519 -156340 -227609 -296330 -204222 -225155 -167065 -202076 -188627
20a88627J13922J290o986J23868j63604j15168n5980J8301j03519J10251Q1886
$$ -188627 -74705 -73415 -80401 43467 -120137 -235305 -291285 -272984 -376503 -266252 -184366
9a84366k2917P0213L9157N0095O485r8118J1504R2223j09979
$$ -184366 -207283 -137070 -97913 -47818 -41333 -139451 -127947 -35724 -145703
0a45703
$$ -145703
$$ Imaginary data points
##PAGE= N=2
##DATA TABLE= (X++(I..I)), XYDATA
16383e409259J16873J54638J06509l7921O8173K817J27724K13721l1092K30548
$$ -5409259 -5292386 -5137748 -5031239 -5069160 -5000987 -4998170 -4870446 -4656725 -4687817 -4457269
16373d457269L4580p8190J06021J18300L5195Q8647M6567O3678L7341K01144j7666
$$ -4457269 -4422689 -4500879 -4394858 -4276558 -4241363 -4152716 -4106149 -4042471 -4005130 -3803986 -3821652
16362c821652J40770L5170J09802K5442J40728N4832Q575P524O3597J03593J26087
$$ -3821652 -3680882 -3645712 -3535910 -3510468 -3369740 -3314908 -3306333 -3298809 -3235212 -3131619 -3005532
16351c005532K9675L5572J90722J19199K5466k9666O3117k054J16074J73406n9331
$$ -3005532 -2975857 -2940285 -2749563 -2630364 -2604898 -2634564 -2571447 -2573501 -2457427 -2284021 -2343352
16340b343352Q2253J56345K3116J20887J46074k9447J12158K5463P224J47397
$$ -2343352 -2261099 -2104754 -2081638 -1960751 -1814677 -1844124 -1731966 -1706503 -1699279 -1551882
16330a551882K851J4871J43879J66971L3911J32524P4765K7515M2372K24285O1682
$$ -1551882 -1549031 -1534160 -1390281 -1223310 -1189399 -1056875 -982110 -954595 -912223 -687938 -626256
16319f26256k10139J81249J25379N441J54794J2603K28059k6338P7772J74332
$$ -626256 -836395 -655146 -529767 -524326 -369532 -356929 -128870 -155208 -77436 96896
16309I6896l6961r9999R1306J48796J09331p1883K2653R3848Q4719J90706l0915
$$ 96896 59935 -40064 51242 200038 309369 237486 260139 353987 438706 629412 598497
16298E98497o1818M6756O6659J91009k405K5498O1693N3842J65042J20609Q3741
$$ 598497 536679 583435 650094 841103 838698 864196 925889 979731 1144773 1265382 1349123
16287A349123J668j0087P119L0252J76785L6962L8616O112P449K6406J63772J07107
$$ 1349123 1350791 1340704 1347823 1378075 1554860 1591822 1630438 1636550 1643999 1670405 1834177 1941284
16275A941284J06508M2015k391J62856K380J497o0050R4735q935n4558J75659
$$ 1941284 2047792 2089807 2087416 2250272 2252652 2254149 2194099 2288834 2279899 2225341 2401000
16264B401000L621Q5423j40289J06107P197N7140J62316p896Q7587K00216R630
$$ 2401000 2404621 2490044 2349755 2455862 2463059 2520199 2682515 2674619 2762206 2962422 2972052
16253B972052k40811q059J27143K12332J9066J07734j43316J28307J61436r6969
$$ 2972052 2731241 2723182 2850325 3062657 3081723 3189457 3046141 3174448 3335884 3238915
16243C238915K066O7567K06361J48257j32846j8438j27715J34733J55280Q0738
$$ 3238915 3240981 3308548 3514909 3663166 3530320 3511882 3384167 3518900 3674180 3754918
16233C754918R0048j7802J0772o5162k71771L11381K2763O0173J82697O6484J0192
$$ 3754918 3844966 3827164 3837936 3772774 3501003 3812384 3835147 3895320 4078017 4144501 4154693
16222D154693k870J10845j8425J0949j09998m5902M1972R9282J20737m4495M2353
$$ 4154693 4151823 4262668 4244243 4255192 4145194 4099292 4141264 4240546 4361283 4316788 4359141
16211D359141j01236o9865J51060J63175J39121l414K0385J48902K9921m1935
$$ 4359141 4257905 4188040 4339100 4502275 4641396 4637982 4658367 4807269 4837190 4795255
$$ [...]
##END NTUPLES=NMR SPECTRUM
##END=
