##TITLE=1H_CA-9181-1
 CDCl3
 8 sc, 
 1.8.2023
##JCAMPDX= 6.0         $$ Bruker NMR JCAMP-DX V2.0
##DATA TYPE= NMR SPECTRUM
##DATA CLASS= NTUPLES
##ORIGIN= UXNMR, Bruker Analytische Messtechnik GmbH
##OWNER= root
$$ XWIN-NMR		Version 3.5
$$ Tue Aug  1 13:53:10 2023 Russian Standard Time (UT+4h)  she@DPX200
##.OBSERVE FREQUENCY= 200.13135
##.OBSERVE NUCLEUS= ^1H
##.ACQUISITION MODE= SIMULTANEOUS
##.ACQUISITION SCHEME= undefined
##.AVERAGES= 8
##.DIGITISER RES= 18
##SPECTROMETER/DATA SYSTEM= spect
##.PULSE SEQUENCE= zg30
##.SOLVENT NAME= CDCl3
##.SHIFT REFERENCE= (INTERNAL, CDCl3, 0, 15.7744)
##AUDIT TRAIL= $$ (NUMBER, WHEN, WHO, WHERE, WHAT)
$$ ##TITLE= Audit trail, XWIN-NMR		Version 3.5
$$ ##JCAMPDX= 5.01
$$ ##ORIGIN= Bruker BioSpin GmbH
$$ ##OWNER= she
$$ F:/spectra/data/she/nmr/H-F/1/pdata/1/auditp.txt
$$ ##AUDIT TRAIL=  $$ (NUMBER, WHEN, WHO, WHERE, WHAT)
(   1,<2023-08-01 13:51:04.07 +0400>,<she>,<DPX200>,
      <created by zg, POWCHK disabled, PULCHK disabled
       configuration hash MD5:
       00 E9 B6 7A A2 85 ED C7 34 08 36 98 17 FE 4E 26
       data hash MD5: 16K
       ED ED 68 A6 02 42 6A 8D 37 3A 31 D2 0B 56 AC F9>)
(   2,<2023-08-01 13:51:06.48 +0400>,<she>,<DPX200>,
      <Start of raw data processing
       efp BC_mod = 2 LB = 0.24 FT_mod = 6 PKNL = 1 PHC0 = -21030.95 PHC1 = -5.747281 SI = 16K 
       data hash MD5: 16K
       61 52 C4 09 68 B6 2E B1 B0 CD B1 AC 50 E5 24 73>)
(   3,<2023-08-01 13:51:43.09 +0400>,<she>,<DPX200>,
      <pk PHC0 = -154.336 PHC1 = -4 
       data hash MD5: 16K
       33 E9 97 30 41 06 AF DA 43 69 35 CF E5 60 51 88>)
(   4,<2023-08-01 13:51:46.67 +0400>,<she>,<DPX200>,
      <abs ABSG = 5 
       data hash MD5: 16K
       69 A2 3C CA 2E BB 6D 25 87 3D 30 D4 ED 91 F6 2A>)
(   5,<2023-08-01 13:52:12.07 +0400>,<she>,<DPX200>,
      <pk PHC0 = -2.47789 PHC1 = 3.200001 
       data hash MD5: 16K
       03 11 EA ED 3C C4 9C 73 58 AA F6 80 5F 94 D0 D1>)
(   6,<2023-08-01 13:52:15.93 +0400>,<she>,<DPX200>,
      <abs ABSG = 5 
       data hash MD5: 16K
       C7 A1 CA 48 74 ED 69 38 40 4B EB 4E CC 99 DF 67>)
$$ ##END=
$$ 
$$ hash MD5
$$ 92 BD 55 4A 73 B5 39 82 19 C1 4F DD C9 33 A5 5E
##$RELAX= 
##$RELAX= 
##$RELAX= 
##$RELAX= 
##$RELAX= 
##$RELAX= 
$$ Bruker specific parameters
$$ --------------------------
##$DU= <F:/spectra>
##$EXPNO= 1
##$NAME= <H-F>
##$PROCNO= 1
##$TYPE= <nmr>
##$USER= <she>
##$AMP= (0..31)
100 100 100 100 100 100 100 100 100 100 100 100 100 100 100 100 100 100 
100 100 100 100 100 100 100 100 100 100 100 100 100 100 
##$AQSEQ= 0
##$AQ_mod= 1
##$AUNM= <au_zg>
##$AUTOPOS= <>
##$BF1= 200.13
##$BF2= 200.13
##$BF3= 200.13
##$BF4= 200.13
##$BF5= 200.13
##$BF6= 200.13
##$BF7= 200.13
##$BF8= 200.13
##$BYTORDA= 1
##$CFDGTYP= 0
##$CFRGTYP= 5
##$CHEMSTR= <none>
##$CNST= (0..31)
1 1 145 1 1 1 1 1 1 1 1 1 1 1 1 1 1 1 1 1 1 1 1 1 1 1 1 1 1 1 1 1 
##$CPDPRG= <>
##$CPDPRG1= <>
##$CPDPRG2= <>
##$CPDPRG3= <>
##$CPDPRG4= <mlev>
##$CPDPRG5= <mlev>
##$CPDPRG6= <mlev>
##$CPDPRG7= <mlev>
##$CPDPRG8= <mlev>
$$ [...]
##$SUBNAM3= <"">
##$SUBNAM4= <"">
##$SUBNAM5= <"">
##$SUBNAM6= <"">
##$SUBNAM7= <"">
##$SUBNAM8= <"">
##$SUBNAM9= <"">
##$SW= 18.05172834244
##$SWIBOX= (0..15)
0 0 2 0 0 0 0 0 0 0 0 0 0 0 0 0 
##$SW_h= 3612.71676300578
##$TD= 16384
##$TD0= 1
##$TE= 0
##$TE2= 300
##$TE3= 300
##$TEG= 300
##$TL= (0..7)
0 120 120 120 120 120 120 120 
##$TP= (0..7)
150 150 150 150 150 150 150 150 
##$TP07= 0
##$TPNAME0= <>
##$TPNAME1= <>
##$TPNAME2= <>
##$TPNAME3= <>
##$TPNAME4= <>
##$TPNAME5= <>
##$TPNAME6= <>
##$TPNAME7= <>
##$TPOAL= (0..7)
0.5 0.5 0.5 0.5 0.5 0.5 0.5 0.5 
##$TPOFFS= (0..7)
0 0 0 0 0 0 0 0 
##$TUNHIN= 0
##$TUNHOUT= 0
##$TUNXOUT= 0
##$USERA1= <user>
##$USERA2= <user>
##$USERA3= <user>
##$USERA4= <user>
##$USERA5= <user>
##$V9= 5
##$VALIST= <valist>
##$VCLIST= <CCCCCCCCCCCCCCC>
##$VD= 0
##$VDLIST= <DDDDDDDDDDDDDDD>
##$VPLIST= <PPPPPPPPPPPPPPP>
##$VTLIST= <TTTTTTTTTTTTTTT>
##$WBST= 1024
##$WBSW= 4
##$XGAIN= (0..3)
0 0 0 0 
##$XL= 0
##$YL= 0
##$YMAX_a= 373743
##$YMIN_a= -239471
##$ZGOPTNS= <>
##$ZL1= 120
##$ZL2= 120
##$ZL3= 120
##$ZL4= 120
##$ABSF1= 15.72485
##$ABSF2= -2.327
##$ABSG= 5
##$ABSL= 3
##$ALPHA= 0
##$AQORDER= 0
##$ASSFAC= 0
##$ASSFACI= 0
##$ASSFACX= 0
##$ASSWID= 0
##$AUNMP= <proc_1d>
##$AZFE= 0.1
##$AZFW= 0.1
##$BCFW= 0
##$BC_mod= 2
##$BYTORDP= 0
##$COROFFS= 0
##$CY= -3
##$DATMOD= 1
##$DC= 0
##$DFILT= <>
##$DTYPP= 0
##$F1P= 0
##$F2P= 0
##$FCOR= 1
##$FTSIZE= 16384
##$FT_mod= 6
##$GAMMA= 0
##$GB= 0
##$INTBC= 1
##$INTSCL= 3.70164e-10
##$ISEN= 128
##$LB= 0.24
##$LEV0= 0
##$LPBIN= 0
##$MAXI= 10000
##$MC2= 0
##$MEAN= 0
##$ME_mod= 0
##$MI= 1.114404
##$NCOEF= 0
##$NC_proc= -6
##$NLEV= 6
##$NOISF1= 3.799351
##$NOISF2= 2.8
##$NSP= 0
##$NTH_PI= 0
##$NZP= 0
##$OFFSET= 15.77444
##$PC= 1
##$PHC0= -21187.77
##$PHC1= -6.54728
##$PH_mod= 1
##$PKNL= yes
##$PPARMOD= 0
##$PSCAL= 0
##$PSIGN= 0
##$REVERSE= no
##$SF= 200.129999420236
##$SI= 16384
##$SIGF1= 3
##$SIGF2= 2
##$SINO= 5.538805
##$SIOLD= 16384
##$SREGLST= <1H.CDCl3>
##$SSB= 0
##$STSI= 16384
##$STSR= 0
##$SW_p= 3612.71676300578
##$SYMM= 0
##$S_DEV= 0
##$TDeff= 16384
##$TDoff= 0
##$TI= <>
##$TILT= no
##$TM1= 0
##$TM2= 0
##$TOPLEV= 0
##$USERP1= <user>
##$USERP2= <user>
##$USERP3= <user>
##$USERP4= <user>
##$USERP5= <user>
##$WDW= 1
##$XDIM= 16384
##$YMAX_p= 317254850
##$YMIN_p= -241544
$$ End of Bruker specific parameters
$$ ---------------------------------
##NTUPLES= NMR SPECTRUM
##VAR_NAME=  FREQUENCY,     SPECTRUM/REAL,   SPECTRUM/IMAG
##SYMBOL=    X,             R,               I
##VAR_TYPE=  INDEPENDENT,   DEPENDENT,       DEPENDENT
##VAR_FORM=  AFFN,          ASDF,            ASDF
##VAR_DIM=   16384,         16384,           16384
##UNITS=     HZ,            ARBITRARY UNITS, ARBITRARY UNITS
##FACTOR=    0.220516191357247, 1,           1
##FIRST=     3156.93863037138, 0,            0
##LAST=      -455.778132634402, 0,           0
##MIN=       -455.778132634402, -241544,     0
##MAX=       3156.93863037138, 317254850,    0
$$ Real data points
##PAGE= N=1
##DATA TABLE= (X++(R..R)), XYDATA
$$ [...]
7862e7823k3731Q979M626J2365M4598k4538j4977K4349n048J875K8330j9728r172
7849b9895n777L6560K660n0266R820n345j5430K704o0J2657j6657m646j6935k927
7835h3537j1318N397K7881J8204k7545k0923K2627P956O469k0341m2169j9314
7823a36613O0203j4123l0767j7944l4131O3710j250R762J4521l4437l0005K7463
7811a23611J0390l3298j9476M353j3712L7640M72528r6968j87326l2447o1468
7800d3395J5457j1405j4312k2313q478k4188L3260L1154N447R54o368k459P737
7787c8909j9041k6375J624K0270n559o31P616J9342q155r590m3968j4921j7776
7774a36073M05J4690K0067j6474K5192q48o736l958M300k4558O300J9057j2876
$$ plain form
7862 -57823 -81554 -72575 -67949 -55584 -10986 -35524 -50501 -26152 -31200 -29325 -995 -20723 -29895
7849 -29895 -35672 888 3548 -46718 -36898 -42243 -57673 -54969 -55029 -42372 -59029 -63675 -80610 -83537
7835 -83537 -94855 -89458 -61577 -43373 -70918 -91841 -69214 -61258 -54789 -75130 -117299 -136613
7823 -136613 -76410 -90533 -121300 -139244 -173375 -109665 -110915 -101153 -86632 -121069 -151074 -123611
7811 -123611 -113221 -146519 -165995 -161642 -175354 -137714 334814 237846 50520 18073 -43395
7800 -43395 -27938 -39343 -53655 -75968 -84446 -108634 -75374 -44220 -38773 -37819 -44187 -46646 -38909
7787 -38909 -57950 -84325 -82701 -62431 -67990 -68621 -61005 -41663 -49818 -59408 -103376 -118297 -136073
7774 -136073 -135668 -120978 -100911 -117385 -92193 -93041 -99777 -103735 -99435 -123993 -117693 -98636 -111512
7761a11512l0512J0065J4799k8957m546J6424K5494P985k9928M210L4841l115
7749i4752l8411k4129J772J6953N280K013M4789j2680k1209j8900n317M5453J4847
7736h4291J0266j4796j1807j2903J0057J1038j6303K2733j8452j0858j2656k0565
7724a48537J8272k3101J1892j3235O786J2275J3753L6114N42l1697L090j6005
7712a29851J252J4331J3390L526p89l9722J3130J4570j2330j0647K7157l6373
7700a42356j7028L1023l2905J8654K6465R331O995l1036L46l0106L2336K2756
7688a05525n9279J0523J5920j0397K6893j1114k9760L6546k9256J4160P505j6123
7676a49907p052j6733N0867l293J9500j1867k3967L265q305K0473K330k322J80
$$ plain form
7761 -111512 -142024 -131959 -117160 -146117 -150663 -134239 -108745 -100760 -130688 -126478 -91637 -94752
7749 -94752 -133163 -157292 -155520 -138567 -133287 -131274 -86485 -99165 -120374 -139274 -144591 -99138 -84291
7736 -84291 -74025 -88821 -100628 -113531 -103474 -92436 -108739 -86006 -104458 -115316 -127972 -148537
7724 -148537 -130265 -153366 -141474 -154709 -147923 -135648 -121895 -85781 -85239 -116936 -113846 -129851
7712 -129851 -128599 -114268 -100878 -97352 -98141 -137863 -124733 -110163 -122493 -133140 -105983 -142356
7700 -142356 -159384 -128361 -161266 -142612 -116147 -106816 -99821 -130857 -130511 -160617 -128281 -105525
7688 -105525 -164804 -154281 -138361 -148758 -121865 -132979 -162739 -126193 -155449 -141289 -133784 -149907
7676 -149907 -156959 -173692 -122825 -126118 -106618 -118485 -142452 -139187 -147492 -127019 -124689 -127011 -126831
7663a26831R344Q60K9875R734o459k3081O614l6957r975K5331Q246j6831m313
7650a34443k5838K6018J0270j1318K649J5044k8232L4558K222j0805l62J6359
7638a03878P389j5275k899N2200K121l582j5374J0470J4883l32j4484Q920N640
7625e4201J364r95p125K1723k698o617j0923J6596L9386k0060J570J5321M149
7612b510l2980j2696L7452Q491O433N761J6461l2983q482K4496j3912J152O90
7599b627q393K1258j3199k9681J4653K3177j3739K1961N210j3940Q286J7432l1285
7586h87L207p031J6334j0903j4879j4731K1270k6562k0974J7310j1560j0893L078
7573e7221k1370L9699Q014j1692J1767o737k5912J964N634K0555K880k5560k7577
$$ plain form
7663 -126831 -117487 -116627 -86752 -77018 -83477 -106558 -99944 -136901 -146876 -121545 -113299 -130130 -134443
7650 -134443 -160281 -134263 -123993 -135311 -132662 -117618 -145850 -111292 -109070 -119875 -120237 -103878
7638 -103878 -96489 -111764 -114663 -62463 -60342 -63924 -79298 -68828 -53945 -54277 -68761 -59841 -54201
7625 -54201 -52837 -53832 -60957 -39234 -41932 -48549 -59472 -42876 -3490 -23550 -21980 -6659 -2510
7612 -2510 -35490 -48186 -10734 -2243 4190 9951 26412 -6571 -15053 9443 -4469 -3317 -2627
7599 -2627 -11020 10238 -2961 -32642 -17989 5188 -8551 13410 18620 4680 12966 30398 -887
7586 -887 2320 -4711 11623 720 -14159 -28890 -7620 -34182 -55156 -37846 -49406 -60299 -57221
7573 -57221 -78591 -38892 -30878 -42570 -30803 -37540 -63452 -61488 -55854 -35299 -32419 -57979 -85556
7560h5556L6499L0860O278k123k7692L071l7434J0075O3226j7515R389J0672n9298
7547e9548K4846K4308M3171j127k3408J4964J2694o917K4943o604m390J2710L9626
7534I5268K8755l147P858K0893J9577k5611L98L5737K2817n623j6984L5656P36
7521B16330l3035k2953l3797r182k8438p573J4878P393l0295l3535k737n200O52
7508C2508O478Q26m0557l6849L7089K0282L9687R847J7814m81J5980J5551O2068
7495A80243o558p138K2582K4135J0399J72l1398n4614j585j8437R306k2765k9060
7482G5282n5951l4863k2246l857K973j3395p563j9896o034k2269k1855L568q871
7469a34977K1858j4771l3605J0737J6782j8914k2280j8026R519o86j2241K0745
$$ plain form
7560 -85556 -49057 -18197 -11919 -14042 -41734 -38663 -76097 -66022 -2796 -20311 -10922 -250 -59548
7547 -59548 -34702 -10394 32777 31650 8242 23206 35900 28983 53926 47322 42932 55642 95268
7534 95268 124023 120876 128734 149627 169204 143593 143991 179728 202545 196922 179938 215594 216330
7521 216330 183295 160342 126545 117363 88925 81352 96230 103623 73328 39793 37056 31856 32508
7508 32508 38986 39812 -745 -37594 -505 19777 59464 69311 87125 86644 102624 118175 180243
7495 180243 173685 166547 189129 213264 223663 223835 192437 137823 136238 117801 127107 104342 75282
7482 75282 19331 -15532 -37778 -41635 -38662 -52057 -59620 -79516 -85550 -107819 -129674 -126106 -134977
7469 -134977 -113119 -127890 -161495 -150758 -133976 -152890 -175170 -193196 -183677 -184363 -196604 -175859
7457a75859J6556J6786K6070m767R223O51k0336l262j8080o064J5235k3164n97
7444a67608P860l667L605J6698r412j3407N809J2209k4113j1531Q485Q777N027
7431a61268K9470O479q485j8685R924M690k8116N1346O83m7176j0704J3755o298
7418a64385k1317j2016K254L7535j0270J9290j608J0773N602n1534q524J819k434
7405a94815J6315m3080j9964M2767M6664l1478K7599K307N350K1177k4953k2375
7393a74486K5691R857l2022K7817k3796o300m438J0109r681K4980K7055k7875
7381a53089p050j7423j4711K071j4808N264Q699K216K3631J7206m6438K1883m577
7368a77126r712J7511l668J8477K3269l8482R804K4578P761l515k0631N969l2885
$$ plain form
7457 -175859 -159303 -142517 -116447 -121214 -111991 -111340 -131676 -134938 -153018 -159082 -143847 -167011 -167608
7444 -167608 -159748 -163415 -159810 -143112 -152524 -165931 -160122 -147913 -172026 -183557 -175072 -166295 -161268
7431 -161268 -131798 -125319 -133804 -152489 -142565 -137875 -165991 -114645 -113962 -161138 -171842 -158087 -164385
7418 -164385 -185702 -197718 -195464 -157929 -168199 -148909 -150517 -139744 -134142 -185676 -194200 -192381 -194815
7405 -194815 -178500 -221580 -241544 -198777 -152113 -183591 -155992 -153685 -148335 -127158 -152111 -174486
7393 -174486 -148795 -138938 -170960 -143143 -166939 -173239 -177677 -167568 -177249 -152269 -125214 -153089
7381 -153089 -160139 -177562 -192273 -190202 -205010 -199746 -191047 -188831 -165200 -147994 -194432 -172549 -177126
7368 -177126 -186838 -169327 -172995 -154518 -131249 -169731 -159927 -135349 -127588 -131103 -151734 -145765 -178650
7355a78650N545K1419N966j4031P5k0319k1607K6205R549L4312j5048k0534M2317
7342a24801K192j150l5691M449m181j2360K4215r557j732n765K4044K5137M505
7329a10695m2960L3772J6694j0181l2794K2258J4339q804J1874j4405o025J3515
7317a13412j0873k730P42o278j0377J4944J4670k3693k232K1864j2885l0359j7587
7304a78206j2252N0460j4740l3686J3592M5220Q28l1540O775J2496L21l080J5105
7291a28707k2636p485K2064L534Q721J9520j3906j9305K4311R217q250n338L94
7278a17866M8345k4299r241k6573j2805P158J883q923k6290O6398J0461q983O02
7265a00133J6612m738m236Q135l4871j8765L7010j145J657K2234J4226k1144q100
$$ plain form
7355 -178650 -173105 -151686 -145720 -159751 -159676 -179995 -201602 -175397 -165848 -131536 -146584 -167118 -124801
7342 -124801 -122609 -123759 -159450 -155001 -159182 -171542 -147327 -156884 -158616 -164381 -140337 -115200 -110695
7329 -110695 -153655 -119883 -103189 -113370 -146164 -123906 -109567 -118371 -106497 -120902 -126927 -113412
7317 -113412 -124285 -127015 -126273 -132551 -142928 -127984 -113314 -137007 -139239 -117375 -130260 -160619 -178206
7304 -178206 -190458 -139998 -154738 -188424 -174832 -129612 -128784 -160324 -153549 -141053 -140732 -143812 -128707
7291 -128707 -151343 -158828 -136764 -133230 -124509 -104989 -118895 -138200 -113889 -104672 -112922 -118260 -117866
7278 -117866 -69521 -93820 -103061 -129634 -142439 -135281 -133398 -142321 -168611 -102213 -91752 -100735 -100133
7265 -100133 -83521 -88259 -92495 -84360 -119231 -137996 -100986 -102131 -100474 -78240 -64014 -85158 -93258
7252i3258J3556M2576j5320K0500n1198k0309K2422j8853O9697q612m9341j3589
7240a01729K2534N4734o322K7474p673l0989J0828J0463K7771n278j5541p259
7228b0987j3237J8702J0550K6328j0566k1567M2635O851R721K0639n701l3212
7216C0156K8544q679l1024J3098k9045K2663j716j2533J8818j5863r46j7500k7656
7203c1683M0136M650J2020J7174L51k2591k5509l7984o134K0709L1472L9823j1284
7190C1150O986j0839j0831o300P108k019o611K6214J0130o142P345J5776K4385
7177H6352j0320j4542J124M146L452K3734l5547M358K2358M3551L7889P458K8640
7164B02653K0253K2162j1481j4471K1972K4592L8685J1877P623M7028K5371K3768
$$ plain form
7252 -93258 -79702 -37126 -52446 -31946 -83144 -103453 -81031 -99884 -30187 -38799 -88140 -101729
7240 -101729 -79195 -24461 -30783 -3309 -10982 -41971 -31143 -20680 7091 1813 -13728 -20987
7228 -20987 -34224 -15522 -4972 21356 10790 -10777 31858 38709 48430 69069 63368 30156
7216 30156 58700 50021 18997 32095 3050 25713 23997 11464 30282 14419 13473 -4027 -31683
7203 -31683 8453 13103 25123 42297 42648 20057 -5452 -43436 -49570 -28861 2611 42434 31150
7190 31150 38136 27297 16466 10166 17274 15255 8644 34858 44988 38846 46191 61967 86352
7177 86352 76032 61490 62614 66760 70212 93946 58399 62757 85115 128666 166555 174013 202653
7164 202653 222906 245068 233587 219116 241088 265680 304365 316242 323865 370893 396264 420032
7152D20032P1602O0202M7742J02312J31278J01457R3721R9128R2598O6169J3291
7141A299532O953n3179j11674j06528j05381j08246j22451n4816m4299r0153p1959
7130D37799j4220o1541n1234q395j0351n0154M288k725k0906j5401j8719O713
7118A95154l534j767k2557q914m758J6851k313j2159K6618l003K3834j5087o285
7105A82080j3929m1298Q45k4187M649L6617K270J1896j2536J8265L7064j8251
7093A83485L47o020l0999K0515M5456m876J5375J6180L4065O037l7680j2132O711
7080B36464O751M749L3641M1959l6223K7472J5529J5897P9589M8666M5862P9094
7068E99450P4940J04981O6648J01273Q8824K9305k348P694l3336m1547j66619
$$ plain form
7152 420032 491634 551836 599578 701890 833168 934625 1028346 1127474 1220072 1286241 1299532
7141 1299532 1306485 1253306 1141632 1035104 929723 821477 699026 644210 599911 509758 437799
7130 437799 423579 362038 310804 302409 292058 241904 246192 243467 222561 207160 188441 195154
7118 195154 191620 189853 167296 158382 153624 170475 168162 156003 182621 179618 203452 188365 182080
7105 182080 168151 126853 127698 103511 108160 144777 147047 158943 146407 164672 201736 183485
7093 183485 183832 177812 146813 167328 212784 207908 223283 239463 273528 279565 241885 229753 236464
7080 236464 243215 247964 281605 323564 287341 314813 330342 346239 425828 474494 520356 599450
7068 599450 674390 779371 846019 947292 1036116 1065421 1063073 1070767 1037431 995884 829265
7057H29265j55632p4366p5271o2431o4943m2585k5677n8717o3486j6918j0326
7046A78913k6659j9327j2555k7178M59l2200j8686J8667K004j508L134k8714K309
7033C8659l0691K367J8951q683l4322J4079j3648k1621K3648p706j4466J2792
7021b0641k7278k8832K3336m936J1657L9187l6581J860j929k6682J2903k502k354
7008f2792K964L7835n8705j1778J7765L2180j8617l8891K2988K4257q046j6522
6996g7362j4453J7704P728N974K5319J2659q699n8796J1398K5039J9177o298n7
6983d0667J6821l9956j4290L4571j0267L975k95q758M644J9j0696J2720J2149
6970d0030j4827j353J2244J730k3715k072J488N729L6721j0552l2874Q826K8494
$$ plain form
7057 829265 673633 599267 523996 461565 396622 354037 328360 269643 206157 189239 178913
7046 178913 152254 132927 120372 93194 93653 61453 42767 61434 63438 61930 65064 36350 38659
7033 38659 7968 10335 29286 20603 -13719 360 -13288 -34909 -11261 -18967 -33433 -20641
7021 -20641 -47919 -76751 -53415 -58351 -46694 -7507 -44088 -42228 -44157 -70839 -57936 -60438 -62792
7008 -62792 -59828 -21993 -80698 -92476 -74711 -42531 -61148 -100039 -77051 -52794 -60840 -77362
6996 -77362 -91815 -74111 -66383 -60409 -35090 -22431 -31130 -89926 -78528 -53489 -34312 -40610 -40667
6983 -40667 -23846 -63802 -78092 -43521 -53788 -49813 -50108 -58866 -54222 -54203 -64899 -52179 -40030
6970 -40030 -54857 -56210 -43966 -42236 -65951 -68023 -66535 -60806 -24085 -34637 -67511 -58685 -30191
6957c0191j3092m590k1676K1875l7951k4093K3351J6374k7097J1516J9619K2341
6945d3614L593l64k4014O93L9952J6399K674O585p121j0628p926j7497m702M2725
6931c245K8492m2899J8282O904k719J1192l2017k314L4950k3003J7910Q915n778
6918A4670K9687K6842r935J1520J9987k9702p901L862J5574K6657l6921M785L4080
6905A03205j7772j9034K7083K8325K2148J6804k3188O33j1264j6821O0763m6977
6893A23905k1937r04J4749k6011J4847R783J7505j0263m746J3671j1789l6243
6881H2567j4829L3646L7869j1385j6980J3673j538K152J99R413j3887k1676l6527
6868F2697L2744K7722j3828p439J5918k2343J2946L2647J5804k580k778K4615
$$ plain form
6957 -30191 -43283 -47873 -69549 -47674 -85625 -109718 -86367 -69993 -97090 -85574 -65955 -43614
6945 -43614 -40021 -40385 -64399 -63706 -23754 -7355 -4681 1904 -5217 -15845 -23771 -41268 -45970 -3245
6931 -3245 25247 -17652 630 7534 4815 16007 -16010 -18324 16626 -6377 11533 20448 14670
6918 14670 44357 71199 61264 72784 92771 63069 55168 59030 74604 101261 64340 69125 103205
6905 103205 85433 66399 93482 121807 143955 160759 137571 138204 126940 110119 170882 123905
6893 123905 101968 101064 115813 89802 104649 114432 131937 121674 116928 130599 118810 82567
6881 82567 67738 101384 139253 127868 110888 124561 123023 125175 125374 134787 120900 99224 62697
6868 62697 95441 123163 109335 101896 117814 95471 108417 141064 156868 154288 151510 176125
6856A76125Q854K0904J6405N3337K5997k1642m8734l0944j4209l5196p749m1006
6844A02142o882J4624K6698j2465j8612J0298N992K696l871K4602k559r240J5877
6831A49300j7610j1599J7257J0111l194J2456j1368j256j4122M850K0859l1954
6819A23730l1683K4850J999n296O996O888K2153J4597L448L0387k5988P929K5826
6806B05836J6015K6712l61j3230k0361K1107j2735j0965K1749K7459J7542J7950
6794B96718J0025m753M7007M3620M0943N6695N3145O2996M1238O0683P1358J50740
6782I30415J27293J32289J22739Q5142L7379k396l6922o5247j11080j49487j37012
6771I33113r0442p9109j02723o4003o0018N091k1323o6180N434p862l3547M268
$$ plain form
6856 176125 184979 205883 222288 275625 301622 279980 231246 200302 186093 150897 143148 102142
6844 102142 95260 109884 136582 124117 105505 115803 121795 124491 120620 145222 142663 133423 149300
6831 149300 131690 120091 137348 147459 144265 156721 145353 144097 129975 134825 155684 123730
6819 123730 92047 116897 118896 113600 120596 127484 149637 164234 167682 198069 172081 180010 205836
6806 205836 221851 248563 248202 234972 214611 235718 222983 212018 233767 261226 278768 296718
6794 296718 306743 301990 348997 392617 433560 490255 543400 606396 647634 708317 779675 930415
6782 930415 1057708 1189997 1312736 1397878 1435257 1432861 1395939 1330692 1219612 1070125 933113
6771 933113 842671 763562 660839 596836 536818 541909 520586 454406 459840 451978 418431 422699
6759D22699k4326n620J2058k3572k305Q808J3617R377k8814j1598J1708l0859
6747C51173J1866J8299m255J4940j5978L8494L981J6541L2291N2949L5036M8501
6735F03838L5540N5359M1696R5049J04484J57573J47735O7277N2485K0120l1508
6724A349648j04844j17466j40837j32589j02452o4117p6389o6916l4534n4156
6714D55348n334M712l0772k5657k2066L2383l9622j0913k2777m7392l66m857j5079
6701B67608J416P917p860j8914L2943j3323K3126J4963P667K2893k2837J3595
6689C29194J3088j0903k4396n8501O3679o521n3266j6710m308p668k6006p140
6677A90542L805j5589K0693J2170m2416k2787o297J569K7163J5980p863j6838
$$ plain form
6759 422699 398373 392753 404811 381239 378934 387742 401359 410736 381922 370324 382032 351173
6747 351173 363039 381338 377083 392023 376045 414539 418520 435061 467352 520301 555337 603838
6735 603838 639378 694737 736433 831482 935966 1093539 1241274 1308551 1361036 1381156 1349648
6724 1349648 1244804 1127338 986501 853912 751460 687343 610954 544038 509504 455348
6714 455348 450014 454726 423954 398297 376231 408614 368992 358079 335302 287910 287544 282687 267608
6701 267608 269024 276941 269081 250167 283110 269787 292913 307876 315543 338436 315599 329194
6689 329194 342282 331379 306983 248482 312161 305640 252374 235664 231356 223688 197682 190542
6677 190542 194347 178758 199451 211621 169205 146418 140121 141690 168853 184833 176970 160132
6665A60132Q154J8900P347J1702m0050o096L889K2708J9124l5889k6051J3696
6653A57566O349j4894k60J3374r688Q560L185L840j650N823J9799J4742k7699
6640A79047R555m937n163P61L206l3464j1566K9634J8769K3368j1458r813K062
6627A90001P319K4380J9427M931L664l5761k2410k9367J0956K1110N627n001p276
6614A87600l046N721k0921j5124j7879J7373r906j7490L3518J0461L0158Q025
6602B08490J3645l0093l3166N75J4158j4862l2207P069O2883L4716l7826n290
6590A88092M3967J793J9508J474J334P104m4487J4984L0754j4982k3013M82j9816
6577B07194J3539K8539r568N105k7496P547k0354j4479J9500m885j4955n215K9896
$$ plain form
6665 160132 168286 187186 194533 206235 166185 160089 163978 186686 205810 169921 143870 157566
6653 157566 163915 149021 148761 162135 152447 161007 164192 168032 166382 172205 192004 206746 179047
6640 179047 188602 183665 178502 179263 182469 149005 137439 167073 185842 209210 197752 187939 190001
6627 190001 197320 221700 241127 246058 249722 213961 191551 162184 173140 194250 199877 194876 187600
6614 187600 184554 190275 169354 154230 136351 153724 143818 126328 159846 170307 200465 208490
6602 208490 222135 192042 158876 159451 173609 158747 126540 133609 196492 231208 193382 188092
6590 188092 232059 233852 253360 254834 256168 263272 218785 233769 264523 249541 226528 227010 207194
6577 207194 220733 249272 239704 244809 217313 224860 204506 190027 209527 204642 189687 184472 214368
6564B14368k1062P82K6738J2312L705k1453P293j1053q192J4191k2266K0948J0492
6551B26803J9944K8513j4670k8535l0417L2217n557M6491K1678k6649l3579J4522
6539B50761L273J6713J0837j5960J07J9501J9926k7195j6571l5147n247K4516
6527B45514L6217q497L5045K0155J0470R196k9263o622k932k7132K7221K6088
6515C35460K2650K133l3843L0363j1253L4598j9329j2892M6573M5162j069r91
6503D37562j9718M810K5083K196J327j6406K6750n973J0692K264q042j268L9779
6490D99056l483L0780j1327J943J9630J3357J5428j470J4439L5052N2895J5673
6478F81973J0502L5168o652O871L8371Q973l280M4314J5549L951J6832K3340M5072
$$ plain form
6564 214368 193306 194088 220826 233138 236843 215390 222683 211630 203438 217629 195363 216311 226803
6551 226803 246747 275260 260590 232055 201638 233855 228298 274789 296467 269818 236239 250761
6539 250761 254034 270747 281584 265624 265731 285232 305158 277963 261392 226245 220998 245514
6527 245514 281731 273234 308279 328434 338904 348100 318837 312215 309283 282151 309372 335460
6515 335460 358110 360243 326400 356763 345510 380108 360779 347887 394460 439622 438553 437562
6503 437562 417844 422654 447737 449933 451260 434854 461604 455631 466323 468587 460545 459277 499056
6490 499056 495573 526353 515026 516969 536599 549956 565384 563914 578353 613405 666300 681973
6478 681973 692475 727643 720991 727862 766233 775206 771926 816240 831789 835740 852572 875912 920984
6465I20984J5253j0240j623R816J0076k3271q62K870K4618L3588m967j0290M3073
6452A009025N22j629P1007K7750m979M753M1636r836M9385N4430J4227K3396M6060
6439A325747L0220M9671L4633j2270J4275R3210K6643L0512L2688J1062P4707
6428A711098L7262Q0890N6942M2146N6892N9105M5167L6732K4900N6746M6727
6417B254607O6329N6650M6046M8809M5631N9522L9801M3597Q5587O7128P3518
6406B887225O3359L3228M5260N1740J09519R1627Q9217R1100Q1785O9654J23795
6395C737509J56028R8675J32142J71748J48492J64461J90348J78389K32663K42855
6385E453310K56280K46776J57127J44396J14779J55541J83869J90572K35669L07714
$$ plain form
6465 920984 936237 925997 924374 934190 944266 920995 920133 923003 947621 981209 976242 965952 1009025
6452 1009025 1009547 1007918 1078925 1106675 1101696 1106449 1148085 1138249 1187634 1242064 1256291 1279687 1325747
6439 1325747 1355967 1405638 1440271 1428001 1442276 1535486 1562129 1592641 1625329 1636391 1711098
6428 1711098 1748360 1829250 1886192 1928338 1985230 2044335 2089502 2126234 2151134 2207880 2254607
6417 2254607 2320936 2377586 2423632 2472441 2518072 2577594 2617395 2660992 2746579 2813707 2887225
6406 2887225 2950584 2983812 3029072 3080812 3190331 3281958 3371175 3462275 3544060 3613714 3737509
6395 3737509 3893537 3992212 4124354 4296102 4444594 4609055 4799403 4977792 5210455 5453310
6385 5453310 5709590 5956366 6113493 6257889 6372668 6528209 6712078 6902650 7138319 7446033
6375G446033L41458L75979M17008M82743N28535N59087P01695Q39899Q94520J039730
6365A3626687J210164J406747J547579J790638K048555K162288K179251J956160
6357B7928069J424620O35772k57294r34579j251032j400729j377145j212040j096119
6348B2459523j055235j060146j071394j217716j293904j355078j344618j227874
6340A2833558j076188r21704p84836o84653n78931n08018m29272l76874l42462
6331G130620l07515k52937k83608k86253k55891k37100j68797k33599k22692j90132
6321D692096j67152k18511j97578j24113j33180j08131j12501j06000j21218p1554
6311C332158r5545j00408p8290j07102n2674j31980m4545q4993o9800n1249q1383
$$ plain form
6375 7446033 7787491 8163470 8580478 9063221 9591756 10150843 10852538 11692437 12586957 13626687
6365 13626687 14836851 16243598 17791177 19581815 21630370 23792658 25971909 27928069
6357 27928069 29352689 29988461 29731167 28796588 27545556 26144827 24767682 23555642 22459523
6348 22459523 21404288 20344142 19272748 18055032 16761128 15406050 14061432 12833558
6340 12833558 11757370 10835666 10050830 9366177 8787246 8279228 7849956 7473082 7130620
6331 7130620 6823105 6570168 6286560 6000307 5744416 5507316 5338519 5104920 4882228 4692096
6321 4692096 4524944 4306433 4108855 3984742 3851562 3743431 3630930 3524930 3403712 3332158
6311 3332158 3236613 3136205 3057915 2950813 2898139 2766159 2721614 2636621 2566821 2515572 2434189
6300B434189o0034q2189q1854k6638l1845o7212q4176r483K939o3645k6620o1997
6288A841435n9491l0677k6607k3332j3567l9455o114m9770j9548j469j7395m5848
6276A508162k8523m0103k5309L5499q118k4346m6416l1091l1514J7612l5718J6516
6264A306651k2141n0536l2758J91J3231N086k4747J0535Q457j6824k280l0328
6252A164537J8433p925n1749r400K3400k4199n9617j2121o250j620l0426k6617
6240I76446r038j0134r061M3589k2369k660j2808R146L9299m2759L1980J4611
6228A006242P51J1181N4622N2332k235L4190L7133L6653l004l6976o2606l3489
6216A094794k4742k3038J5204l0220J4562L163K5896q92O5516O8699K6117L1474
$$ plain form
6300 2434189 2374155 2291966 2210112 2183474 2151629 2084417 2000241 1990758 1993697 1930052 1903432 1841435
6288 1841435 1781944 1751267 1724660 1701328 1687761 1648306 1642192 1592422 1572874 1571405 1554010 1508162
6276 1508162 1479639 1439536 1414227 1449726 1441608 1417262 1370846 1339755 1308241 1325853 1290135 1306651
6264 1306651 1284510 1233974 1201216 1201407 1214638 1219724 1194977 1205512 1213969 1197145 1194865 1164537
6252 1164537 1182970 1175045 1123296 1113896 1137296 1113097 1053480 1041359 1035109 1033489 1003063 976446
6240 976446 967408 957274 948213 991802 969433 966773 953965 963111 1002410 959651 991631 1006242
6228 1006242 1006993 1018174 1072796 1125128 1122893 1157083 1194216 1230869 1227865 1190889 1128283 1094794
6216 1094794 1070052 1047014 1062218 1031998 1046560 1049723 1075619 1074727 1140243 1208942 1235059 1266533
6204A266533K7934o240o4980n6725n2469n5212l1525m9916j2038j5008l1963l9345
6192H79046l5102q91J2973r478K8781J5827k4107Q164N8932j280l850M898m22
6179I33491M706j8171j9623O1074L6834j9057m3844j906M8491P728m4187j9722
6167I25814K3297L616k8067j4079J9490L4447L6792j0787j868n962J8451L3195
6155A034339K6629J3970K3914k0738n403L0995Q1552M305j4060L156K0687J1020
6143A210366J0581L3362J6356K2830l1949K8098l621k6087K2208k3199m1189o832
6131A210924o914J1535K4029j5697Q384j6950K0506M3695m4469M957L8883K2430
6119A301313O606L0392M5931M8333O4822K1744j339K812j6344l5621j1033Q612
$$ plain form
6204 1266533 1294467 1288227 1223247 1166522 1114053 1058841 1027316 977400 965362 950354 918391 879046
6192 879046 843944 843053 856026 846548 875329 891156 867049 875213 934145 932865 929015 933913 933491
6179 933491 938197 920026 900403 961477 998311 979254 935410 933504 981995 989723 945536 925814
6167 925814 949111 952727 924660 910581 930071 964518 1001310 990523 988655 982693 1001144 1034339
6155 1034339 1060968 1074938 1098852 1078114 1072711 1103706 1185258 1189563 1175503 1178659 1199346 1210366
6143 1210366 1220947 1254309 1270665 1293495 1261546 1289644 1286023 1259936 1282144 1258945 1217756 1210924
6131 1210924 1204010 1215545 1239574 1223877 1232261 1215311 1235817 1279512 1235043 1240000 1278883 1301313
6119 1301313 1307919 1338311 1384242 1432575 1497397 1519141 1517802 1520614 1504270 1468649 1457616 1466228
6107A466228L5129j379P2888j1429n129P2446L0020O2376M9763J9344j7718n6930
6095A715609p4970o9584l8221J7157k6786l9127J983K7320J4136K6716M3820N0480
6083A648533O4885O8518L5197R891J2180L338K2603l8248p9722r1320q2302n4163
6071A519390q7006k9258o2931k2974J2475o1266k6216J4010K164j546k5959n791
6059A225092J1616K083l6467o4087l5468J2375L7536j5790j5957N275J8565m771
6047A140002j6559M685k023K9681K7634J1104K8747J0358k2719k4539J0865l0168
6035A167068j4934K100k8438K4070K4228M596J408m04m683M472J8071L354j43
6022A200765l4406k6042L5652K8823k4097r755K6708r766K5462k8323l9101P040
$$ plain form
6107 1466228 1501357 1499978 1572866 1561437 1556308 1628754 1658774 1721150 1770913 1790257 1772539 1715609
6095 1715609 1640639 1571055 1532834 1549991 1523205 1484078 1486061 1513381 1527517 1554233 1598053 1648533
6083 1648533 1713418 1781936 1817133 1827024 1839204 1842542 1865145 1826897 1747175 1655855 1573553 1519390
6071 1519390 1432384 1403126 1340195 1317221 1329696 1268430 1242214 1256224 1258388 1256842 1230883 1225092
6059 1225092 1236708 1238791 1202324 1138237 1102769 1115144 1152680 1136890 1120933 1126208 1144773 1140002
6047 1140002 1123443 1128128 1126105 1155786 1183420 1194524 1223271 1233629 1210910 1186371 1197236 1167068
6035 1167068 1152134 1154234 1125796 1149866 1174094 1178690 1180098 1179694 1175011 1179483 1197554 1200908 1200765
6022 1200765 1166359 1140317 1175969 1204792 1180695 1170940 1197648 1187882 1213344 1185021 1145920 1152960
6010A152960k02j5931J154p917l3078j6834n092N2287q423J4918j3378L5007k4840
5997A130631q408k679k0801J9873j5885j4032n380K6275R533k4329k3811J6255
5985A087242K0456m315p538R052K5446k664K2197K6713K1613J028N5869M1075
5973A296174K7987k7853m4328Q601P606p68k7121l8151K6404q293n9568K1771
5961A182461K014L1060r706L745K9657J0424J5465J2192j3418o98K8606N9682
5949A351484J4324J0575M5206N4230K8293O5132N2153L359J3227L2828l281L5864
5937A703394K6883m249k3915m10K4960k3601m2318j5255l9649p894J6017j0652
5925A603311l7410l1111k1073P793L0121O524n643j6693j407J3851r393Q075J7783
$$ plain form
6010 1152960 1152758 1136827 1137981 1130064 1096986 1080152 1075060 1127347 1118924 1133842 1120464 1155471 1130631
5997 1130631 1122223 1119544 1098743 1118616 1102731 1088699 1083319 1109594 1119127 1094798 1070987 1087242
5985 1087242 1107698 1103383 1095845 1104897 1130343 1127679 1149876 1176589 1198202 1199230 1255099 1296174
5973 1296174 1324161 1296308 1251980 1260581 1268187 1267419 1240298 1202147 1228551 1220258 1160690 1182461
5961 1182461 1184475 1215535 1205829 1209574 1239231 1249655 1265120 1277312 1263894 1263196 1291802 1351484
5949 1351484 1365808 1376383 1421589 1475819 1504112 1569244 1621397 1624756 1637983 1670811 1667530 1703394
5937 1703394 1730277 1726028 1702113 1701703 1726663 1703062 1660744 1645489 1605840 1597946 1613963 1603311
5925 1603311 1565901 1534790 1513717 1521510 1551631 1558155 1552512 1535819 1534412 1548263 1538870 1546945 1564728
5912A564728K3163P718J7179M546L0627K7865N203r144j419j0950p333Q741J9800
5899A680724m278r862O611L5091k1974j1210L2052l009K4509l2529p336M1383
5887A730172M6109J1660j5506J5907K5484q766J9053J5102K0506L6000L9019N192
5875A939932k1302K1294L4798j8573L4414J9846M485N6682M3426K1907M3286P2092
5863B252287N3864M9944M5564K6592L0649M0854N7159N7059O0584j5710L5439
5852B694285M1754L8830K6978J3438L0600M4587M8564M6217P2579Q5426O0400
5841C203658Q6554Q9767J06005O2788Q6902P3352R3306Q5561R8683R7454K0772
5830D104802P0323R6019O0675J14372J26920J32149J67325J73339J91087K58767
$$ plain form
5912 1564728 1587891 1595609 1612788 1617334 1647961 1675826 1681029 1671885 1670466 1659516 1652183 1660924 1680724
5899 1680724 1676446 1666584 1673195 1708286 1686312 1675102 1707154 1704145 1728654 1696125 1688789 1730172
5887 1730172 1776281 1787941 1772435 1788342 1813826 1805060 1824113 1839215 1859721 1895721 1934740 1939932
5875 1939932 1918630 1939924 1974722 1956149 1990563 2010409 2014894 2071576 2115002 2136909 2180195 2252287
5863 2252287 2306151 2356095 2401659 2428251 2458900 2499754 2556913 2613972 2674556 2658846 2694285
5852 2694285 2736039 2774869 2801847 2815285 2845885 2890472 2939036 2985253 3057832 3143258 3203658
5841 3203658 3290212 3379979 3485984 3548772 3635674 3709026 3802332 3887893 3986576 4084030 4104802
5830 4104802 4175125 4271144 4331819 4446191 4573111 4705260 4872585 5045924 5237011 5495778
5820E495778K87374L26479L51964L60373L51423K40596J35358j6096r2153k88982
5810G152114l72480l49022l40453l04353k81794j96619j49034j24961j14669j07208
5800D811521q1908o9632k2823m0904p7028l5989J374k3591R806j1285Q642J6840
5788D485023L042O773M0602N8907O8089K788L9369O3553J06128P2508P3260R6574
5776E116616J09102K3211J19692J53411P5281J29272J22812J31925J48005J62901
5766F292228J83135K13174K18837K21407K42506L15867K88803L10849L72813L93805
5756I053424L80780L99128M18202M43578M30241M32626L59175L03591J68942Q3685
5746A2473372k436r0774k01204k76045k84806k53425k07537j58302r5272o9613
$$ plain form
5820 5495778 5783152 6109631 6461595 6821968 7173391 7413987 7549345 7533249 7441096 7152114
5810 7152114 6779634 6430612 6090159 5785806 5504012 5307393 5158359 5033398 4918729 4811521
5800 4811521 4729613 4659981 4637158 4596254 4519226 4483237 4484611 4461020 4470826 4459541 4468183 4485023
5788 4485023 4488065 4494838 4535440 4594347 4662436 4665224 4704593 4768146 4874274 4946782 5020042 5116616
5776 5116616 5225718 5248929 5368621 5522032 5597313 5726585 5849397 5981322 6129327 6292228
5766 6292228 6475363 6688537 6907374 7128781 7371287 7687154 7975957 8286806 8659619 9053424
5756 9053424 9434204 9833332 10251534 10695112 11125353 11557979 11917154 12220745 12389687 12473372
5746 12473372 12470936 12380162 12178958 11902913 11618107 11364682 11157145 10998843 10903571 10833958
5736A0833958K6752J00889J88879K93277L26449L98783M69064N22493N35127M37371
5726A4133042L07744J21139j80474l53562n27419o56329p25591p38095o77877
5717A0702578o69990n76822n16837m94540m13656l03158l07200l05929k74696
5708F839750k74045k57622k42415j97244j65988j60648j82241j04170j03366r2517
5698E059494o4286q4506o3003j09456l9378p3865l1474l8584M743m1637l747m8841
5686D465460n3347k8375m8721m9756l6981l4151k7184m3353q1958j5493k0226
5675D025915j5687l6503j2755O140m014K5612j2855k2422j2175k35J6867j6944
5663C940944k0048q682l9912Q492K887l4685k8724J0133j5496l2132M2812l4278
$$ plain form
5736 10833958 10860710 10961599 11150478 11443755 11770204 12168987 12638051 13160544 13695671 14133042
5726 14133042 14440786 14561925 14381451 14027889 13500470 12844141 12118550 11380455 10702578
5717 10702578 10032588 9455766 8938929 8444389 8030733 7727575 7420375 7114446 6839750
5708 6839750 6565705 6308083 6065668 5868424 5702436 5541788 5359547 5255377 5152011 5059494
5698 5059494 4995208 4910702 4847699 4738243 4698865 4625000 4593526 4554942 4559685 4518048 4514301 4465460
5686 4465460 4412113 4383738 4335017 4285261 4248280 4214129 4186945 4143592 4061634 4046141 4025915
5675 4025915 4010228 3973725 3960970 3967110 3963096 3988708 3975853 3953431 3941256 3941021 3957888 3940944
5663 3940944 3920896 3912214 3872302 3880794 3883681 3848996 3820272 3830405 3814909 3782777 3825589 3791311
5651C791311j6379j4330J0967R88J0692m867J4063k371k5813m6748O846j1936
5639C712423K0883j1031O669o790J4725l608L3593L7261k6663J1208N0315K0909
5627C859894q81L5677p786Q985j3063J9029P142q731q38M20J8873M7758L9376
5614D005855j0759K1584P2515L700l7223K710m20N827L9965M6725L631K7172J2
5601D181294K362K1728L0805J3797r232J1367l1666O8208M8924L1520o326K1509
5589D384290L9582K4297J4102R536K955J8651M5970L0640J3337K8791L0903N6929
5577D699983K8405L6551P6992N7678K5259L8853K4760n53K1315n84R527O2469
5565E080655L2261K2355M7127L8928M0461M1904M9408O7465P1872M5001M2796
$$ plain form
5651 3791311 3774932 3760602 3771569 3772557 3783249 3778382 3792445 3790074 3764261 3717513 3724359 3712423
5639 3712423 3733306 3722275 3728944 3722154 3736879 3733271 3766864 3804125 3777462 3788670 3838985 3859894
5627 3859894 3859013 3894690 3886904 3895889 3882826 3901855 3908997 3900266 3899428 3899848 3918721 3966479 4005855
5614 4005855 3995096 4016680 4089195 4092895 4055672 4058382 4057962 4063789 4103754 4150479 4154110 4181282 4181294
5601 4181294 4183656 4205384 4236189 4249986 4240754 4252121 4220455 4288663 4337587 4369107 4362781 4384290
5589 4384290 4423872 4448169 4462271 4471807 4474762 4493413 4539383 4570023 4583360 4612151 4643054 4699983
5577 4699983 4728388 4764939 4841931 4899609 4924868 4963721 4988481 4987928 5009243 5008659 5018186 5080655
5565 5080655 5112916 5135271 5182398 5221326 5261787 5303691 5353099 5420564 5492436 5537437 5580233
5554E580233N8262N6452M9979O8532M0102N4104K6174O6739L272N6514L7152K0652
5542F118167J1714L8783Q4702M3913K7084J9984P5627O4770L0724N3340k740K0386
5530F586454N7739L0760L9389L1243L4432j272K2804L2483L5020N4934O6707M8293
5518G038986o16M5007N0162N6881L5039L1956N6960L0405O737P451N8369L6920
5506G454257q713j9053K2378K9838R6979K7740P3451M5530P8889R0907J05523
5495G997726J14726N8428O2306l00K939L7505R351K2272O977k6946m5053m7018
5483H192913p6673o8084q6204o2626o7542m3921J0150K9775J4959k1508n792J4338
5471G829785m303M526j5064j5348m8330n5723l7972q5546k9194m7143l9095k9893
$$ plain form
5554 5580233 5638495 5694947 5744926 5813458 5853560 5907664 5933838 6000577 6003849 6060363 6097515 6118167
5542 6118167 6129881 6168664 6253366 6297279 6324363 6344347 6419974 6484744 6515468 6568808 6566068 6586454
5530 6586454 6644193 6674953 6714342 6745585 6780017 6778745 6801549 6834032 6869052 6923986 6990693 7038986
5518 7038986 7038370 7083377 7133539 7190420 7225459 7257415 7314375 7344780 7351517 7358968 7417337 7454257
5506 7454257 7445544 7426491 7448869 7478707 7575686 7603426 7676877 7722407 7801296 7892203 7997726
5495 7997726 8112452 8170880 8233186 8232886 8235825 8273330 8282681 8304953 8311930 8284984 8239931 8192913
5483 8192913 8116240 8048156 7961952 7899326 7831784 7787863 7798013 7827788 7842747 7821239 7815447 7829785
5471 7829785 7825482 7830008 7814944 7799596 7751266 7695543 7657571 7572025 7542831 7495688 7456593 7426700
5459G426700k863j4437j8059k4587J0064k8044p1957L4704J5651J4105L1978K3404
5447G396659J2569L3900L2286R002P151k2341k9705p2305J2720j1862J4881J6056
5435G399011K3419Q954j3580k7368r431O0740K3510R1457P0229K7503R4707M2023
5423G791174O4435L4121j3193J1166K560k6714o475j9079K6517k324l9902j7417
5411G804869m9686N278L8907K2172J3343L3803K2781J3993J3216m474O957j75
5399G920984l669J8141O7744N5189O6548N6530R9515R2004J16032J69430K26292
5388H884740J72040J5109j37667k75859k60644j94858j23058j08535l2433o6551
5378G872284l9611l5268n4613j2286K2339M749J3568K2076j42P8697J28992J74392
$$ plain form
5459 7426700 7423837 7409400 7391341 7366754 7376818 7348774 7276817 7311521 7327172 7341277 7373255 7396659
5447 7396659 7409228 7443128 7475414 7484416 7491567 7469226 7439521 7367216 7379936 7368074 7382955 7399011
5435 7399011 7422430 7431384 7417804 7390436 7381005 7441745 7465255 7556712 7626941 7654444 7749151 7791174
5423 7791174 7855609 7889730 7876537 7887703 7890263 7863549 7857074 7837995 7864512 7862188 7822286 7804869
5411 7804869 7755183 7760461 7799368 7821540 7834883 7868686 7891467 7905460 7918676 7914202 7921159 7920984
5399 7920984 7917315 7935456 8003200 8058389 8124937 8181467 8280982 8372986 8489018 8658448 8884740
5388 8884740 9056780 9071889 8934222 8658363 8397719 8202861 8079803 7971268 7938835 7872284
5378 7872284 7832673 7797405 7742792 7730506 7752845 7757594 7771162 7793238 7793096 7871793 8000785 8175177
5366H175177J77781K00586J77470R4248n7036j26219j31602p3979L5083M1520
5356H513029P6071J11872J29385R2945N4756n5879r6620j54571j72870j62666
5346H335452j19969j10493p4666j3092n1259q9986p2782o5981p5414q6295r8557
5335G476958l7004n2177n7126m9934K536k6186n6735j9217o4927q3179n6492l7359
5323F939158l6172k7409o82K2137K1806K831J8232K8587J4299J5044O1557L1154
5311G090542N3254R0366R4474J42163J06500J64418J35962J46701J70847J13879
5301H309106J34002J52474J46592K16659J90563J95635K04400J80766K55592L25150
5291A0310939M00036M19422L22575J79733o8219k02089j50072j09905q7848k5988
$$ plain form
5366 8175177 8352958 8553544 8731014 8825262 8768226 8642007 8510405 8436426 8471509 8513029
5356 8513029 8589100 8700972 8830357 8923302 8978058 8922179 8825559 8670988 8498118 8335452
5346 8335452 8215483 8104990 8030324 8017232 7965973 7875987 7803205 7737224 7661810 7575515 7476958
5335 7476958 7439954 7387777 7330651 7280717 7283253 7257067 7200332 7181115 7116188 7033009 6976517 6939158
5323 6939158 6902986 6875577 6874895 6897032 6918838 6921669 6939901 6968488 6982787 6997831 7059388 7090542
5311 7090542 7143796 7234162 7328636 7470799 7577299 7741717 7877679 8024380 8195227 8309106
5301 8309106 8443108 8595582 8742174 8958833 9149396 9345031 9549431 9730197 9985789 10310939
5291 10310939 10710975 11130397 11452972 11632705 11564486 11362397 11212325 11102420 11014572 10988584
5281A0988584K9738M2408l3651j01771j78902j95864j99997j77558j36700q3864
5271I952423m9822M3900J17229K38996K71380K37741J25794Q791l8594j67148
5261A0740690k51296l05846l19397l10403l16392l16275k28466k18976j72305
5252H301334q3530j13894p9144j32283j83157k26451k49227k11324k09849r0825
5242F721650r7378m6714j7377N7335J2214K6651p083p5328p6051j73476j79015
5231F145428j61194j44946j19956j49594n8109o2502k6441J9571k0518k1639K5044
5220E425144k4713n3510q7669o6407o8385p6668j01928r8859m7432o0508n3418
5209D685647n9553l1335m4160J6196j0924n5861O230j6703M3295K9992R732p714
$$ plain form
5281 10988584 11018322 11060730 11027079 10925308 10746406 10550542 10350545 10172987 10036287 9952423
5271 9952423 9902601 9946501 10063730 10302726 10574106 10811847 10937641 10946432 10907838 10740690
5261 10740690 10489394 10183548 9864151 9553748 9237356 8921081 8692615 8473639 8301334
5252 8301334 8217804 8103910 8024766 7892483 7709326 7482875 7233648 7022324 6812475 6721650
5242 6721650 6624272 6577558 6560181 6617516 6629730 6656381 6649298 6573970 6497919 6324443 6145428
5231 6145428 5984234 5839288 5719332 5569738 5511629 5449127 5422686 5442257 5421739 5400100 5425144
5220 5425144 5400431 5346921 5259252 5192845 5124460 5047792 4945864 4847005 4799573 4739065 4685647
5209 4685647 4626094 4594759 4550599 4566795 4555871 4500010 4506240 4489537 4532832 4562824 4572556 4564842
5197D564842j2680k7726k7336m7452j1834j2951k3383k185R614O8651N4836M4073
5185D576469L6344O8296J3695R41L9265P512k9182k6850n6819n6953q2495l9454
5173D450769l5018J0427p645m0648k0804j7179l8413M689Q362J5483N1463L2529
5161D414015K5557J8377J8543K1458k537L7084O0797L7464M6438N3559J5878p843
5149D738790l0119r5329q6825q0845q3000q4539m886j4926l4387k1268Q555N5216
5137D266437N020J2221K6078N1383N0372L703Q566j2875L9974M7981l26J8645
5125D517179K6001P9260N1652M2027M0024O9157L9539J10194J14930P1593Q9490
5114E251046Q4080M2763K9102P5063L8933K7449Q9220J16940N6415P2658O3414
$$ plain form
5197 4564842 4552162 4524436 4497100 4449648 4437814 4424863 4401480 4399295 4408909 4477560 4532396 4576469
5185 4576469 4612813 4681109 4694804 4695745 4735010 4742522 4713340 4686490 4629671 4572718 4490223 4450769
5173 4450769 4415751 4426178 4418533 4377885 4357081 4339902 4301489 4306178 4314540 4330023 4381486 4414015
5161 4414015 4439572 4457949 4476492 4497950 4495413 4532497 4593294 4630758 4677196 4730755 4746633 4738790
5149 4738790 4708671 4613342 4526517 4445672 4362672 4278133 4273247 4258321 4223934 4202666 4211221 4266437
5137 4266437 4271457 4283678 4309756 4361139 4411511 4415214 4423780 4410905 4450879 4498860 4498534 4517179
5125 4517179 4543180 4622440 4674092 4716119 4756143 4825300 4864839 4975033 5089963 5161556 5251046
5114 5251046 5335126 5377889 5406991 5482054 5520987 5548436 5637656 5754596 5811011 5883669 5947083
5103E947083M7874O819o6237o5370m7350k4352n9155k9027m0567l7387N535l2765
5091E605101M5698K6172L8433N3930k3447j527o523J3988l1436q9505p6153r6540
5079E458191j09575p4737q2148q2872r1524p0865j26064q8387j02730p5836q9653
5068D463800q8896l9458k6966l2597m8981l2958n9570l3189n1625n484m2635n9654
5056C941787k9327q000l1163n3847l3730Q458k7486m5953k9041j3060J2614o7296
5044C623956k1691m945p6953r595J2875M9241j7373O608J8507p470N2518M0384
5032C666062K7248O1126J8325M3214Q1436Q3960K00843J94520J49492P1555r0761
5021D507020j88245k37187k14709j94216j23917o6343p6211r5835k8570K6099
$$ plain form
5103 5947083 5994957 6001776 5935539 5870169 5822819 5798467 5739312 5710285 5669718 5632331 5637866 5605101
5091 5605101 5650799 5676971 5715404 5769334 5745887 5744360 5737837 5751825 5720389 5630884 5554731 5458191
5079 5458191 5348616 5273879 5191731 5108859 5017335 4946470 4820406 4732019 4629289 4553453 4463800
5068 4463800 4374904 4335446 4308480 4275883 4226902 4193944 4134374 4101185 4049560 4044076 4001441 3941787
5056 3941787 3912460 3904460 3873297 3819450 3785720 3794178 3766692 3720739 3691698 3678638 3691252 3623956
5044 3623956 3602265 3597320 3520367 3510772 3523647 3572888 3555515 3562123 3580630 3573160 3625678 3666062
5032 3666062 3693310 3754436 3772761 3815975 3897411 3981371 4182214 4376734 4526226 4597781 4507020
5021 4507020 4318775 4081588 3866879 3672663 3548746 3482403 3406192 3310357 3281787 3307886
5011C307886q490l5055m0283j7498n103k1329L2504k4333l1082M2483M6049J9135
4999C264884m1879K0020j9016n6774j0577J6981J6267j9874j0314L2005K5486
4988C217209K0415M4240N3767O7141r62p833k8093K0035K9276J5144N3216P6034
4976C559589P6900J40680J91254K14182K00131P8730k3096p9569j84676k52266
4966C921859j95559j48561q4508r1493m7150k9826K5340l2112l8023K9167L083
4955C312217O1235J0072j500l855K95J5514m754r191K1230J4992J1900L9834J9306
4942C487295M566O72l0814o855p292k3816k9459J5444J2109n3469J6390P3413
4930C458184j8501o303J3804j9892J7888K5871L5584k2165j311J4581K5964J2992
$$ plain form
5011 3307886 3299396 3264341 3224058 3206560 3201457 3180128 3212632 3188299 3157217 3199700 3245749 3264884
4999 3264884 3223005 3243025 3224009 3167235 3156658 3173639 3189906 3170032 3159718 3191723 3217209
4988 3217209 3237624 3281864 3335631 3402772 3401810 3393977 3365884 3385919 3415195 3430339 3483555 3559589
4976 3559589 3636489 3777169 3968423 4182605 4382736 4461466 4438370 4358801 4174125 3921859
4966 3921859 3726300 3577739 3493231 3401738 3354588 3324762 3350102 3317990 3279967 3309134 3312217
4955 3312217 3373452 3383524 3382024 3378169 3378464 3393978 3389224 3380033 3401263 3416255 3428155 3467989 3487295
4942 3487295 3491861 3492533 3461719 3454864 3447572 3423756 3394297 3409741 3421850 3368381 3384771 3458184
4930 3458184 3439683 3433380 3447184 3427292 3445180 3471051 3506635 3484470 3483159 3497740 3523704 3536696
4918C536696M2253P6465K2349L1752N1700L6641L2282O3334Q692R30K013r946
4906C895161p067L4482K4403N7771L3544L4340L1073N8400O7563N1648J05981
4895D387299J00245J39100Q1088Q1311O4068O5963J8582M4324j1974N1246J0383
4884E031635J4215M7099J7907j6625K3144n4520l6746k3498k6700l3303K9796
4873D972404N9675Q0132O5056P2877J1196o725N7595M201q378J1668K7737Q2895
4861E430333M2353L2681N5462P0511J8048J24489J07655Q7670P9084L4138P6997
4850F159421P4536Q3058M2249O7220N1662L4964Q8185J20897J20101J89487J37520
4839G169300J78231J41708J57581J23539J33780N2689P8279R8432J43139J02613
$$ plain form
4918 3536696 3578949 3655414 3677763 3709515 3761215 3797856 3830138 3893472 3902164 3903094 3905107 3895161
4906 3895161 3888094 3922576 3946979 4004750 4038294 4072634 4103707 4162107 4229670 4281318 4387299
4895 4387299 4487544 4626644 4707732 4789043 4853111 4919074 4937656 4981980 4970006 5021252 5031635
4884 5031635 5045850 5092949 5110856 5094231 5117375 5062855 5026109 5002611 4975911 4942608 4972404
4873 4972404 5032079 5112211 5177267 5250144 5261340 5254615 5312210 5316411 5308033 5319701 5347438 5430333
4861 5430333 5472686 5505367 5560829 5631340 5649388 5773877 5881532 5969202 6048286 6082424 6159421
4850 6159421 6233957 6317015 6359264 6426484 6478146 6513110 6601295 6722192 6842293 7031780 7169300
4839 7169300 7347531 7489239 7646820 7770359 7904139 7956828 8035107 8133539 8276678 8379291
4829H379291J32902P5399Q8642J07169M5587K7238N1123K2056J8535M1583M5678
4818I035203Q0873R2731R8101J31084J23541J19518J68527J49578J72076J74544
4808A0345776J22044J26926J17956J19534J29473J55593J68833J31875J89892
4799A1607902J82507J69484J98730J73143J93181J45440J11519J22084J10541
4790A3014531J36193J81874K02475K88120K41045K93996L02563L50646L08688
4781A5320131L59737L71416L83688L63353L44453M43343N07995N19407N53499
4772A9167022N44711N40164N15167M77770L95696M00379M13568M53060M77024
4763B3384561M82901L98897M44755M49297M94223N09029N70841O44510O72364
$$ plain form
4829 8379291 8512193 8587592 8676234 8783403 8828990 8856228 8907351 8929407 8947942 8989525 9035203
4818 9035203 9116076 9208807 9306908 9437992 9561533 9681051 9849578 9999156 10171232 10345776
4808 10345776 10467820 10594746 10712702 10832236 10961709 11117302 11286135 11418010 11607902
4799 11607902 11790409 11959893 12158623 12331766 12524947 12670387 12781906 12903990 13014531
4790 13014531 13150724 13332598 13535073 13823193 14064238 14358234 14660797 15011443 15320131
4781 15320131 15679868 16051284 16434972 16798325 17142778 17586121 18094116 18613523 19167022
4772 19167022 19711733 20251897 20767064 21244834 21640530 22040909 22454477 22907537 23384561
4763 23384561 23867462 24266359 24711114 25160411 25654634 26163663 26734504 27379014 28051378
4754B8051378P31319Q06100Q73596R19637R92029J062143J190336J267701J381795
4745C7276034J381266J421869J471508J547099J548509J542930J454814J336423
4737D8980452J095531Q72535Q50546J048794J327995J651994J875499K089277
4729E9792623K253305K652549L251488M253170N484098O830521Q183717R528507
4721A02229978J0803415J2718397J5668691K0630898K8296629L6933385M1090343
4714B68371736L5745312J3137802j2618976l3594471m6297499m2636332l2776965
4707A49330607k3622310j7188607j2515691r063328o585183n090994m109655l680878
4699F7473961l313766l029237k647373k158883j608993j151654p63633n60513
$$ plain form
4754 28051378 28782697 29588797 30462393 31382030 32374059 33436202 34626538 35894239 37276034
4745 37276034 38657300 40079169 41550677 43097776 44646285 46189215 47644029 48980452
4737 48980452 50075983 50948518 51799064 52847858 54175853 55827847 57703346 59792623
4729 59792623 62045928 64698477 67949965 72203135 77687233 84517754 92701471 102229978
4721 102229978 113033393 125751790 141420481 162051379 190348008 227281393 268371736
4714 268371736 304117048 317254850 304635874 271041403 224743904 182107572 149330607
4707 149330607 125708297 108519690 96003999 86940671 80355488 75264494 71154839 67473961
4699 67473961 64160195 61130958 58483585 56324702 54715709 53564055 52800422 52239909
4691E2239909m41919l53318k49606r6664J15408J45458K24194K15459K11495J84211
4681E2194627L15631N33139P43537R62653J149501J351498J560741J805406K383794
4672F3000527L246513M349750N564444O993132Q385731R790465J1769083J4730806
4664A27830451J9382738K6861612L3803272L5586240K8713647Q861570p693848
4657B73345682j8787935l5409994m1977253l5184870k5699250j8407617j3642720
4650H4236043j0087525p496034n735932m538005l825833l396446l051135k814195
4642D3290938k506752k105803j751228j486087j291354j201999j111161j065775
4634C0770779r73787q36790p21446n73510n57230n48143m92702n07013n29235
$$ plain form
4691 52239909 51797990 51444672 51195066 51098402 51213810 51359268 51583462 51798921 52010416 52194627
4681 52194627 52510258 53043397 53786934 54749587 55899088 57250586 58811327 60616733 63000527
4672 63000527 66247040 70596790 76161234 83154366 91540097 101330562 113099645 127830451
4664 127830451 147213189 174074801 207878073 243464313 272177960 281039530 273345682
4657 273345682 254557747 219147753 177170500 141985630 116286380 97878763 84236043
4650 84236043 74148518 66652484 60916552 56378547 52552714 49156268 46105133 43290938
4642 43290938 40784186 38678383 36927155 35441068 34149714 32947715 31836554 30770779
4634 30770779 29796992 28960202 28238756 27665246 27108016 26559873 26067171 25560158 25030923
4625B5030923n34698m82391m47630m49985m34875l26099l00459k62218j78479
4616B1614089j36466o0958o3557J3963M5857P5112L9018J3969L1530j6682o7274
4605B1488601j05210p4604o3886n6394j7946N1208J60609J65996J95319K57756
4595B2001449K88732L40964L39382L87844L51670L61036L05078K09239M9201r3100
4585B4541495k09073k30906k59499l25954l10456k48708k30891j58214r2670r623
4575B2465501K3862Q8329J19730J70964K44106K92115L63196L88627M17656M11041
4565B4985127M48743L36416K70751K13167O7302m655q1369j56204j51470j26015
4555B5801793j12943p0877n460P3211O4083M7775r3041k57356l32277l00133k63257
$$ plain form
4625 25030923 24496225 24013834 23566204 23116219 22681344 22355245 22054786 21792568 21614089
4616 21614089 21477623 21416665 21353108 21367071 21412928 21488040 21527058 21541027 21572557 21555875 21488601
4605 21488601 21383391 21308787 21244901 21188507 21170561 21221769 21382378 21548374 21743693 22001449
4595 22001449 22290181 22631145 22970527 23358371 23710041 24071077 24376155 24585394 24634595 24541495
4585 24541495 24332422 24101516 23842017 23516063 23205607 22956899 22726008 22567794 22475124 22465501
4575 22465501 22489363 22577692 22697422 22868386 23112492 23404607 23767803 24156430 24574086 24985127
4565 24985127 25433870 25770286 26041037 26254204 26321506 26316851 26235482 26079278 25927808 25801793
4555 25801793 25688850 25617973 25612513 25685724 25749807 25797582 25704541 25447185 25114908 24814775 24551518
4544B4551518j69362n5994q899Q2882Q7679J09549J09664R7019Q6497O7505K3564
4533B4981622L817N1751L0046O2203L3213M6510M5645K033O4973J40816K68704
4522B5731333M71719N49810P10490Q78672R10614P56355L88746j46556n28309
4513B9722874o98186n99444n08503l35933k29067j54628j20542p4816m5258n2325
4503B6904172o9671j22841j18958j70799j23976p1435l4675m900p1560j79045
4493B5936312j95195k58979j92391m0902J11084K89027M51537N74348N82062L36177
4483B7593080j06230o18569r02173q74713p40502n67539l68459k58538j44685
4474B3011672q6715q1852p7648q4099j71769k55839l11853l08435l00471k44405
$$ plain form
4544 24551518 24382156 24326162 24317263 24400145 24487824 24597373 24707037 24804056 24890553 24958058 24981622
4533 24981622 24985439 25037190 25067236 25129439 25162652 25209162 25254807 25256840 25321813 25462629 25731333
4522 25731333 26203052 26752862 27463352 28342024 29252638 30008993 30397739 30251183 29722874
4513 29722874 29024688 28425244 27916741 27580808 27351741 27197113 27076571 27001755 26956497 26904172
4503 26904172 26834501 26711660 26592702 26421903 26297927 26226492 26191817 26186917 26115357 25936312
4493 25936312 25741117 25482138 25289747 25248845 25359929 25648956 26100493 26674841 27256903 27593080
4483 27593080 27486850 26868281 25966108 25091395 24350893 23783354 23414895 23156357 23011672
4474 23011672 22924957 22843105 22765457 22681358 22509589 22253750 21941897 21633462 21332991 21088586
4464B1088586k03957j59806k30632k74694m22982n75381n19242l90967k86391
4455A8024534j78870j09163o2699m3957j16051k51793l34748l90472l11833k37217
4445A5987731j58637j61995j43159j60180j46218r2696j17720j94174k04542j84575
4435A4423835k28177j87298j77627j55691j20924j15064j26517j34177j71525
4426A3006835j41864j20839j35541j63648j01007q0666q8182n9858m0300n5453
4416A2019477l4966k5617k1283p899J958J9276J1686P389J5872k2925m7945n8171
4404A1856852q239M5435R1296J15767J38596O758j18002k24587l42261k91676
4394A1269939j96119j92010j23006n4649o1971m0722r871J7584R874k2186l0978
$$ plain form
4464 21088586 20884629 20724823 20494191 20219497 19796515 19221134 18701892 18310925 18024534
4455 18024534 17845664 17736501 17673802 17629845 17513794 17262001 16927253 16536781 16224948 15987731
4445 15987731 15829094 15667099 15523940 15363760 15217542 15124846 15007126 14812952 14608410 14423835
4435 14423835 14195658 14008360 13830733 13675042 13554118 13439054 13312537 13178360 13006835
4426 13006835 12864971 12744132 12608591 12444943 12343936 12263270 12175088 12115230 12074930 12019477
4416 12019477 11984511 11958894 11937611 11929712 11931670 11950946 11962632 11970021 11985893 11962968 11915023 11856852
4404 11856852 11848613 11894048 11985344 12101111 12239707 12246465 12128463 11903876 11561615 11269939
4394 11269939 11073820 10881810 10758804 10704155 10642184 10601462 10591591 10609175 10619049 10596863 10565885
4383A0565885M72l6848L110K2085o989j9609q2040P336j9730j5251J055j185L6030
4370A0454321K9505J4854K6743N7278J1157O4151R0096L8663M7390J0706N5751
4359A0900615Q4194Q7259J23067Q2695Q7054J22281J44023N7761J05264J31698
4349A1925911P9586J01158J65261J83883K09788J62769N7686k3790q1279j55543
4339A2625430j96201j27659n3036j1686K2203M7248J0227Q1436P7239M8724M9013
4328A2572938N8524P353m0283P16K0134N2217K3826N7897N0093P1210Q4018L8157
4316A2996800Q8839P0255O8712R1107P9201J07072J32308J77209J30387J60816
4306A4102706J71707J34678J24923J79068J75485J79557K40704K11310K19173
$$ plain form
4383 10565885 10566357 10529509 10532619 10554704 10547715 10528106 10446066 10453402 10433672 10418421 10419476 10418291 10454321
4370 10454321 10483826 10498680 10525423 10582701 10593858 10658009 10748105 10786768 10834158 10844864 10900615
4359 10900615 10984809 11072068 11195135 11277830 11364884 11487165 11631188 11688949 11794213 11925911
4349 11925911 12005497 12106655 12271916 12455799 12665587 12828356 12886042 12862252 12780973 12625430
4339 12625430 12429229 12301570 12248534 12236848 12259051 12306299 12316526 12397962 12475201 12523925 12572938
4328 12572938 12631462 12638815 12598532 12599248 12619382 12671599 12695425 12753322 12803415 12874625 12958643 12996800
4316 12996800 13085639 13155894 13224606 13315713 13394914 13501986 13634294 13811503 13941890 14102706
4306 14102706 14274413 14409091 14534014 14713082 14888567 15068124 15308828 15520138 15739311
4297A5739311J86896J69638J80496J38209J28628J69520J80665J36081J88572
4288A7218016K03954K22275K77398K68662K08454J80817J23960J00368N2873K1588
4278A8878365K2917N5015M9434J11434J24161J22091K35100K27877K31729K51011
4268B0309134K94232L16281L22982L03072L45748L03856K80559K72847K86446
4259B3035157K35916K51641K20618K29786K56827L18482L89856M70498N48856
4250B5957637O19242P08973R06402J029256J147539J318333J494316J585499J545814
4241C6313011J467196J313550J295917J224569J224698J372737J584328J895163
4233D7691169K228616K550690K694717K629302K130290J172224N712j261739k478705
$$ plain form
4297 15739311 15926207 16095845 16276341 16414550 16543178 16712698 16893363 17029444 17218016
4288 17218016 17421970 17644245 17921643 18190305 18398759 18579576 18703536 18803904 18856777 18878365
4278 18878365 18901282 18956297 19005731 19117165 19241326 19363417 19598517 19826394 20058123 20309134
4268 20309134 20603366 20919647 21242629 21545701 21891449 22195305 22475864 22748711 23035157
4259 23035157 23271073 23522714 23743332 23973118 24229945 24548427 24938283 25408781 25957637
4250 25957637 26576879 27285852 28192254 29221510 30369049 31687382 33181698 34767197 36313011
4241 36313011 37780207 39093757 40389674 41614243 42838941 44211678 45796006 47691169
4233 47691169 49919785 52470475 55165192 57794494 59924784 61097008 61102720 59840981 57362276
4224E7362276l488306m087626m225154l920794l398240k737451k168828j695421
4216C1640456j344698j093526q85087o84058m97758l25839k26772k5050J11458
4207B6669126J91851K83813L15933L37900K89587K91986K44214J13754k3874k33444
4197B8480846m51789o54271q43224r11010r30599q44908p78458p21188o46045
4188B1699354o07236n95083n46487n58989n06780n26256m78962m46140m24434
4179A7008987m38184m48175l74292l45468l00036j92573j16875k8465K5006Q3986
4169A4873911K08032K99820M54405N07345N66973N56214L64270J49511j23154
4160A7857327m90473o75100q51247r01787r01521p55460n82683m29952l89171
$$ plain form
4224 57362276 53873970 49786344 45561190 41640396 38242156 35504705 33335877 31640456
4216 31640456 30295758 29202232 28317145 27633087 27135329 26809490 26582718 26557668 26669126
4207 26669126 26860977 27144790 27460723 27798623 28088210 28380196 28624410 28738164 28714290 28480846
4197 28480846 28029057 27374786 26531562 25620552 24689953 23845045 23066587 22345399 21699354
4188 21699354 21092118 20497035 19950548 19391559 18884779 18358523 17879561 17433421 17008987
4179 17008987 16570803 16122628 15748336 15402868 15102832 14910259 14793384 14764919 14789925 14873911
4169 14873911 15081943 15381763 15836168 16343513 16910486 17466700 17830970 17980481 17857327
4160 17857327 17366854 16691754 15840507 14938720 14037199 13281739 12699056 12269104 11879933
4151A1879933l20988k84101k11688j86444k22203j85184j78710j54560j03885
4142A0032170q3595q1412q1452r4478l1267m5740l7473M96M7168J53884J18126
4131I896427K16410K14116J20545J6263r4001j99997k65859k60566k07389j12997
4121I322952j27698l5027j1997L4494j548M0014N8164P0883J57843J03060P8458
4110I689598j9229j90501k39036k25403j50948p6962m7115l5600k7180L6820N6891
4099H771335N5363Q8428L5396O0110L8208l4612o4533l7009o6469r2677k4770
4088H728770J7514r95O63L2829J9326M9083M6981J8707J5806o3373m7626n3223
4076H764462q2244n1001j9300J6223L7928N8580Q1742L0271P785K8298P105l2942
$$ plain form
4151 11879933 11558945 11274844 11063156 10876712 10654509 10469325 10290615 10136055 10032170
4142 10032170 9948575 9867163 9785711 9691233 9659966 9614226 9576753 9577249 9624417 9778301 9896427
4131 9896427 10112837 10326953 10447498 10463761 10369760 10169763 9903904 9643338 9435949 9322952
4121 9322952 9195254 9160227 9148230 9182724 9181176 9221190 9279354 9350237 9508080 9611140 9689598
4110 9689598 9670369 9479868 9240832 9015429 8864481 8787519 8740404 8704804 8677624 8714444 8771335
4099 8771335 8826698 8915126 8950522 9010632 9048840 9014228 8949695 8912686 8846217 8753540 8728770
4088 8728770 8746284 8745289 8745952 8778781 8798107 8847190 8894171 8912878 8928684 8865311 8817685 8764462
4076 8764462 8682218 8631217 8611917 8628140 8666068 8724648 8806390 8836661 8844446 8872744 8879849 8846907
4064H846907l9114m609m7504K0038L1831J9999k294J875P4501L4702L5646J6774
4052H988752P0129M5246K9570K5776O7639J33779R0751R7213R9744J62657K02575
4041A0013831J73730J54059J77091J90086J16457P4520N7142M0210L3235M0293
4031A1070654M3629O6041J26602R8541Q7744J16296J11961Q9093O1058K9105O1441
4020A1962165L4541N7390J00792O4339M1635J03129R0289L7020N7852M6999M506
4009A2600657j2676m722k2619p128k1423k7188k6806K313k7907n1403o5356r4997
3997A2240745j63317j60022j31440j70911j14661j08291j33916j03889j02592
3988A1051706j45179j47287j68881j96678k17225k12574k02508k68439k71223
$$ plain form
4064 8846907 8807793 8803184 8755680 8775718 8807549 8827548 8825254 8827129 8901630 8936332 8971978 8988752
4052 8988752 9058881 9104127 9133697 9159473 9227112 9360891 9451642 9548855 9648599 9811256 10013831
4041 10013831 10187561 10341620 10518711 10708797 10825254 10899774 10956916 10997126 11030361 11070654
4031 11070654 11114283 11180324 11306926 11405467 11493211 11609507 11721468 11810561 11871619 11900724 11962165
4020 11962165 11996706 12054096 12154888 12219227 12260862 12363991 12454280 12491300 12549152 12596151 12600657
4009 12600657 12587981 12583259 12560640 12553512 12532089 12504901 12478095 12480408 12452501 12401098 12335742 12240745
3997 12240745 12077428 11917406 11785966 11615055 11500394 11392103 11258187 11154298 11051706
3988 11051706 10906527 10759240 10590359 10393681 10176456 9963882 9761374 9492935 9221712
3979I221712l00037k53162k10925k25466k15496k24292k25682j68387k19744j44101
3969G034420j44540k26384j42926j61410j29047j83828j74574j45007j32936j36580
3959E457188j10578j00319j06851o6529r9984j03647n8318n2988m5194q6770o0943
3948D565067k9065m7197k7421m9012J2637l1298l5741n5386p0628p4484j06973
3937D050499q0264j08465j15524j09573o3747m8972l2712o5522n4776l8010j9515
3926C313419j3847j9526o2094l0890m1975p4720p4870k2119k7507p7242m2812
3915B825817L4707k0862J166k4879m4969l1560k2936M2071p353l3458o301q02
3903B710641O5768N2725j2282Q2203P0550R7507R9433K5677n5670j34955j50662
$$ plain form
3979 9221712 8921675 8668513 8457588 8232122 8016626 7792334 7566652 7398265 7178521 7034420
3969 7034420 6889880 6663496 6520570 6359160 6230113 6046285 5871711 5726704 5593768 5457188
3959 5457188 5346610 5246291 5139440 5072911 4972927 4869280 4810962 4757974 4712780 4626010 4565067
3948 4565067 4536002 4488805 4461384 4412372 4425009 4393711 4357970 4302584 4231956 4157472 4050499
3937 4050499 3970235 3861770 3746246 3636673 3572926 3523954 3491242 3425720 3370944 3332934 3313419
3926 3313419 3299572 3280046 3217952 3187062 3145087 3070367 2995497 2973378 2945871 2868629 2825817
3915 2825817 2860524 2839662 2840828 2815949 2770980 2739420 2716484 2758555 2751202 2717744 2711443 2710641
3903 2710641 2776409 2829134 2816852 2899055 2969605 3067112 3166545 3192222 3136552 3001597 2850935
3892B850935r5932r0690o6688m3488o1420m1556p001l2586l2329l5381j2970j2800
3880B318094k2807M656l5853j6053m915m6349l2685K265j0620k5703K9511l145
3868B156396m3419k3732r456M362l376m9668q563n341M243j5727n3256j3364m242
3855A934857m0639k8151K070j343K596q394j5904j4208J3856k9197j9251J5316
3843A811608k076J1180K6952q589P495m544k5639j566j573J437q084m2255j5028
3830A749318M0862j6415k9366J6760j3187k4450r388j4396m4961J8727l3216J6378
3818A656666K6349p570K2212m2162Q774k5006N182L1603K1741K3686m93q268K441
3805A715155J0881j2335r352P110K527K2412k1908J6342K29J2257N962l590j3093
$$ plain form
3892 2850935 2755003 2664313 2597625 2554137 2492717 2451161 2444160 2411574 2379245 2343864 2330894 2318094
3880 2318094 2295287 2299943 2264090 2248037 2243122 2196773 2164088 2166353 2155733 2130030 2159541 2156396
3868 2156396 2112977 2089245 2079789 2084151 2080775 2031107 2022544 2017203 2021446 2005719 1952463 1939099 1934857
3855 1934857 1894218 1866067 1868137 1866794 1869390 1860996 1845092 1830884 1844740 1815543 1796292 1811608
3843 1811608 1809532 1820712 1847664 1839075 1846570 1842026 1816387 1814821 1813248 1814685 1806601 1764346 1749318
3830 1749318 1790180 1773765 1744399 1761159 1747972 1723522 1714134 1699738 1654777 1673504 1640288 1656666
3818 1656666 1683015 1675445 1697657 1655495 1664269 1639263 1644445 1676048 1697789 1721475 1720982 1712714 1715155
3805 1715155 1726036 1713701 1704349 1711459 1713986 1736398 1714490 1730832 1731061 1743318 1749280 1745690 1732597
3792A732597J935J5477K7829J3085l949j4228J047J6075j8680J7182O7446M0453
3780A896269J2033Q355q888K9324p348N200J1270K6127K9704q918L2718k5065
3768B000781j462K914O8642L1110j0948J8676J3976R178k266L5659K8637K0652
3756B215549K9038K50L7919N9334L2693J9630J2693M0031p841K2139p266L7995
3744B492164M5417N1475m637K3343K0160L5276M6301k536P154L7421L4847N4501
3732B840886L1019L2509M9767N8910O1820M1118J5859N3620J02876O2455J7165
3721C368004J09882O9854N4782O7587M6977M8301L6986K7878j6413K8912M6096
3710C888846L8830K4057K2807L0514L3277L5094L2270L9867M3153K5265K8316
$$ plain form
3792 1732597 1734532 1750009 1777838 1790923 1786974 1772746 1773793 1789868 1771188 1788370 1855816 1896269
3780 1896269 1908302 1916657 1907769 1937093 1929745 1934945 1946215 1972342 2002046 1993128 2025846 2000781
3768 2000781 1999319 2002233 2070875 2101985 2091037 2109713 2123689 2132867 2130601 2166260 2194897 2215549
3756 2215549 2244587 2244837 2282756 2342090 2374783 2394413 2407106 2447137 2439296 2461435 2454169 2492164
3744 2492164 2537581 2589056 2584419 2607762 2627922 2663198 2709499 2706963 2714117 2751538 2786385 2840886
3732 2840886 2871905 2904414 2954181 3013091 3074911 3116029 3131888 3185508 3288384 3350839 3368004
3721 3368004 3477886 3547740 3602522 3670109 3717086 3765387 3802373 3830251 3813838 3842750 3888846
3710 3888846 3927676 3951733 3974540 4005054 4038331 4073425 4105695 4145562 4188715 4213980 4242296
3699D242296K6740L4013j9738P398L4492N8937J6161K0911o162l174N0246P0718
3687D532838P0002L9793M0848P0841Q9363R0073N5811R3825R5816Q3616R7138
3676E359964Q0093R4199J09151P5506J07269J00267J06215J29911R3767J56148
3666F412490N5556J28814Q7963Q2567O1284O3979P6861R6469J06532J2257P1348
3655G256120J08925Q9880K7332R275K0151j7421k6268p8490q0220q4914p6457
3644G147913j02059j33102j07608q8958o2325k0104q8982p6738m7848j00512q3380
3633F236297q7594n7065j21784j23912p1436n1076q9933n5927l4846p698n412
3622E529614j8204J8780M5856L5581J4122M7984Q2260J2189j8633M1482O3033
$$ plain form
3699 4242296 4269036 4303049 4283311 4290709 4325201 4384138 4400299 4421210 4415048 4411874 4462120 4532838
3687 4532838 4602840 4642633 4683481 4754322 4843685 4933758 4989569 5083394 5179210 5262826 5359964
3676 5359964 5440057 5534256 5643407 5718913 5826182 5926449 6032664 6162575 6256342 6412490
3666 6412490 6468046 6596860 6684823 6767390 6828674 6892653 6969514 7065983 7172515 7184772 7256120
3655 7256120 7365045 7454925 7482257 7491532 7511683 7494262 7467994 7389504 7309284 7224370 7147913
3644 7147913 7045854 6912752 6805144 6716186 6653861 6633757 6544775 6468037 6420189 6319677 6236297
3633 6236297 6148703 6091638 5969854 5845942 5774506 5723430 5633497 5577570 5542724 5535026 5529614
3622 5529614 5511410 5530190 5576046 5611627 5625749 5673733 5755993 5768182 5749549 5791031 5854064
3611E854064M1814Q4761N1559L4021N0315N1817Q672N6445K2273M1573m726n832
3599F286756k833m7430j9887l1835j9513m6946p2721k6668k1965p2610l3096J6700
3587E907952k5643m8064j752j2906p6403l1091n9213l9833k9374o1139r698J0054
3575E522890m4862K8525J4522N695L9462L5964L7961R0522P8471M795N4892N8620
3563E927457L2913M0050M1551L9608O9179J6616P3355O9434N3515M9076Q4400
3552F497154N4803O4647Q9845R8389N1410Q2920P4591O1757R6071P9872J18719
3541G370178Q8102Q6551J24555J34214J18464J03160Q3418R2544J10695R4968
3531H406849Q5752L4512M2048J498K3589N8842J0266O356K9091N5452N6012j6611
$$ plain form
3611 5854064 5895878 5980639 6032198 6066219 6116534 6168351 6177023 6233468 6255741 6297314 6292588 6286756
3599 6286756 6283923 6236493 6216606 6184771 6165258 6118312 6045591 6018923 5996958 5924348 5891252 5907952
3587 5907952 5882309 5834245 5832493 5819587 5743184 5712093 5652880 5613047 5583673 5522534 5512836 5522890
3575 5522890 5478028 5506553 5521075 5526770 5566232 5602196 5640157 5730679 5809150 5813945 5868837 5927457
3563 5927457 5960370 6000420 6041971 6081579 6150758 6167374 6240729 6310163 6363678 6412754 6497154
3552 6497154 6551957 6616604 6706449 6804838 6856248 6939168 7013759 7075516 7171587 7251459 7370178
3541 7370178 7458280 7544831 7669386 7803600 7922064 8025224 8108642 8201186 8311881 8406849
3531 8406849 8492601 8527113 8569161 8570659 8594248 8653090 8663356 8669712 8698803 8754255 8810267 8793656
3519H793656L2070J1860Q9988L4003O3264N7071P8025J07564P1423J20748J37970
3508I597642J56004J21781J07091J48352J67768J27877J51977J25317J76530J72019
3498A1052358J91741J95574J82701K02675K15653K52499K46965K10919K32043
3489A2983128K77107K77297K17843K63415K91722L31371L17271L05006L04936
3480A5569096L22624L11317K78785L15315L12336K94126L09090K91212L13273
3471A8317174L00005L04822L02632K86652K96290L09410K87281K85560K47405
3462B0937231K41774L25106K54499K55609K66334K17872K38814K30883J86437
3453B3154559K15440J71682J82318J79355J66785J22759L8592k0642j05830j15602
$$ plain form
3519 8793656 8825726 8837586 8927574 8961577 9024841 9081912 9159937 9267501 9338924 9459672 9597642
3508 9597642 9753646 9875427 9982518 10130870 10298638 10426515 10578492 10703809 10880339 11052358
3498 11052358 11244099 11439673 11622374 11825049 12040702 12293201 12540166 12751085 12983128
3489 12983128 13260235 13537532 13755375 14018790 14310512 14641883 14959154 15264160 15569096
3480 15569096 15891720 16203037 16481822 16797137 17109473 17403599 17712689 18003901 18317174
3471 18317174 18617179 18922001 19224633 19511285 19807575 20116985 20404266 20689826 20937231
3462 20937231 21179005 21504111 21758610 22014219 22280553 22498425 22737239 22968122 23154559
3453 23154559 23369999 23541681 23723999 23903354 24070139 24192898 24231490 24210848 24105018 23989416
3443B3989416j50686j98978k20718k93528k74953k58842k44563k37468k56157
3434B1853523k26138k36051k23391k08543k16956k03532j82986j70474j32702
3425B0052750j43333p2012n8844k1390K9153P5187J04820R2491J46956J32859
3415B0338637J05727Q9002R0992J03537M6396k6369m0422l1734n0768r8517j05956
3404B0420525j39777j46055j70755j77028k19463j98407j95895j84291k14940
3395A8773914k18605j57779j80001k13843k24047k68614k85550k47723k90964
3386A6686788k75011k82103k31173k28210k00387k14852j73101j25276j17698
3377A4838977l6264q4692q6105k4698R580P5199J6912M9481N7728M6665O0064
$$ plain form
3443 23989416 23838730 23639752 23419034 23125506 22850553 22591711 22347148 22109680 21853523
3434 21853523 21627385 21391334 21167943 20959400 20742444 20538912 20355926 20185452 20052750
3425 20052750 19909417 19837405 19778561 19757171 19786324 19861511 19966331 20058822 20205778 20338637
3415 20338637 20444364 20533366 20624358 20727895 20774291 20747922 20707500 20675766 20624998 20526481 20420525
3404 20420525 20280748 20134693 19963938 19786910 19567447 19369040 19173145 18988854 18773914
3395 18773914 18555309 18397530 18217529 18003686 17779639 17511025 17225475 16977752 16686788
3386 16686788 16411777 16129674 15898501 15670291 15469904 15255052 15081951 14956675 14838977
3377 14838977 14802713 14718021 14631916 14607218 14616798 14691997 14708909 14758390 14816118 14862783 14922847
3366A4922847R9474R2087J26829J27609M8956k186m2224j9318l3218n0866J7717
3355A5287707K6045J043K9048M6855L1067N4482M4079K8229J6518J9060L943L5998
3343A5624074J6172K252k874M616M1497r3N1395K6740N2780O0926O6372Q0698
3331A6024555Q7472R3838J17055R7728Q3737J05624J29005J63006J52870J57376
3321A7212266J62403J01536J54334K23134K00446K29901K49460K29581K71633
3312A9034694L05736K92294L22417L41092L56839M17831M01657M36697M49574
3303B2358831M93677N26310N26541N59839O15867O50801P26541O95378P02815
3294B7856600P88986Q58347Q77283R26552R51828J011152J045159J109164J136884
$$ plain form
3366 14922847 15022321 15114408 15241237 15368846 15417802 15415616 15373392 15354074 15320856 15269990 15287707
3355 15287707 15313752 15314795 15343843 15390698 15421765 15476247 15520326 15548555 15565073 15584133 15588076 15624074
3343 15624074 15640246 15642498 15639624 15644240 15685737 15685644 15737039 15763779 15816559 15877485 15943857 16024555
3331 16024555 16112027 16205865 16322920 16420648 16504385 16610009 16739014 16902020 17054890 17212266
3321 17212266 17374669 17476205 17630539 17853673 18054119 18284020 18533480 18763061 19034694
3312 19034694 19340430 19632724 19955141 20296233 20653072 21070903 21472560 21909257 22358831
3303 22358831 22852508 23378818 23905359 24465198 25081065 25731866 26458407 27153785 27856600
3294 27856600 28645586 29503933 30381216 31307768 32259596 33270748 34315907 35425071 36561955
3285C6561955J102867J139453J097747R60312Q74539P47310O15502M30762L21728
3276D3852175K28704J57977J56798J13655K07021K23424K15085K39859J95774
3267D5590472J32511R7330j2956k9877m8598j36166j65879p7875o650J12852K15089
3256D5670253L65884N11906O46216P55247Q67631R63725J050596J053004J076528
3247E2960990J125975J093990J098502J136370J131395J136036J139381J125590
3239F1948229J145546J152209J057708J016638J001249R14609P67544O35410N47937
3230G0187079M68028M19124K93537K21633J75840J17458M6891m865p6182j75401
3220G1673142j90049k66376l08711k87733k64469k92983k72277k61097l09000
$$ plain form
3285 36561955 37664822 38804275 39902022 40862334 41736873 42484183 43099685 43530447 43852175
3276 43852175 44080879 44238856 44395654 44509309 44716330 44939754 45154839 45394698 45590472
3267 45590472 45722983 45820313 45807357 45777480 45728882 45592716 45426837 45348962 45342312 45455164 45670253
3256 45670253 46036137 46548043 47194259 47949506 48817137 49780862 50831458 51884462 52960990
3247 52960990 54086965 55180955 56279457 57415827 58547222 59683258 60822639 61948229
3239 61948229 63093775 64245984 65303692 66320330 67321579 68236188 69003732 69639142 70187079
3230 70187079 70655107 71074231 71367768 71589401 71765241 71882699 71929590 71924725 71848543 71673142
3220 71673142 71483093 71216717 70908006 70620273 70355804 70062821 69790544 69529447 69220447
3211F9220447l94518m69972o09872q67574j123744j447262j708752j844721j847966
3202E8906066j790515j667707j562287j420686j310138j203888j048905r65963
3194D7935977r19843r07708q92954q66236q50307p69831p55416p61641o43691
3185D0568350o10095o25846n29629n62845n69127o07788n74174m63364m60627
3176C5564855l17199k16722j31693o0003P311K20460L86871N10722O87558O78318
3166C7330478M34379N620m72760o66874p00329o00833m14176l25895j63176q3014
3156C4343420m9683N3974J0174o1714j28916j76702j68941j57316o8197n2767
3146C3543332j04668k8262J40017K89776M19202N29054P60664J005210J275010
$$ plain form
3211 69220447 68825929 68355957 67746085 66878511 65754767 64307505 62598753 60754032 58906066
3202 58906066 57115551 55447844 53885557 52464871 51154733 49950845 48901940 47935977
3194 47935977 47016134 46108426 45215472 44349236 43498929 42729098 41973682 41212041 40568350
3185 40568350 39958255 39332409 38802780 38239935 37670808 37063020 36488846 36025482 35564855
3176 35564855 35247656 35030934 34899241 34839238 34846549 35067009 35453880 35964602 36652160 37330478
3166 37330478 37764857 37770477 37297717 36630843 35930514 35329681 34915505 34589610 34426434 34343420
3156 34343420 34293737 34347711 34357885 34296171 34167255 33990553 33821612 33664296 33596099 33543332
3146 33543332 33438664 33410402 33550419 33840195 34259397 34788451 35549115 36554325 37829335
3137C7829335J689610K086585K282381J991879J030005m28659j434041j552121
3129D3494974j251905q40930m91419k28919j01812J618P9547O8314q8056l46829
3119D0294583o26890p89033p03177o04585o66402q27218q77948p51570n57430
3110C3890330l22798j26039M6535J55112L01433M37931M84929N45317M73053K29690
3100C6115493k80928q48259j142942j152190j042417q47480o54034m72692l13086
3091B9361465k25826j52489j33569p9115j30683k13188j39478j23565j18607q3297
3081B7961648p6553q7617l4077J5550J13681J62714K08905K20894K25822K11141
3071B8922108J21032N1092j2526n5225j48421j89357k19170j87934k09552k18720
$$ plain form
3137 37829335 39518945 41605530 43887911 45879790 46909795 46481136 45047095 43494974
3129 43494974 42243069 41402139 40910720 40681801 40579989 40581607 40661154 40729468 40641412 40294583
3119 40294583 39667693 38878660 38175483 37570898 36904496 36077278 35199330 34447760 33890330
3110 33890330 33567532 33441493 33488028 33643140 33944573 34382504 34867433 35412750 35885803 36115493
3100 36115493 35834565 34986306 33843364 32691174 31648757 30801277 30147243 29674551 29361465
3091 29361465 29135639 28983150 28849581 28770466 28639783 28426595 28287117 28163552 28044945 27961648
3081 27961648 27885095 27797478 27763401 27778951 27892632 28055346 28264251 28485145 28710967 28922108
3071 28922108 29043140 29094232 29081706 29026481 28878060 28688703 28469533 28281599 28072047 27853327
3061B7853327j94145k12480k13093k20389l07154l41082k99123l42563l64400
3052B5358898l07981l23750l77342l79185l24531l51137l85081l69563m11856
3043B2128472m00023l88569m43678m65795n37697n03122m78509m76800m54404
3034A7979875m52399m19884l92568l86207l68725l37585l56627l18486k66211
3025A4681183l03580l09352k69656k36886k46566k37837k30146k41026k23672
3016A2382462j37717j27443j94110j39409j51321r1948j14149j27815j35713n5499
3006A1107338p6546r0143p8225o3596o9825n7744n8863m4207l2039q2057m0088
2995A0414005n2454o1510k5732k7641k7950o9256m6447j0255n954l8564l5690
$$ plain form
3061 27853327 27659182 27446702 27233609 27013220 26706066 26364984 26065861 25723298 25358898
3052 25358898 25050917 24727167 24349825 23970640 23646109 23294972 22909891 22540328 22128472
3043 22128472 21728449 21339880 20896202 20430407 19892710 19389588 18911079 18434279 17979875
3034 17979875 17527476 17107592 16715024 16328817 15960092 15622507 15265880 14947394 14681183
3025 14681183 14377603 14068251 13798595 13561709 13315143 13077306 12847160 12606134 12382462
3016 12382462 12244745 12117302 11923192 11783783 11632462 11540514 11426365 11298550 11162837 11107338
3006 11107338 11030792 10940649 10862424 10798828 10729003 10671259 10612396 10568189 10536150 10454093 10414005
2995 10414005 10361551 10300041 10274309 10246668 10218718 10149462 10103015 10092760 10086806 10048242 10012552
2984A0012552P592m8092m983o189M181q468M1857M3518K2521L7825N2631q738
2972A0146207K1212O1726M7355L6219N8011P983M8580N7515L7503L7774J9630
2961A0579715K6640M3902M4118N1977R5746P4596J14221O2108P5522K6713Q4496
2950A1279754Q0752J15451J55603J58833K31718J89352K27101K86744L10522K40386
2940A3276216K08004K15392J52745Q2867Q3889P4994L8529p750l0898j0079j7671
2929A4066238K9965J05363J22238J43092J38484J64324J45892J58529J82749J73395
2919A5430269J89239K54823L30153L12206L98245M37544N00578N33075N57581
2910A8943713N95659N22712M08005K81522J89717J19471Q6077R4502P9800J22483
$$ plain form
2984 10012552 10020144 9972052 9967069 9960880 9965061 9956593 9998450 10041968 10064489 10102314 10154945 10146207
2972 10146207 10167419 10229145 10276500 10312719 10370730 10378713 10427293 10484808 10522311 10560085 10579715
2961 10579715 10606355 10650257 10694375 10746352 10842098 10916694 11030915 11093023 11168545 11195258 11279754
2950 11279754 11360506 11475957 11631560 11790393 12022111 12211463 12438564 12725308 13035830 13276216
2940 13276216 13484220 13699612 13852357 13935224 14019113 14094107 14132636 14124886 14093988 14083909 14066238
2929 14066238 14096203 14201566 14323804 14466896 14605380 14769704 14915596 15074125 15256874 15430269
2919 15430269 15619508 15874331 16204484 16516690 16914935 17352479 17853057 18386132 18943713
2910 18943713 19539372 20062084 20470089 20751611 20941328 21060799 21146876 21241378 21321178 21443661
2900B1443661K10445K07456K38638K49975K66499L00937L31786L91802M50750
2891B4091949M94395N22039N86456O62774P40341P70055Q83425R78186J104881
2882C0834501J236168J387040J513732J622721J777379J927302J973565K001713
2874D4274121J971426J926975J960794J973998J960793J929711J944771J842895
2866E9785484J462977O46593n80869j920899k573531k643383k241876j675768
2858E0258728r84531m04299L5176M33386Q25668J158223J462326J774006K156249
2849E6714932K594913K966017L282882L313092L073317K735116K473166K306492
2841G9459927K231387K301002K425872K690492K862907K794673K636002K264560
$$ plain form
2900 21443661 21654106 21861562 22100200 22350175 22616674 22917611 23249397 23641199 24091949
2891 24091949 24586344 25108383 25694839 26357613 27097954 27868009 28751434 29729620 30834501
2882 30834501 32070669 33457709 34971441 36594162 38371541 40298843 42272408 44274121
2874 44274121 46245547 48172522 50133316 52107314 54068107 55997818 57942589 59785484
2866 59785484 61248461 61895054 61314185 59393286 56819755 54176372 51934496 50258728
2858 50258728 49274197 48869898 48905074 49338460 50164128 51322351 52784677 54558683 56714932
2849 56714932 59309845 62275862 65558744 68871836 71945153 74680269 77153435 79459927
2841 79459927 81691314 83992316 86418188 89108680 91971587 94766260 97402262 99666822
2833I9666822J870436J348815P94257M59948L91548L52816r5546j213338k750994
2824A00824764m210959n162947n330937n004786m487962l993957l556218l236736
2816F5840262k999029k881930k753366k723404k757300k690286k698409k623546
2808D3712992k467849k310788k105392j894999j803693j651305j541500j414467
2800B8522999j322383j142528j064059j016736r52898q87744q32982p85980p31795
2791A9785894o82579o62632o58046o40145n84273m97655n13691m32066m07906
2782A4706901m41038m50953m30243m80991m91070l97357m64264m52140m20224
2773A0678621l48465l35328l05578k80641k76333k28327j91317k50600k04160
$$ plain form
2833 99666822 101537258 102886073 103680330 104140278 104531826 104884642 104789096 103575758 100824764
2824 100824764 96613805 91450858 86119921 81115135 76627173 72633216 69076998 65840262
2816 65840262 62841233 59959303 57205937 54482533 51725233 49034947 46336538 43712992
2808 43712992 41245143 38934355 36828963 34933964 33130271 31478966 29937466 28522999
2800 28522999 27200616 26058088 24994029 23977293 23024395 22136651 21303669 20517689 19785894
2791 19785894 19103315 18440683 17782637 17142492 16558219 16060564 15546873 15114807 14706901
2782 14706901 14265863 13814910 13384667 12903676 12412606 12015249 11550985 11098845 10678621
2773 10678621 10330156 9994828 9689250 9408609 9132276 8903949 8712632 8462032 8257872
2764H257872j98503j84938j85788k04187j73995j69386j65449j49000j39122j61493
2754F526011j61853j22230j47007j59091j34633j31871j33111r5860p4175r4732
2744E271448j38207j16692p8313j57463j22684j17042j10106j34755j03008o2871
2734D130307r4826j17676l8858o9657p2716j11329q4324p6488j03832n9854p2583
2723C228164o4304r2308l6075q803r4590q6023n8531m0806m5239l1737m4387p7813
2711B547548n8125O717m0974l8459j2237o0075k1742l8482m9257l2784k0401j633
2699B180096j3952j7645o6896k4422K787m1553l6377j1573k9531m3270l8022j6960
2687A842682K150k3258p852m2945m1268q192l1287k8573p025r426m4077k6469
$$ plain form
2764 8257872 8059369 7874431 7688643 7484456 7310461 7141075 6975626 6826626 6687504 6526011
2754 6526011 6364158 6241928 6094921 5935830 5801197 5669326 5536215 5440355 5366180 5271448
2744 5271448 5133241 5016549 4938236 4780773 4658089 4541047 4430941 4296186 4193178 4130307
2734 4130307 4035481 3917805 3878947 3809290 3736574 3625245 3540921 3464433 3360601 3300747 3228164
2723 3228164 3163860 3071552 3035477 3026674 2932084 2846061 2787530 2746724 2701485 2669748 2625361 2547548
2711 2547548 2489423 2496140 2455166 2416707 2404470 2344395 2322653 2284171 2234914 2202130 2181729 2180096
2699 2180096 2166144 2148499 2081603 2057181 2059968 2018415 1982038 1970465 1940934 1897664 1859642 1842682
2687 1842682 1844832 1821574 1813722 1770777 1729509 1721317 1690030 1661457 1654432 1645006 1600929 1574460
2675A574460k7397k6502J3956k8754o9361O248l5749j6232m0990k9928k3505j6884
2663A279362J2566k2849o707n9465J6255k2663l8739J529k6801n3618N239j6388
2651A067721l3602l101j0337j6344l8684k797k3522k6002K9681Q582n333k6566
2639I19696j227O136k7758K5226J7742k6638N178K7975q011K0959j5940J1135
2627I54473l015O289k1993O496R283k6633j583k2678J2432l609l0432m998r394
2614H64638k3082k0768K3648l133K5494O640j4086j0795k2577l2268R218M7886
2602H50815J9679k1122k5055J1618N4837N0336j2045R688o741J4955L5643J4006
2590I96614l4617J8063j4814M8735j7175k046J8834K9121J1030M1945P539l2846
$$ plain form
2675 1574460 1547063 1520561 1534517 1505763 1436402 1442650 1406901 1390669 1349679 1319751 1296246 1279362
2663 1279362 1291928 1269079 1262372 1202907 1219162 1196499 1157760 1159289 1132488 1078870 1084109 1067721
2651 1067721 1034119 1031018 1020681 1004337 965653 962856 939334 913332 943013 951595 946262 919696
2639 919696 918469 924605 896847 922073 939815 913177 918355 946330 938319 959278 943338 954473
2627 954473 951458 957747 935754 942250 951533 924900 923317 900639 913071 909462 879030 874032 864638
2614 864638 841556 820788 844436 841303 866797 873437 859351 848556 825979 793711 802929 850815
2602 850815 870494 849372 824317 835935 890772 941108 929063 938751 932010 946965 982608 996614
2590 996614 961997 980060 965246 1013981 996806 994760 1013594 1042715 1053745 1095690 1103229 1070383
2578A070383j8054O748m657k7866j807k5662k0235n083J6897M1049k3783K9425
2566A037355L560J0581M3980p335L2065M8397M6899J3814K8105r890k8299R383
2554A228615M618k1467k6585J2638n388k311r922k126J9699j7335l2315r000K670
2541A141791k9498l5955l6579l1785k4078k8153m3890k4052M425N160l8125O405
2529H65666j4086m8995N49K0967j2359j0430J6262O138p0855m7540k8118J2996
2517F90195m9206l6673j9699j0030n6142j7491k4437l701K8151j6861J0336l5191
2505D59251n0883K7995l6261J3705K4355j8672j9549k0852J8518l3824p630j9749
2493C36404k7879j1822J68m4829K4202K6188l145k7597O480o669j6621j7014r443
$$ plain form
2578 1070383 1052329 1059077 1054420 1026554 1024747 999085 978850 973767 990664 1031713 1007930 1037355
2566 1037355 1040915 1051496 1095476 1088141 1120206 1168603 1215502 1229316 1257421 1247531 1219232 1228615
2554 1228615 1233233 1211766 1185181 1197819 1192431 1190120 1180198 1178072 1197771 1180436 1148121 1139121 1141791
2541 1141791 1112293 1076338 1039759 1007974 983896 955743 911853 887801 892226 897386 859261 865666
2529 865666 851580 802585 803134 824101 811742 801312 817574 823712 752857 705317 677199 690195
2517 690195 640989 604316 584617 574587 518445 500954 476517 472816 500967 484106 494442 459251
2505 459251 408368 436363 400102 413807 438162 419490 399941 379089 397607 363783 356153 336404
2493 336404 308525 296703 296871 252042 276244 302432 299287 271690 278170 271501 254880 237866 228423
2480B28423L909j8922k9340m79k4765o835J0585n157L6242K293n0389k1319J2568
2467A36814j4755J0052k0528k1041k0504J4227j6826R439J7733k1880L718K0396
2455I6845j3794J2395Q846o8253J1442j6513j7824J7273J1425J1771l1183j5403
2443G027J1089j5028J3856K8222p296l7295j10L2976P617l2696p482M8157l1301
2430A7736k7717J4778J2014l3907J4219j3646J4139J7211p219N223j3843M6842
2418D5830k7522l6044j8095l436J7432k9211J5697j0491j1787L7648k0242j7655
2406e7876M692J9097k358l488Q038j8556L162N454m730J6820p321l4911L7756
2393c4221K7703k4756M155j4183O520M422j2896m098K964j1697L988K3205L0151
$$ plain form
2480 228423 232332 213410 184070 183591 158826 151991 162576 157419 193661 195954 145565 124246 136814
2467 136814 122059 132111 111583 90542 70038 84265 67439 76878 94611 72731 76449 96845
2455 96845 83051 95446 104292 36039 47481 30968 13144 30417 41842 53613 22430 7027
2443 7027 18116 3088 16944 45166 37870 575 465 33441 41058 8362 880 49037 17736
2430 17736 -9981 4797 16811 -17096 -2877 -16523 -2384 14827 7608 12831 -1012 45830
2418 45830 18308 -17736 -35831 -39267 -21835 -51046 -35349 -45840 -57627 -19979 -40221 -57876
2406 -57876 -53184 -34087 -36445 -39933 -31895 -50451 -47289 -41835 -46565 -29745 -37066 -71977 -34221
2393 -34221 -6518 -31274 -27119 -41302 -34782 -30360 -43256 -47354 -44390 -56087 -52099 -28894 1257
2380A257J6454l7590j5049J4138k752K0911k89l3901j1235K8416r770l076J284
2367c1202l6220l883p811O349J7029L178p324J0821K6093m582N757j5407q036
2354d5238N93K6721J5028M005L918l0344m072l3148k826K8998q04l5500M6575
2341b6094K9430k7121K9318N65l868k8547m681k4205L8715j9340l3145R107n011
2328f4877K1185J4781k9967J4728j3608l3456L0791l708K2338k2042n580L552
2316f5863j6855j1764K5237J6055j725k998r432l0819J9281K8073p012Q503j5854
2303f5173K4571k613j2485l0405j8162P17J4435k6920L0647K6338j8824m424m566
2290h6864K7095j9388k5538J656j9676q551N3068R272j3809K7599k0356Q210N274
$$ plain form
2380 1257 17711 -19879 -34928 -20790 -23542 -2631 -2920 -36821 -48056 -19640 -29410 -32486 -31202
2367 -31202 -67422 -71305 -79116 -72767 -55738 -52560 -59884 -49063 -22970 -27552 -21795 -37202 -45238
2354 -45238 -44645 -17924 -2896 1109 5027 -25317 -29389 -62537 -65363 -36365 -37169 -72669 -26094
2341 -26094 3336 -23785 5533 6098 2230 -26317 -30998 -55203 -16488 -35828 -68973 -59866 -64877
2328 -64877 -43692 -28911 -58878 -44150 -57758 -91214 -60423 -64131 -41793 -63835 -69415 -65863
2316 -65863 -82718 -94482 -69245 -53190 -54915 -57913 -67345 -98164 -78883 -50810 -57822 -49319 -65173
2303 -65173 -40602 -43215 -55700 -86105 -104267 -103550 -89115 -116035 -85388 -59050 -77874 -82298 -86864
2290 -86864 -59769 -79157 -104695 -103039 -122715 -131266 -78198 -68926 -82735 -55136 -75492 -67282 -62008
2277f2008k0267j3347K5742J2485k7709N067J1666K2498m982K761k882k4537J260
2264g4253J5900j7251K4119l0352J814J6301k2274q928L1267o763r721Q360m774
2251g6555K2970L3344k7447l8577k4718J9085R976K7062J3336j2451L674j9194
2239f9495k9387N8143J8883l4397o485J5652j0039r920j2627j6216K5974K272
2227f7642J218k936P074L2449J035o720J76K1857j5391l8396L2657N478j037l5278
2213f5456o09K0534j8247L9165j5444n675l6735L0416K8266p517j89q001K4482
2200a5010m3131n246K6424J0668K0949J13j8494K635n2079L6924J4634n758J9294
2187h077k2322o007r288o940Q398n380p954K3924J8571M140L009o645K1105j88
$$ plain form
2277 -62008 -82275 -95622 -69880 -57395 -85104 -80037 -68371 -45873 -50855 -48094 -50976 -75513 -74253
2264 -74253 -58353 -75604 -51485 -81837 -80023 -63722 -85996 -94924 -63657 -70420 -80141 -71781 -76555
2251 -76555 -53585 -20241 -47688 -86265 -110983 -91898 -81922 -54860 -41524 -53975 -50301 -69495
2239 -69495 -98882 -40739 -21856 -56253 -62738 -47086 -57125 -67045 -79672 -95888 -69914 -67642
2227 -67642 -66424 -69360 -62286 -29837 -28802 -35522 -35346 -13489 -28880 -67276 -34619 -29141 -30178 -65456
2213 -65456 -66065 -45531 -63778 -24613 -40057 -45732 -82467 -52051 -23785 -31302 -31491 -39492 -15010
2200 -15010 -58141 -63387 -36963 -26295 -5346 -5233 -23727 -21092 -73171 -36247 -21613 -27371 -8077
2187 -8077 -30399 -36406 -45694 -52634 -44236 -49616 -57570 -33646 -15075 -10935 -7926 -14571 6534 6346
2173F346l280p370J9525J9154l267R791P64k5587O223J3699J0466j9793o052K2282
2159D2901P412j5417r252J094P369L083j2430J0968M0702j844j9234j3220J8770
2146F0902R316J3544R342j6570j6208J3266p824J8248K8430l090L5665J2964l5312
2133A22673O411K2823J876r779O304J9528r846j4433J2594P595j0280R016J674
2120A66156K7638N0285j4186R033k1590k9281J634M1293J6417J6745K2413n021
2108B81536K0165L7104M2320j3886R02j2936L9673L356J6041N1785O097L3410
2096E05567m282K5955L3932M5564q516J4900O5325K6272N7117M8959O1767R9547
2084I72107J01492P1088P9195L9590L2392Q3957J75138K08324K57622K85520L44006
$$ plain form
2173 6346 3066 -4304 15221 34375 31108 40899 41663 16076 22299 35998 46464 26671 20619 42901
2159 42901 50313 34896 25644 26738 34107 37190 24760 35728 76430 74586 55352 42132 60902
2146 60902 70218 83762 93104 76534 60326 73592 65768 84016 112446 109356 145021 157985 122673
2133 122673 129084 151907 153783 144004 150308 169836 159990 145557 158151 165746 155466 164482 166156
2120 166156 193794 244079 229893 238926 217336 188055 189689 230982 247399 264144 286557 281536
2108 281536 301701 338805 381125 367239 368141 355205 394878 398234 414275 466060 472157 505567
2096 505567 501285 527240 561172 606736 598220 613120 678445 704717 761834 810793 872560 972107
2084 972107 1073599 1144687 1223882 1263472 1295864 1379821 1554959 1763283 2020905 2306425 2650431
2073B650431M20133N50778Q09958J183025J121099P98367m93879j577045j379209
2064D083658r72875o47900m90583l75580k52644j68339j23704r0854o1846m3482
2054H55851j1917m1281q0857j42611q4471j1205m8315l9899n7467J1696k1593
2043C27931j2938k6465n6428Q823L5683j9571n0487l525R981n2913l3570m083
2031A22438k691k6220j4431p648J969M218K5163j6746M297R993j4789J5618k6879
2018G4292k38k7991J0481J7196m9340m2060L576J0583j600K6560J2145m570J4263
2005D3297j895j3394l2313J1094k5229k3779M516L4618J11k3744J037J2389K1675
1992H383j4805k3848p990K6189r025K125P915j720l6248M541J1928J6709m507
$$ plain form
2073 2650431 3070564 3621342 4431300 5614325 6735424 7533791 7039912 5462867 4083658
2064 4083658 3110783 2462883 1972300 1596720 1344076 1175737 1052033 961179 899333 855851
2054 855851 843934 802653 721796 579185 494714 483509 435194 395295 337828 349524 327931
2043 327931 314993 288528 232100 240923 276606 257035 206548 203023 213004 160091 126521 122438
2031 122438 119747 93527 79096 71448 73417 77635 102798 86052 90349 100342 85553 101171 74292
2018 74292 74054 46063 56544 73740 24400 -17660 -14084 -3501 -5101 21459 33604 29034 43297
2005 43297 41402 28008 -4305 6789 -18440 -42219 -37703 -3085 -2974 -26718 -25681 -13292 8383
1992 8383 -6422 -30270 -38260 -12071 -21096 -18971 -11056 -12776 -49024 -44483 -32555 -15846 -20353
1979b0353k2050M0694k931k3095N966k823j4145k0730K8222N512j479n008N547
1966b6673L91j0414K1788K473k6239L0143K3361P56l8569l0429J6451P091P211
1953b2659k0084m6126q07L9833J1653K07P76j6667k9119M737K9058j8573J0484
1940e7287j091K3164M921j0434K497M945L8165n005k3527j1292n467j1866O743
1927d5534K2488J1764l459j0817j4064l7394q207L9906K94J9218M586J238J056
1914a8925N342J2237j1012j0846n864k582K3360j9655k0025j2512l7913L2708
1902f5687K8215j4541j2917K1215M211Q543o363j2261P609N498J2928k7826K5652
1889b5724k9079l962K0456J9186J6894j4306j7396r138J4182j72K3443k433l5095
$$ plain form
1979 -20353 -42403 -1709 -4640 -27735 -21769 -24592 -38737 -59467 -31245 -25733 -27212 -32220 -26673
1966 -26673 -26282 -36696 -14908 -12435 -38674 -8531 14830 15586 -22983 -53412 -36961 -29870 -22659
1953 -22659 -42743 -88869 -89676 -49843 -38190 -37983 -37207 -53874 -82993 -78256 -49198 -67771 -57287
1940 -57287 -58378 -35214 -30293 -40727 -38230 -33285 4880 -125 -23652 -34944 -40411 -52277 -45534
1927 -45534 -23046 -11282 -14741 -25558 -39622 -77016 -85223 -45317 -45023 -25805 -21219 -19981 -18925
1914 -18925 -13583 -1346 -12358 -23204 -29068 -31650 -8290 -27945 -47970 -60482 -98395 -65687
1902 -65687 -37472 -52013 -64930 -43715 -39504 -30961 -37324 -49585 -41976 -36478 -23550 -51376 -25724
1889 -25724 -54803 -58765 -38309 -19123 -2229 -16535 -33931 -43069 -28887 -29059 -5616 -8049 -43144
1876d3144K349l759K7762q982j6100j4234j7503l431l429J1093K2866q484k427
1863e7423K290j816j6171J2275J1621k0478L3493J5124j5124j5547J5609L027
1851c3120k0744L5526K0781n352J0411m6436J2780J4101K165k7699r651J068K47
1838d5923J355O655j6643J1910k2016L8927j7871N645K3118l2938K956j6304j1722
1825g2851j6509M7333M7313k2123L4136k3597j7370J5583m3857j840J6498K7286
1813i998k139K1052l4638k2143j1117L6272R024R483K7569k8383j1143L769n828
1800a8220Q301J0564K3423k5767O130J0436n0734k893r782N420N8545r891j0199
1787d667l8951j0747L6555k3888J680J5943L4236k4852j5168J3272l7015K5996
$$ plain form
1876 -43144 -40795 -44554 -16792 -25774 -41874 -56108 -73611 -77042 -80471 -69378 -46512 -54996 -57423
1863 -57423 -55133 -56949 -73120 -60845 -49224 -69702 -36209 -21085 -36209 -51756 -36147 -33120
1851 -33120 -53864 -18338 2443 -2909 7502 -38934 -26154 -12053 -9888 -37587 -47238 -46170 -45923
1838 -45923 -44568 -37913 -54556 -42646 -64662 -25735 -43606 -37961 -14843 -47781 -44825 -61129 -72851
1825 -72851 -89360 -42027 5286 -16837 17299 -6298 -23668 -8085 -51942 -53782 -37284 -9998
1813 -9998 -12137 8915 -25723 -47866 -58983 -22711 -13687 -4204 23365 -5018 -16161 -12392 -18220
1800 -18220 -9919 645 24068 -1699 4431 14867 -35867 -38760 -48542 -43122 15423 5532 -4667
1787 -4667 -43618 -54365 -17810 -41698 -40018 -24075 10161 -14691 -29859 -16587 -53602 -27606
1775b7606l641k773j3201L524j1054K1018J4302k0531J4754O082K6048m0001j5222
1762d8301r191j6807K6125k479K748J8358j7844j1125K1553O495j3028L3900j4393
1749b3989J7651L2664m000m4404O232L2977m4493j2765j4327J2542J5647q76j8364
1736d5505Q557J5268l5193j0077J6116j504J1568O605m689n544K6977j6349j1179
1723d4949J7805m6927J526M9548j4469n2126P0122K859k0979M6308j7255j4883
1711b3420K208r49P196j3844O737l04J4114J5309j639r114o0503q570K3060M3962
1697e757j4947j0859k3379M153r860o745P3672Q207k4091l4534K7247K4267J1700
1684A9074j9928J666J0582k054P059k6990k8593J1340J8544l9760k2144J6487
$$ plain form
1775 -27606 -31247 -34020 -47221 -43697 -54751 -33733 -19431 -39962 -25208 -19126 6922 -33079 -48301
1762 -48301 -57492 -74299 -48174 -50653 -47905 -29547 -47391 -58516 -36963 -30468 -43496 -9596 -23989
1749 -23989 -6338 26326 22326 -22078 -15846 17131 -27362 -40127 -54454 -41912 -26265 -27141 -45505
1736 -45505 -36948 -21680 -56873 -66950 -50834 -52338 -40770 -34165 -38854 -44398 -17421 -33770 -44949
1723 -44949 -27144 -74071 -72545 -22997 -37466 -89592 -19470 -16611 -37590 8718 -8537 -23420
1711 -23420 -21212 -22161 -14965 -28809 -22072 -22376 -8262 7047 5408 -3706 -64209 -72779 -49719 -5757
1697 -5757 -20704 -31563 -54942 -50789 -60649 -67394 6278 14485 -9606 -44140 -16893 7374 19074
1684 19074 -854 812 11394 9340 16399 -10591 -39184 -27844 -9300 -49060 -71204 -54717
1672e4717N808K1222k871J5425J3742q181R415j2918J5974k6589J784J7761k1182
$$ plain form
1672 -54717 -48909 -27687 -30558 -15133 -1391 -9572 -157 -13075 2899 -23690 -21906 -4145 -25327
$$ [...]
##END NTUPLES=NMR SPECTRUM
##END=
