##TITLE=1H_CA-9172-2xy
 DMSO
 8 sc, 
 13.7.2023
##JCAMPDX= 6.0         $$ Bruker NMR JCAMP-DX V2.0
##DATA TYPE= NMR SPECTRUM
##DATA CLASS= NTUPLES
##ORIGIN= UXNMR, Bruker Analytische Messtechnik GmbH
##OWNER= root
$$ XWIN-NMR		Version 3.5
$$ Thu Jul 13 14:54:18 2023 Russian Standard Time (UT+4h)  she@DPX200
##.OBSERVE FREQUENCY= 200.13135
##.OBSERVE NUCLEUS= ^1H
##.ACQUISITION MODE= SIMULTANEOUS
##.ACQUISITION SCHEME= undefined
##.AVERAGES= 8
##.DIGITISER RES= 18
##SPECTROMETER/DATA SYSTEM= spect
##.PULSE SEQUENCE= zg30
##.SOLVENT NAME= CDCl3
##.SHIFT REFERENCE= (INTERNAL, CDCl3, 0, 15.7656)
##AUDIT TRAIL= $$ (NUMBER, WHEN, WHO, WHERE, WHAT)
$$ ##TITLE= Audit trail, XWIN-NMR		Version 3.5
$$ ##JCAMPDX= 5.01
$$ ##ORIGIN= Bruker BioSpin GmbH
$$ ##OWNER= she
$$ F:/spectra/data/she/nmr/H-F/1/pdata/1/auditp.txt
$$ ##AUDIT TRAIL=  $$ (NUMBER, WHEN, WHO, WHERE, WHAT)
(   1,<2023-07-13 14:52:52.09 +0400>,<she>,<DPX200>,
      <created by zg, POWCHK disabled, PULCHK disabled
       configuration hash MD5:
       00 E9 B6 7A A2 85 ED C7 34 08 36 98 17 FE 4E 26
       data hash MD5: 16K
       91 45 BE 66 6D DE 85 C1 60 F2 C5 EC 34 AE 1B 13>)
(   2,<2023-07-13 14:52:54.53 +0400>,<she>,<DPX200>,
      <Start of raw data processing
       efp BC_mod = 2 LB = 0.24 FT_mod = 6 PKNL = 1 PHC0 = -20992.28 PHC1 = 11.65272 SI = 16K 
       data hash MD5: 16K
       96 8D 74 8D 42 AB B2 5E 14 7C 2C 62 0A 0B A2 5E>)
(   3,<2023-07-13 14:53:14.09 +0400>,<she>,<DPX200>,
      <pk PHC0 = -1.672954 PHC1 = -1.6 
       data hash MD5: 16K
       BC 5D 6C F0 AD 80 59 89 0A 3E 1C 74 16 44 4A 64>)
(   4,<2023-07-13 14:53:18.12 +0400>,<she>,<DPX200>,
      <abs ABSG = 5 
       data hash MD5: 16K
       31 F5 4A C0 9A 24 E0 2C 49 B7 C2 8A 08 B4 21 96>)
$$ ##END=
$$ 
$$ hash MD5
$$ A5 C7 CF FB 91 1D 4A A2 FA 1B 17 48 13 A0 8A 17
##$RELAX= 
##$RELAX= 
##$RELAX= 
##$RELAX= 
##$RELAX= 
##$RELAX= 
$$ Bruker specific parameters
$$ --------------------------
##$DU= <F:/spectra>
##$EXPNO= 1
##$NAME= <H-F>
##$PROCNO= 1
##$TYPE= <nmr>
##$USER= <she>
##$AMP= (0..31)
100 100 100 100 100 100 100 100 100 100 100 100 100 100 100 100 100 100 
100 100 100 100 100 100 100 100 100 100 100 100 100 100 
##$AQSEQ= 0
##$AQ_mod= 1
##$AUNM= <au_zg>
##$AUTOPOS= <>
##$BF1= 200.13
##$BF2= 200.13
##$BF3= 200.13
##$BF4= 200.13
##$BF5= 200.13
##$BF6= 200.13
##$BF7= 200.13
##$BF8= 200.13
##$BYTORDA= 1
##$CFDGTYP= 0
##$CFRGTYP= 5
##$CHEMSTR= <none>
##$CNST= (0..31)
1 1 145 1 1 1 1 1 1 1 1 1 1 1 1 1 1 1 1 1 1 1 1 1 1 1 1 1 1 1 1 1 
##$CPDPRG= <>
##$CPDPRG1= <>
##$CPDPRG2= <>
##$CPDPRG3= <>
##$CPDPRG4= <mlev>
##$CPDPRG5= <mlev>
##$CPDPRG6= <mlev>
##$CPDPRG7= <mlev>
##$CPDPRG8= <mlev>
##$CPDPRGB= <>
##$CPDPRGT= <>
##$D= (0..31)
0 1.2 0 0 0 0 0 0 0 0.06 0 0.03 0 0 0 0 0.0002 0 0 0 0 0 0 0 0 0 0 0 0 
0 0 0 
##$DATE= 1689245571
##$DBL= (0..7)
120 120 120 120 120 120 120 120 
##$DBP= (0..7)
150 150 150 150 150 150 150 150 
##$DBP07= 0
##$DBPNAM0= <>
##$DBPNAM1= <>
##$DBPNAM2= <>
##$DBPNAM3= <>
##$DBPNAM4= <>
$$ [...]
##$SUBNAM3= <"">
##$SUBNAM4= <"">
##$SUBNAM5= <"">
##$SUBNAM6= <"">
##$SUBNAM7= <"">
##$SUBNAM8= <"">
##$SUBNAM9= <"">
##$SW= 18.05172834244
##$SWIBOX= (0..15)
0 0 2 0 0 0 0 0 0 0 0 0 0 0 0 0 
##$SW_h= 3612.71676300578
##$TD= 16384
##$TD0= 1
##$TE= 0
##$TE2= 300
##$TE3= 300
##$TEG= 300
##$TL= (0..7)
0 120 120 120 120 120 120 120 
##$TP= (0..7)
150 150 150 150 150 150 150 150 
##$TP07= 0
##$TPNAME0= <>
##$TPNAME1= <>
##$TPNAME2= <>
##$TPNAME3= <>
##$TPNAME4= <>
##$TPNAME5= <>
##$TPNAME6= <>
##$TPNAME7= <>
##$TPOAL= (0..7)
0.5 0.5 0.5 0.5 0.5 0.5 0.5 0.5 
##$TPOFFS= (0..7)
0 0 0 0 0 0 0 0 
##$TUNHIN= 0
##$TUNHOUT= 0
##$TUNXOUT= 0
##$USERA1= <user>
##$USERA2= <user>
##$USERA3= <user>
##$USERA4= <user>
##$USERA5= <user>
##$V9= 5
##$VALIST= <valist>
##$VCLIST= <CCCCCCCCCCCCCCC>
##$VD= 0
##$VDLIST= <DDDDDDDDDDDDDDD>
##$VPLIST= <PPPPPPPPPPPPPPP>
##$VTLIST= <TTTTTTTTTTTTTTT>
##$WBST= 1024
##$WBSW= 4
##$XGAIN= (0..3)
0 0 0 0 
##$XL= 0
##$YL= 0
##$YMAX_a= 268954
##$YMIN_a= -218493
##$ZGOPTNS= <>
##$ZL1= 120
##$ZL2= 120
##$ZL3= 120
##$ZL4= 120
##$ABSF1= 15.7535
##$ABSF2= -2.298349
##$ABSG= 5
##$ABSL= 3
##$ALPHA= 0
##$AQORDER= 0
##$ASSFAC= 0
##$ASSFACI= 0
##$ASSFACX= 0
##$ASSWID= 0
##$AUNMP= <proc_1d>
##$AZFE= 0.1
##$AZFW= 0.1
##$BCFW= 0
##$BC_mod= 2
##$BYTORDP= 0
##$COROFFS= 0
##$CY= -3
##$DATMOD= 1
##$DC= 0
##$DFILT= <>
##$DTYPP= 0
##$F1P= 0
##$F2P= 0
##$FCOR= 1
##$FTSIZE= 16384
##$FT_mod= 6
##$GAMMA= 0
##$GB= 0
##$INTBC= 1
##$INTSCL= 3.70164e-10
##$ISEN= 128
##$LB= 0.24
##$LEV0= 0
##$LPBIN= 0
##$MAXI= 10000
##$MC2= 0
##$MEAN= 0
##$ME_mod= 0
##$MI= 1.114404
##$NCOEF= 0
##$NC_proc= -9
##$NLEV= 6
##$NOISF1= 3.799351
##$NOISF2= 2.8
##$NSP= 0
##$NTH_PI= 0
##$NZP= 0
##$OFFSET= 15.76562
##$PC= 1
##$PHC0= -20993.95
##$PHC1= 10.05272
##$PH_mod= 1
##$PKNL= yes
##$PPARMOD= 0
##$PSCAL= 0
##$PSIGN= 0
##$REVERSE= no
##$SF= 200.130001184933
##$SI= 16384
##$SIGF1= 3
##$SIGF2= 2
##$SINO= 5.538805
##$SIOLD= 16384
##$SREGLST= <1H.CDCl3>
##$SSB= 0
##$STSI= 16384
##$STSR= 0
##$SW_p= 3612.71676300578
##$SYMM= 0
##$S_DEV= 0
##$TDeff= 16384
##$TDoff= 0
##$TI= <>
##$TILT= no
##$TM1= 0
##$TM2= 0
##$TOPLEV= 0
##$USERP1= <user>
##$USERP2= <user>
##$USERP3= <user>
##$USERP4= <user>
##$USERP5= <user>
##$WDW= 1
##$XDIM= 16384
##$YMAX_p= 478736056
##$YMIN_p= -4889780
$$ End of Bruker specific parameters
$$ ---------------------------------
##NTUPLES= NMR SPECTRUM
##VAR_NAME=  FREQUENCY,     SPECTRUM/REAL,   SPECTRUM/IMAG
##SYMBOL=    X,             R,               I
##VAR_TYPE=  INDEPENDENT,   DEPENDENT,       DEPENDENT
##VAR_FORM=  AFFN,          ASDF,            ASDF
##VAR_DIM=   16384,         16384,           16384
##UNITS=     HZ,            ARBITRARY UNITS, ARBITRARY UNITS
##FACTOR=    0.220516191357247, 1,           1
##FIRST=     3155.173595637, 0,              0
##LAST=      -457.543167368781, 0,           0
##MIN=       -457.543167368781, -4889780,    0
##MAX=       3155.173595637, 478736056,      0
$$ Real data points
##PAGE= N=1
##DATA TABLE= (X++(R..R)), XYDATA
$$ [...]
8573 71934163 72571112 73494076 74380233 75450705 78467656 79620376 81461454 82913647 85244672
8564 85244672 87201897 89322280 92029956 93096789 94325308 96257145 96651853 97084700
8556 97084700 98206682 98185204 97242366 97137703 96435473 95817929 94818927 93305137 93496974
8547 93496974 93213184 92806404 92663513 92842392 94659517 95781394 96917774 98358419 99754247
8538 99754247 101793848 103844464 107088527 109218160 111488957 114272762 116588935 119205125
8530 119205125 121656569 123602995 125403332 127188379 128233999 128144117 127722576 126305661
8522 126305661 125926054 124740205 122672690 120245673 118495924 117071497 115443550 113502971
8514 113502971 111109647 109806414 109217282 108283804 107644586 106816940 106349116 106616591 107129528
8505 107129528 109155937 110122391 111555945 113215695 113318272 114436313 116839460 117802106
8497 117802106 119397371 120252155 120636399 122097314 122074168 121416961 120575661 119933182 120334390
8488 120334390 119166564 118639439 116351718 115877933 114960213 113158216 111740207 110773773 109807978
8479 109807978 109943297 108731696 107805116 108748089 107473594 107462241 107605380 106510527 106048912
8470 106048912 104666790 102610157 99962895 97307998 94493546 92324602 90226431 88027813
8462 88027813 86273231 83757285 81669633 79593073 76897949 74870033 74221034 73405601
8454 73405601 73088576 72001557 70941496 70667479 71181596 71615509 72109775 72959179 74670593
8445 74670593 75093644 76157046 77472209 78213888 79025510 78901791 78774412 77982316 76870664
8436 76870664 75313157 72151628 69116116 66596362 64476664 62661409 59567443 56462122
8428 56462122 53857130 50370573 48823752 47538759 45839517 44590137 43544693 41939712
8420 41939712 40340542 39858366 39430378 38759578 38186794 37949044 38408918 37823897 38135066
8411 38135066 38574220 38077061 37157409 36260180 36522645 36501683 35676800 35411632 34196713
8402 34196713 32404927 31180873 30536946 29023947 27341585 26016415 25744317 24785899 23090183
8393 23090183 22190241 21056611 20895736 19843574 18735099 17915573 16706544 16757826 16886643
8384 16886643 16543477 15688485 15533091 16444948 15359346 14191195 14206131 13672858 13148940
8375 13148940 12740564 12334900 12736106 11775183 11066893 10976767 10904171 10472076 9743647 9812142
8365 9812142 10361631 10166204 10133863 9267712 8673067 9279833 9232968 8871445 9140480 8664462
8355 8664462 8318971 8573425 8336450 8104903 6906569 7120802 7076342 7037932 7817327 7189924
8345 7189924 7452967 6926733 7237602 7154598 6910527 6852682 6381141 5981761 5252594 5730126
8335 5730126 5917876 5713902 6497741 6350869 5440906 5214884 5389399 5273750 5442568 5547314
8325 5547314 4662867 4262249 4897449 5156927 4245610 5008647 5872805 5030526 4542105 5281326
8315 5281326 5651493 5575115 4862086 3749159 4331264 4701189 4542675 4981550 4212904 3280491
8305 3280491 3184158 3891312 4154725 4641639 4285612 4250616 4164880 4180975 3614644 3256115
8295 3256115 3508240 3280861 3100092 3051957 3096717 3388554 3736899 3642661 3305727 2626231
8285 2626231 2765550 3335167 3091368 3318002 3172590 3293357 3084852 2438618 3070606 2761221
8275 2761221 2353868 2570704 2879763 2629790 3006251 2417103 2437302 1807583 1864558 2414864
8265 2414864 2046972 2847668 2488611 1850354 2551717 2596067 1979207 1987751 2365910 2879414
8255 2879414 3324737 2757405 2409610 1479127 2000282 3010706 3580480 3697009 2644968
8246 2644968 1710899 1697419 2122488 2218973 2097189 3281503 3511077 2292804 1522392 2142434
8236 2142434 2099518 1423338 1561368 2124488 2269832 2250463 2981649 2356081 1782040 2007891
8226 2007891 908238 871916 1199686 805391 1944998 1806730 1989511 1967726 1835949 1885928
8216 1885928 2767990 3222467 3431943 2711513 2305951 2600368 2225714 1562267 1663867 2797115
8206 2797115 2371167 2152433 2054168 1514128 1997946 1069639 1909143 1461484 2076830 1082243
8196 1082243 797140 -523098 -900610 -4889780 -258769 8478947 4733732 3821336 2967954
8187 2967954 3196728 3460231 4282158 3570962 3096973 2916648 2726880 2568602 2960479 1753310
8177 1753310 1414918 1766548 2770420 2030416 1884000 2683282 2958176 2746580 1406056
8168 1406056 1268287 1114749 725050 298865 1117425 1175248 820247 1277534 1879207 1929677
8158 1929677 1471098 1894194 2377106 2650665 1553420 700894 2013275 1863216 1552502
8149 1552502 1945528 1639931 1720402 2569813 1949518 1472189 1879881 2030819 2492340 2558625
8139 2558625 2252668 2478496 2224429 1487800 1074371 948679 1386214 1282671 822420 738970
8129 738970 861629 972717 1497440 1043447 930956 1201136 789657 1092813 1447898 1442820
8119 1442820 1668468 1275691 1277671 1337018 974776 516597 569653 2020222 1572757 1092878
8109 1092878 -334644 -17313 1093240 664112 526366 396081 365196 1231778 1338174
8100 1338174 1212994 578989 759980 860324 281264 476270 1366503 1166758 821445 929796
8090 929796 993139 1081521 550586 1435114 1204271 644817 808978 1257904 1279548 713263
8080 713263 1398335 2035750 1676920 1246816 709933 154747 -146577 -888074 58265 662505
8070 662505 511343 564191 212124 -368732 -129197 1128035 990323 875062 -260367 -320525
8060 -320525 -292073 -549851 -788824 -289715 -330294 -49785 655341 59174 -65409 -642502
8050 -642502 -441875 395886 633272 373179 -18905 -615554 241539 891874 1014363 1106124
8040 1106124 1480728 1218400 360134 408565 306770 520525 -21792 -446096 -245811 180007
8030 180007 918472 1194654 16608 -746261 -51368 859631 582452 1024806 977482 412475
8020 412475 596947 106206 -23837 79156 48710 244074 665443 405358 371698 560187
8010 560187 -4976 538610 1007715 229632 17079 -108152 -435945 -54944 4907 300069
8000 300069 893756 1488263 882069 407058 129780 -49997 -426176 -537776 245689 1279741
7990 1279741 518765 -237919 -292492 186383 181151 5222 1061062 653663 646763 282405
7980 282405 188437 -386155 -413623 264328 -333959 -395672 -465138 -120966 -233157 345380
7970 345380 969093 844975 1016484 156809 -86404 223052 520311 -51474 492033 531813
7960 531813 565013 34671 77358 -55375 -727805 -628084 -16715 351379 -765260 -740512
7950 -740512 35865 114390 51325 85458 -411972 308040 -63686 -1322231 -1331941 -1223169
7940 -1223169 -809592 -241315 -460331 -911690 -857853 -100049 215212 237432 536471 36589
7930 36589 -668667 -1267974 -1413603 -543292 -693853 -912986 -54376 -713512 -348142 -226303
7920 -226303 -677265 -972694 -962312 -152507 541629 -5608 -8550 357009 99189 9665
7910 9665 -119514 -638446 -214741 -506920 -184430 -79527 -433160 63414 -217680 -359305
7900 -359305 -3129 625128 37499 445844 156740 -452475 -274683 -221481 -1025499 -513588
7890 -513588 9852 -861521 -535125 -64167 407099 1026725 257347 -112531 -771232 -1622363
7880 -1622363 -445694 127117 -461512 -774052 -599264 -517410 -491944 75563 -111513 397024
7870 397024 492303 323196 -415744 -1015838 -464552 -459625 -1348342 -964369 -73553 220344
7860 220344 376142 -438775 -1053283 -1235506 -996194 -707159 133467 -193267 -203101 321843
7850 321843 322777 488790 -50737 111341 -360296 -900553 -683033 -571188 -580883 -1302222 -437682
7839 -437682 -644421 -1304806 -40547 -211557 -892711 -1485832 -1112101 -1004934 -48716 508396
7829 508396 -384743 -582532 -691686 -766235 -675763 237494 -499255 -875073 -794192 -336233
7819 -336233 42936 473847 80626 -234997 94314 -249776 -447567 20535 699502 58443
7809 58443 -347018 -352535 -1211957 -1544527 -2300862 -1190980 -176605 18121 942805 495850
7799 495850 604560 853297 1164875 1106440 1389401 1520310 669043 136938 587294 953361
7789 953361 1208119 573758 697152 178734 343373 148144 412798 569506 -153782 -99890
7779 -99890 -932069 -461815 281387 57455 286574 264264 -255415 -531263 -474734 -7961
7769 -7961 122066 135954 -181021 -274227 374555 -132582 -616304 92591 -540036 -995597
7759 -995597 -915295 -358054 -70084 308740 728764 479233 244887 -202902 -248642 -321501
7749 -321501 -6343 190960 -152793 1113624 261440 -316345 225676 -184783 -259759 75601
7739 75601 -779531 -927593 -468628 531492 1094244 127831 -221217 -380491 -604238 -815340
7729 -815340 -1564616 -1079768 -287192 23708 838140 593438 264881 102662 552199 -151311
7719 -151311 -448019 -963117 -718108 -210923 -1187925 -863257 -246737 -580308 -925719 -712595
7709 -712595 204253 -308644 47737 405378 436448 210139 -72982 -161688 -198946 -88691
7699 -88691 143757 733653 33576 -57195 -825998 -1326613 -931470 -306572 579757 361525
7689 361525 -58276 -561712 -1180391 -1548880 -777286 -462700 -326721 -362191 -419608 -197574
7679 -197574 -83559 -1126777 -449029 143777 -255696 -216385 166489 -447947 -690502 -184993
7669 -184993 -1166598 -946401 -209073 -233923 -1545387 -1500835 -1076649 -1503609 -857739 -694440
7659 -694440 -144372 -96237 -743270 -477676 151545 298376 497448 837733 264024 775285
7649 775285 930652 1326980 1246746 678948 210797 50313 137874 534243 190690 -170754
7639 -170754 91290 -82955 -192435 628895 -269571 -466466 91818 -516061 -966481 -50474
7629 -50474 -258409 -269735 -168776 -534335 -996681 -359705 480299 -387861 -242180 -344950
7619 -344950 -354449 -277299 -223417 178706 447191 444070 -64459 -567029 -924829 -949266 -1671285
7608 -1671285 -572467 -970748 -1498324 -1378523 -1370651 -1259021 -1234434 -1412908 -493866 -630252
7598 -630252 -906350 -290505 -892732 230064 448793 1501431 1184418 285317 -195033
7589 -195033 -604525 -652853 -38956 -69002 23574 -540044 -537692 -237266 -15080 -76772 -566358
7578 -566358 -1253481 -647736 134372 -623436 -295155 458812 709866 638288 396095 -118546
7568 -118546 -608965 -473694 -359036 156557 316929 -79904 -714641 -1235338 -149787 222127
7558 222127 -796934 -793409 -350092 -116917 -3125 -1662 -165730 -461533 -1620857 -1511968
7548 -1511968 -1798246 -528835 -212458 384688 203749 98753 559321 387247 194701
7539 194701 -953070 -276595 -211504 -277864 -4873 -91481 -531642 42034 -452847 -725964
7529 -725964 -189326 -248633 -547232 -300208 -1663047 -481636 -318330 -826757 -109121 -20210
7519 -20210 -194123 -278126 -161106 -830574 -765343 266572 712838 -47629 -168115 -422826
7509 -422826 -394220 -184003 -391175 -772496 199474 121944 657301 151170 -613493 -1136687
7499 -1136687 -365397 -43011 -427757 -608502 -641868 -45219 -99365 387726 383084 152251
7489 152251 -483525 -555523 -52266 222771 -742136 -416471 -176221 859213 481095 -278356
7479 -278356 -450254 -496680 -187734 -418127 80859 1027138 1134144 949560 315901 27885
7469 27885 53583 467101 329956 -313828 -319383 161458 -94878 -634587 -100652 294476
7459 294476 -186807 -866234 -306356 650674 569856 -594574 -836319 -435944 -78054 -157701
7449 -157701 -361956 -1049792 -1078325 -1057375 -1168890 -995242 -1028598 -1098173 -754250 -110501
7439 -110501 -455188 -1209355 -740439 -51293 -337237 -353545 243327 264505 237309 402993
7429 402993 628517 710122 608123 346870 167904 -88768 -660830 -861664 -392993 -323828
7419 -323828 -473313 -303495 -320030 -874034 -817234 54515 44646 -71030 -587338 -591488 -83303
7408 -83303 269878 -70616 -294191 -140436 -616926 -952695 -804926 -971715 -1473048 -2431869
7398 -2431869 -2262589 -805014 -56221 -301077 -1103849 -752860 188540 -830183 -925175
7389 -925175 358366 518285 564488 -143681 -1124249 -1071178 -494062 -15244 -382015 -331215
7379 -331215 541512 529289 -113934 -105065 555969 636112 -172928 -282643 -789168 -458056
7369 -458056 358299 445253 322624 -606521 -484125 126338 121809 -552850 -887451 -293832
7359 -293832 -343455 -1226488 457993 1546564 -128275 -183313 159750 539787 165529 -55125
7349 -55125 -207154 -978307 -335434 -303519 -39867 708497 403646 429217 469719 263231
7339 263231 72056 -113857 482746 -296793 -719112 -55689 -429299 -331960 -566702 -616991
7329 -616991 -756227 -818869 437359 -324516 -438994 -659250 -426658 808466 288053 530124
7319 530124 101392 -161860 426465 383342 556628 -693346 -904074 865145 928958 106544
7309 106544 285351 -677837 154121 497950 1042628 480487 -876537 -539184 -135157 -508343
7299 -508343 -643482 216789 -667915 -803669 -700765 -846801 -657981 -699505 -441803 -271451
7289 -271451 135471 83940 -889576 -444927 -347633 -499074 -545000 1031013 1357614 421544
7279 421544 95898 -187253 -192392 -232192 685735 1024023 559186 467200 664087 381883
7269 381883 171508 -146469 -1389361 -358050 -189438 522958 1150316 458209 409438 240848
7259 240848 -266108 -696732 -311552 51539 438154 104876 -242340 -366800 766848 544930
7249 544930 455790 -455030 433059 176897 604530 -28604 -1697184 -823024 300219 368813
7239 368813 787951 -373331 29748 701906 476484 1225428 212905 -572226 -1037804
7230 -1037804 -744747 -1505450 -548372 -516945 -437725 -320144 -440230 -190066 -760334 -288174
7220 -288174 549338 -30265 -441722 -416953 -190041 203881 205311 118391 -103308 -481331
7210 -481331 -202162 -289461 47663 209171 -110947 -458814 -63690 -27678 576014 198108
7200 198108 186132 81750 -298133 -1353626 -1388297 -1545944 -737235 -864774 -557717 21470
7190 21470 -70594 44287 657428 261691 -121984 -184214 -77365 827214 137499 -892461
7180 -892461 -186940 -98268 -444356 299829 318659 830388 317486 471230 401594 525893
7170 525893 568173 74835 -353873 800350 1215079 325754 -22371 153757 -524453 -1173640
7160 -1173640 -958996 -975082 108887 32985 -783427 -990851 -298389 307173 -685058 -590221
7150 -590221 -222177 -36284 184892 203386 235498 10031 -936318 -975135 -162347 436813
7140 436813 320922 504781 815677 256115 -1159335 -590768 -393370 -177931 138411 -468643
7130 -468643 -649023 -938428 -532136 -218807 -305694 -188221 66586 424738 488112 675404
7120 675404 286005 669845 107396 37220 -93340 -261843 -760216 246447 -529316 -460708
7110 -460708 323979 362142 558627 -323174 462837 1056609 493017 20604 405911 438547
7100 438547 292935 830595 1786441 981978 -88721 -1006412 -934549 -654240 -376546 -641284
7090 -641284 743186 405470 -185842 130950 332485 194189 -286924 137979 -559679 -748080
7080 -748080 -397726 -411736 -887190 -534743 -231930 73652 212615 974033 291979 284911
7070 284911 927324 1005557 721947 26471 -371713 -677003 150896 -150458 122182 823131
7060 823131 492449 -17625 -940160 -889249 -41126 -193037 -875999 477683 466519 -486281
7050 -486281 -601771 -349435 527174 -76081 -338579 152183 141259 -279616 415555 548088
7040 548088 524515 -178484 -448260 355082 201312 166631 250718 -108052 122858 86139
7030 86139 516669 317295 528348 -2990 -649999 -802151 -1150007 89224 -139450 -448031
7020 -448031 -288692 -561663 -155850 248649 -280710 -750478 -566126 -667189 -146780 -279200
7010 -279200 -97402 -123734 728452 626371 463156 979570 1112216 326501 107751 -426805
7000 -426805 -302753 -703653 -669366 74590 393116 827529 1242142 1211745 783204 355659
6990 355659 -600507 -286385 -59037 477183 705137 606268 934599 768178 -282759 117112
6980 117112 662232 397994 267454 594015 -194137 -132929 -425123 -130547 388901 388496
6970 388496 343826 -180010 -310415 -102945 -295633 151924 407326 -25876 313697 -166393
6960 -166393 36185 1030742 1101541 207119 48071 239835 -499432 -225567 67657 197646
6950 197646 1134252 907510 624013 810026 355751 517035 981648 418018 -247225 -476041
6940 -476041 98944 72499 495661 458520 637757 362550 -18547 509671 569636 663966
6930 663966 1595512 749642 412879 1505475 1265532 1278181 1221263 1003459 1261883 1252881
6920 1252881 552344 -411281 -242776 349275 91660 374632 753826 696795 975957 1090366
6910 1090366 400174 760269 1094193 1295778 585300 -913783 -466312 724681 68892
6901 68892 287659 386937 713661 223116 887628 1312662 1562936 820015 595919 772918
6891 772918 994403 410847 850509 937725 375408 -169695 -161952 505322 787231 561439
6881 561439 389889 915522 1032534 551916 1597180 1140918 1025231 1326846 275026
6872 275026 114442 233123 701907 195541 373818 896672 562406 531189 1446801 1317532
6862 1317532 956250 1216767 933027 745387 968163 651686 472620 43918 306808 -665405
6852 -665405 -537727 -533092 246773 421935 1196605 1212657 270022 773923 1069840 865798
6842 865798 872483 944378 758712 -288296 -422732 -628035 410198 802489 641194 676815
6832 676815 866923 634366 523534 336088 -255000 526228 928715 458840 275249 1026122
6822 1026122 -233268 -94842 212135 -149913 873382 887620 1000867 409765 790083
6813 790083 398393 60549 428836 453823 613613 515267 229405 538663 105131 5099
6803 5099 896376 704163 -81047 673968 1419828 576404 390506 59304 440357 824819
6793 824819 568230 683487 1079825 2007646 787254 503038 969653 519834 919281 414656
6783 414656 1069991 562730 86676 354404 -253971 18650 1500505 358513 142396
6774 142396 1015467 1052281 378232 1497884 1497930 27317 -405137 -95723 151299 492400
6764 492400 1011787 672049 404380 671945 486770 307200 911587 1150602 1494317 1684058
6754 1684058 1120235 987185 1049137 1085442 785481 290200 386273 220095 437907 686025
6744 686025 748110 633513 690329 961225 1147002 773260 416082 584320 781818 575780
6734 575780 1488438 653273 641865 339789 -318073 -340673 64728 723702 919753 829535
6724 829535 756190 249906 499921 218690 684298 1108121 667122 209022 -195678 -263839
6714 -263839 55357 1205742 1691391 1635058 1899132 2469461 2200379 2668560 1483411 1081354
6704 1081354 1207742 1395596 1274162 1755621 1496828 1177713 1241262 1561842 831823 1246090
6694 1246090 1690489 1712941 1903125 1533318 1834405 1447345 1030639 1354974 1175351 1713127
6684 1713127 1991997 2370431 1938135 1617604 2167577 1939715 1082250 695500 1008482 1238520
6674 1238520 2027353 1435652 979064 1006850 1633483 1966266 1566712 1768788 1622609 1851089
6664 1851089 1835116 1168844 1123861 722180 1658713 1624820 1462091 2646642 1970147 2104454
6654 2104454 2189846 1658968 1778061 1596996 1420746 1782216 1998857 2071874 2152657 1662317
6644 1662317 1632885 1393076 1809883 1063930 1034532 699746 490594 1340813 1618808 1728164
6634 1728164 2098362 2194317 1964241 2771322 2251669 1700920 1230145 823287 1474283 1793047
6624 1793047 1001602 1486220 1897883 1313717 1079428 1381256 2081236 2306692 1778379 1361434
6614 1361434 1538716 1347105 1714907 1865114 2206317 1531952 1335634 2039258 1685103 2305703
6604 2305703 2453348 1152513 1768658 2490897 2238404 1832196 2848637 2198373 1795130
6595 1795130 1952742 2701737 3277266 2143880 1858418 1491866 1960959 1955280 1670393 1551350
6585 1551350 1618143 1565274 1305723 1914592 1947683 2002444 1866490 1553265 2829036 3149175
6575 3149175 2901585 2802981 2330369 2474700 2520401 2511061 2136518 2003855 2410341 2054465
6565 2054465 1925372 2093718 2786551 2612918 2278781 2971025 2202083 1392172 2155089 2487987
6555 2487987 2797567 2708654 2522857 2501586 2727480 3112527 2744011 3231808 3433518 2709762
6545 2709762 1953829 2387275 3030233 3353319 2893732 2446738 2100305 2827716 2640974 1687813
6535 1687813 2054199 1571873 2176187 2760289 3219625 3386848 2492252 2824465 2807485 2608200
6525 2608200 2908120 3000530 3902537 4054514 3362468 2710119 3041792 3201910 3461893 3037898
6515 3037898 2098411 3166108 3270478 3317520 3313899 2628189 3178827 2928591 2340354 2810797
6505 2810797 2339283 3062532 4152484 4097348 3666612 3537208 3934621 4026433 4139494 3750507
6495 3750507 4162693 3599895 4056738 4703332 4068293 2606723 2638157 2644123 3300100 3033920
6485 3033920 3424175 3684366 4771848 5245155 4769288 3605131 2500334 3262952 3394414
6476 3394414 4114156 4230072 2988276 3631950 4288442 3800565 3894300 3738004 3959785 3514435
6466 3514435 3389422 3927746 4255364 4940722 5383388 4560621 4981931 4828767 4319436 5103604
6456 5103604 4474123 3027194 3058575 4209890 5108362 4533590 4259784 4320148 4280358 4520814
6446 4520814 5532412 5529537 5384345 6110816 5481254 4700037 4953255 4922626 4945343 4780958
6436 4780958 4318471 3879513 5167333 5505443 4662407 4039433 4242203 4773316 5050699
6427 5050699 4945859 5382989 4644542 5092305 5687842 5393292 4337032 5194447 5367835
6418 5367835 5310931 5855308 5913810 5681399 5744289 5649958 5916791 6296047 6479788 6658530
6408 6658530 5993692 5673348 5512968 6223209 6424912 5936937 6276699 6220026 6469348 6739281
6398 6739281 6295099 6376721 6150573 6436665 6617729 7316138 6619497 6794569 6652218 6618865
6388 6618865 7448630 7320116 7447203 7507118 7147807 8285225 7576708 8169077 7652694 8237542
6378 8237542 8131759 7067662 7015162 7534890 8687499 9236213 9671982 9957821 9633780
6369 9633780 9689871 9991919 9535504 8993407 9122323 10189783 9398345 9427329 9891586 9683633
6359 9683633 10167479 10653943 10286175 10318387 10345916 10981290 11214514 11448976 12485239 12669693
6349 12669693 11918602 12355646 13334612 13377285 13172081 12983170 12381902 12918451 13409189 13367428
6339 13367428 14250083 14646077 14849686 14937295 14536936 14671115 15031766 15512621 15518856 16001655
6329 16001655 16476448 17096742 17998828 18409637 18446608 18006663 18928716 20345873 20813703
6320 20813703 20080395 20184836 20810904 22125289 22549132 22713001 23130735 23290717 23539694
6311 23539694 23959076 24248349 24763464 26248017 26858960 27020169 27526055 28349497 29287576
6302 29287576 29961953 30692938 31554155 31784374 32643787 34014107 35609566 36814960 37435957
6293 37435957 37969791 38550184 39710165 41143829 41094373 42525932 43486382 43911752 45346408
6284 45346408 46873387 48469302 49173293 50301899 51558436 52395559 53067138 54361360 55413792
6275 55413792 56106147 56897267 56976185 59204521 60849401 60962896 61949223 63225374 63832772
6266 63832772 64533096 65358399 66588357 67264162 68028605 67924332 67925056 68277044 68464185 69304929
6256 69304929 69688925 69828960 69401986 69314511 69409611 69360921 69286032 68771314 67792602 67808589
6246 67808589 68059044 67518348 66815790 66961056 66061832 65992940 65937145 65841845 64940780 65919111
6236 65919111 65665092 65159610 65205812 64420580 64759907 65944804 66401270 65457973 65885327
6227 65885327 66579735 67645353 67439844 67793114 68469594 68730957 69477407 70742213 71820394
6218 71820394 72156628 72205147 74123869 74869596 76062060 77117368 77899600 78511521 78401579
6209 78401579 79378280 80709300 81919142 81718834 82405970 82420987 82235940 83455086 84522168
6200 84522168 85444149 85049017 85339844 85560444 84794463 84568325 84298126 84233131 83441527 82560616
6190 82560616 80147029 79577917 79096132 77507994 75669309 73652850 71981081 71142136 69517397
6181 69517397 67454842 66260764 64536266 62437337 60791788 59355176 57135826 55143059
6173 55143059 53965382 51893498 49247057 47196946 45887635 44312918 43699566 43460517
6165 43460517 42384643 40958182 39689284 38100392 36939898 36187752 34706226 34478944
6157 34478944 33464235 33155616 32635776 31145643 30757663 29888194 29116159 28711168 27986456
6148 27986456 27944646 27493730 27313230 27189914 26236201 26440307 26514457 26010157 26130760 25683421
6138 25683421 25432174 25600387 24867745 24257435 24525433 24433923 25100385 25238600 24442213 23920261
6128 23920261 23227473 23599306 23863863 24164249 25085724 24723779 24169288 23356728 23678127
6119 23678127 24500486 24601777 24021491 24484838 24572294 25237045 25026843 24557088 24655503 25258338
6109 25258338 25451348 25158467 26152153 25397431 25591617 26495703 27073070 26250183 27152589
6100 27152589 26821497 26466275 27360876 27253713 28439501 28426235 28413801 30036714 30098404 29480024
6090 29480024 30029652 29509889 30653341 31144539 32186007 32497984 32553575 33099319 33154301
6081 33154301 33839511 34325916 35246693 35520092 36691783 37585984 38339961 38706818 39644218
6072 39644218 40460256 40286947 40535237 41755026 42350268 42582769 43233475 44057428 44502206
6063 44502206 44561716 45257852 45512503 45864182 45986422 46181024 46871641 47616520 47725135 47989499
6053 47989499 49197688 49714819 50025409 50409288 50570923 51171966 51962465 53518101 53610227
6044 53610227 54503738 55445254 56052212 57135205 56969484 57306411 58853443 60284845 60752310
6035 60752310 61131251 61737785 61987552 63222329 63239802 63692205 64739646 65421540 66996894
6026 66996894 68088534 68324441 67883239 70179371 71608385 73001929 74200108 75099730 77366013
6017 77366013 78748336 79145652 80915336 82320553 84090540 85129481 86349016 88441514
6009 88441514 89196955 90601811 91952352 93643326 95453386 97068112 98777878 100500540
6001 100500540 102071517 102032979 104072577 105497557 106433527 107177000 108050221 109668509 111420793
5992 111420793 112418349 112588023 113508124 114683227 115150265 115821909 115742755 115757565 115918430
5983 115918430 116337624 116481405 115951759 114828367 114994413 116101512 115525490 115462492 115389778
5974 115389778 114706166 113634718 113703049 113423170 113414737 113095435 112429954 112150217 111336380 111812450
5964 111812450 112417549 111565303 112073884 112765527 113412598 113388998 113415611 113577500 113437346 113312205
5954 113312205 113977227 114203080 113593589 113201049 112778429 112471890 113144853 112578204 112355317
5945 112355317 111397333 111206501 110291380 110621826 110877177 110902505 110901845 110847064 110953602 110696980
5935 110696980 110311259 110501612 110213000 109329020 110298936 110749169 110744085 110485490 110585154 111029207
5925 111029207 110726027 111524880 111128299 110092255 110216602 110675428 111015252 110735437 110529332
5916 110529332 110592598 110175473 110520877 111114960 110071831 110649071 110278148 109895853 109483204
5907 109483204 110059952 109787849 109534911 109512591 110157311 110523358 111607576 111092622 110968951
5898 110968951 111333117 110879542 110679389 110512595 110476882 110346740 110080524 109350994 108625455
5889 108625455 107642517 107460115 106299466 105979922 105426020 104782345 103483944 102656718 101777898
5880 101777898 100600662 100799026 100980409 100485608 99690465 101133348 100526012 99929946 99737343
5871 99737343 98719036 98828069 99432850 100025694 99963589 100465937 99717173 98910284 99561182
5862 99561182 99270786 98451270 96762473 95510432 95192192 93129209 91574175 90216746 88268057
5853 88268057 86116850 85102167 83754964 82262159 80313587 77626231 75847948 74302432
5845 74302432 73005441 70563602 68125134 65607289 64259661 62495956 61690492 60566203
5837 60566203 59015679 58074876 57000315 55438880 53905748 53091135 52509699 51062265 50513835
5828 50513835 50927886 49329221 48426534 48245360 47291616 46582665 46336474 46121906 45504573
5819 45504573 45251657 45048747 43863299 43595659 44023458 43824134 43659518 43872997 42715707
5810 42715707 43292003 43743854 43249043 43513327 43010681 42399753 42547022 42711407 42963043
5801 42963043 42548461 41796767 41219952 40829676 39681803 39219698 39163670 37925112 37323167
5792 37323167 36772007 36251219 36294993 35681563 35021456 33775147 34151475 33770824 33350517
5783 33350517 32321989 31852791 30941183 30291015 30106829 30313579 30043112 29265255 29411937
5774 29411937 28773804 28357973 28359290 28087207 27751551 27814831 27727564 27733826 27189431 26825927
5764 26825927 26899618 27061794 25888899 25530615 24727379 24310164 23949734 23377804 22231996
5755 22231996 22259736 22363871 21840167 20929464 19524020 20164718 20626169 19892280 19099464
5746 19099464 19015931 18703408 17912929 18552789 18713826 18219360 17633852 17722889 17841960 17587442
5736 17587442 17187682 17292389 16952790 17179787 16826457 16198663 16007483 15398024 15077475
5727 15077475 14711182 14981514 14624456 14766332 15239065 15110082 15168760 15235479 15054496 14842060
5717 14842060 14914149 15124438 15003844 14548215 13991880 14480182 14346085 14774856 13749924
5708 13749924 13731938 14550972 14326707 14090364 12672276 12538156 13156574 13453031 12770656
5699 12770656 12772026 12778641 12411197 12529111 13561249 12670862 11786317 11210017 11192569 12958519
5689 12958519 12686559 11677555 11749395 13196320 13069179 12074447 12313635 12493017 12341455
5680 12341455 12430334 13508003 12899520 12148215 11788017 12358464 13050422 12706322 13199284
5671 13199284 12512196 11252728 11265935 11393788 10891304 11563211 12912934 12796735 11439506
5662 11439506 11621798 11331600 10798900 11375678 12310537 12205882 11825946 11949757 11596656
5653 11596656 12135680 12369845 12771182 12692745 11463616 11675438 11599483 11989585 12044980 12262971
5643 12262971 12455117 12718867 12510338 11897484 12293126 12109578 12874889 12612618 12085858
5634 12085858 12582516 12555703 12987356 13220305 12923261 12864143 12899466 13188815 13573819 14464274
5624 14464274 14178809 13986013 14476927 15037040 14786809 14234094 14031090 13514762 13652695
5615 13652695 13645426 13520873 13772434 14687697 13953805 13738680 13567943 13883669 14922480 14330048
5605 14330048 14723688 14213984 14266684 14709874 15428463 15230291 14993883 15365766 15175464 15172386
5595 15172386 15676573 15687377 16632700 17007546 17361478 17955710 17651631 17486165 17040618 16196518
5585 16196518 16313901 16281853 16499591 18010682 19020981 18558252 17247524 18478137 19008169
5576 19008169 18721298 18293918 18589867 17983329 18208066 18456880 19240379 19973497 20205005
5567 20205005 20129565 20365569 20899232 21040239 21280074 21094708 20982429 21430202 22270581 21891823
5557 21891823 22380597 22919111 23016867 23670635 24978706 25153382 25030179 24448028 24945799
5548 24945799 25596175 25709498 26421979 26297319 27147033 28465793 28398735 27982968 29269129
5539 29269129 30723505 30962957 30817657 31225305 31912787 32823961 33371626 33419198 33643191
5530 33643191 34836772 35566101 35950552 35705796 37191778 37708653 37773921 38752929 39001303
5521 39001303 39994258 40598919 41042328 41197707 41412164 42435069 42852992 43744051 43844482
5512 43844482 43927729 44931138 45574771 45837439 46595471 47668823 48483480 48756168 48180925
5503 48180925 49042201 49215142 50423636 50132672 50659496 51724600 52175719 52515448 53834158
5494 53834158 54301276 54361994 54504786 54329511 55661115 56665729 57833444 57967077 58618713
5485 58618713 59754975 61159824 61528720 62275920 62255421 63651840 65045564 65397024 66535904
5476 66535904 67306921 66957314 66924874 68369397 69373028 70140968 70277837 71081842 71326967
5467 71326967 71752785 73125781 73616972 74123532 74205507 74184744 75654435 76298378 76196023
5458 76196023 75898602 76032916 76077963 76271841 76415565 75691829 75573167 76401460 76396205 76705791
5448 76705791 76714419 75549573 75274400 75656195 75470187 75212187 75042317 75613910 74955986 74271296
5438 74271296 73270023 73614045 73255343 71996440 71408146 71202977 70081517 69756524 69826275
5429 69826275 69342145 69334385 69235502 69085158 69025482 68995234 68839888 68651909 68494977 68914861
5419 68914861 68996017 68518965 67597278 67542050 67484147 67410892 67362532 67412145 67071503 67049307 66622317
5408 66622317 65711996 66051523 65929941 65889587 65524811 64955530 63764183 63950489 64230842
5399 64230842 63633913 63303109 62144046 61031632 60680493 59669437 59057875 58939285 57733798
5390 57733798 57700148 57811164 57181273 55801155 55333020 54489107 54494451 53022950 52140608 51730628
5380 51730628 50526066 49031887 48643156 47229629 46654904 45753932 45454994 44393842 43705717
5371 43705717 42134086 40997581 40721519 39709175 39426125 38423528 37921000 36631629 36592263
5362 36592263 36949466 35791241 35583335 35371434 35637686 35804626 35246824 34768281 33807547
5353 33807547 32666234 33133583 33732813 33614256 34668013 33718389 33604861 34370516 34596300
5344 34596300 34361223 33633359 33391490 33200987 33157741 33421234 34284887 35150007 35315417 34506153
5334 34506153 34998669 35043278 34906154 36720961 36471408 36217678 37213383 37377132 37281368 37268948
5324 37268948 38329752 39023722 39663209 40352163 39932692 40784648 41471565 41733618 41108489
5315 41108489 40560370 40989763 41424063 41703371 42141079 42822856 42960620 43916807 45016984
5306 45016984 45241174 45609473 46168681 46365465 46599060 47138437 48065215 48479495 48467375 48776579
5296 48776579 48694939 49994195 49858486 51338179 52511588 52755579 52518037 53390026 54655594
5287 54655594 55228212 56366418 56850797 57109311 58268640 58948894 59069242 59908260 60788322
5278 60788322 61608139 62551282 62666812 62650904 63978459 65042540 65740109 66463623 67072422
5269 67072422 67567565 68875010 69476362 70360431 71443934 71883406 72449627 72128996 72453751
5260 72453751 72944241 73330808 74623647 75842469 75616449 75376472 75661886 77169249 77815081
5251 77815081 77491588 77529841 78200491 78423597 78370237 78784795 79279169 79277154 79649190 80382156
5241 80382156 80920948 81597469 82526686 83190892 83114726 83023625 82625045 82324541 82264007 82926115
5231 82926115 83043537 83400967 83345806 83228343 83685806 83654133 83427519 83546836 83651427 82486841
5221 82486841 82473155 82649052 82969112 82676458 81580834 80759324 80442469 80633867 80261087
5212 80261087 80406361 80349751 79743228 78934015 79478823 79562674 79290233 79480166 78998537 78242554
5202 78242554 77923928 78159643 78002756 77828545 78185067 78341767 78836932 78493552 78175568
5193 78175568 77865547 77192278 76587309 76253288 75803770 75289892 74470788 74789245 74010873
5184 74010873 72719056 71536873 71068279 70749532 70242938 70025047 69547208 69502477 69220993
5175 69220993 68495213 67428345 67501785 67140867 65858283 66048685 65295567 65012049 64979686
5166 64979686 64640274 63733101 63850417 63076521 63301315 62694032 61449954 62002818 61801852
5157 61801852 61604435 61674502 61227981 60139056 58991519 59047050 58728975 58299298 58491532
5148 58491532 57853914 57422516 56663594 56883009 56993651 56276534 54708165 54135579 54292924
5139 54292924 53858494 53926666 53686621 52546408 51362313 51608672 51915130 52288809 52268950
5130 52268950 50669700 50590824 50847483 51023381 50294956 50327994 49980773 50484171 50172954 50414693
5120 50414693 51746231 51726601 51886978 51287073 50328827 51083097 50480545 50820040 52194329
5111 52194329 51770722 52404440 52266169 52819797 54040414 55511026 56829516 56797069 57083534
5102 57083534 57210171 57711427 58737337 59735224 59897592 60817688 61871217 63252116 64617855
5093 64617855 65163038 65401755 66452576 67634010 67698944 68335349 69087393 70222240 71107503
5084 71107503 72220010 72198359 73073105 73614188 74412413 74821082 76205959 76687819 76560144
5075 76560144 77798861 78426561 79151348 80541060 81821937 81481001 83100339 84009523 84273357
5066 84273357 84933484 86197805 87697578 88401781 88713584 90658806 91808967 92409043 93339781
5057 93339781 94051329 95030790 95714227 96444820 98154338 99005089 99508956 101073261 101698953
5048 101698953 102991710 104853772 105768563 106972589 108669736 108852636 110468334 111653278
5040 111653278 112459580 114018294 114773849 116367254 117714575 118618345 119081794 120601510 122314062
5031 122314062 122776665 122687386 124811018 125778580 126931584 128778530 130069202 130556486 131271235
5022 131271235 131977279 132761554 133491630 134544404 136669036 137101650 137166149 138500035 138783751
5013 138783751 139136647 139146185 139190930 139620548 140197831 140862172 141799761 142140103 141827261 141144851
5003 141144851 141463729 142010028 142091766 141992924 142319885 142408116 141601688 141012593 141468339 141661573
4993 141661573 141601516 141631724 141560708 141771577 141284220 141507463 140654323 141290384 141540500 141093091
4983 141093091 141237713 140462400 139118910 139231832 138795658 137910941 137055153 137308948 136478062
4974 136478062 135713535 135046908 135440866 134429484 133525272 133266545 132272981 131725347 131256732
4965 131256732 130564382 130541809 130342840 128919521 127623319 127632591 125919162 124853850 124072017
4956 124072017 123304861 121515102 120049555 118610366 117608208 116803309 115706646 114912408
4948 114912408 113916337 112630595 112617453 111987640 110657807 109741371 109057333 108177959 107299349
4939 107299349 106450047 106112135 105057421 103877192 103889742 103437188 102671358 102074759 101004517
4930 101004517 100069567 98795777 97973559 97917720 97377517 97134633 95646945 94994209 94460074
4921 94460074 94097063 92536904 92764876 92190715 91141530 90446200 90516522 90510022 89779982 89902153
4911 89902153 89637454 88444279 88437499 88245238 89077455 89698376 89864744 89548538 89071276 89482599
4901 89482599 89841157 89665139 90177818 91008177 91225117 91882099 92497586 93029840 93650388
4892 93650388 94188431 94271762 93794103 94996045 95835113 97077848 97645652 97728961 98730930
4883 98730930 100237862 100563898 101475435 102523826 102939457 103719708 104103643 104892170 105407722
4874 105407722 105827626 105442090 105339975 105852931 106211160 106908446 106516424 107367483 107284324
4865 107284324 107544689 108039580 107426396 107868997 107750325 106705441 107350678 107493883 106370354
4856 106370354 105856035 105735963 105059874 104030110 103992150 103431403 103482482 103078678 102742106
4847 102742106 102696946 102257230 101927648 102030748 102478635 102384491 102011724 102719625 102903913 103593755
4837 103593755 104176711 104079374 104797455 105242944 106266597 107017417 107963770 109080197 110555604
4828 110555604 111882479 112368161 113924633 115353709 116258520 118671337 120672446 122936974
4820 122936974 125536451 127261849 129606455 132441529 134810946 136762290 140067313 142775245
4812 142775245 146490427 149228960 152927261 155990170 158990633 162768937 167722577 171770076
4804 171770076 175469085 179803837 183756088 187762745 192900634 197708674 202245286 208597945
4796 208597945 214597821 219823607 225460874 233016040 239482137 246646968 254468924 262223311
4788 262223311 270264496 278726322 287858469 296702641 305583650 315386726 325014296 334780069
4780 334780069 345813232 356638428 366635520 376726974 387900649 398338225 408413802
4773 408413802 418879261 427219381 435965899 443269304 447495516 450844396 452839978 453575653
4765 453575653 453149043 452111525 450748936 448766193 445381253 442314981 440068317 437055832
4757 437055832 433730787 431352263 428440968 425432923 421760543 418244406 413478092 408352169
4749 408352169 402076436 394484523 386548667 376712394 365355244 353946756 342148229 328792801
4741 328792801 316761395 304346170 291384676 279265508 266531475 256225383 245822127
4734 245822127 235569110 226400478 217891111 209610896 201133993 194700263 188035453 180703613
4726 180703613 174935718 170086662 164597674 159754038 156001066 151606268 146484312 142436482
4718 142436482 138970309 135801692 131815805 128428430 125727557 122795735 120088743 117439040
4710 117439040 114484967 112663231 109989556 107289283 104956526 102561982 100249502 98109310
4702 98109310 96337421 95108903 92498463 90943463 89320744 87213234 85281466 84208136
4694 84208136 82960042 81976942 79864297 78269458 77697843 75409166 73645678 72079431
4686 72079431 71337918 70413187 69097634 66658125 66427602 66122343 64992927 62555988 61676428
4677 61676428 60386511 59779445 59157085 57559239 56862810 56258598 55510365 53855860 52647276
4668 52647276 52125354 50823511 50048451 49634665 49051668 49109025 48008252 47056018 46346795
4659 46346795 45301808 44409027 43577738 43057656 42099955 40817483 40247929 39804937 39697952
4650 39697952 38855404 38052408 37866046 37316726 36655582 35810926 35456302 35569968 34443129
4641 34443129 33453074 32533642 32612674 31261970 31115947 31883791 31926642 30635511 29485145
4632 29485145 28945660 28855695 29127200 29157195 27806471 27315334 27769007 27031568 25899271
4623 25899271 25972419 25653977 24879261 24689370 23628065 23965942 24059565 24340040 24131000 22939238
4613 22939238 23076096 23147373 22656097 22216394 22428975 22086112 22128881 21791892 21921132 21146492
4603 21146492 20818388 20638170 20322327 20462768 19851450 19672390 20403467 20920233 20468052
4594 20468052 19836541 19746877 19988613 19483551 18727589 18677653 19348715 18755950 19222955 19279259
4584 19279259 18538356 18161683 18367546 17801292 17012178 17065567 17585713 18209379 17533458 17107702
4574 17107702 17783471 18159354 18350920 17700323 17620866 17045469 16971448 17270494 17748278 17215645
4564 17215645 17676735 17644737 17536325 16677573 17075750 16265037 16142696 16529383 15990364 16469668
4554 16469668 16432488 16176740 15765820 15150618 15073794 15461566 15855499 16663120 16251382 15214755
4544 15214755 15639072 15650893 15998430 15281123 14552105 14887490 14737189 15634526 16456850 15829008
4534 15829008 15451650 15662490 16655207 16658466 15908793 15612553 15448973 15833564 15418720 16173559
4524 16173559 15834023 15782388 15356795 14887936 14887128 14973375 14568400 13616048 13781739 14150080
4514 14150080 14849180 14940314 14796971 15156602 14888498 14439253 13977231 13795370 14254139 14890528
4504 14890528 14859004 15553313 14675962 14793889 14558043 15250247 15278297 15101035 14675121 14989808
4494 14989808 14310002 14408670 14266064 14316353 15120223 15549013 15168296 14840585 14213628 13943936
4484 13943936 15357554 14963289 14274522 13903387 14405315 15292009 15514417 14841973 16082061
4475 16082061 16581132 16669886 15972954 16890731 16970607 16106904 16478183 16571190 16331929 16731662
4465 16731662 17896224 18585494 18607784 18639392 17806064 18284391 18708937 19120649 19951546 20208061
4455 20208061 20605974 20184299 19464414 19530945 20111901 19938287 20395760 21285663 21361015 21452822
4445 21452822 21397739 22069308 22631967 23813003 23735819 23789317 23970782 24565739 25614094 25783272
4435 25783272 26380254 25584673 24985735 26005779 26663305 26653377 26860448 27572224 29194932
4426 29194932 28813501 29388746 29682328 29790417 31507695 31559588 31816716 32738408 33698335
4417 33698335 34936378 34563294 34532587 34916262 35917247 36935533 37813032 38608195 39921534
4408 39921534 41001818 41640318 42949995 44712473 45245608 46032118 47607367 49609406 50958983
4399 50958983 51912305 53468035 55659746 57087037 58744950 61029130 63788110 66108245
4391 66108245 68630938 71956965 75000251 78428491 81528822 85043490 89810817 94423343
4383 94423343 99207795 104926706 109773380 114760824 120193776 126591219 133045598 138488695
4375 138488695 143520507 148853970 154188630 159638229 164763994 168953673 172993686 177676339
4367 177676339 180857979 183690149 185921520 187242719 187899099 187869122 187354236 185784711 182248055
4358 182248055 179580036 175823195 170853435 167115818 163296453 158134257 152063728 145343821
4350 145343821 139486093 134231766 128288595 121751729 116296886 110727297 104167164 99331645
4342 99331645 93847445 89557741 84407326 79486879 74771085 70885460 67493284 63985425
4334 63985425 60982978 57279180 54824493 52170096 50667669 48770472 45739340 43962448
4326 43962448 42941664 41476804 39837392 37942610 37405484 36598349 35495539 34415139
4318 34415139 33277108 32596266 31566631 29988537 29787295 29689688 28945219 28066181 27981401
4309 27981401 27929321 26647939 26030798 25162001 24558348 25340391 24221226 23706607 23182025
4300 23182025 23073948 21631917 21558536 22594891 22090886 22436246 21499867 21373417 22203369
4291 22203369 22823751 22215336 21735779 21237750 22139867 21504661 21239322 21655902 20907917
4282 20907917 21271222 20845196 19315197 19370266 19516149 18819893 18412816 18532893 18461312 18798993
4272 18798993 18113195 17487499 17099986 17883005 17689144 17558082 18014990 18535586 18361362
4263 18361362 18786203 19164013 18270999 18118854 17406450 17767746 17159137 16488970 16277151
4254 16277151 16762656 17890070 17910620 17304811 16673202 16757487 17083916 17079067 16454379 16137651
4244 16137651 16774134 17177814 17601391 17351326 16778236 17139517 17152550 16391555 15660492 15640602
4234 15640602 16605465 16784786 16591083 16947896 16538107 16653441 16643395 16223749 16238855 16510274
4224 16510274 16759017 16372323 16575078 16705537 16920060 16208040 16531642 16088987 16276176
4215 16276176 16882296 16694955 16087012 15891240 15854463 16007127 16034676 15968613 15687636 15680706
4205 15680706 15945749 15789199 16080351 16557112 16747862 17657324 17777706 16384844 15760747
4196 15760747 16386183 17048741 16281432 16750099 17166327 17368338 17070709 17682830 17504389
4187 17504389 17642036 16829516 17183279 17450229 17720810 17773920 18713658 18878374 17849671
4178 17849671 18893831 18899123 18194881 18860115 19587888 19358809 19180710 19460732 19588062 19868457
4168 19868457 20557185 20858035 20027596 20205961 20394189 20305917 20178517 19931762 20122425 20961530
4158 20961530 21939820 22557214 22883855 23197336 23269144 23079198 23277446 23093558 23575794 24074507
4148 24074507 23871341 23256076 23740688 23866237 25119066 25374471 25821891 25793876 26106507
4139 26106507 26469536 26628850 26772352 26156431 26374703 26981399 27651721 28720854 28312178
4130 28312178 28102452 28399658 28805200 29128991 29140826 29756290 30702766 31339865 31362288 32162518
4120 32162518 32882611 32075059 32752758 33222901 33783662 34063710 34255648 34866570 35922058
4111 35922058 36893490 37702654 37755672 38445462 39186103 39059405 39788313 39725349 40520602 42126982
4101 42126982 42707471 43547955 44183112 44007068 45037251 46268548 47372695 46685157 47228752
4092 47228752 48493589 50031193 51596330 51222672 52155342 53503803 54318020 54975350 56319466
4083 56319466 57337417 57552214 59061304 60289199 61676947 62371245 63520482 64654509
4075 64654509 66711630 67339146 67944350 69374019 70394867 72361258 73094868 73359609 74526783
4066 74526783 76582733 78250839 78717640 80427051 82456679 84402214 86911967 88330364
4058 88330364 89748004 91020726 92338927 94238769 97078798 99275265 101346177 102736580
4050 102736580 104368977 106956951 109148149 111685042 114231976 116665176 119792376 122408207
4042 122408207 125835699 129206884 132447282 136571907 139713412 142865211 146662788 150252739
4034 150252739 154018949 157888071 161886175 166383270 171701631 176175571 179571645 184644320
4026 184644320 189886252 195810319 201812645 207021135 211954670 217352878 222622340 228156653
4018 228156653 234591869 240441910 244832942 250844805 257195028 262398566 267981290 272717648
4010 272717648 277559350 281812648 285939137 290271442 295083957 299304355 302359742 306110302
4002 306110302 308907480 310885257 312425361 314105095 315382871 316724709 317824058 317616048
3994 317616048 316555952 316473221 315839185 314238193 312963136 311817940 310203983 309535061 307824672
3985 307824672 306335802 304283564 303564610 302658674 301915287 302772603 303853803 305704578 309769691
3976 309769691 315147134 321720847 329775315 336249318 341588123 342657687 341116743 335981769
3968 335981769 325300817 308988954 290122477 272088865 255529611 240265893 226867358
3961 226867358 214626784 204631456 195704384 187221960 179299337 172969669 166089054 160913903
3953 160913903 155694162 150391204 145659373 142242331 139185179 135620681 132524129 129847488
3945 129847488 126794979 123317566 121452576 119228780 116330674 115265630 113461651 111930635
3937 111930635 110873343 109030095 107725136 106989981 106255457 104782077 102828101 101501111
3929 101501111 101173911 100009334 99798529 99111351 98476036 97574539 96979526 97635385 97732512
3920 97732512 97071134 97440922 97448797 96581270 97564733 97778594 98131893 97874539 98036032 99030261
3910 99030261 99175145 99636235 100569330 99984085 100243783 102729039 103471139 104751133 106190963
3901 106190963 106288585 106650573 108200214 109766591 111452827 111642453 113949296 115410785 116931045
3892 116931045 118071328 119616165 122468167 124288385 126356322 127664510 128431722 130201664
3884 130201664 131523827 134005233 135670235 137799778 139667814 141989646 144254735 145570697
3876 145570697 148534223 151097466 152875092 154461662 156283243 158558122 160659817 162493428
3868 162493428 164490728 167405155 170422201 172526771 175102895 177065832 180384922 182598972
3860 182598972 184499590 187390803 190901326 194798044 198195991 201853670 206185683 209904355
3852 209904355 214828300 218760018 223796126 228437876 233189453 239095737 244667645 250479240
3844 250479240 257283617 264252757 271971658 279783742 286476718 294301304 302811355 311336016
3836 311336016 320903692 329838135 339581662 349410819 359770978 369498144 379157515 388491466
3828 388491466 398161446 408393504 417595508 426488971 435620899 443557884 450649223 457823570
3820 457823570 463574859 468259971 472536774 474350582 476351944 478736056 478603221 477114352
3812 477114352 475382819 472032803 467817880 464230767 458705960 452033228 444464945 436954668
3804 436954668 427773373 418924576 409128919 399985664 388735418 378323936 368847046 358373164
3796 358373164 348678769 337794777 326912942 316419235 306025952 296022820 286553735
3789 286553735 277828386 268022691 259683421 251055540 242616191 234223031 226922257 220380878
3781 220380878 213598127 206483883 200267985 194659644 189400302 184771929 179563910 174431244
3773 174431244 170273391 166630616 163229143 160053400 157135767 154372914 150757695 147671260
3765 147671260 144966513 143646814 141173620 138517671 137537895 135727930 133453131 132472943
3757 132472943 131314858 129147776 127549758 125571310 122879832 120638671 119032092 117577840
3749 117577840 116080479 114463205 112398450 111155771 109332399 106656749 104763653 103884513
3741 103884513 102463855 101423489 99583234 98294822 97125638 96247319 95286716 93322042
3733 93322042 92776931 92486809 91091770 89508459 89358788 88436993 87146491 86377893 85649286
3724 85649286 85497532 84777049 84626347 83943549 83312414 82671225 81722698 81237227 80691600
3715 80691600 80367917 80162281 79244904 78721894 78105158 76371963 75389934 75282088 75160115
3706 75160115 73903298 72761102 72671227 72583121 71888762 70930826 70550923 69091317 68164718
3697 68164718 68404192 68874265 67436789 66845369 67131212 66389155 65898356 66242392 67313635
3688 67313635 67644736 67768189 67534901 68169170 68420134 68627621 68109294 68648150 68311724
3679 68311724 67850080 67332630 67502318 68493491 68069009 68239879 68701179 70022550 70871066
3670 70871066 71788055 71639486 71180898 72005647 71829479 72148012 72828589 73356361 73682966
3661 73682966 74214430 75586110 75833273 76596427 78318075 79963251 81393519 82761198 83298224
3652 83298224 84979005 85749142 87831374 89484449 90510485 91972953 93303293 95260752
3644 95260752 96595107 98958576 100986351 102879611 103904773 106431895 109205846 110787009
3636 110787009 113350844 115900592 117975249 120326313 122612996 124952616 127351193 129043289
3628 129043289 130585239 132669009 134482101 136778918 138760373 140630027 142049572 143467932
3620 143467932 145103527 146060800 148129609 150287246 152422015 153730440 154730919 155661303
3612 155661303 156741958 159587856 161791719 163795113 166034272 167853115 169930123 172461676
3604 172461676 175690466 177857062 180634535 184449957 188071303 190841936 195182940 199525159
3596 199525159 203356192 208573468 213998890 219274949 223886038 229732953 235400733 242356588
3588 242356588 249012197 254844334 262269063 269539872 277017569 284787401 292149259 298980568
3580 298980568 306706722 314317840 322355551 330510321 337994815 345443496 352864761 359435720
3572 359435720 366098106 372902240 378577628 385045496 390364891 395697646 400347848 404700054
3564 404700054 408903884 412379369 415217217 417471543 418959011 420522053 421937332 423292454
3556 423292454 423650184 423497998 422679644 421466305 419502938 417129424 414898976 412026146
3548 412026146 408615003 405257456 402237935 397811593 393697572 388703641 383663147 378750412
3540 378750412 373501293 367326174 360865890 354159875 346379878 339047893 331732084 324821365
3532 324821365 316403010 308475629 301621178 294212803 286790566 278728120 271210682 263721952
3524 263721952 256336341 248556664 240980489 234429775 227477677 221197439 213916715 207890444
3516 207890444 202458392 196214747 190305999 186018125 181825094 176293372 171375304 167201343
3508 167201343 164071236 159913511 156121046 152903719 150958186 148055124 144219160 142856320
3500 142856320 140619483 138603392 136741617 134167406 131873627 130178203 128213278 126675546
3492 126675546 126164716 123900902 121629787 120385815 119197629 116634427 115010790 113213847
3484 113213847 111898644 110133948 108893659 106634692 104410212 102543391 99949899 98025902
3476 98025902 95909848 94586010 92307778 89914666 87286442 85594684 83475659 80950528
3468 80950528 78638277 76279870 74683771 73224713 70760276 68745645 67764787 66139688
3460 66139688 64558446 62292962 61258614 59324049 57677567 56615845 54859331 53638310
3452 53638310 52621578 51387390 49929364 49025018 47661307 46448712 46159968 44830861
3444 44830861 43969744 43039334 42033195 41287738 40473438 39270121 38258223 38601981 37590266
3435 37590266 36616275 35981539 35610613 35215467 33845701 33150707 32775909 31991110 31986618 31510893
3425 31510893 31337377 30125022 29728462 30149034 29153166 28569344 28399462 28719896 28456404
3416 28456404 27121253 27457923 26927962 26380744 26130514 25607514 24836591 23498191 23910608
3407 23910608 23774768 23295361 22022515 22445096 22621676 22524371 21948772 21797353 21062034
3398 21062034 20645956 20348888 20863665 21442499 20939358 20724417 20114714 20136127 19856999 19030901
3388 19030901 19238587 19631247 18958614 19201864 18761647 18726838 18196776 17488037 17497849 17677846
3378 17677846 17208994 16947320 16631537 16325111 15708055 16054611 16391271 15674899 14882951
3369 14882951 14839565 15660443 15249593 14831621 14583045 14665555 14389219 14117389 14901900 15081826
3359 15081826 15014004 14355630 14265760 13830634 13999911 13092765 13794923 13721914 13672178 13820373
3349 13820373 13561959 14374810 13953341 13478124 13171957 13261861 13444868 13422684 13164321 12592353
3339 12592353 12319454 12788225 12439850 11583243 12317185 13352682 12987540 12761449 12921869
3330 12921869 12035706 11340365 10802997 10826825 11552941 11146132 11549110 11762442 11850565 11662616
3320 11662616 11339551 11047312 11346961 11665528 11068742 11181734 11307320 11184250 11545275
3311 11545275 11192088 11136392 11357353 10881037 11033961 11344677 11865790 11438283 10523390 11218468
3301 11218468 10998502 11469133 11726923 11620405 11742373 12019749 11684486 11746948 12042662 11462063
3291 11462063 12452799 13178204 13061967 13046406 12940697 12226452 12794560 12370711 12429043 12558458
3281 12558458 11876364 12175148 12935544 12703298 12566118 11885597 11338480 11937898 12608827
3272 12608827 12755542 12241726 12232665 12437601 13377878 13565802 13483464 12430828 12112194 12351182
3262 12351182 13188066 13180418 13345639 13000685 13222736 13712227 13586176 13533404 13446117 14100740
3252 14100740 13672956 13773406 13542399 13477800 13181769 13215224 14082099 14387553 13650157 13362999
3242 13362999 13520350 13437234 13980859 13484701 13703238 13768979 14834145 15727462 15483916 15985600
3232 15985600 15130365 14997322 15245504 15012635 15656228 15388999 15696571 16132829 16758816
3223 16758816 15668940 16700110 17211265 17090533 16783542 16719076 18012258 18321813 18974812
3214 18974812 19952954 20315521 20256052 21079271 21902062 22056951 23013309 22826324 23540918 24366704
3204 24366704 25550328 27188758 27464362 27648424 27985156 27989444 27747096 26872842 25956667
3195 25956667 25010658 23761362 23268551 21331667 21148548 20399957 19466812 18317087 18306777
3186 18306777 18356881 17245109 15935626 15431557 15582975 14989167 14298117 13346844 13066802
3177 13066802 12973863 12302216 12375047 11123204 11230849 11358840 11449307 11391846 11676568 11000153
3167 11000153 10561236 11125622 11053320 10650734 10856610 10129632 10279095 10663049 10621821 10202040
3157 10202040 9803875 10019405 10193539 10607270 10441427 9802850 9331825 9291028 9779356 9588980
3147 9588980 9982472 10445223 9694188 9719859 9916217 9925045 9714968 9235611 9394118 10037459
3137 10037459 9892419 9832216 10277072 10805995 10964181 11573572 11307627 11055653 12774545
3128 12774545 13211269 12783990 13803569 14710431 15455987 15543546 15819186 15939281 16262292
3119 16262292 16212925 16869133 16574602 15013033 14974022 14342752 13090480 11702699 10902667
3110 10902667 10890556 10469194 9826355 9671432 9490052 9250176 8738649 8643945 8261545 7350712
3100 7350712 8196464 8953243 8773551 7922961 7208972 8068039 7427377 6356084 5807859
3091 5807859 6438726 6973529 7265440 7746968 8205918 7597870 6798037 6410604 5999185 6483583
3081 6483583 6491913 6384927 6581046 6802147 7021861 7566895 7101856 6456370 6817661 7210615
3071 7210615 6977221 7648313 7473388 7247225 6376052 7614844 6748454 6641875 6643954 6853409
3061 6853409 5783613 5701381 5908681 5677115 6084123 5553173 5508106 5727474 6234566 6053074
3051 6053074 5305587 5518789 6962705 7053132 7387647 7468116 7311575 8035660 8274329 8058104
3041 8058104 7712696 8396727 9156259 9127524 8414800 6941953 6637078 6860137 6466973 6018557
3031 6018557 6230836 6251636 6029885 5390132 5108043 4910714 4759562 5165874 5765563 6029869
3021 6029869 5084849 5013425 5422783 5304157 6083350 5527047 5870455 5549137 4621467 4789748
3011 4789748 5044763 5510657 5407008 5722009 5768660 4416482 5318245 5697961 5016918 4958641
3001 4958641 5272963 4906217 4854917 4673523 3630083 3619766 3553219 3614956 4420798 4141522
2991 4141522 3452763 3185303 3254506 3218096 2695521 2562847 3025267 3084952 2799755 2136049
2981 2136049 1518303 1825834 2401406 2913268 3302918 3962618 4216495 3462828 2676858 2306965
2971 2306965 1741451 1905617 2036694 2538097 3001901 2263367 2003446 1632109 1717535 2171159
2961 2171159 2709465 2678151 3184059 2649503 3476290 3555152 3439478 2844073 3233533 3374505
2951 3374505 3330765 2832666 2515604 3245848 2909436 2861536 2744143 2476281 2212366 2695723
2941 2695723 2894029 3002147 2915160 2941895 2906101 2755335 3011898 3115569 3653919 4210159
2931 4210159 3963150 3146885 3064502 3041673 3050313 3909690 3841217 3830790 3470432 3546170 3544902
2920 3544902 3015715 3570147 4204669 3213513 2716316 2279945 3608345 4406787 3744882
2911 3744882 3728395 4580635 4205566 4288042 3972595 3743160 3362419 4208999 4351881 4292446
2901 4292446 4051114 4381711 4548017 4285662 5008559 4276340 4175922 4878005 4537993 4981419
2891 4981419 4140045 4172455 5188757 5004776 4457602 4455677 4774099 5259142 6220912 5426174
2881 5426174 4853385 4972445 5497421 5656434 6236489 5710256 5391327 5820405 6267305 7202177
2871 7202177 7259089 6659959 6713254 6746505 7685305 6859347 6689092 6903103 6573648 6913921
2861 6913921 6799174 6335462 6545130 6574610 6920988 7485593 8031337 6992512 7204259 7531596
2851 7531596 6844820 6274237 6963542 6276176 5887182 6290219 4759380 4975930 5552763
2842 5552763 5581221 5148847 5316291 4812877 4297868 4018964 4592961 4872530 5396761 5366432
2832 5366432 4554029 3877609 5092677 4547266 4873965 4587338 4178844 3526007 4086800
2823 4086800 4415482 4407555 4699140 4284745 4714040 5369330 5396123 4325067 3941223 3653156
2813 3653156 3981374 3188357 3081780 3724828 2547210 2350668 2813884 3148847 3096176 3466572
2803 3466572 3646746 3088606 2748241 2868544 2640545 2466704 3131756 2354338 2108701 2097780
2793 2097780 2363684 1434752 1290757 1481887 2160627 2127132 2815391 2222364 2775912 2497532
2783 2497532 2543726 3626490 2855942 2196661 2213549 2090089 1486262 1630972 1922660 2739389
2773 2739389 2239645 1217257 1142538 1619886 2451487 1935565 1523795 1458193 1221399 1357809
2763 1357809 1674196 1727110 1538546 1458307 1265832 1037648 1435948 945193 1166636 1664717
2753 1664717 1037134 -7021 201003 653966 1145410 1926034 1657188 1531299 1662048
2744 1662048 956116 938107 1089556 1473640 723993 1528980 1827146 1419199 2013010 1960631
2734 1960631 1984762 1983897 1646131 246268 573413 595681 1886123 1545313 1316693 1023903
2724 1023903 999560 1024495 1141190 811952 689713 925314 968980 1138313 830245 190724
2714 190724 411202 539564 259535 135954 141092 287777 856498 647607 1076477 764451
2704 764451 1037207 641355 117844 -203827 -627753 620451 1360187 877381 237812 1070089
2694 1070089 687089 74546 1003994 1008258 566947 559301 459760 948700 1962039 1663526
2684 1663526 1646678 877845 988701 1767565 907878 497056 1122444 1452982 1165632 1274583
2674 1274583 661801 826846 537332 406486 304361 384048 223546 -238796 -831002 -292488
2664 -292488 579842 -16938 501759 788063 991820 718308 139094 675700 162561 658136
2654 658136 577968 476931 954315 810671 1193269 1241519 127741 -209741 -46745 -3754
2644 -3754 464972 558504 615417 630316 33845 570682 463592 547509 -27034 -273355 591819
2633 591819 363440 -95563 724069 633094 44544 -491656 -48534 -67240 666776 914890
2623 914890 1042102 584995 -456305 65406 1025999 579365 158359 627362 199751 106647
2613 106647 67355 886006 506642 105036 -144207 -404052 -482036 -647666 -280527 23821
2603 23821 78224 466096 1066390 918127 589509 488581 -83889 -55370 -164926 -476315
2593 -476315 -781076 425038 1105594 581186 1229019 1016530 2030051 1210301 620728
2584 620728 503920 -134689 563914 311651 902223 89450 37275 14907 196655 691238
2574 691238 430699 -102322 -27990 -180787 97701 -26355 401421 -48112 -391729 -811975
2564 -811975 -937407 -774338 -581238 -657736 -225024 -208024 -559768 -511261 1074042 743076
2554 743076 322948 515494 1111727 1395473 811846 1258625 51672 637307 1392576 435370
2544 435370 19381 92241 136975 -522765 137590 655239 800261 807457 798178 1252401 702359
2533 702359 76189 41779 -391997 -187055 842062 1187542 1144030 593421 851735 386078
2523 386078 380522 176504 543706 652698 865368 1018463 26850 377357 568398 -429837
2513 -429837 75373 466344 721400 455557 839459 682227 479024 252123 517679 -264987
2503 -264987 -147764 148096 22651 -652078 -489998 -147749 -37834 -77671 380382 -78134
2493 -78134 621613 473276 34242 54905 -107771 630596 430805 776522 1418999 816824
2483 816824 433917 -120713 470216 -108709 -473697 -926238 -877129 -30027 -102193 -70275
2473 -70275 -356047 -322987 543145 470706 -202921 52072 170336 706192 283060 433681
2463 433681 -75742 208286 -193679 -30878 73596 73594 647261 94191 -216553 531009 52120
2452 52120 665812 293067 -65389 -450280 -457769 149971 -405624 -630132 -427445 -91575
2442 -91575 550417 456961 184248 583060 796268 423462 274834 -434117 118724 -360652
2432 -360652 266223 -29575 -136424 298456 868413 1040656 446847 260289 484577 617166
2422 617166 711571 536443 -529937 -757677 -274800 -306569 -207217 -135163 364033 -111947
2412 -111947 -519123 -353439 -127772 96804 258532 972009 1464700 645612 220576 338502
2402 338502 731064 620137 -24752 -188191 -83893 -305283 -365935 1090429 816605 200043
2392 200043 279554 430326 634639 526753 448561 588157 -30473 489643 558510 417250
2382 417250 354649 868190 -34054 23766 -74659 137985 590572 559484 -65133 57041
2372 57041 -57644 682790 75810 -205158 596477 885204 196077 -89809 -527696 -894564
2362 -894564 -813575 -250418 276442 -90538 571114 -221225 594483 483646 -283423 141838
2352 141838 385851 853264 360099 -220236 -507400 -974536 -702948 103422 21326 -10722
2342 -10722 -485725 -1269880 -693520 -337419 56282 -708225 -668344 -177543 431885 217082
2332 217082 862811 971691 519165 115463 -114595 -325634 -807279 -489435 -61991 -359545
2322 -359545 -396141 184668 -104483 -428732 -1640869 -1179846 -915183 -617418 -760932 -127770
2312 -127770 275346 -119875 -379395 -448533 -792425 -460891 -357459 169745 793961 620577
2302 620577 230857 -165062 -580865 57204 1003750 756128 594543 -207488 -467658 -967253
2292 -967253 -574156 -589681 -256949 550849 440427 139764 132018 152920 -535172 -1034445
2282 -1034445 293121 586823 656096 899210 -285810 -991211 250958 441386 253054
2273 253054 -81700 -814680 -474780 -57902 164210 -242507 -94716 365145 -74244 140692
2263 140692 -274400 -474770 521399 545825 345853 323566 191863 25918 -337646 -428040
2253 -428040 -1089182 -985072 10498 -287063 -576393 -955057 -277843 700154 503104 -62367
2243 -62367 105104 59266 195 280957 -536797 -496455 -181638 605458 -492171 -848463
2233 -848463 -314649 -605488 -474557 -442674 277301 65186 165075 691964 672887 797837
2223 797837 666313 204967 -195514 -101501 -981370 -1165193 -294438 -927595 -635517 -787769
2213 -787769 161590 4691 -72903 62375 262442 -76553 -253266 197950 378064 315836
2203 315836 153715 544687 488430 439996 -219819 70590 450322 278886 -1093068 129346
2193 129346 661331 -729342 -219507 -69927 -502718 577277 674146 2258 -99610 863553
2183 863553 254027 -42583 457895 272680 403651 648603 651749 124486 398521 407110
2173 407110 855101 722481 -135769 -294556 -422937 -99265 371563 -64950 283214 796183
2163 796183 449231 -156782 -209798 635194 886905 879803 223872 242020 -153242 -83435 1115243
2152 1115243 1681781 833356 420631 -19812 440823 1408087 1387032 1683871 642274 499746
2142 499746 1604923 1560633 1109159 1029781 717212 1640607 1879476 1587428 1264858 1144564
2132 1144564 1049469 1186371 645150 1270470 1018893 1655559 2008509 1578260 1384278 1610678
2122 1610678 1873102 1810845 1856080 2375087 2932525 2629991 2701991 2803203 3143402 3541477
2112 3541477 2851413 2448774 3085581 3055484 4223451 4595153 4259529 4299013 4038396 3925062
2102 3925062 3740820 4634679 4738515 4636464 5928304 5631428 5918589 5928471 6639980 7272338
2092 7272338 6555116 6856043 7211336 7877383 7951295 8815118 9271575 10062274 11803093 12479165
2082 12479165 13626157 14967466 16383552 18213010 20074407 21918966 23898328 25687351
2074 25687351 24722571 24597611 23351039 21986771 20157734 17922139 16074349 14494378
2066 14494378 12919079 11632691 11064990 10144751 9175798 7446560 7582798 6982683 6209518
2057 6209518 6021769 6038663 5794225 5974031 4350968 3897212 3582114 3463035 3586418 2633737
2047 2633737 2237456 3154871 3033385 2279640 2832768 2219423 2143829 2367243 2464485 1861043
2037 1861043 973559 1487820 1704053 2106702 2060377 2170122 1167836 796664 1005837 1503394
2027 1503394 1555030 840023 510541 997421 1397833 1105038 913295 784517 1371417 2052808
2017 2052808 1651161 751181 944474 1478718 1233012 549070 295252 85644 -35990 537373
2007 537373 738188 949375 1160460 937612 638523 32747 90857 81629 759814 1168253
1997 1168253 311964 85485 -121634 -97635 496644 300311 57781 -190760 149883 938892
1987 938892 671964 39522 -44154 -475675 -134254 249388 266481 516943 641306 1132034
1977 1132034 876882 1214825 391755 317374 981540 503216 461607 -325014 -331744 -34341
1967 -34341 704897 952489 826018 343357 -189660 257870 305658 -801957 -435663 -1264371
1957 -1264371 -1465727 -1569758 -266284 270924 -493123 -129964 152635 -358552 -698361
1948 -698361 -127279 -516004 -973501 -1074955 -458857 -476123 19865 -493275 -761993 -340378
1938 -340378 -359999 111433 358220 -503278 158120 -285064 300017 1111515 1067153 762724
1928 762724 253818 113918 528397 670074 -143512 -20673 -416709 -5687 -474242 -90515
1918 -90515 -342896 -149580 399085 257927 497044 985261 468016 -765225 -903594 -99950
1908 -99950 793148 828317 760000 607504 548630 1579828 1338344 674086 -482787 -1214874
1898 -1214874 -268796 12215 311411 762020 449014 215820 -238972 -473506 -587822 -356112
1888 -356112 -185641 -288236 -439861 -105443 817854 726247 267455 127503 746030 710356
1878 710356 762746 949258 142766 -45295 397150 497749 688463 -61875 -328865 -680502
1868 -680502 373799 854653 971417 232869 -179327 87076 -309796 -1172960 -28532
1859 -28532 125441 -407824 -234687 -128370 55495 649942 443520 -151816 -106082 -277290
1849 -277290 101698 30611 -370094 -400672 297399 -295873 -564818 -1080380 -548112 -219109
1839 -219109 147513 291264 112310 -454811 -462260 -341192 -611356 -651946 -1271203 -579158
1829 -579158 240438 -238138 -416791 -856002 -845254 -885796 -1079573 -1246537 -1274243 -1424153
1819 -1424153 -166454 -398448 304928 193630 -362667 402157 -190306 -427278 -730673
1810 -730673 178830 -437445 -543105 -520642 -1176631 -1169159 -615700 -531550 -409685 -1095192
1800 -1095192 -937217 38836 -197600 -312361 254187 816757 687458 544338 72994 196527
1790 196527 -188562 -576379 -297612 -645862 853978 729672 264691 426225 466305 379941
1780 379941 866345 23318 -477149 -177077 -905970 -509069 -179056 419538 432349 -610303
1770 -610303 -187956 -324438 -358058 -55846 -172422 285055 60293 -419790 187468 838476
1760 838476 569900 -125624 -695440 -253359 -83130 17798 426242 805925 370188 41537
1750 41537 3719 259044 -740653 -346115 157339 -499183 440576 -272052 -720422 -1477971
1740 -1477971 -1068218 -643847 -928475 -505991 -565666 -199372 -479183 425 -223894 -356528
1730 -356528 -198009 758637 -217140 -491314 -93437 -738196 -607124 -834677 -309421 -186214
1720 -186214 -294166 -1002689 -716071 104594 -106149 -55127 117197 722307 510797 -16717
1710 -16717 -46821 -312020 -184495 207883 -96609 -357836 -561524 -397318 -814960 -726135
1700 -726135 -139388 95039 531367 860105 301233 664447 218199 -209413 -694302 -443640
1690 -443640 253259 356164 245308 771088 676037 736136 785002 911045 1184725 2079
1680 2079 332046 681516 407393 115757 644041 447820 -537892 -741201 -168744 -165907
1670 -165907 -26425 -608510 -726529 -427338 -154056 109020 -465407 -802318 -216198 -921452
1660 -921452 -728187 -122994 -63600 -881791 -1335851 -596997 -849745 -915655 -637945 -698797
1650 -698797 -680407 -689755 256497 135635 -113590 -814158 -231396 765626 952081 1314303
1640 1314303 330167 23476 -358414 -200781 240763 164487 206158 273168 -527448 -833497
1630 -833497 -660963 -809257 -1048455 -842157 111869 346505 6173 500852 437196 -203107
1620 -203107 -917652 -691691 -294747 475280 85582 266342 66310 -170263 -198421 -570809
1610 -570809 -499082 -408670 -547891 -882593 -675195 -417221 327230 491319 117194 48093
1600 48093 -380801 -931422 91277 596066 493479 519584 -250617 -954217 206515 -35990
1590 -35990 -184729 391025 -343704 -710953 144271 -494921 -267832 150288 373558 236464
1580 236464 189057 201713 -731622 -702485 -333139 -654212 -1042419 -979451 -1226031 -707921
1570 -707921 -381548 -200351 -287732 -614517 -1053875 -781040 -390672 83148 -453314 -901354
1560 -901354 -727100 -854090 -663865 -251176 -362007 -700999 -225034 -649267 -181027 -183480
1550 -183480 -927573 -230574 208232 -197174 -798541 -310266 141393 -540064 -461275 -926777
1540 -926777 -1001187 -852196 -690065 -694694 -1257194 -1358997 -648777 589720 -669327 -1583824
1530 -1583824 -640891 -129268 -164530 -271150 280824 -97518 -51661 183657 -807827 -465004
1520 -465004 -382830 -421814 426140 311297 141087 131870 -238097 -321612 -742872 -1111830 -558639
1509 -558639 -516179 -719224 -648174 152143 615087 433066 888234 -272051 -559964 -699353
1499 -699353 -873181 123397 762846 723600 -519223 -214573 401972 235008 -611799 -656302
1489 -656302 -22950 -459785 292591 -76839 -156473 137718 -88 -520198 -519962 -429105 519943
1478 519943 50967 -676512 -410574 -328200 -52008 349583 361351 522448 631904 -194444
1468 -194444 -468640 -507734 -212616 -464027 -244482 574457 492628 -201805 -379840 424781
1458 424781 449159 648484 84575 -616470 -443571 -823259 -403193 229059 194039 285709
1448 285709 -26542 -884579 -357991 241732 668774 79163 -332730 -396893 -536259 -190798
1438 -190798 106279 -37075 149907 -841869 -1444306 -460595 -999670 -960669 -359367 -191345
1428 -191345 172110 665385 -343304 -601459 -820519 -814964 -25615 -728981 -459676 -270306
1418 -270306 -644102 -1135299 -1059506 -803006 -1002232 -1070724 -1024436 -921312 -625062 -48212
1408 -48212 -152587 -793984 -791505 -147471 116129 233952 191185 95580 614205 -80933 109034
1397 109034 52927 -605004 -622978 -18225 210337 224801 -209962 -348624 -28486 127741
1387 127741 276465 -24685 -706635 -932471 -1236348 -1448614 -926300 -923414 -688667 -755410
1377 -755410 -695948 -973084 -590873 -419548 -157906 51866 -372608 224331 1469251 213817
1367 213817 -375900 111999 -188454 -8441 -559618 -558601 -28704 -215059 -322849 -502779
1357 -502779 -748851 197609 434681 -131905 -490259 279180 292736 173950 934631 787702
1347 787702 286591 459989 -211415 -634237 30460 -861806 -1463795 -423593 -161842 459949
1337 459949 -624800 -487165 631074 900838 33051 -393327 -862679 -374485 85273
1328 85273 -190672 -241824 -145534 -266390 -565362 74771 -527241 -169856 304573 -436165
1318 -436165 -390162 65657 188561 202254 651515 971200 642302 484958 16269 -597078
1308 -597078 -313256 109526 -517097 -153145 96905 -242016 -381173 155683 -156683 -212633
1298 -212633 -606984 -776037 -653110 -332296 -1063878 -454821 -160870 -615319 -1079289 -549370
1288 -549370 -845261 -1545182 -1343470 -728846 -19977 247717 -84 185703 -262182 -488230
1278 -488230 -79061 -667930 -224639 85948 -250685 -413460 364692 355802 -117326 -331241
1268 -331241 -476829 213352 520071 393515 674274 388570 389120 476105 1149190 726693
1258 726693 135936 -522670 -731446 -1854159 -1381576 -350912 621117 -50279 -767518
1249 -767518 402135 1118143 983446 362334 144952 -288170 270768 179778 465463 47588
1239 47588 566918 -188688 -87428 794938 294065 -478180 272318 -20260 386187 82728
1229 82728 -99833 467195 391432 -122924 -177860 146088 70792 -350100 -207286 281804
1219 281804 -202304 175214 -437271 -365779 131154 -238308 -104442 487101 433434 -264080
1209 -264080 -369873 -767545 -464962 336701 -161362 -621741 -818855 305142 360084 940409
1199 940409 1590842 712041 -23082 -198766 -1236359 -1129433 -932664 -602783 -438340 331711
1189 331711 665875 29179 -248229 -506009 -506901 -974448 -971623 252798 -424656 -525180
1179 -525180 6394 -117828 -161728 117534 -272739 -279541 -267813 -544212 50684 175329
1169 175329 -357269 158397 349571 745368 591844 607021 993704 134152 210420 -316126
1159 -316126 -393051 -368373 -497115 41562 446108 350911 52853 -109606 122113 878798
1149 878798 386813 -31907 -681348 -546064 -1018994 -524739 87864 -588209 -757281 -279683
1139 -279683 366928 61082 691900 -233855 -705205 -77478 -338887 -115667 -147528 -71988
1129 -71988 543048 -801235 -386411 -69432 -158725 -334414 -175460 292219 -98677 -288246
1119 -288246 -388790 124271 -283904 -393606 -380943 -535773 191057 150685 -539196 90183
1109 90183 54335 -882083 -917546 -451113 -600863 -524642 721913 80337 702898 740095
1099 740095 176782 603121 190715 162429 -268492 -661944 -1133063 -358856 218075 158529
1089 158529 490042 1442216 1251396 456650 834915 -36374 70845 -603865 -406944 266597
1079 266597 492033 566444 -133134 153898 67350 305315 792818 479067 388343 119983
1069 119983 -61540 874401 1207875 404446 192970 -249387 -531099 25542 -78969 90655
1059 90655 557319 8411 15836 696637 717707 173781 -437522 187563 -67716 -1377705
1049 -1377705 -518431 -139070 534320 771326 16361 -260262 -636628 -702726 -507322 -23950
1039 -23950 280055 600352 939256 801533 418344 939459 1138695 528690 -569283 -244279
1029 -244279 691620 1152237 1692743 661987 536925 732901 217216 -24948 533538 -230606
1019 -230606 500941 288760 -480975 128361 -72341 476086 620988 -2757 -861546 -514614
1009 -514614 -508066 -951958 -784501 216817 818831 948575 535374 260598 -931241 -1623228
999 -1623228 -919868 -491037 47853 302592 207337 900990 892355 887565 429233 316498 416478
988 416478 349419 474188 -271508 -214369 -576257 -163981 -33894 288466 59055 499157
978 499157 635862 323601 1091778 395929 -297973 -465342 -299146 -760706 48235 -265561
968 -265561 -115103 291321 -413462 -548685 -7865 307181 893844 1109675 643645 901769
958 901769 791744 19227 -217668 233536 -7216 545336 819126 916924 378664 127151
948 127151 -5116 -353153 94827 -23480 453768 -112159 212115 372250 -905497 -1446428
938 -1446428 288680 570747 154184 298615 552478 382823 357586 857006 374159 -709105
928 -709105 -1218487 -846253 114173 295085 125848 610647 519026 527309 339449 -200844
918 -200844 -168737 122504 29384 9981 143967 377802 -174650 -1004150 -811288 -847959 -518907
907 -518907 -462298 -1185245 -258880 449434 25896 106375 320868 41675 -446252 -437634 -560546
896 -560546 -455372 479402 490554 -92819 420125 29714 3233 -111268 -263900 -104087
886 -104087 -12653 576829 1379701 835901 -78571 -283946 -273860 -297682 93447 309189
876 309189 -461280 -263410 286751 191899 -433211 -430524 -614281 -722356 -1124682 -54555
866 -54555 -808456 -719889 -532378 167263 -209924 -1247777 -732619 -924049 -467700 -231525
856 -231525 -196125 -507876 -287391 133383 -494134 -388058 -645202 488555 73293 -282166
846 -282166 -104332 586771 700765 456298 517207 61511 162520 403550 522420 1343749
836 1343749 1088979 -122183 211173 517058 -352228 -236151 -174882 -193925 -222501 -406048
826 -406048 -715258 -1115225 -235151 -439283 -188684 -312903 366002 59887 -523726 -240301
816 -240301 208975 -33310 -1133938 -910629 -370918 42213 401295 462673 665139 112044
806 112044 -449146 -130745 -137081 -197321 -236584 -27542 -34110 -470354 -831324 -630286 91106
795 91106 -123327 -9154 -35398 416483 106588 -337639 -208451 -200170 413235 -291112 -571054
784 -571054 -365969 -231790 -269661 464406 1015143 349873 662974 700329 651719 191835
774 191835 660811 213349 -425846 -320123 593797 748300 -417543 -482400 -109172 1022454
764 1022454 505263 -365112 723143 515973 158446 554133 387407 287133 20804 105141
754 105141 -107019 594449 856483 1153645 796485 767488 497193 -408155 -86382 -352799
744 -352799 -468265 -180783 195518 660335 -365716 -405249 177930 -4284 292109 387326
734 387326 601758 -588753 159725 434355 870462 135802 190700 1447443 1797885 1392587
724 1392587 866015 455921 280845 -704922 -543485 -525811 73068 18691 -24338 58828
714 58828 -327013 170869 710304 433516 509112 383026 239947 389228 -157698 -607209
704 -607209 -102643 576651 1184367 687128 961742 690896 866405 833568 465405 -316315
694 -316315 -347517 -306071 -114147 339884 -223974 -393724 -709696 -280144 165778 -452233
684 -452233 230004 1202308 1134000 1053837 -177105 -121602 -220089 112587 52539 584795 -926974
673 -926974 -974261 -165053 471021 -334426 -390439 361640 258187 -36750 215017 173476
663 173476 691330 10399 -381292 -113457 -424700 -454422 561870 87865 425049 241760
653 241760 678817 -581349 172293 437043 75401 653613 317258 25038 -457299 -1063660
643 -1063660 -930776 -399087 337891 643875 453841 -137702 -815725 -500581 -745096 -695591
633 -695591 124791 312679 277063 469756 826822 431118 471952 -64117 341400 271534
623 271534 -496343 -799521 -560122 -1173743 -790224 -13714 -355483 -412166 -804654 -350766
613 -350766 -372265 -296827 -1115966 -71828 -79053 124911 752009 -12411 -832372 173349
603 173349 463347 894860 1015647 845646 698258 -868715 -1121480 234389 868253 495582
593 495582 89329 -410369 -1381888 -1167002 -1205858 -615251 -1124879 -1139253 -637409 -829350
583 -829350 -518072 -788133 -589896 571490 181619 87175 -190609 325086 -607867 119367
573 119367 249922 445580 -104346 846451 894270 155018 -44662 95275 -796841 -848327
563 -848327 -875176 -478901 -172721 -536476 -525015 -812324 -903229 -107756 488163 -706115
553 -706115 -511267 -40794 789543 894684 1380340 682628 407327 369154 -177295 514986
543 514986 99055 -662500 480938 159118 95373 304412 101356 10505 -149250 -96362
533 -96362 173524 538708 1094553 1057191 99730 36680 152919 291502 564464 434125
523 434125 17295 -141776 181309 -266544 -32178 581294 379230 81171 20446 215163
513 215163 962132 524195 27 537526 937662 -91962 461094 596115 167348 -227675
503 -227675 163096 271676 -51505 93161 -324821 -657578 -347049 699660 1498952 367659
493 367659 286824 -135891 -636544 -803162 -684722 -779788 -161472 56704 -1021593 -401510
483 -401510 690737 182519 -415233 -290994 -583125 -630516 -162800 -1116460 -1199317 -583689
473 -583689 -629564 212253 570373 145571 -1134939 -820402 122770 -245208 -540356 -68414
463 -68414 -145918 -197825 801419 433444 -283047 -262898 390596 836987 535708 330146 -483180
452 -483180 -604801 -636977 -415065 181693 20812 -345234 -250774 448892 611955 346109
442 346109 402488 109255 -181342 31369 -217131 -386585 -447174 -195573 -628750 -974973
432 -974973 -529854 -511275 -308595 286622 735229 812589 721095 1189298 331438 -6763
422 -6763 988800 515304 -252369 -428782 -852329 -742283 70752 740865 -420931 -927990
412 -927990 -703966 -718273 51776 611240 993032 456879 148158 647565 476672 989461
402 989461 449643 -377157 -229526 -1167354 -595205 -805081 -407950 -165350 159543 318922
392 318922 542397 270962 609082 332253 808550 338109 -229804 496328 791158 371970
382 371970 86806 660182 384632 643542 1360878 1383895 800105 -84356 -207625 1127268
372 1127268 1702375 362379 14378 216043 -24884 326521 901348 1546051 816167 698220
362 698220 457090 455594 489465 164264 283129 -50237 -21797 381584 328029 -154946 200129
351 200129 645819 1145713 568026 344619 88229 1058910 170358 -238354 2787 117445
341 117445 159298 -159078 357705 82607 -519721 -659831 226593 -20240 -785389 -670815
331 -670815 113960 -11164 -22759 480716 675444 961000 526008 -194529 -364262 -1209724
321 -1209724 -285549 190695 620764 -694090 -243171 904364 885832 694471 1051483 544693
311 544693 785121 556257 181075 280905 417640 1156510 1089773 1047092 268934 -128411
301 -128411 -366752 -1043576 -430175 240085 686757 762533 14440 -372902 134370 -399051
291 -399051 -148619 122268 -1168867 -530824 554596 1300161 708900 753827 622988 477670
281 477670 389028 242700 -397486 -358322 -10159 617781 -220169 -1159129 396762 1504784
271 1504784 890674 309766 766389 450643 729434 739731 600824 672968 545120 637363
261 637363 877623 1451630 1039331 271913 -578163 101054 -118775 424536 114402 262285
251 262285 286771 482758 1333483 1152153 889528 224996 675274 583104 662603 -321327
241 -321327 31103 185593 -46502 10100 433840 99818 -330058 143375 459394 41216
231 41216 740665 1007773 560826 892886 498589 -1321 -87908 268450 94064 229301
221 229301 -540968 -504909 570175 355448 -149265 39361 -162402 -777493 -844016 -342239
211 -342239 10894 -31626 165077 -112681 548783 532726 943256 985306 1202125 583577
201 583577 365125 -281333 -296849 509810 -256338 -219610 -538586 -269029 417801 626277
191 626277 647716 866372 258870 -428554 311453 532615 -450234 -607558 -552402 571830
181 571830 355505 -186472 -30045 -760433 -952156 -385772 -581638 137531 910970 693764
171 693764 806694 518852 53373 -11244 24043 47196 -234648 -248396 289964 240300 480744
160 480744 676905 165424 203598 157125 455381 437362 443785 1407865 766011 642646 1011401
149 1011401 1402566 1577931 1217581 676891 496069 949667 353552 211750 156907 195114
139 195114 -327247 -848496 -836436 -551248 393563 1236226 769342 654513 -215241 -453509
129 -453509 233516 764530 128832 87311 -591507 -504809 528136 1042013 691304 603555
119 603555 538866 69370 -128767 -468774 -239014 85294 434427 51585 -312352 -145999
109 -145999 48720 -663489 -429568 -768107 134318 839106 1023879 562639 -210418 -174148
99 -174148 512088 136602 -149584 198122 1084093 888596 223454 614760 213694 144152
89 144152 13373 -198327 97549 266501 804657 731624 -120855 -688724 -734324 166855
79 166855 428523 -29258 363041 402556 537829 653464 853683 134134 -301325 345815
69 345815 200579 -7660 309963 1011559 682911 -22727 -107541 -186708 -34648 214419
59 214419 742287 538326 346272 -450548 -160662 405027 243508 109358 -230560 263204
49 263204 32320 130795 -19199 -211265 -75308 286488 377009 46175 -51188 518054 82061
38 82061 677588 595561 -830352 -1350201 -520949 415276 844388 1003838 20779 -203990
28 -203990 146650 381163 593246 -313494 13847 192897 503585 602881 832668 575094
18 575094 247885 252998 -297510 -85291 -172154 164994 381498 -91121 75069 -161637 -182260
7 -182260 -697191 -525570 240010 534873 404832 484321 982705
0 982705
$$ Imaginary data points
##PAGE= N=2
##DATA TABLE= (X++(I..I)), XYDATA
16383 -4473299 -4691186 -4535047 -4027901 -4053359 -3861915 -3220554 -2851185 -3061181 -3030573 -2974313
16373 -2974313 -2181836 -2478346 -2446502 -2298185 -2666066 -2415950 -2465062 -2598875 -1922450 -1381191
16363 -1381191 -1251094 -1124819 -788610 -1039063 -550495 -716974 2954 412763 308025
16354 308025 645016 1044900 629409 428837 407508 288578 285901 863611 1185475 1655952
16344 1655952 1133552 941306 1184731 1475635 1417007 1606018 2319211 2899570 2384352 2463469
16334 2463469 2586434 2750032 3021198 2991797 3308815 3734753 3477084 2760310 2956478 3984021
16324 3984021 3574479 3083816 3902819 3574453 3702957 3911338 4149236 4457663 4763145
16315 4763145 4896899 5037423 5424227 5779257 5527121 6062529 6050420 6358417 6198706 6007540
16305 6007540 5757445 6024330 5962909 5812182 6833287 7973093 7653593 7810443 8244860
16296 8244860 7947359 8018292 8094354 7812721 8356771 8466950 7921225 8012665 8918833 9433304
16286 9433304 9336113 8704628 8325289 8755118 8723308 8993403 8523544 8417745 8443802 9023754
16276 9023754 8966574 8867367 9848321 10146618 10462949 10390579 9923161 9743639 9659828 10695340
16266 10695340 10414650 10440504 10905846 10873089 10286604 10012649 11043918 11103662 10691659 11205014
16256 11205014 12162762 11639084 11530541 11746569 11938655 12309409 12651885 11938894 12237656
16247 12237656 12448452 12223788 12239470 12486765 12718411 12597578 12929759 13471833 13299905
16238 13299905 12800424 12877822 13068110 13413589 13287539 12603011 12874146 12870671 12766124 13207041
16228 13207041 13497101 13518419 13987743 13446794 12983515 13771750 13734351 14151259 13890074 13730773
16218 13730773 13952109 14324613 14708604 15631409 14914396 14513729 14601658 14528127 14701697 15648925
16208 15648925 15465533 14592251 14679751 14815332 14792691 15422594 15543516 15575883 15208854 15467353
16198 15467353 15885266 15425660 15352138 14713290 15584340 15325552 15964005 16340621 16183436
16189 16183436 15363643 15483574 16154910 16174548 16453523 15626342 15126421 15207376 15839740 15769303
16179 15769303 16402671 15862270 14916476 15999662 15742356 16106266 16691301 16486179 16553633
16170 16553633 17108721 17000275 17066957 17243913 16374661 16150445 16966903 16313313 15937996
16161 15937996 17166809 17596074 18080971 17351403 17408570 17178038 16552150 16686566 17151549
16152 17151549 17395534 17880919 16703239 16088484 16689161 17481016 17395859 16672758 16016406
16143 16016406 16112080 16366185 17011176 17343825 18768479 19179319 18943879 18621676 18459118
16134 18459118 17785370 17416506 17329283 17673456 17991911 17588029 18233913 17650397 17795153
16125 17795153 17158774 17516360 17572330 17357396 17220037 18410363 18137296 17808837 17346585
16116 17346585 16958315 17731035 17456544 17699603 17619480 17842790 18257111 18082145 18279560
16107 18279560 17974307 18616304 18314054 19036856 18778042 17942068 18258989 18489660 18541544
16098 18541544 18213230 18304181 18678045 18640458 19140668 19064614 18493204 17952692 18160727 17681065
16088 17681065 17667577 18726422 19255538 18698159 18893666 18909072 18313784 18190036 18787174
16079 18787174 18435271 19266425 19863221 19543799 19922710 18863113 18794289 18673059 18864899
16070 18864899 19177633 19134562 18209391 18395932 17982796 18299449 18030677 18467488 18509131 18528809
16060 18528809 19062813 18746784 18512446 18330385 18257107 18808255 18184317 18750090 18830422 19219342
16050 19219342 18784298 18000701 18358283 18711191 18878969 18560114 20272676 19608782 19113164
16041 19113164 19205362 18967464 18319455 17946236 18323984 19245274 19553038 19694615 19812909
16032 19812909 18587873 18027414 17750469 18679679 19774741 19816611 19591452 19365180 18913507
16023 18913507 18136798 18138341 18770778 18993134 19309831 19138985 19006033 18666516 18312021 18309790
16013 18309790 19160504 18941607 18684262 19079786 19804039 19307818 18540351 18864222 18838912
16004 18838912 19533364 19613102 20199698 20231055 19658269 19292018 19196889 19554714 20078083 20192311
15994 20192311 18786554 18313048 19296108 19180881 19023164 19546768 19239051 19099734 19575493
15985 19575493 18770477 18535094 19082981 18983857 19082938 19475168 18904744 18318360 19328130
15976 19328130 19873451 20005424 19626682 19940224 19414944 19468902 19411003 19963288 19599074 19713231
15966 19713231 20155321 19759391 19833605 19199501 19515258 19118042 18927108 19140777 19117039 18445680
15956 18445680 18754775 18825866 19090565 19325058 19678517 19094754 19487631 19475015 18216571
15947 18216571 18698142 19474275 19273518 19538666 19771267 19039849 18986570 19529907 19534702 19896386
15937 19896386 19457933 19340507 18303554 18430544 18420907 18900656 18725413 19238106 19864406
15928 19864406 18942653 18726503 19211276 18833699 17968599 18527616 18886081 18690372 18968553
15919 18968553 18848004 19057960 18773174 18870963 20110786 19790638 19470796 18465196 18481114
15910 18481114 18104505 18160424 18425427 18424724 18233750 19000398 19380404 19287368 19619333 19241905
15900 19241905 18931764 19931993 19781178 19883163 20071227 20211865 19514917 18562443 19032605
15891 19032605 18369641 18772274 18927444 19663158 20331275 19574416 18982122 19516898 18920934
15882 18920934 17701578 18261401 18177453 18689200 19002646 19041020 19077731 19339223 19086393 18734361
15872 18734361 18583614 19120662 20050286 18986798 18355844 19370010 19164234 18686791 18513628
15863 18513628 18814738 18867308 18277377 18545522 18563651 18613550 19057745 18903232 19195222 19469408
15853 19469408 20138117 20236133 19982559 19177842 18485953 17918150 17986739 18750315 18567595 19461169
15843 19461169 19470871 19921459 19684224 19230024 19454444 19389046 19261343 18790379 18673832 18959021
15833 18959021 18834656 19207580 19764489 20500895 20129069 19254685 19241047 19181451 19436083 19324565
15823 19324565 18745168 19199158 19449193 19070810 18712759 18837190 19637810 19575783 18916481
15814 18916481 19004250 19742413 19776499 19590790 19567550 19369087 18556147 18164841 18658402 18786720
15804 18786720 18576187 19637845 19381759 19508764 20137504 20431254 19958762 19554295 19451052
15795 19451052 19420291 19816977 19364865 18917657 19590941 19998242 19662669 19937470 19736704
15786 19736704 19900328 19569154 18780719 19140443 19037294 19015554 20029187 20518106 19906546
15777 19906546 19432548 19417092 19911147 19722394 18943907 19706501 20137882 19854165 20665357
15768 20665357 19814721 19234169 18564055 18463180 19350007 19539747 19931973 19785538 19572259
15759 19572259 19527695 19329773 18801376 19251858 19604166 19404323 19318406 18713614 18643236 19525074
15749 19525074 19066031 19184919 19220601 19305052 19406437 19348077 19604941 19932731 19614691 19808871
15739 19808871 19691284 19704117 19912773 19667192 19796935 20141861 20254022 19756667 19385716
15730 19385716 20121791 20322862 19702369 19633332 20243074 19427045 19632954 19379383 19998698
15721 19998698 19911825 20315020 19929186 19144896 18984746 18851406 19157366 18904631 19562830
15712 19562830 19383138 21010387 20853396 19733555 20290058 19756652 19034037 19114848 19516753
15703 19516753 20201093 20771798 20545291 20496057 20705177 20157513 19423773 19128786 20250616
15694 20250616 19758519 19049955 19564344 19649170 19656847 19995328 19621823 19601591 19667703 19683222
15684 19683222 19785466 20040575 20007000 20151748 20062157 19860305 18878292 19475676 19984473 20516806
15674 20516806 20856045 20783943 20698475 20656550 21082921 21108318 20236206 19871054 20442423 20557540
15664 20557540 20137380 20426095 19817499 19685949 20248537 19587418 19683093 19654978 20438353 19884095
15654 19884095 19851667 20094333 19956303 20434028 20140436 19401925 19487918 20546371 20136827
15645 20136827 19862064 20423287 19337148 19277237 20001683 19805360 19387766 19527613 19502622
15636 19502622 19179771 19897085 19758538 20129640 20563198 20005033 20172571 20258004 19511482
15627 19511482 19346602 19297848 19071204 19703219 19614221 20086438 20195519 20631175 20704966 20029832
15617 20029832 20774036 20453375 20414222 20579727 19964027 20580637 20632969 20415111 19940184 19455519
15607 19455519 19785104 19609932 19102184 19769737 20205815 20619063 20292625 20067971 20741204
15598 20741204 20391492 20324245 19764787 19269685 20338675 21370424 20502870 19263106 19336448
15589 19336448 19231891 19413708 20318397 20435156 20010070 19794981 19738238 19106658 19615026
15580 19615026 19901255 19780544 19804313 19974727 19789207 20036727 20548829 20806637 20749443 20323429
15570 20323429 20270804 20168595 20618559 21126364 20959459 21165013 21055810 20308040 20000019
15561 20000019 20153431 20222080 20526996 21017872 20879459 20086115 19229723 19555693 20098112
15552 20098112 20413695 20426889 20139634 19673582 19560537 20479637 20494911 20163630 19989065 20495818
15542 20495818 19755966 19587169 19707154 19888586 20483190 20212361 21362289 21099351 20161921
15533 20161921 18824205 19672410 20311545 19747025 20498177 20885948 21030290 20560803 19392605
15524 19392605 19698087 19539017 19723120 21198555 21128437 20848512 20679164 20298503 20871331
15515 20871331 20653966 19642519 19371078 19395299 19596394 19850947 20617503 20596888 19830349
15506 19830349 19838179 20737502 20568799 20006088 20028415 20201923 20867500 20500294 20184491 19930810
15496 19930810 20378590 20083636 20478369 20455616 21321445 21523150 21108316 21264753 21834288
15487 21834288 20837199 20575986 21190993 20221959 21439646 20777021 20802548 20181955 19976716
15478 19976716 20536149 20576041 20670932 20232322 20630770 21399939 21271178 20919447 21201710 20846317
15468 20846317 20058093 19471247 20324449 20198963 19786084 20326489 20634398 20048072 20159992
15459 20159992 20627073 21051410 20747457 20215537 20685185 21278624 22035637 21449375 20864033
15450 20864033 20552573 19964747 19270929 19927227 20015877 20164523 20389250 20428924 20353302 21440418
15440 21440418 20688346 20631453 20324639 19725911 20271652 20593111 20699593 20537239 20936013
15431 20936013 20681213 20290314 20690007 21654532 21685037 21730576 21534398 21054003 20551233 20280345
15421 20280345 20036116 21031135 21011705 20788962 20723125 20209764 20678814 21067336 20828317 20094776
15411 20094776 20685809 20436479 20793376 21033430 20466885 20328048 19986221 19658124 20483777
15402 20483777 20363043 20102155 19944970 20431206 21893431 21163106 20159700 20111124 20763431
15393 20763431 20784150 20414708 20062352 21086277 20848503 20764006 20812811 20349718 20432633 20704307
15383 20704307 20365637 20374020 20472450 20420271 20422742 20773450 21065611 21064260 20269156 20508921 20452199
15372 20452199 19188020 19278599 20033862 20670188 20655842 20529089 20438314 20464509 20929333 20670719
15362 20670719 20308378 21000128 21648641 22342649 21548925 20935264 20818404 20127575 20612398
15353 20612398 20749572 20699176 21160747 20768666 21364553 21614395 20742823 20157200 21846471
15344 21846471 21806755 21333960 20976342 20643945 20404773 20753843 20967216 20643449 20448851
15335 20448851 20461153 20208562 20980570 21001922 20348019 20661991 21167426 21430848 21269327 21688272
15325 21688272 21331504 21441710 21262165 22634022 21319188 20645610 20817192 20320976 20301634
15316 20301634 20959441 21134429 20658903 21457692 21282123 21376807 21922059 21598792 20204417
15307 20204417 20067648 21176860 22034022 22095889 21333725 20225012 20509439 20926836 21013814
$$ [...]
##END NTUPLES=NMR SPECTRUM
##END=
