##TITLE=1H_CA-9172-2x
 DMSO
 8 sc, 
 13.7.2023
##JCAMPDX= 6.0         $$ Bruker NMR JCAMP-DX V2.0
##DATA TYPE= NMR SPECTRUM
##DATA CLASS= NTUPLES
##ORIGIN= UXNMR, Bruker Analytische Messtechnik GmbH
##OWNER= root
$$ XWIN-NMR		Version 3.5
$$ Thu Jul 13 13:57:36 2023 Russian Standard Time (UT+4h)  she@DPX200
##.OBSERVE FREQUENCY= 200.13135
##.OBSERVE NUCLEUS= ^1H
##.ACQUISITION MODE= SIMULTANEOUS
##.ACQUISITION SCHEME= undefined
##.AVERAGES= 8
##.DIGITISER RES= 18
##SPECTROMETER/DATA SYSTEM= spect
##.PULSE SEQUENCE= zg30
##.SOLVENT NAME= CDCl3
##.SHIFT REFERENCE= (INTERNAL, CDCl3, 0, 15.7524)
##AUDIT TRAIL= $$ (NUMBER, WHEN, WHO, WHERE, WHAT)
$$ ##TITLE= Audit trail, XWIN-NMR		Version 3.5
$$ ##JCAMPDX= 5.01
$$ ##ORIGIN= Bruker BioSpin GmbH
$$ ##OWNER= she
$$ F:/spectra/data/she/nmr/H-F/1/pdata/1/auditp.txt
$$ ##AUDIT TRAIL=  $$ (NUMBER, WHEN, WHO, WHERE, WHAT)
(   1,<2023-07-13 13:56:24.04 +0400>,<she>,<DPX200>,
      <created by zg, POWCHK disabled, PULCHK disabled
       configuration hash MD5:
       00 E9 B6 7A A2 85 ED C7 34 08 36 98 17 FE 4E 26
       data hash MD5: 16K
       0F 3A C5 5D CD 1E A5 E3 E9 52 3D 84 01 90 16 01>)
(   2,<2023-07-13 13:56:26.67 +0400>,<she>,<DPX200>,
      <Start of raw data processing
       efp BC_mod = 2 LB = 0.24 FT_mod = 6 PKNL = 1 PHC0 = -20991.6 PHC1 = 7.052721 SI = 16K 
       data hash MD5: 16K
       65 5F A4 61 C6 E1 96 65 C8 4F 6B 79 CE FD F5 05>)
(   3,<2023-07-13 13:56:44.34 +0400>,<she>,<DPX200>,
      <pk PHC0 = -3.172585 PHC1 = 4.4 
       data hash MD5: 16K
       87 12 12 CE 79 38 A4 F1 24 C2 65 57 D0 27 93 86>)
(   4,<2023-07-13 13:56:47.64 +0400>,<she>,<DPX200>,
      <abs ABSG = 5 
       data hash MD5: 16K
       F3 74 CE 60 11 8F 94 A8 7F 4D B4 69 03 FE 5B 1A>)
$$ ##END=
$$ 
$$ hash MD5
$$ 9B 2C AD 97 0B C9 73 79 59 0C 33 6A 5E AF 18 77
##$RELAX= 
##$RELAX= 
##$RELAX= 
##$RELAX= 
##$RELAX= 
##$RELAX= 
$$ Bruker specific parameters
$$ --------------------------
##$DU= <F:/spectra>
##$EXPNO= 1
##$NAME= <H-F>
##$PROCNO= 1
##$TYPE= <nmr>
##$USER= <she>
##$AMP= (0..31)
100 100 100 100 100 100 100 100 100 100 100 100 100 100 100 100 100 100 
100 100 100 100 100 100 100 100 100 100 100 100 100 100 
##$AQSEQ= 0
##$AQ_mod= 1
##$AUNM= <au_zg>
##$AUTOPOS= <>
##$BF1= 200.13
##$BF2= 200.13
##$BF3= 200.13
##$BF4= 200.13
##$BF5= 200.13
##$BF6= 200.13
##$BF7= 200.13
##$BF8= 200.13
##$BYTORDA= 1
##$CFDGTYP= 0
##$CFRGTYP= 5
##$CHEMSTR= <none>
##$CNST= (0..31)
1 1 145 1 1 1 1 1 1 1 1 1 1 1 1 1 1 1 1 1 1 1 1 1 1 1 1 1 1 1 1 1 
##$CPDPRG= <>
##$CPDPRG1= <>
##$CPDPRG2= <>
##$CPDPRG3= <>
##$CPDPRG4= <mlev>
##$CPDPRG5= <mlev>
##$CPDPRG6= <mlev>
##$CPDPRG7= <mlev>
##$CPDPRG8= <mlev>
##$CPDPRGB= <>
##$CPDPRGT= <>
##$D= (0..31)
0 1.2 0 0 0 0 0 0 0 0.06 0 0.03 0 0 0 0 0.0002 0 0 0 0 0 0 0 0 0 0 0 0 
0 0 0 
##$DATE= 1689242183
##$DBL= (0..7)
120 120 120 120 120 120 120 120 
##$DBP= (0..7)
150 150 150 150 150 150 150 150 
##$DBP07= 0
##$DBPNAM0= <>
##$DBPNAM1= <>
##$DBPNAM2= <>
##$DBPNAM3= <>
##$DBPNAM4= <>
$$ [...]
##$SUBNAM3= <"">
##$SUBNAM4= <"">
##$SUBNAM5= <"">
##$SUBNAM6= <"">
##$SUBNAM7= <"">
##$SUBNAM8= <"">
##$SUBNAM9= <"">
##$SW= 18.05172834244
##$SWIBOX= (0..15)
0 0 2 0 0 0 0 0 0 0 0 0 0 0 0 0 
##$SW_h= 3612.71676300578
##$TD= 16384
##$TD0= 1
##$TE= 0
##$TE2= 300
##$TE3= 300
##$TEG= 300
##$TL= (0..7)
0 120 120 120 120 120 120 120 
##$TP= (0..7)
150 150 150 150 150 150 150 150 
##$TP07= 0
##$TPNAME0= <>
##$TPNAME1= <>
##$TPNAME2= <>
##$TPNAME3= <>
##$TPNAME4= <>
##$TPNAME5= <>
##$TPNAME6= <>
##$TPNAME7= <>
##$TPOAL= (0..7)
0.5 0.5 0.5 0.5 0.5 0.5 0.5 0.5 
##$TPOFFS= (0..7)
0 0 0 0 0 0 0 0 
##$TUNHIN= 0
##$TUNHOUT= 0
##$TUNXOUT= 0
##$USERA1= <user>
##$USERA2= <user>
##$USERA3= <user>
##$USERA4= <user>
##$USERA5= <user>
##$V9= 5
##$VALIST= <valist>
##$VCLIST= <CCCCCCCCCCCCCCC>
##$VD= 0
##$VDLIST= <DDDDDDDDDDDDDDD>
##$VPLIST= <PPPPPPPPPPPPPPP>
##$VTLIST= <TTTTTTTTTTTTTTT>
##$WBST= 1024
##$WBSW= 4
##$XGAIN= (0..3)
0 0 0 0 
##$XL= 0
##$YL= 0
##$YMAX_a= 253672
##$YMIN_a= -309556
##$ZGOPTNS= <>
##$ZL1= 120
##$ZL2= 120
##$ZL3= 120
##$ZL4= 120
##$ABSF1= 15.72816
##$ABSF2= -2.323689
##$ABSG= 5
##$ABSL= 3
##$ALPHA= 0
##$AQORDER= 0
##$ASSFAC= 0
##$ASSFACI= 0
##$ASSFACX= 0
##$ASSWID= 0
##$AUNMP= <proc_1d>
##$AZFE= 0.1
##$AZFW= 0.1
##$BCFW= 0
##$BC_mod= 2
##$BYTORDP= 0
##$COROFFS= 0
##$CY= -3
##$DATMOD= 1
##$DC= 0
##$DFILT= <>
##$DTYPP= 0
##$F1P= 0
##$F2P= 0
##$FCOR= 1
##$FTSIZE= 16384
##$FT_mod= 6
##$GAMMA= 0
##$GB= 0
##$INTBC= 1
##$INTSCL= 3.70164e-10
##$ISEN= 128
##$LB= 0.24
##$LEV0= 0
##$LPBIN= 0
##$MAXI= 10000
##$MC2= 0
##$MEAN= 0
##$ME_mod= 0
##$MI= 1.114404
##$NCOEF= 0
##$NC_proc= -8
##$NLEV= 6
##$NOISF1= 3.799351
##$NOISF2= 2.8
##$NSP= 0
##$NTH_PI= 0
##$NZP= 0
##$OFFSET= 15.7524
##$PC= 1
##$PHC0= -20994.77
##$PHC1= 11.45272
##$PH_mod= 1
##$PKNL= yes
##$PPARMOD= 0
##$PSCAL= 0
##$PSIGN= 0
##$REVERSE= no
##$SF= 200.130003830232
##$SI= 16384
##$SIGF1= 3
##$SIGF2= 2
##$SINO= 5.538805
##$SIOLD= 16384
##$SREGLST= <1H.CDCl3>
##$SSB= 0
##$STSI= 16384
##$STSR= 0
##$SW_p= 3612.71676300578
##$SYMM= 0
##$S_DEV= 0
##$TDeff= 16384
##$TDoff= 0
##$TI= <>
##$TILT= no
##$TM1= 0
##$TM2= 0
##$TOPLEV= 0
##$USERP1= <user>
##$USERP2= <user>
##$USERP3= <user>
##$USERP4= <user>
##$USERP5= <user>
##$WDW= 1
##$XDIM= 16384
##$YMAX_p= 455219057
##$YMIN_p= -1157981
$$ End of Bruker specific parameters
$$ ---------------------------------
##NTUPLES= NMR SPECTRUM
##VAR_NAME=  FREQUENCY,     SPECTRUM/REAL,   SPECTRUM/IMAG
##SYMBOL=    X,             R,               I
##VAR_TYPE=  INDEPENDENT,   DEPENDENT,       DEPENDENT
##VAR_FORM=  AFFN,          ASDF,            ASDF
##VAR_DIM=   16384,         16384,           16384
##UNITS=     HZ,            ARBITRARY UNITS, ARBITRARY UNITS
##FACTOR=    0.220516191357247, 1,           1
##FIRST=     3152.527952038, 0,              0
##LAST=      -460.18881096778, 0,            0
##MIN=       -460.18881096778, -1157981,     0
##MAX=       3152.527952038, 455219057,      0
$$ Real data points
##PAGE= N=1
##DATA TABLE= (X++(R..R)), XYDATA
$$ [...]
10235 3553898 3350313 3054825 2928208 2892135 3241293 3805089 3799214 3417490 3812226 4228447
10225 4228447 4232128 4356803 3757870 4060398 4032077 4202255 4452293 4736975 5161450 5086020
10215 5086020 4866912 4608950 4449348 4709096 5047765 5136148 5501464 5374062 5172137 5305433
10205 5305433 5332720 5333539 5813772 6196238 6507326 6395530 6314995 6495475 6414794 6684496
10195 6684496 6980356 7368241 7068128 7157840 7505770 7763984 8014859 8609956 8665673 8934633
10185 8934633 9190208 9005371 9513052 9731334 9836030 10349371 10119921 10322461 10355729 10577127
10175 10577127 11191938 11647258 11466786 11466022 11535343 11343670 11650653 12298728 12410054 12298473
10165 12298473 12554999 12580730 12941492 12888788 12733769 12992697 13187506 13244341 13498007 13741248
10155 13741248 13914585 13946457 13680949 14104701 14382855 14814266 14800860 14625640 14713929 14720207
10145 14720207 14876901 14988032 15219782 15166091 15515405 16132893 16091260 15858471 16550533 16823630
10135 16823630 16909406 16858395 16741369 17267352 17572448 17846964 17866900 18094713 18625364 18851902
10125 18851902 18990054 19067226 18747798 18247001 18451114 19135637 19808608 19737383 19440078 19284275
10115 19284275 19299206 19320343 19539210 19231451 19466373 19542633 19271826 18949575 19108712 19368801
10105 19368801 19043469 18978915 18837624 18574110 18483360 18548903 18628769 18521577 18490923 18533606
10095 18533606 18485444 17970038 17928228 18040331 17879998 17915704 17647333 17759244 17996724 18084891
10085 18084891 18222933 17688567 17967692 17724179 17278425 17091902 17394182 17781404 17304667
10076 17304667 17344023 17515282 17456284 16897964 16684533 17042133 17193412 16692118 16701603 16538606
10066 16538606 16222949 16227906 16017016 16015245 16125315 15885814 15463426 15462530 15439063 15231608 15013354
10055 15013354 14776937 14609858 14226264 14161765 13623267 12996556 12569565 12632123 12916100 12202748
10045 12202748 11823832 11672840 11710470 11486406 11335708 11136077 10748304 10519183 10072414
10036 10072414 10127649 10283385 10072908 10189702 10390578 9920394 9408764 9147164 8917047
10027 8917047 8772026 9061402 8775206 8770052 9028535 8746165 8471156 8186813 8206583 8154920
10017 8154920 7878289 7745007 7432977 7282723 7167165 7024976 7109282 7222104 7070296 6518666
10007 6518666 6050738 5848434 5585167 5875081 5993034 5996795 5826719 5776454 5430379 5073812
9997 5073812 5183543 5077587 4687354 4808990 4775001 4862903 4662396 4275151 4596750 4028103
9987 4028103 4386115 4191229 3754266 3719205 3438194 3444009 3799028 3885931 3326887 3456367
9977 3456367 3646647 3561354 3417864 3024055 3211147 3249576 2881505 2504816 2657470 2717280
9967 2717280 2826098 2666049 2350867 2836200 3077798 2948030 2767557 2402551 2359099 2788969
9957 2788969 2617241 2402935 2339437 2245379 2292973 2712732 2462637 2235435 2286272 2248826
9947 2248826 2090855 2171904 1871197 1819752 2000757 1881594 1841484 1813039 2071069 1738548
9937 1738548 1900957 1918439 1612045 1340955 1180075 1223720 1385888 1384671 1719660 1801185
9927 1801185 1350422 1532515 1806556 1570084 1333881 1307530 1190561 1771577 1825918 1752011
9917 1752011 1924798 1982528 1757580 1675061 1516417 1821208 1843328 1535992 1539534 1989788
9907 1989788 1693732 1096080 1548349 1177373 1545372 1514568 1464183 1703263 1645859 1647007
9897 1647007 1178662 1246196 1373842 1864842 1683109 1298771 1350557 1157656 1002493 1346776
9887 1346776 1382351 1539210 1719074 1163162 1477451 1669705 2015292 970554 1098331 1499172
9877 1499172 1626413 1666301 1179132 1372264 1617131 1199475 1153156 1254712 921534 1065891
9867 1065891 1404974 1570604 1551328 1550342 1397345 1372836 1434476 1699785 1683498 1542262 1194638
9856 1194638 1453913 1531349 1780978 1777111 1707882 1716616 1937820 1470871 1237443 1488023 1445895
9845 1445895 1439076 1457796 1695495 1745629 1866662 1871249 1598299 1832790 1885307 2075145 2381343
9834 2381343 2612018 2751785 1995982 2188720 2297774 2342878 2102190 1922569 1811340 1953258
9824 1953258 1966404 1533362 1990219 2185694 1945687 1937155 1977799 2006079 2027905 2137219 2413955
9813 2413955 2922256 2824583 2438031 2590850 2576241 2221288 2509335 2323483 2276232 2588184
9803 2588184 2776004 2536208 2417185 2809067 2291257 2560930 2661463 2523885 2647546 3159775
9793 3159775 3086083 3420733 3791976 3422249 3655980 3511565 3748424 3603940 3553192 3605556
9783 3605556 3939421 3715049 3258876 3532741 3498808 3667423 3709018 3971895 4317648 4317548
9773 4317548 4121176 4277684 4470758 4400411 4372083 4872851 5032451 4968986 4764638 5129947
9763 5129947 5408023 5306212 5541100 5225753 5203834 5300199 5580837 5707807 5900350 6071268
9753 6071268 5650004 5737158 5771905 6218768 6526960 6335363 6403828 6846403 6777818 6639768
9743 6639768 6947989 6916337 7186143 7590522 7569964 7477709 7512031 7988452 8355376 8507727
9733 8507727 8888046 9140243 9886772 10491941 10420091 10220162 10498297 11156676 11753882 12052334
9723 12052334 12582631 12571761 12952803 14188947 14795095 15418373 15910265 16298500 17206907
9714 17206907 18385473 18816087 19177218 20463431 21467334 22915641 24191206 25464714
9706 25464714 26804168 27978562 29346790 31330494 33368429 35348435 37614384 40462288
9698 40462288 43710108 47236091 51707250 57169394 63317547 70848076 80160950 90620830
9690 90620830 100807960 109274587 114111337 112372439 105941177 96070824 84758855 73885911
9682 73885911 63830619 55508739 48927629 43574463 39382304 35878184 32643393 30065229
9674 30065229 27040987 25160244 23859504 21796996 20078347 18970443 18152268 16828091
9666 16828091 16336384 15439144 14799540 14035568 13334145 12285358 11535266 11240957 10527176
9657 10527176 10372908 10091851 9781439 9076650 9143387 8711886 8156442 7400804 6921660 6855836
9647 6855836 7013401 6933838 6601416 6512487 6467814 5970885 5715355 5599625 5361977 5210248
9637 5210248 5078070 5080778 4502812 4407580 4328171 4333965 4481003 4258201 3994183 3855811 3442211
9626 3442211 3991173 3353413 3226535 3481877 3564210 3641348 3463867 3374523 3346057 3115625
9616 3115625 2679110 3031800 3473325 3190920 2442849 2473150 3100215 2669207 1960094 1839889
9606 1839889 2249234 2510511 2544062 2529580 2071340 2031450 1956075 2127770 1879761 1782305
9596 1782305 1911074 1817672 1928479 1625696 1700300 1878557 1657591 1346655 1508748 1827774
9586 1827774 1847887 1768242 1760936 1601256 1334497 1296062 1367709 1758067 1473855 1664507 1912922
9575 1912922 2035099 1888166 1963944 1967035 1835612 2179817 2138993 1535074 1537917 1861537 1548458
9564 1548458 1214988 1448847 1594452 1771048 1622665 1461163 1297992 1551485 1892842 2051015
9554 2051015 1655768 1495191 1361890 1588683 2247674 1733626 1273801 1583788 2000260 2089253
9544 2089253 2118137 2286487 1817563 1683620 1788266 2163346 2540936 2312031 2231426 2117887
9534 2117887 1871971 1672108 1822361 1799495 1958702 1862012 1933494 1828136 1554085 1545665
9524 1545665 1184615 1295008 1576100 1718492 1560280 1869408 1737406 1818503 1696303 1412879
9514 1412879 1532497 1755236 1868614 1425353 1420269 1193625 1059000 1038716 737903 1114090
9504 1114090 841103 624017 898833 1160120 1243119 1093958 1239954 1248793 1390248 1040681
9494 1040681 1159567 993965 1173245 1014715 847290 860813 872971 465116 867081 1146184
9484 1146184 1391092 1188484 880074 600500 416092 701341 845064 383641 568544 633759
9474 633759 457542 566490 667821 249147 146574 69342 106308 332282 726772 851480
9464 851480 916529 927870 274884 35214 270414 464246 402783 230270 62991 448044
9454 448044 488645 760460 491200 30911 -166799 -12953 210353 526023 310024 -28917
9444 -28917 -8965 80988 181433 333741 222571 260696 855117 1058181 557618 203321
9434 203321 366659 407633 438870 459527 445284 252173 274510 278071 293105 450093 15055
9423 15055 23093 -1858 261230 599095 115155 200824 241652 -153594 64641 -897 518677
9412 518677 396474 61782 32339 -157345 -152332 283773 438633 384837 270920 434557
9402 434557 382538 336558 114074 108660 324931 704212 643281 189458 -34241 -48073 -257888
9391 -257888 -262044 437178 775506 80296 66641 486308 490266 228257 -31628 415518 609918
9380 609918 590189 411766 451513 280773 124370 188955 308571 707580 681832 727706 902361
9369 902361 570820 426829 359599 328060 576337 1060506 541234 298577 17198 447581
9359 447581 740851 1005895 796034 648469 703391 766377 595481 495084 631765 207397
9349 207397 300189 356743 478043 504274 464749 339657 314052 532834 502206 501639 222003
9338 222003 385742 509373 249217 948133 475294 257130 462849 647963 623509 551140
9328 551140 344180 560775 816469 953229 430085 383899 383380 40922 232322 142189 743245
9317 743245 874985 620479 112446 191973 804785 594723 557205 378907 370259 622507
9307 622507 939265 667473 324908 914406 346910 267239 566229 601421 643441 548478
9297 548478 801029 904624 271761 253709 495111 229380 -38222 141228 360691 823551
9287 823551 841455 624157 432594 248750 653002 703305 603591 888200 798693 701685 510119
9276 510119 526829 249778 518747 825995 1202860 869258 735055 918090 908261 822703
9266 822703 631160 735037 872952 477822 693540 634546 394307 733813 675438 475774
9256 475774 688238 1070064 1089189 1090238 601967 508940 341825 996069 920688 1151216 1017392
9245 1017392 1015802 1168159 1212266 1066128 1143502 1158398 1190259 1357012 1077490 965818 1318972
9234 1318972 1648416 1456318 1303941 1273084 1134594 1365778 1495306 1405474 1478765 1395840
9224 1395840 1447743 1456396 1142558 1572659 1566747 1480852 1346394 1518831 1533714 1220090 789850
9213 789850 1599754 1768621 1249128 1799185 1719481 1673619 1559968 1745233 1830519 1943445
9203 1943445 1764536 1550810 1562662 1755865 1722873 1630022 1966284 2399314 2288962 2086786
9193 2086786 2058318 1976658 1810853 1981557 2126905 1719930 1819013 2054820 2044972 2077484 1705769
9182 1705769 1815757 1942162 2147001 2177870 2396386 1960789 2168642 2121553 2426257 2275661
9172 2275661 2081409 2012598 2175880 1934189 2042859 2503922 2228109 1698008 1263609 1841748
9162 1841748 2030343 2184458 1989116 1830177 1647308 2009079 2104317 1786575 2057098 2312372
9152 2312372 2152353 2372328 2595968 2565882 2239875 2254839 2127653 2067724 2287116 2254541
9142 2254541 2566307 2577725 2481598 2813241 2719284 2676924 2433673 2314981 2103129 2049001
9132 2049001 2419923 2942996 2937441 3129286 3113839 3002327 2649187 2566226 2822355 3388917
9122 3388917 3110113 2807674 3062712 2839924 2785536 3119567 2813823 2636528 3029614 3127528
9112 3127528 3152463 3427629 3535586 3672069 3961495 3632022 3873603 3950516 4143052 4021840
9102 4021840 4004627 3984903 3946650 3899414 4154523 4495742 4169423 4242670 4203442 4283062 4659967
9091 4659967 4157151 4254891 4542732 4371252 4409289 4853875 4830628 5147518 4897305 5282886
9081 5282886 5879764 5970287 5501898 5667222 5569953 5793253 6509141 6376122 6148408 5951611
9071 5951611 6209679 6105092 6223536 6653993 7268733 7275486 7370779 7728271 7707719 7658068
9061 7658068 8003970 8212674 8322009 8782479 8970563 8746959 9229071 9617612 9615758 9897248
9051 9897248 10356126 10758779 10907175 11370135 11886297 11820070 12248176 12497211 13113511 13811971
9041 13811971 14243470 14672868 15150264 15584858 16657318 17446605 18175138 18407979 19003606
9032 19003606 20125006 21125372 21721482 21930157 22691893 23736219 24471497 24470973 24850807
9023 24850807 25660948 26335491 26799097 26975270 27067123 27251701 27509812 27250018 27079836 27298879
9013 27298879 26911078 27107439 26930256 26116489 26218707 25893948 25691640 25335099 25199443
9004 25199443 25079415 24837490 24499027 24932504 25253857 25105080 25357361 25832936 26508223
8995 26508223 26893086 27287716 27432613 28035986 28363998 28376613 28097272 29061680 29327537 28957922
8985 28957922 28875722 28492215 28292056 28140441 27821650 27837521 27130887 26303501 25568769 25347646
8975 25347646 24433845 23597298 22550817 21770436 20727133 19304216 18780266 17883024 17348672
8966 17348672 16641538 15985581 15351478 15077007 14718192 14049230 13464719 13080339 12329562
8957 12329562 11984202 11808061 11737788 11661321 11570955 11561137 11714523 11533244 11134739 11238711
8947 11238711 10856868 10211470 10239718 10502822 10157878 10167489 10282315 10145748 10034335 10142438
8937 10142438 9922062 9774662 9829979 10132721 9794079 9999991 10098498 10097120 9693019 9988203
8927 9988203 10172633 10247955 10066480 9954512 9990151 9787482 10281773 10028639 10254825 10588065
8917 10588065 10762101 10743182 11046744 10962460 10900113 10798902 10862894 10887662 11123476 11719714
8907 11719714 11483024 11332382 11955833 12391888 12489935 12598724 12687335 12819740 13052372 12822125
8897 12822125 13442199 13428530 13863331 14107256 14340605 14558463 14704441 15362107 15743790 15799578
8887 15799578 15995299 16923369 17521014 17713135 18223938 18904513 19513906 19777822 20731229
8878 20731229 21154822 22155400 22618626 23558495 24630245 25468297 26751247 26943700 27968104
8869 27968104 29062066 30299221 31749123 33334743 34217449 34989461 35843999 37228894 38103675
8860 38103675 38994961 39347592 39490566 39896553 40175729 40519645 40509048 39961822 39590094 39460282
8850 39460282 39172403 39525580 39653661 39854739 39804543 39914328 40510615 40895786 41567392 42796404
8840 42796404 43834848 44396110 45441340 46913770 48421958 50632606 52442133 54192361
8832 54192361 56396651 58832207 60746575 62583406 64365108 66343077 67749038 68664854
8824 68664854 68765398 68275993 67982540 67157422 66170707 64238478 62094797 60707894 59097648
8815 59097648 56789818 54745804 52681488 51379504 50145822 48635424 47421489 46732296
8807 46732296 46096634 45497092 45483294 45050561 44635879 45241148 45994024 46793629 47663751 49228519
8797 49228519 50690310 51800329 52505074 54122024 55856924 57347237 58542321 59461392
8789 59461392 59832000 60253792 60472325 60324671 60352886 60361493 60320425 59958168 59617006 59540355
8779 59540355 59196810 58549930 57714993 56642856 55058762 53695345 52385343 50316564 47980354
8770 47980354 45629773 43364969 42086580 40581884 38984159 37624603 36457098 35842145
8762 35842145 35129408 34269154 33748625 33501117 33381111 33495116 33573776 33762455 33720386 34566947
8752 34566947 35035488 36065358 37497006 38745566 40352970 42073290 43400598 44499964
8744 44499964 45670238 46530620 47359521 47300675 46654855 45864498 44688430 42908449 40482169
8735 40482169 38064249 35981553 33962108 31558122 29688415 28122379 26568479 24970576
8727 24970576 23563366 22209646 20937682 20078445 19335754 18575484 17766492 17273224 16895228
8718 16895228 16078753 15780348 15630889 15096656 14639012 14061201 13572547 12988087 12487952
8709 12487952 12797629 12851842 12479669 12038245 11823248 12063965 11983347 11678954 11579334 11346896
8699 11346896 11200408 11279452 11223684 10858683 10881060 10380206 10336699 10507072 10110197 10071502
8689 10071502 10354813 10553351 10224706 10006880 9710020 9663414 10105230 10230290 10215446 10168706
8679 10168706 9893215 9508160 9782998 10010565 10140113 9931130 10363821 10261005 10218392 10506268
8669 10506268 10084285 10242990 10238250 10350374 10706452 10938083 10977707 10843341 10793649 11321033
8659 11321033 11779184 11903463 11690229 11812282 12167974 12154342 12152086 12390028 12940706 13160799
8649 13160799 13039943 13507204 14039746 14663996 14986593 15491785 15476130 15958979 16652942 17418790
8639 17418790 17864471 17954301 18925713 19585225 19853564 20282390 21203311 21765308 22217559 22601532
8629 22601532 22904997 23116877 23700843 23843723 23785111 24215348 24339172 24349346 24621023 24553647
8619 24553647 24815152 24868994 25163545 25580076 25685145 25953437 26678431 26650734 26812644 27826660
8609 27826660 28629060 29398267 30125018 30739839 31291108 32234579 33222561 33814926 34738923
8600 34738923 35524883 35977781 36418608 36854928 37555273 37406421 37592872 37642071 37749919 37382825
8590 37382825 37386948 36887218 36664016 36435539 36351114 35951615 36083487 35718120 35823736 35685240
8580 35685240 35094926 35682026 35707695 35942018 36074242 36432133 36421357 37511493 38300167 39013454
8570 39013454 40170092 41231593 42264597 43131550 44294583 45320849 46814139 48039316
8562 48039316 49038621 49357749 49821253 49975196 50038147 50030783 49758793 49322692 48857418 48350716
8552 48350716 47917945 47533935 47075260 46642008 46642349 46673815 46879685 47327699 47601758 48601323
8542 48601323 49960037 51055191 51710848 52831275 54129555 55821963 57194381 58656554
8534 58656554 59949675 61608998 63475518 64775876 65760528 65733006 65127949 66057037 65577672
8525 65577672 64455632 63594953 62149254 60480890 58761655 57869338 56236098 55165782
8517 55165782 54155298 53109988 52372712 51840961 51672338 51514256 51685908 51997453 52548389
8508 52548389 52958794 53432883 54575674 55551860 56286499 57215974 57928962 58655222 59594520
8499 59594520 60701157 61551092 62115453 62182049 62275116 62235394 62101117 61416413 61333850 60393437
8489 60393437 59246526 58382986 57407962 56525155 55628199 55090562 54600575 53961646 53809378
8480 53809378 53677315 54190428 54405387 53805792 54030822 53829559 52777140 52086336 51118199
8471 51118199 50378350 49156462 47506982 46389903 45147326 43778798 42305324 41231856
8463 41231856 40022568 38898525 38228077 37436169 36239124 35786266 35623873 35262426 35013490
8454 35013490 34776538 35053959 35496838 35938584 36704440 37279744 38371589 38995403 39488974
8445 39488974 40080453 40175895 40328988 39880007 39142707 38440113 37389792 36481149 34918928
8436 34918928 33097671 31712377 29924296 27881104 26607697 25177816 24109279 22755387
8428 22755387 21770827 21226500 20606891 19981459 19574991 18686675 18333867 18424361 18322799 18468642
8418 18468642 17778676 17672024 17878908 18389836 18342054 18242773 18295993 18267283 18426602 18055607
8408 18055607 17588659 16918831 16070298 15163663 14242515 13217895 12835635 12293292 11442287
8399 11442287 10590318 10042796 9679489 9660573 9181568 8396082 8016177 7553575 7308272 7441212
8389 7441212 7220627 7096471 6708239 5869491 5905515 6246210 6157504 5399185 5112300 5308705
8379 5308705 5340045 5164483 5096152 4723083 4719474 4529539 4274384 4497849 4325112 4397373
8369 4397373 3977338 3523456 3718485 3483467 3363132 3502313 3076041 2892447 2864708 2924534
8359 2924534 2565647 2382715 2417125 2461042 2344793 2335521 2079936 2084125 2282712 2374430 2627734
8348 2627734 2395990 2191405 1895926 1733146 1719858 1664116 1692215 2073160 2013458 1628826
8338 1628826 1623005 1846450 1942109 1877947 1659582 1491683 1581634 1642870 1552172 2149756 1974721
8327 1974721 1807339 1739218 1610669 1581222 1391915 1337388 1572709 1555366 1248127 1356485
8317 1356485 1711921 1511501 941996 1140738 1086653 1249882 1035370 757483 919940 854389
8307 854389 794116 699360 709504 778054 877980 688037 274170 107838 309789 607071 735247
8296 735247 644607 615306 771550 757117 786301 905273 672605 827153 800355 862604 501874
8285 501874 533076 733669 780808 745009 643525 374043 612848 812058 889622 471135
8275 471135 899473 592387 654324 616657 150023 596181 784464 737245 363981 739279
8265 739279 239906 128724 652182 594642 477740 1036638 887117 555319 478384 294458
8255 294458 59422 402916 516908 307028 372187 386595 240395 889292 661978 350597
8245 350597 263156 234274 359321 338079 851270 953531 425118 340976 240308 541906
8235 541906 552235 330197 -42623 -529931 117483 554280 436111 472652 439311 229945
8225 229945 -43029 68806 47020 388334 231651 209708 539769 215370 125172 -179752
8215 -179752 -237696 315614 -59274 -419867 125724 70573 114946 -105294 -17552 4750 204891
8204 204891 -40698 -399097 -103538 -73226 -257485 160741 -45559 -201701 229313 -306720
8194 -306720 -616301 -841358 502368 1287114 944199 374024 -392064 -319023 119231 433623
8184 433623 610053 406415 111995 -60807 -4901 -33524 128784 37868 -409127 -25605
8174 -25605 -222334 -35120 -178924 209195 253030 258371 -40451 -97560 -253306 -599587 -167302
8163 -167302 147573 187574 -138816 191113 20001 290995 276531 -285632 -146440 88900
8153 88900 523501 515784 246519 -258489 -5878 -211523 -313914 299484 248222 144891
8143 144891 -34079 -383068 -476872 -184927 -274957 -63275 112472 -77789 -149019 -82572
8133 -82572 -385504 -221073 44520 573465 545573 329554 47611 -102191 -235908 31170
8123 31170 -12503 -214801 -73841 -344720 -546565 -495845 -266807 -160198 -138153 40601
8113 40601 55531 133623 -72976 -221536 83542 -114884 -359280 -193979 -328470 -104802
8103 -104802 54982 -125018 -198159 163851 -356724 -351868 -248607 63324 -121141 -475146
8093 -475146 -391135 -533431 34485 -83268 -214102 -546837 -114371 -79478 23401 -192245
8083 -192245 -137193 -414945 -747191 -837072 -392430 -123757 -407505 -737030 -534021 -630163
8073 -630163 -123011 -272448 -406824 -218941 -116807 172683 23423 -337886 -164208 -183189
8063 -183189 -495633 -160631 -57729 -428972 -157577 -135627 -197689 -193575 -200274 -46474 -132267
8052 -132267 -413255 -321761 -220890 -745020 -528598 -836991 -726493 -307501 8452 -189706
8042 -189706 120329 10653 -72826 -226451 -657156 -440917 -186550 106284 184914 66185
8032 66185 -270058 -328410 -234498 -431036 -364699 -411574 -535302 -1117254 -952107 -620458 -418017
8021 -418017 75982 -111366 -417046 -418342 -417107 -448904 -291371 -253910 92561 270379 -326018
8010 -326018 -548770 -649099 -467218 -519017 -647900 -514035 -536501 -628893 -477188 -403733
8000 -403733 -129329 -350490 -743278 -387115 -281 50593 -91312 42435 6672 -122459
7990 -122459 -271257 -223668 -595759 -624398 -690606 -810416 -850624 -711527 -220582 -24454
7980 -24454 -83026 -646969 -882309 -315154 78976 52356 307266 263999 236433 -7693 -344411
7969 -344411 -514534 -43628 43672 -274433 -273923 -212149 -496289 -501935 -530959 -623955 -494309
7958 -494309 -186334 -171571 -56429 247046 -111522 20680 -56358 -439768 -543141 -218753
7948 -218753 258782 34225 -392615 -207471 -514179 -535355 -419057 -542827 -510030 -445986
7938 -445986 -320518 -254770 -16705 -49155 7838 215263 209770 129538 91169 375751 316316
7927 316316 536043 376977 75281 48593 -24712 159835 240773 228624 -20456 -83829 -145041
7916 -145041 -342621 -124460 13587 -336968 -308476 -99907 -243138 16453 340321 186383
7906 186383 129203 138915 328665 220008 101956 232237 415241 235522 141966 288639
7896 288639 80651 -178994 -527934 -211498 -116010 9507 2145 81578 196138 516145
7886 516145 157491 -156309 257257 536174 556196 157568 478209 351323 145197 280253
7876 280253 268236 448935 380820 399275 233743 256189 514660 204838 198937 288069 350383
7865 350383 408852 118481 447182 757304 520600 71859 -93715 44613 67063 447223
7855 447223 935907 628920 472847 421707 542939 567533 903693 674798 985089 1064572
7845 1064572 829685 288228 244475 367064 766796 798951 1104259 1043241 777181 602137
7835 602137 639006 716711 447822 782346 865082 862339 526847 591578 574529 980160 863959
7824 863959 826742 239493 824463 942839 1043431 844404 1081770 762585 741060 817369
7814 817369 1010773 1090965 1102192 1278321 1379482 1521851 1207234 1388204 1655470 1724419
7804 1724419 1779746 2002335 1815583 1953724 2174973 1786216 1638310 1963896 2214066 1733030
7794 1733030 1729554 2350308 2469626 2486766 2651445 2618698 2615887 2822563 2678871 2551827 2839256
7783 2839256 2724714 2740924 2745988 2643661 3088158 3226318 3137839 3260523 3670552 3447112
7773 3447112 3272493 3330075 3299257 3922321 3734739 3837981 3424686 3264990 3140167 3189631
7763 3189631 3769667 4365475 4390324 4325026 3984263 3967246 4426156 4356581 4064517 3628640
7753 3628640 4176800 4110854 4014048 3767378 3624061 3547677 3658521 3922664 4118370 4387334
7743 4387334 4173216 3937843 4005663 3786587 4190631 4250258 4221780 3826946 3780712 3582005
7733 3582005 3696444 3605918 3709655 3958594 3839678 3356205 3017679 2914168 3173460 3183209
7723 3183209 3096334 2974805 2854101 2927485 2604981 2605400 2867481 2836641 2388423 2134857 2796174
7712 2796174 3046572 2607070 2079463 1900906 1915537 2209084 1907002 2113980 2390063 2582279
7702 2582279 2518321 2434492 2286212 2036155 1906189 1655077 1668311 1366588 1498400 1784028
7692 1784028 2382525 2507429 2305501 2558660 2239336 2125944 2330897 1957728 1888338 1680012
7682 1680012 1942597 1884725 1597298 1948781 2184088 2101715 1931846 2260268 2199127 2102912
7672 2102912 2423176 2303667 2338075 2487992 2648933 2690474 2831177 2561680 2192135 2136835
7662 2136835 2386204 2800162 2603163 2279814 2539360 2681537 2739650 2167140 2185253 2130781
7652 2130781 2188322 2111626 1856070 1737476 1634580 1505965 1980858 2118590 2246416 2176686
7642 2176686 2127012 2198337 2537329 2887108 2787026 2634757 2610410 2470443 2322781 2397817
7632 2397817 2434842 2488380 2251641 2483356 2958481 2584588 2145151 2140219 2307434 2595819
7622 2595819 2355404 2663753 2815179 2687863 2735245 2637014 2236430 2443402 2399665 2630863
7612 2630863 2675757 2821391 2695822 2702808 3051800 3247713 2965222 3077309 3569287 3362813
7602 3362813 3577547 3559938 3224511 2929971 3269231 3378174 3465198 3057447 3251287 3150921
7592 3150921 3156863 3235063 3004743 3165683 3124586 3138193 3520003 3515067 3274941 3460375 3550216
7581 3550216 3414645 4294363 4145738 3904214 3941687 3778381 3971322 4139970 4342046 4242676
7571 4242676 4324090 3996365 4026073 3931525 4131204 4684900 4833397 5199317 4988198 4733331
7561 4733331 4595420 4532499 4989129 4664171 4895080 4993741 5440525 5259413 5590686 5665944
7551 5665944 5630299 5738823 5531580 5184986 5056286 5427424 5632957 5807451 5803903 6145583
7541 6145583 5926839 6076532 6719465 6653959 6712891 6710203 6635925 6674143 6892176 6870282 6803970
7530 6803970 7118770 7107032 7314659 7278783 7119433 7486380 7364096 7625941 7273092 6877342
7520 6877342 7254162 7496296 7543941 7535343 7766116 8035849 7621854 7350658 8289696 8405160
7510 8405160 8360365 8390040 8424474 8509822 8535003 8717370 8795599 8810890 8789965 8477293 8527060
7499 8527060 8455157 8306658 8226765 8832645 9302913 9136716 9186371 9045830 9017239 9104139
7489 9104139 8959988 9128609 9207248 9179667 9060689 8685554 8987841 9068333 9205967 9515236
7479 9515236 9200836 9015540 9011043 8731287 8726804 8925884 8792200 8573219 8770312 8654022
7469 8654022 8784912 8602232 8681142 8812153 8979179 8710564 8584565 8697904 8664998 8871731
7459 8871731 8448378 8336224 8490358 8609174 8676355 8145119 8523298 8495303 8245493 8318722
7449 8318722 8105965 8189372 8241091 8561298 8411194 8285726 8433191 8385690 7705965 7586091
7439 7586091 7535129 7779193 8208618 8200820 8073810 7912486 7426949 7852221 7726374 7558299
7429 7558299 7864265 8014649 8010282 7518868 7299292 7585684 7681715 7780226 7743377 7807448 7729761
7418 7729761 7808140 7363472 7195398 7207066 6875426 7160197 7238831 7187772 7131265 7310290
7408 7310290 7377289 6977972 6367706 6839339 6996837 6827794 6400017 6335726 6471462 6309203
7398 6309203 6091752 5983574 5994231 6093998 6036759 6023584 6190798 6247916 5673074 5381557
7388 5381557 5416762 5052609 5426504 5356569 5524145 5597293 5272816 4886079 5130741 5176109
7378 5176109 4976136 5020267 5161369 4973892 4916837 4974664 5153205 4969116 4488567 4403408
7368 4403408 4016494 4099329 4332119 4366760 4679920 4442332 4030743 4025091 4007634 3555925
7358 3555925 3373032 3691010 3814692 3732942 3946187 3426224 2955768 3164004 2999223 3240183
7348 3240183 3535064 3298535 3096382 3445596 3380430 3366683 3459596 3457111 2957102 3085562
7338 3085562 3308126 3129862 2518122 2596607 2792092 2754178 2937924 3053394 2855842 2600096
7328 2600096 2419993 2893156 2664964 2548676 2395739 1829286 1863830 1943618 2365077 2346787
7318 2346787 1993578 1847007 2019501 2384615 2103942 2065786 1979470 1841890 1836690 1637064
7308 1637064 1832751 1856835 2053917 2391883 2193290 2124781 2034785 1836640 1659691 1692922
7298 1692922 1870677 1988649 1797471 1502609 1425497 1681062 1891863 1724879 1659808 1855697
7288 1855697 1991717 1320247 1227983 1219097 1297229 1204284 1975662 2129524 1462197 1389632 1049614
7277 1049614 1288698 1198044 966273 1335933 1247439 1412474 1626759 1073299 1024667 1267202
7267 1267202 1449308 1379797 1251642 1199919 1321344 1262362 992710 942302 970486 1043930 974134
7256 974134 1110035 1315223 1319550 779007 838241 610604 1371997 1658602 1249691 1214115
7246 1214115 972867 1403946 1399720 1481054 1339293 1080610 877118 915514 1177402 935377
7236 935377 604551 696782 881468 1018365 1381921 1037526 727477 736242 1071184 1286337
7226 1286337 1032402 1046176 804804 876169 1044847 680739 866341 669049 730390 1016210
7216 1016210 959483 483733 563568 1007880 957480 882286 1112839 1093592 992447 830734
7206 830734 597344 554218 533802 572504 483590 882077 743844 545432 325528 825040
7196 825040 652500 484906 630783 431843 586314 631273 360716 213654 464882 730683
7186 730683 472629 80466 487516 464611 714498 617470 103896 227666 56840 95337
7176 95337 122879 115318 275576 584615 679745 494154 336850 621167 538847 482183 128895
7165 128895 -189987 57156 508080 398961 417259 525103 469423 511860 -233402 -176132
7155 -176132 240996 226511 419645 363022 174083 27974 -5880 231482 120169 201517
7145 201517 346420 187518 368635 556528 804528 661959 619691 387923 -42666 32156
7135 32156 471843 483998 611075 646155 509998 872368 376404 79483 36421 155031
7125 155031 137723 285890 -85539 130735 342440 759995 637596 154843 -159750 -42446
7115 -42446 108276 -150067 76431 119952 269588 112553 -5045 229686 260398 518292
7105 518292 674589 583291 310680 502289 479698 176518 671228 653367 465964 269786
7095 269786 -65613 43871 358677 527212 187526 -116642 405735 279899 -143554 -450101
7085 -450101 396962 851068 618173 435314 597137 190369 265874 134077 -122586 125844
7075 125844 350918 110294 -315779 -159892 295182 502150 127504 139837 206987 165896
7065 165896 -60056 169049 343634 15610 387754 355432 547374 907735 536093 537789
7055 537789 405440 791609 687551 75580 145326 168797 233838 366467 -72000 65637
7045 65637 -101676 79609 248121 -276836 -95974 45920 -302638 21697 -244749 67082
7035 67082 361864 37170 162050 -33016 -402223 -66335 -43170 131672 357792 406109
7025 406109 250777 -5734 -250632 162558 363670 300212 898518 1014044 815940 503267
7015 503267 377742 537903 424386 294097 555025 466740 290298 -159288 -235999 -84414
7005 -84414 -148815 -98338 224422 188427 164419 53809 48781 -67531 -20689 129953 208647
6994 208647 -66708 188907 357494 142251 -137639 -68397 69354 354530 64903 180599
6984 180599 474609 471872 27872 -32910 -103613 141014 138861 -132808 -148579 11634 290846
6973 290846 408551 524624 53097 4440 275533 59919 -41422 464470 82354 196179
6963 196179 119855 -46787 113203 137739 -84801 360719 381860 307070 50482 171739
6953 171739 69532 -134540 143565 497776 420494 405332 408906 662336 476890 298999
6943 298999 286679 -91284 488079 412419 338657 156700 -62006 84058 380570 368640
6933 368640 86238 151669 -65340 -172353 -33404 -49271 -107958 34572 12600 -39842 206361
6922 206361 -309583 -227930 14967 -174719 -138100 -12058 162758 56517 72159 460021
6912 460021 197136 363294 146210 181948 135488 -48420 234861 31221 256251 152610
6902 152610 281185 77161 -122786 210768 307673 384268 334321 44968 266869 16706
6892 16706 347663 171724 37870 111624 253986 561205 425616 392083 -118215 -121570 -121371
6881 -121371 -241607 -331313 -341345 -344505 -192895 251061 245998 501893 389685 -8918 219915
6870 219915 413441 572410 307614 389961 456868 371651 -19671 -104877 69113 141284 68910
6859 68910 33970 515084 459896 42258 -155980 7932 23795 -45213 -655060 -499696 -304834
6848 -304834 -273217 -108686 234635 34500 72542 323038 61832 23932 119148 281582
6838 281582 624541 592726 156918 690743 555007 48379 221091 406530 289571 -124721
6828 -124721 -133030 44278 126325 218341 14675 118485 17048 314538 294972 138232 127425
6817 127425 -15009 -99183 110198 -83419 -50295 -195751 85046 -3401 418043 407066
6807 407066 459554 654352 215361 27838 294091 67305 -186536 -129139 4772 246077
6797 246077 114355 -104885 -3923 136625 162565 407324 -20620 53342 107697 -138311
6787 -138311 92718 247019 247381 296892 -10748 489840 445855 64088 279467 204892 157979
6776 157979 296352 307809 276001 357453 648264 736993 315504 -279540 -178401 288372
6766 288372 337993 49495 -133007 206740 507238 -48982 257915 471180 660649 26106
6756 26106 -195849 247142 139718 64744 -40612 231059 434654 202880 92128 141998
6746 141998 211715 177088 172791 201038 299361 416827 472861 964566 326607 -155798 130831
6735 130831 179203 543109 727123 437641 408951 615605 165746 -122038 116296 242757
6725 242757 140856 567506 117821 330842 977333 1051636 482760 394104 584027 490807
6715 490807 514134 521766 716511 745222 1024155 1251148 797137 522536 404794 453542 670562
6704 670562 327340 254137 324590 443166 494661 246778 139974 553247 767672 900038
6694 900038 684619 798990 630206 436737 149115 -162118 482448 448732 308276 785879
6684 785879 516349 405028 566425 1097780 1138889 931518 1036274 1039496 538440 619139
6674 619139 755044 782399 479679 639927 775829 705208 454964 569208 206166 -76144
6664 -76144 24746 680736 913897 994016 1146940 718875 912233 838080 953870 671942
6654 671942 716664 433248 291787 140903 543009 727864 465051 561852 527470 535361 485431
6643 485431 206089 484327 553246 605009 603238 417813 512445 442431 348056 317370 529305
6632 529305 536979 602152 978163 906223 588943 794881 1012292 1273656 1149347 1044442
6622 1044442 1065471 1392743 1160847 964322 1216060 756149 935648 941033 911815 1078961
6612 1078961 1006400 813358 921932 963002 860438 699548 974059 892289 907204 1243378
6602 1243378 1539779 1846758 1571821 1319192 1135761 261228 340354 503663 947787 979343
6592 979343 708584 883885 1223072 1460302 1407694 1213755 693968 697390 1413562 1732790
6582 1732790 1318169 1181380 1094587 894076 703275 1128201 1139537 1480955 1095356 982562
6572 982562 743719 830261 676801 376186 611981 1034928 1175633 1284750 1156080 1389590
6562 1389590 1073180 863970 882950 1111401 1242095 612708 1130789 760774 517495 899866
6552 899866 892128 646926 701699 518039 709993 614079 426019 612083 985831 1214904
6542 1214904 822167 1203460 1895856 1963247 1946228 1471961 1420608 1241820 1268609 1628618
6532 1628618 1399203 1347016 1223801 1208199 1178673 1044939 1145182 1359733 1332516 1287433
6522 1287433 1552085 1649713 1182532 1151997 1347108 1359225 1349762 1480858 1627944 1739645
6512 1739645 1531625 1741569 2023028 1608860 1169221 1342057 1259183 1384927 1120742 1192443
6502 1192443 1764188 1339470 1233466 1344592 1216704 1358149 1450103 1359166 1326945 1345589
6492 1345589 1251274 1088853 1661838 1888092 2025217 1828869 1504087 1529092 1939409 1860380
6482 1860380 1729935 1443622 1587324 1629898 1545130 1472638 1880478 1306037 1074610 1432666
6472 1432666 1635823 1621280 1575726 1770409 1916653 1937392 1884930 2250740 2029554 2007429
6462 2007429 1806705 1792258 2028313 1972777 2083989 2141162 2457600 2399422 2415166 2451439 2122894
6451 2122894 2410208 2331731 2146101 2217993 2161013 2324327 2632653 2554106 2511055 2452335 2361274
6440 2361274 2094844 1984888 2061825 2423158 2445778 2565916 2343090 2365621 2221582 1973682
6430 1973682 2226821 2354655 2069551 2439309 2373414 2197965 2014302 2379987 2385691 2374157
6420 2374157 2555821 2737099 3206052 2768846 2658024 2536660 2535256 2769471 2929704 2525773
6410 2525773 2824647 2891631 2747865 2763182 2487478 2051331 2019730 2906017 3266880 3376311
6400 3376311 3540092 3338041 3747085 3383928 3498150 3487802 3394909 3008783 3026209 3342370
6390 3342370 3164388 3757060 3485666 3366163 2944733 3147085 3613078 3705751 3680204 3789435
6380 3789435 3694451 3551315 3323174 3502401 3457416 3834017 4070723 4114260 4292973 4039796
6370 4039796 3777248 4056102 4393083 3945533 4114506 4278052 4420910 4516293 4904826 4784167
6360 4784167 4970877 5002814 4902875 4813460 4718629 4683578 4678747 5130799 5236789 5464777 5063132
6349 5063132 5031362 5166554 5398064 5605980 5803254 5738055 6173843 6453095 6416265 5870563
6339 5870563 5348698 5790433 5943306 6415119 6625538 6162014 6524518 7167885 6919473 6866261
6329 6866261 6753093 6875822 7041143 7304667 7558351 7563228 7779214 7778650 7674211 8220365
6319 8220365 8615989 8818333 8341721 8276127 8928257 9223336 9210322 9105484 9543527 10032199
6309 10032199 10142642 10633703 10428631 10388342 10558608 10457593 10951836 11354968 11941594 12283732
6299 12283732 12706843 13043370 13117634 13407241 13550457 13871263 13930255 14283929 14555296 15074946
6289 15074946 15497978 16182751 16707899 16893286 17269036 17506069 18067885 18820742 19029635
6280 19029635 19331670 19591242 19965444 20562814 21386787 21871118 22246881 22476862 22586513
6271 22586513 23058950 23812342 24183916 25116831 25637829 25869222 26378736 26473770 27124431 28192529
6261 28192529 28362798 28939917 29729677 29763628 30092997 30485785 31008943 31671481 31937623 32895958
6251 32895958 33232331 33027157 33404549 33581695 34467307 34605453 34753396 34709943 34890434 34968660
6241 34968660 35256698 35355113 35367339 34976854 35316323 35399234 34817681 34565027 34890247 34991053
6231 34991053 34752270 34361074 34340450 34186128 34290755 34153268 33877332 33753636 33379793 33137823
6221 33137823 33476665 33440723 33583413 33774322 34281353 34127772 34150238 34749011 34946794 34897995
6211 34897995 35353634 35707764 36007820 36422612 36496442 36852623 37024760 37777747 38165178 38519334
6201 38519334 38576010 38993837 39476800 39901890 40392315 40412202 41128529 41422357 41606894 41864802
6191 41864802 42368712 42552179 42656236 43084732 42891392 43296053 43668213 43816050 43397651
6182 43397651 43471056 43644543 43661466 43023495 42592327 41962805 41281514 40750673 40307538 39612984
6172 39612984 38950587 38263738 37753590 37181295 36268652 35374603 34699702 33433870 32391831
6163 32391831 31491007 30453100 29696012 28865866 28199466 27161360 26386615 25416800 24696230
6154 24696230 24405669 23854766 22491377 21521079 21516474 20892681 20230919 19867409 19387869 19141979
6144 19141979 18992336 18423019 18453245 18164950 17745357 17609715 17214005 16704635 15967100 16077972
6134 16077972 16060144 15805276 15946509 16013474 15906775 15499439 15240284 15131186 15320594 15185567
6124 15185567 14887109 14482107 14456446 15089717 15617629 15271354 14920102 15109795 15320242 15609111
6114 15609111 15165470 14945093 15402391 14779381 14980643 15061962 14995675 15210154 15539676 15546937
6104 15546937 15477790 15679841 15917273 15945861 15799003 16271186 16283789 16211768 16242093 16903479
6094 16903479 16925259 16977954 17116536 17611548 17783461 18151275 18854526 18892434 19329374 19572054
6084 19572054 19373923 19504379 19793417 20303149 20445119 20513653 20878225 21223779 21266885 21690232
6074 21690232 22118389 22276152 22502688 22824390 22840610 23281253 23523442 23343307 23920521 24522238
6064 24522238 24600169 24378148 24291731 24503157 24508595 24907732 25429625 25591418 25928599 26372721
6054 26372721 26527043 26986995 27276407 27255778 27609823 27785206 28049370 28864601 28742435 28661591
6044 28661591 28905868 29060157 29198716 29198792 29346011 29799411 29932994 30477375 30733574 30666466
6034 30666466 31065698 31512378 32166006 32882749 32915657 33419538 33908715 33890377 34235766 35069128
6024 35069128 35791085 36296079 37048918 37727911 38543750 39166392 40061285 40664514 41644996
6015 41644996 42376176 42926804 43320340 43912563 44674907 45068157 46011319 47017588 47461656
6006 47461656 47876159 48815080 49673901 50257433 50789200 51371590 52208201 52724657 53711202
5997 53711202 54161282 54427285 54827297 55849336 56281726 57225424 58145918 57983521 58231767
5988 58231767 58739919 59474918 59551537 59674678 60046748 60366662 60849305 60379219 60350419 60735241
5978 60735241 61111220 60842606 60715745 61054323 60871043 60615795 60582077 60442653 60310757 59958677
5968 59958677 59924502 60254287 60082872 60324244 60232071 60055425 60194011 60360294 60594861 60695133
5958 60695133 60510287 60444851 60342074 60524140 61177218 61267848 61601809 61259869 61203580 61182689
5948 61182689 61087810 61280910 60910672 60839716 60336046 60009655 59966863 59969996 59375908 59442152
5938 59442152 59560996 59311480 59849076 60008625 59703480 59702592 59370071 59343979 59372102 59729612
5928 59729612 59699946 59606812 59774427 59747356 60090418 60399363 60279714 59939811 60116957 60460935
5918 60460935 60491243 60189974 59832556 60006437 59706077 59421679 59558684 59041919 58746650 58488970
5908 58488970 58487071 58025478 58138055 57823431 57418634 57444445 57354949 57068607 56675527 56468673
5898 56468673 56335380 56273526 55657133 55307619 55653427 55938517 55647772 55683333 55788369 55804114
5888 55804114 55350538 55344054 55659951 55383014 55540980 55055482 54793040 54825791 54258781 54336404
5878 54336404 54100783 53249402 52894242 52781161 52507836 51820045 50921598 50343627 49640929
5869 49640929 49294255 48254940 47746291 46729824 45824681 45219445 44556519 43518696 42377718
5860 42377718 41226736 40335544 38983916 38196546 37261203 36397247 35961927 35151609 34385356
5851 34385356 33605388 33044685 32190205 30954267 30595176 29806129 29072417 28532710 27793170
5842 27793170 27800119 27376074 26814623 26439411 26361797 26018042 25538133 25125766 24652383 24027062
5832 24027062 24147637 23882240 24020101 24178705 23623129 23419318 23582601 23577289 23434302 22974041
5822 22974041 22791050 22652120 22644492 22636012 22391748 22349944 22596225 22479825 22669536 22661086 22346124
5811 22346124 21769252 21445797 21647831 21651326 21626789 21897335 21581089 21312144 20687655 20148133
5801 20148133 19902121 19589152 19093825 19234996 18608713 18427552 18210628 17867808 17417002
5792 17417002 16688639 16882467 16929618 16650293 16411157 16511870 16435370 16472333 16127398 15529562
5782 15529562 15000020 15084828 15160464 15139265 14754236 14447287 14684892 14272333 14343486 14476252
5772 14476252 14044450 13759597 13405795 13334637 13093964 12925674 12377834 12326757 12168237 12037570
5762 12037570 12027810 11528757 11361740 11236281 10896212 10887654 10824324 10361392 10290951 10606361
5752 10606361 10469466 9917406 10068989 9899117 9963889 9712957 9400591 9287189 9200647 9373224
5742 9373224 9157022 8756540 8905545 9368900 8589107 8669780 8420847 8255478 8238483 8270332
5732 8270332 8230758 7977265 8037803 7913714 8240979 7976739 7826405 7997031 8135114 8196513
5722 8196513 8191797 8112974 7764226 7877195 8064392 7959928 7994715 7870192 7857521 7706556
5712 7706556 7415909 8126820 8210725 8003757 7945166 7795901 7399135 7654654 7733945 7520337
5702 7520337 7665448 7527996 7574862 7605679 7814214 7836465 7387132 7252670 7306692 7219368
5692 7219368 7427616 7816246 7708890 7181020 7221329 7163592 6949517 7177232 7596369 7634058
5682 7634058 7296263 7154314 7275796 6810520 7117992 7191849 7342619 7418050 7273271 7474445
5672 7474445 6975947 7061672 7246942 7734724 7825548 7340360 7412638 7170304 7167349 7065726
5662 7065726 7437723 7569071 7218706 7140097 7072860 7037021 7065158 7289690 7109341 6811545
5652 6811545 6682170 7294751 7233386 7170129 6790459 6888242 7174923 7146219 7257966 7196763
5642 7196763 7667201 7902720 7731066 8200620 8099633 7855128 7566943 7737289 7777702 7737274
5632 7737274 7607912 7330044 7935311 7775234 7995441 8216947 7929567 8116686 8506272 8471658
5622 8471658 8254773 8383013 8320117 7941678 8094583 8320646 8240766 7949225 8292524 8504012
5612 8504012 8503913 8698626 8608707 8652304 8505929 8751582 9309757 9299244 9284102 9109739 8996714
5601 8996714 9329290 9582743 9189091 9338264 9483346 9854972 10225237 9700339 9703886 10080743
5591 10080743 10071927 10118951 10125940 10303578 10183134 10232739 10555622 10523668 10639824 10776010 10643892
5580 10643892 10409651 10569284 10798782 11248855 11005495 10900848 11091292 11196332 11487574
5571 11487574 11745065 11829530 11950082 11786649 11787737 11775914 12069622 12328276 12551199 12539688
5561 12539688 12307758 12619541 12641817 12475893 12549464 12869897 12576913 12597594 13034103 13544849
5551 13544849 13705832 14063339 13909728 13782833 13836294 14527195 14586362 14823489 14799833 14707074
5541 14707074 14828039 15169828 15635421 16173210 16295140 16323821 16861353 16978624 17142178 17168429
5531 17168429 17462639 17429825 17108030 17375184 17948837 18220014 18749614 19116785 19157586 19612725
5521 19612725 19946054 20117196 20387698 20515613 21131168 21677570 21822011 21826912 22319625 22643095
5511 22643095 22871667 22969247 23613514 24273470 24339894 24277361 24726822 25411879 26061717 26205651
5501 26205651 26477102 26646273 26835990 27094750 27138039 27274731 28067873 28586250 28720246 29333947
5491 29333947 29551759 30347780 30466758 30587015 30736377 31381171 31771615 31750077 31672962 31452672
5481 31452672 32328423 32991979 33725333 34017443 34437302 34682868 35022865 35487052 35827330
5472 35827330 36556388 36859650 36994846 37630292 38389242 38425943 38463076 39353551 39563381 40166350
5462 40166350 40559541 40927483 41174492 41395883 41981961 42410176 42523133 42729721 43218520
5453 43218520 43300309 43963810 44305765 44322232 44591709 44989362 44967770 45130976 45565636 46002552
5443 46002552 46037384 45680661 45547215 45973314 46194505 46495771 46687544 46245724 46286993 46422856
5433 46422856 46438350 46119933 45996198 45623071 45553769 45751561 46096236 46020671 45512804 45259788
5423 45259788 45288749 45262896 45556610 45390402 44846917 45337891 45000693 44773637 44675341 44456443
5413 44456443 44846643 44422458 44571049 44956489 44748430 45238244 45492694 45182264 45045312
5404 45045312 44903191 45028856 45315762 45510251 45586338 45387580 45253587 45422161 45544562 45377122
5394 45377122 45346484 45125797 45194416 45493029 45641755 45875457 46146577 46030113 45604957 45572160
5384 45572160 45478732 45560160 45123954 44664006 44709734 44277785 44670714 44952147 44883227 44233732
5374 44233732 43767633 43477906 43406184 42817259 42790588 42961708 42810539 42219530 42221909 42143161
5364 42143161 42325634 42217210 41412605 41037361 41162172 41338136 41243770 41144504 40872237 41510450
5354 41510450 41322469 40734168 41137670 41374122 41472769 41098995 40991128 41294039 41196445 41245613
5344 41245613 41581492 41977839 42062563 42201556 42290108 42528976 42631408 43328977 43950251 44434321
5334 44434321 44911725 45583692 45878584 45720457 46300431 46803462 47063019 47840302 48655206
5325 48655206 48680896 48990335 50094801 50642727 51289769 51532474 52072756 52582217 52841316
5316 52841316 53602501 54492715 55223171 55845129 56344786 57292751 58042760 58844322 59736084
5307 59736084 60669021 61793481 62142920 62784030 63997980 64724914 65948947 67315192 68054626
5298 68054626 69080728 70044099 71510496 72262282 73187508 74870720 75425861 76569895 78366375
5289 78366375 79624167 80890074 81826774 83152123 84349547 85759668 87109641 88400140
5281 88400140 89753474 91426184 92818120 94380658 96245528 97963394 99336221 101301295
5273 101301295 103434928 104806990 106783981 108941011 110818486 112900201 114886084 117043340
5265 117043340 119283906 121260942 123821189 126557841 129019132 131400200 133911177 136237990
5257 136237990 139135384 142203313 145649908 148995109 152698789 155951569 159098352 162935149
5249 162935149 166468685 170114976 174823428 179201985 183296993 187982113 193028700 198449357
5241 198449357 203888447 209368011 215153712 221125217 226691228 233062030 240056977 246951204
5233 246951204 254549103 262144978 269852120 278194063 286587299 295722121 304627056 313949828
5225 313949828 323917990 333794862 344205520 354169599 364636903 375131227 385762765
5218 385762765 396272336 406302860 415728089 425187883 433252427 440000896 446219395 450801352
5210 450801352 453507512 455219057 454694486 452481927 448466839 442813450 435974173 427185747
5202 427185747 417436797 406626845 395435159 383757323 372063105 360214672 348724607
5195 348724607 336629243 324688323 312757277 301593490 291236500 280757151 270592659
5188 270592659 261090030 252369286 243660067 235241871 227637333 220230397 212601432 205427670
5180 205427670 198964252 192819728 186902771 181589087 176217878 170934715 166276521 161586410
5172 161586410 156937927 152815043 148610461 144956971 141505592 138142451 134867838 131709082
5164 131709082 128617371 125195506 121857978 119323868 116381416 113386756 111288127 109232776
5156 109232776 106824990 104323183 102226724 99917334 98154185 96469623 94228519 92243040
5148 92243040 90572156 88926459 87487912 85681568 83993561 82408432 81169074 79158364
5140 79158364 78125831 76484055 75085459 74041203 73358069 72399702 71470793 70312081 68782411
5131 68782411 67633634 66985770 66159891 65349983 64513611 63651010 63108626 62551211 61693423
5122 61693423 60842570 60103691 59633025 59289042 58727452 58347778 57876524 57932320 57758089 57128449
5112 57128449 56738886 56578523 56005054 56210372 55973164 55696249 55195612 55409433 55347143 54958041
5102 54958041 55078757 55366773 55373048 55195417 55355914 55329486 54986176 54808616 54932606 54816919
5092 54816919 54759600 54689333 54432271 54910439 54926947 54757166 54698520 54784447 54725415 54831368
5082 54831368 55289793 55432998 55469725 55791250 55720353 55683578 55682652 56032503 55970682 56621853 57049033
5071 57049033 57190956 57085834 56923612 57582494 58110005 58511098 58744140 58761070 59094721 59320438
5061 59320438 59830901 60385691 60509949 61023789 61601517 62257480 62338539 62566378 63298637 63894033
5051 63894033 64423673 64745556 64983866 65838638 66217923 66604199 67015179 67567671 68248372
5042 68248372 68954600 69680691 69994695 70171654 70701017 70974553 71592830 72239762 72751338
5033 72751338 73028320 73767256 73886787 74268398 74668334 74867599 75837389 76122095 76288581
5024 76288581 76309316 75988467 76115495 76567022 76928406 76878102 76780815 76703628 76291442 76448127
5014 76448127 76478235 76564280 76562077 76207714 75875545 75817150 75796009 75853294 75624503 75357644 75108338
5003 75108338 74839211 74703335 74849436 74514505 74317269 74438133 74431894 74435567 74206494 74047632
4993 74047632 74363896 74028874 73881883 73956693 73190543 72895875 72502751 72355597 72067388 71318340
4983 71318340 71235421 71220555 70855134 70624167 70068033 69151679 69227822 68651373 67983906 67061037
4973 67061037 66551748 66839530 66005251 65162219 64052255 63771116 63304034 63147500 62835735
4964 62835735 62706603 62753714 62276732 62330758 62158938 61428280 60229542 58944145 58210706
4955 58210706 57721408 57543482 56510554 55670628 55141110 54870088 54271184 53846914 53599144
4946 53599144 53492416 53039537 52395359 51744150 51377857 51408565 51036428 50433486 49837115 49875057
4936 49875057 49281662 49078181 48762376 48440605 48117088 48507648 48288214 47767571 47858063 47487709
4926 47487709 46940243 46760500 46467926 45974675 45898534 45982874 46338082 46092122 45447976 45091950
4916 45091950 45055339 45135427 45110251 44610036 44330131 44334369 44323899 44098645 43814813 43556391
4906 43556391 43553363 43551014 43184746 43071568 43093577 43011803 42968539 43188128 43738988 43880701 44172824
4895 44172824 44516910 44063323 44197792 44639480 44817328 45025754 45508168 45523896 46091383 46289453
4885 46289453 46811392 47691550 47756134 48173373 48835713 48908847 49162369 49775632 50542441 50838461
4875 50838461 51152016 51993610 52785066 53066160 53566914 53482890 54003350 54739573 54813509 55078446
4865 55078446 54968073 54832126 55038824 55176687 55483236 55457798 55355829 56065271 55722219 55058495
4855 55058495 54605174 54899980 55120566 55071278 54516136 54323196 54076471 54050802 54274930 53906654
4845 53906654 53788272 53518501 52829094 52829533 52863730 52717081 52623937 52360680 52028922 52290788
4835 52290788 52352321 52546305 52786321 52969317 53018610 52909121 52978367 53141220 53630081 53379253
4825 53379253 53776909 54354174 55007650 55582413 55978212 56666412 57206644 58029223 58448218
4816 58448218 59384841 60033804 61035672 62213202 62915930 63989149 64877692 65389231 66674182
4807 66674182 67841451 69116844 70686396 71544535 73197674 74317558 76075253 77851046
4799 77851046 79298872 80870777 82662786 84694655 86239893 88068176 90145143 92645810
4791 92645810 94512074 96096572 98772463 101187649 103794762 106121979 109005825 111857405
4783 111857405 114810901 118077050 121149094 124663135 127992840 132214383 136215799 139858722
4775 139858722 144133347 148040499 151917841 156522039 161279052 165951517 171068171 176019612
4767 176019612 181061859 186254623 191089022 196147189 201661322 206850824 211784353 217014479
4759 217014479 221534189 225429017 229360630 232496714 234590804 236244180 236947557 236692925
4751 236692925 235969452 234866892 233680614 231682620 229896873 228083360 226239085 224192344
4743 224192344 221926726 219818629 217269907 214397810 211358580 208245178 204619887 200609198
4735 200609198 195527014 190465382 185087870 178468136 172034914 165486621 158874451 152197435
4727 152197435 145376764 139096002 133305848 127610482 122086078 117415186 112621841 108162922
4719 108162922 103764115 99935963 96511307 92740582 89262403 86232553 83491984 81178972
4711 81178972 78283976 75679106 73616356 71401200 69583867 67682555 65893889 63990656
4703 63990656 61799307 59955892 58427188 57091227 55513523 54011542 52935514 51851841
4695 51851841 50783736 49201503 48157386 47162490 46488970 45419483 44301808 43150680
4687 43150680 41945269 41285634 41025060 40242114 39273286 38331893 37337434 36964071 36174080
4678 36174080 35191825 34567764 33972579 32862528 32438207 31648122 31092272 30585496 29964960
4669 29964960 29484957 28785720 28219859 28263086 27412207 27018194 26551718 25989891 25342821 24745527
4659 24745527 24294668 23496196 22752718 22686096 22885080 22448708 21911201 21406458 20898491 20672262
4649 20672262 20842317 20264636 20006306 19703421 19302817 19676366 19108570 18363827 18218240
4640 18218240 17812623 17677508 17281625 16772946 16505565 16070283 15515147 15439724 15251225 15499875
4630 15499875 15544854 15306518 14964846 14508472 14437804 14277275 13704099 13390925 13350329 13294556
4620 13294556 13392742 13148567 12894595 12543302 12055842 12285325 11992525 11930837 11885314 11697953
4610 11697953 11706630 11476236 11156930 10942259 11129537 11001986 11062614 11192332 10675342 11049193
4600 11049193 11140450 11103815 10962458 10954314 10812225 10648982 10697830 10788688 10747082 10492730 10828450
4589 10828450 10911386 10178116 10128135 10143446 9814128 9619094 9549567 9767664 9994831 9938957
4579 9938957 10044432 10252416 10105881 10058475 9823065 9730965 9508744 9668424 9518015 9192171
4569 9192171 8897090 9248630 9434215 9117869 9371682 9628036 9634595 9039499 8738436 8456227
4559 8456227 8448367 8454656 8521070 8757468 8588281 8425512 8416100 8234638 8226857 8125006 8080260
4548 8080260 7887827 7887285 7914958 7843584 7988586 7922157 8042777 7755956 7649199 7635044 7703826
4537 7703826 7396146 7438670 7579117 7800097 7807244 7447876 7844899 8166007 8128717 8029398
4527 8029398 8083932 7793097 7371832 7482006 7368423 7418088 6918085 6816657 7123605 7001669
4517 7001669 7091894 7514712 7219167 6970034 6722254 7195814 7357772 7017567 7306632 7448266
4507 7448266 6966910 7235493 7449936 6861941 6674061 7064089 7621424 7589990 7271130 7373922
4497 7373922 7464014 7991788 7755383 7771627 7627197 7501027 7366319 7700247 7923865 7752699
4487 7752699 7579391 7561125 8021501 7708484 7961986 7940402 7594425 7628748 8191015 8325605
4477 8325605 8270988 8257010 8329804 8445408 8585636 8370077 8198745 7920434 8558338 8523937
4467 8523937 8329602 8557113 8985308 9236423 9131691 9069909 9265928 9263356 9276711 9203064
4457 9203064 9502801 9660255 9801954 9710786 9911285 10398223 10515921 10776050 10901191 10681172
4447 10681172 10988378 10957404 11218505 10937009 11256161 11804415 11967218 12124979 12367010 12333035
4437 12333035 11949252 12617262 12728604 13105089 13167252 12983110 12632179 12985674 13455484 13456137
4427 13456137 13734605 14401421 14710457 14781195 15066530 15024415 15396728 15574237 15802712 16227791
4417 16227791 16488883 16673423 17102774 17888252 17830395 18349380 18519474 18731737 19009425 19438309
4407 19438309 19898553 20531514 21085074 21786281 22520944 22797292 23824846 25049203 26110626
4398 26110626 26783374 27223364 27916603 28716881 30288212 31460452 32700062 34330465 35464336
4389 35464336 37220726 39148825 41031399 43134929 45677205 48404475 51168594 54096760
4381 54096760 56995978 60192418 63242565 65750932 69026610 71980899 75161620 78766630
4373 78766630 81746909 84863377 87960902 90338319 92927998 94875559 96420982 97881224
4365 97881224 99387153 100358497 100870786 101083561 100424819 99341692 97296382 95705966 93519219
4356 93519219 91098495 88902780 85970842 82972181 80095645 76878774 73264662 70050125
4348 70050125 66532398 63202344 60644434 57374397 54003181 51104324 47958353 44872772
4340 44872772 41764309 38777095 36265763 34626223 32836641 30804017 29138394 27502349
4332 27502349 26230249 25396247 24785854 23640232 22699656 21627061 20998835 20155840 19578996
4323 19578996 18905168 18361221 17618995 17117427 16787642 16151061 15601012 15592582 15498981 14794075
4313 14794075 14171570 13994052 13585481 13226041 13155685 13212316 13071209 12660316 12242207 11783063
4303 11783063 11489963 11780012 11537024 11271344 10680383 10365726 10711785 10732891 10559911 10330790
4293 10330790 10456940 10060077 9842595 9718905 9888531 9634375 9465306 9181674 9088978 9050133
4283 9050133 9487189 9003176 9083799 8947789 8453311 8279892 8034857 8103042 8182321 8076157
4273 8076157 8107413 8199377 7911439 8423105 8701562 8463478 8387305 8219285 8643332 8070880
4263 8070880 7953998 7951419 7630124 7660612 7724918 7517843 7830767 7604078 7774193 7934248
4253 7934248 7473859 7714535 7718752 7615273 7893137 8249214 7910403 8273022 7660586 7945269
4243 7945269 8210933 7884306 7739211 7389992 7625250 7777198 7598931 7571761 7753481 7290820
4233 7290820 7282567 7292135 7453573 7711147 7405797 7308555 7437478 7559449 7795657 7739419 7605750
4222 7605750 7941730 7744054 7843020 7776274 8089635 8017913 7710428 7786735 7701189 7659980 7940486
4211 7940486 7880736 7479030 7646685 7725636 7845195 7889829 8057539 7911836 8001728 8055499
4201 8055499 7686676 7777006 8036083 7938373 8213829 8392551 8177027 8376193 8408579 7956456
4191 7956456 8330809 8414125 8351971 8122974 8268835 8900077 8853691 9021719 9248757 9219946
4181 9219946 9000595 9013570 8636219 8672961 9203491 9503717 9145536 9274388 9536893 9747364
4171 9747364 9509285 9327076 9898243 10156748 10185458 10053555 10362465 10411370 10199307 10292451
4161 10292451 10283166 10669096 10609909 10783462 10729788 10426087 10654061 10660765 11005068 11517658
4151 11517658 11733968 11603159 12054499 12028931 11617295 12071259 12197895 12514424 12710666 12876568
4141 12876568 13000389 13118525 13139868 13184228 13394277 14025348 14158290 14210976 14266051 14403554
4131 14403554 14846872 15107544 14985947 14902508 15511080 15600336 15410470 15510146 16003101 16240994
4121 16240994 16470933 17027507 17287438 17778534 17689354 17992633 18702772 19409725 19349609 19205124
4111 19205124 19468975 20022897 20032604 20128847 20595529 20580511 20961367 21242471 21627275 21869255
4101 21869255 22204909 22608433 22997525 23062425 23644610 24065518 24304008 24569875 25196277 25387292
4091 25387292 25729439 26273833 26913948 27358249 27809693 28643460 29065609 29358395 29793687
4082 29793687 30269381 30750412 31323049 31926837 32421452 32967247 33435855 34044481 35038723
4073 35038723 35856155 36029563 36987182 37384288 38127885 38620734 39036273 39597023 40326227
4064 40326227 41359797 42227926 43172580 43609947 44521115 45035372 45372644 46599811 47638278
4055 47638278 48492919 49576059 50584248 51632775 52691072 53674877 54333117 55956950 57641302
4046 57641302 59135639 60540973 62024898 63883796 65203303 66581333 68294329 70247419
4038 70247419 72310158 74304033 76172132 78402380 80560737 83355521 85736755 87997517
4030 87997517 90319526 92914368 95481257 98375130 101053284 104115577 107697187 110687489
4022 110687489 113767870 116602196 119499213 122247790 125610056 128968692 131843863 135128790
4014 135128790 138316885 141312480 143998398 146863578 150035286 152200095 154494662 156582261
4006 156582261 158760296 160489732 161995778 163002917 164534236 165860184 166637044 167756944
3998 167756944 169263345 169964885 170180005 170731614 171702110 172410254 172753561 173381076 174282185
3989 174282185 175187863 176885075 178978332 181584280 186243793 192182628 199679411 207030973
3981 207030973 212381809 212718780 205780153 194964870 182963851 170126932 157704359 146916311
3973 146916311 138177307 130947699 124517238 118782040 113849115 109540041 105867268 101982592
3965 101982592 98512627 95379949 92161197 89396113 86604323 84185486 82225250 79595152
3957 79595152 77055637 75233761 73732672 72173720 70329246 69111323 67643843 66413831
3949 66413831 65303489 64294217 63406956 62392702 61019158 60275438 59454952 59025947 57923973
3940 57923973 57254693 56751895 55854977 55040587 54792268 54278781 53593719 53078485 53016282 52944014
3930 52944014 52545128 52638233 52498906 52685008 52405063 52332048 52534640 52440111 52270568 52660364
3920 52660364 52927971 53044583 53401628 53624211 53589019 54295827 54394189 54885522 54988977 55511623
3910 55511623 56089012 56694008 57115059 58177570 58680842 58793992 59541259 59995303 60698156
3901 60698156 61535436 62351859 63160445 63758376 64554313 65662137 65779541 66772979 67845899
3892 67845899 69161471 70243608 70820304 71669580 72369463 73228459 74252604 75308945 76475994
3883 76475994 77239853 78050248 79231323 80429719 81386844 82758912 83769126 85036324 86249707
3874 86249707 87030915 88724805 90033126 91621552 93106602 94459355 95690282 97318474
3866 97318474 99273706 101277683 103846867 105705489 107620308 110266050 112931740 115389628
3858 115389628 118103963 121198647 124120441 127900338 130803068 134170363 138581550 142628306
3850 142628306 146391197 150897124 155528775 160000343 164790857 170052886 175097579 180080081
3842 180080081 185254690 190461872 195703636 200951745 206208044 210982348 216421629 221080228
3834 221080228 225039120 229067680 232871465 236209397 239393540 241981891 244049424 245100674
3826 245100674 245913609 246424475 245767830 245054709 243835792 242173223 239715685 236794907 233836427
3817 233836427 230586156 226563094 222382422 217685033 212729457 207511693 202943453 197275238
3809 197275238 191613115 186498986 181018991 175570362 170610653 165075883 159404552 154557538
3801 154557538 149848093 144547734 139485209 134906079 130471542 126374119 121853040 118073891
3793 118073891 113979676 110444795 106679854 103532088 100784713 97974525 95232626 92672059
3785 92672059 90271080 87952154 86054719 84185270 82105057 80547417 78886798 77508421
3777 77508421 75494789 74156760 72897594 72026539 71005363 69871794 68795665 67645231
3769 67645231 66437222 66039343 65256979 64042472 63163834 62396637 61595453 61123392 60434040
3760 60434040 59515517 58195448 56666416 55511611 54580325 53782669 52943741 52334439 51330993
3751 51330993 50331505 49346457 48553996 47506579 46991871 46476824 46244177 45636529 45081088
3742 45081088 44670012 44093025 43366355 43071645 42955894 42868853 42420273 41839872 41114901 41105497
3732 41105497 40876017 40265186 39680990 39783569 39672318 39382518 38948124 38518693 37996391
3723 37996391 37390210 37261637 36461518 36123744 35652507 35081613 34728170 34368642 33785208
3714 33785208 33169822 32943467 33041925 32895555 32522729 32264961 32318310 32034541 32144548 31888749
3704 31888749 31487746 31967660 31749912 31403127 31187643 31151754 30810006 31074802 31305495 31353199
3694 31353199 31590290 31565127 31495553 31512077 31631808 31798874 31828681 32026826 32092623 32249173
3684 32249173 32661234 32587746 32612530 32270540 32957988 32945618 33146070 32827699 33016079 33188095
3674 33188095 33252828 33780537 33763309 34232899 34477862 34981243 35169891 35573449 35739215 36343573
3664 36343573 36540871 37049297 37332187 37660387 38778867 38965617 39319969 40148192 41004630
3655 41004630 41505345 41800551 42453257 43365056 44057108 45014901 46159233 46836802 47350345
3646 47350345 48581543 49435244 50368185 51789027 52480658 53298318 54438189 55597444 56747441
3637 56747441 57672188 58914388 60097644 60614907 61540998 62783165 64006947 64635354 65416714
3628 65416714 66020612 67261177 68572104 69732963 70401925 71100311 72022629 72508024 73208463
3619 73208463 74181354 74893295 75096267 75774850 76660657 77312762 78369028 79502461 80213664
3610 80213664 81313154 82292325 83036121 84257901 85678575 86565382 88015730 89550888 91580724
3601 91580724 93742436 95285185 97864373 100581153 102832498 105241081 107865121 110558116
3593 110558116 113709497 116591059 119989251 123402588 126883648 130376850 134163846 137955787
3585 137955787 141853133 145791897 149895282 153832153 157974460 162166724 166462713 170569539
3577 170569539 174425139 178652701 182187447 185749840 188996588 192607359 195971102 198967832
3569 198967832 202088825 204865854 207050677 209004056 210653700 212199576 213705956 214844871
3561 214844871 215628081 216792270 217295326 217567635 217560046 217242710 216684843 215833036 215094125
3552 215094125 213653710 212463823 210842932 208716600 206654429 204583200 202341204 199544254
3544 199544254 197065539 194177274 191182379 187840894 184438647 181055599 177492956 173948412
3536 173948412 170560818 166529788 162320946 158683432 154925490 150880031 146790212 142142336
3528 142142336 137821543 134069292 130617949 126893612 122970821 119521029 115723548 112226490
3520 112226490 108852314 105611051 102543502 99280985 96628224 94291093 91674589 89372433
3512 89372433 87066779 84582163 82749534 80661989 78818267 77485341 75980556 74564070
3504 74564070 73297900 72021979 71193133 70135602 68644230 67190562 66740703 65873097 65164898
3495 65164898 64523833 63729908 62568946 61828296 60885754 60317978 59336258 58250446 57804632
3486 57804632 56863799 55896215 54532174 53214397 52510992 51381700 50539222 49537246 48047887
3477 48047887 47398016 46166854 45132167 43920863 42796050 42098529 40771428 39638942
3469 39638942 38977932 38019100 37077902 35914942 34975915 34234875 33465239 32332574 31550432
3460 31550432 30290556 29537079 28817728 27997060 26920088 26678388 26232957 25490750 24740460
3451 24740460 23958717 23498784 23330245 22544896 21968417 22152699 22213707 21447783 20922401 20530758
3441 20530758 20211139 19733940 18934566 18537980 18137637 17991837 17958848 17602473 17309897 17337762
3431 17337762 17237223 16619584 16111455 15942583 15946829 15623411 15163072 14842949 14518750 14015715
3421 14015715 14017837 14279043 14394751 13917059 13886384 13692490 13417649 12723171 12135311 12021977
3411 12021977 11981461 11779359 11588507 11590553 11520073 11293329 10778874 11004310 11053733 10656144
3401 10656144 10296759 10504339 10475521 10078782 9886325 9991961 9656418 10079549 10071468 9662008
3391 9662008 9621096 8900012 8934503 9127548 9117193 9271825 9346986 9120032 8556301 8517236
3381 8517236 8589497 8814930 8485631 7953754 8237648 8434479 8266386 8224528 8189989 8334073
3371 8334073 7756261 8071790 7927466 7870820 7588421 7651150 7425273 6934721 7030258 7085196
3361 7085196 6971946 7074371 7149670 6993463 6840449 6697764 6282216 6490650 6539919 6514648
3351 6514648 6393627 6583179 6777324 6762998 6637000 6555846 6353893 5839547 6159011 6324528
3341 6324528 6322381 5965312 6082658 6005667 5842832 6069195 5778707 5793970 5666011 5706296
3331 5706296 5624389 5342468 5489804 6060130 6044330 5826293 6012521 5403553 5137991 5217603
3321 5217603 5702882 5486183 5718373 5509818 5707070 5770477 5555051 5438120 5551489 5556978
3311 5556978 5647536 5775033 5751652 5727054 5621573 5681730 5701383 5480806 5206916 5715310
3301 5715310 5726207 5597484 5529989 5451398 5448018 5581544 5971508 6054247 5783923 5775074 5677222
3290 5677222 5752258 5784988 5982272 5728370 5910335 6354563 6064482 5885797 6105952 6261640
3280 6261640 6090126 6309789 6244351 5905779 5936754 6146604 6021073 5848776 5839580 6068477
3270 6068477 6039889 6369028 6483779 6566036 6302366 6332945 6510330 6508877 6689311 6050741
3260 6050741 6260807 6361132 6643683 6678488 6844324 6862349 6224768 6168525 6281315 6221063
3250 6221063 6250563 6698994 6384005 6130148 6412343 6459806 6551270 6818077 6897800 6767308
3240 6767308 7078774 7376748 7483374 7142931 7247759 7700027 7542296 7467488 7387818 7428263
3230 7428263 8260229 8165182 8074500 8384026 8712740 8819548 8578582 8758159 9001760 9156154
3220 9156154 9486857 9863267 10080049 10755870 11043901 11771346 12087152 12323397 12993872 13643671
3210 13643671 13596782 13639815 13843629 13816763 13970388 13631232 12640212 12440330 11868489 11663959
3200 11663959 10767634 10303168 9639450 8769530 8464331 7972199 7817195 7446359 7272194
3191 7272194 7383578 6933245 6622421 6617770 7019418 7134159 6312265 5994549 5792262 5915275
3181 5915275 5641107 5641488 5782967 5107052 4702258 5192111 5327636 5338014 5314121 5007900
3171 5007900 5004452 5147047 5041527 5067612 5093565 5057265 5156765 4747579 4769980 4804384 4391690
3160 4391690 4662709 4407013 4316404 4348631 4439981 4481048 4690544 4856060 4903729 4769338
3150 4769338 4646669 4414852 4318416 4123421 4671547 4809914 4954146 4895775 4766968 5071254
3140 5071254 5017588 4948701 4974665 5334805 5313747 5115018 5270387 5385880 5707999 6296926
3130 6296926 6505364 6954916 7658224 7650490 7660567 8033109 8425640 8269047 8309654 8411415
3120 8411415 8054094 7236002 6649620 6118036 5562504 5359740 5308819 5021815 4893801 4497950
3110 4497950 3943532 3848639 3669870 4108066 3717735 3658895 3514337 3594790 3576540 3521751
3100 3521751 3864616 3617605 3643564 3603941 3238201 3010368 2927203 2992413 3030392 3162333
3090 3162333 3329454 2997908 2993907 2947089 3372437 3461408 3551141 3626726 3214151 2955702 3071526
3079 3071526 3372433 3338434 3517757 3537215 3540054 3499422 3340095 3080207 3055052 3120334 2824633
3068 2824633 2855066 3367191 2874766 2561121 2597352 2717572 2154490 2235721 2717517 2605918
3058 2605918 2540580 2491019 2462371 3096475 2897280 2740921 3053581 3172595 3068166 3505349
3048 3505349 3872189 4155629 4306356 4140204 3996473 4036333 3917459 3525741 3251861 3416479
3038 3416479 3247253 3072523 2977808 2685729 2909384 2727989 2874268 2478267 2335764 2552432
3028 2552432 2462503 2214988 2458962 2598415 2538716 2384377 2622072 2780139 2530006 2294353
3018 2294353 2638796 2989573 2724488 2429591 2789600 3235944 3152661 2695713 2422230 2210047
3008 2210047 2285190 2210151 2100353 2270872 2299014 1995692 1973970 2164912 2447170 2303573
2998 2303573 1760833 1814779 1661858 1547798 1519939 1300986 1225952 1267165 1636064 1818795
2988 1818795 1635872 1906250 1754525 1226127 1039928 948646 1079529 1246248 1377715 1801982
2978 1801982 1464563 1083252 1475279 1506648 1276970 694055 1061573 1539686 1344555 1522004
2968 1522004 1740168 1588036 1417669 1016256 874928 1294587 1567737 1452582 1399765 1358528
2958 1358528 1223845 894921 968911 1152394 715285 939190 733576 788983 1139739 936493
2948 936493 1106919 1155391 1270234 896279 900367 1137309 1354944 1336172 1111365 1149027 925905
2937 925905 636838 663997 619658 543936 868088 1165624 1549600 1350387 1530613 1702956
2927 1702956 1205749 1316084 1836511 1329672 1245251 1506525 1536550 1418693 1524678 1502895
2917 1502895 1217060 1617817 1737176 1305326 1723789 1895412 2123716 1761533 1857298 2052590
2907 2052590 1999565 2059977 1736363 2103445 2345439 2037225 1770424 1739343 1688257 1845497
2897 1845497 1625979 2018359 2541414 2386554 2076388 2308230 2450937 2195046 2217052 2031074
2887 2031074 2474567 2514887 2448068 2278786 1973743 2058227 2219828 2654052 2588464 2629485
2877 2629485 3125554 3118572 2911966 3400276 3503989 3062617 2840067 3355143 3595146 3201108
2867 3201108 3249937 3488977 2933565 2808824 3315515 3339873 3467340 3494286 3247738 3187660
2857 3187660 2888353 2896083 2781731 2550649 2342093 2012126 2281057 2285573 2123196 2189271
2847 2189271 2110958 1986424 2237614 2045821 2030385 2077920 1908377 2342663 2364314 2013910
2837 2013910 1928504 2103801 1833837 1701739 1544064 1935905 1840802 1951236 1724083 1631005
2827 1631005 1372009 1291843 1672457 1555550 1489745 1294867 1457625 1269004 1331918 1167591
2817 1167591 856313 707500 1022666 1160952 1415045 1384083 1037420 689702 716406 1181600
2807 1181600 1257080 1132573 1061381 1287704 1550900 1188190 1109899 969704 845402 1030545
2797 1030545 765940 846695 1145030 1052935 880605 924998 464991 418398 619476 747329
2787 747329 487664 376289 1179602 1240975 773538 632520 470061 424083 837809 836001
2777 836001 446325 607425 675433 551851 934711 986176 814592 636411 651669 431380
2767 431380 236635 460591 830486 1013582 190677 350510 497722 669698 1039126 1121862
2757 1121862 750472 579944 592327 417445 527875 1031211 1005785 1035142 804543 651348
2747 651348 429823 371412 545808 505384 484534 474835 561816 59657 -193567 223946 284148
2736 284148 78237 241391 313311 485672 441830 585416 578614 674685 698906 355077 160113
2725 160113 369341 818158 319524 98413 556029 609314 740409 409195 507428 589156
2715 589156 769864 562012 721370 614563 376141 588554 779589 318474 143967 180168
2705 180168 433544 252709 18610 134733 399463 297857 287460 349709 501407 438107
2695 438107 289072 236600 204161 262070 413355 751067 616108 -69027 -451699 14327
2685 14327 98530 -85181 3142 87919 231292 187373 293636 38071 633 438773 -2268
2674 -2268 -56326 602059 644677 487249 192181 177041 649951 975610 840437 483543 309202
2663 309202 -81578 -91287 116503 342146 190419 563586 279114 185039 147522 -167292
2653 -167292 -84484 166114 -177134 190802 362841 302551 538293 311640 520536 230235
2643 230235 200892 409672 561824 181090 148830 222392 17352 366562 207566 171579
2633 171579 206974 276678 123345 598836 694077 830093 628157 315887 249438 -174237
2623 -174237 -122946 98017 118979 289345 -27109 125175 284806 494126 357224 328207
2613 328207 544396 790182 830664 434139 -200398 -151655 -243801 -550874 -69508 176785
2603 176785 286187 -17206 69794 43964 122395 -89764 48276 294618 6239 95719
2593 95719 -18373 -119574 -201608 -157456 185990 41231 -84552 313936 143738 -174264
2583 -174264 -201909 -533071 -30636 54486 170610 53581 210702 -155351 -334834 -150205
2573 -150205 -26630 145774 135655 94503 231023 328340 45594 62724 -112098 -415213
2563 -415213 -13730 662467 374633 7019 299206 398298 498697 312226 328380 270642
2553 270642 214785 351156 193805 415428 314386 231362 96458 168571 103026 41778 -18508
2542 -18508 155615 375790 221147 574001 333933 -200219 42761 429209 208432 -593
2532 -593 314860 172432 -22483 -210595 -437178 -468138 362385 94784 90672 151703 32029
2521 32029 -328074 -824481 -874237 -213390 -57466 -44097 -39024 -232051 33944 130137 477518
2510 477518 544137 497718 147628 341680 -78242 -327819 -154489 236478 -51006 50837
2500 50837 -388969 -987370 -473142 -80151 -341547 -361615 -94346 -155392 -173829 196098
2490 196098 41756 30295 -409635 -369274 -252709 -221685 -132705 -349871 -35208 6614 113615
2479 113615 270729 -40088 178649 124429 -145943 75065 299063 83437 -181932 -66678
2469 -66678 -428400 -353370 103991 141226 200433 217231 222094 258948 244881 -52703 -70697
2458 -70697 25749 -157626 -46839 71847 111563 82294 -14094 -183104 -138120 -230413 -180129
2447 -180129 -360306 -35686 -79026 -243284 108585 241190 107869 -312111 -243982 -111684
2437 -111684 28244 -158840 -413793 -146238 -11540 -145323 20106 125225 84378 -161652
2427 -161652 148782 549472 -14818 -49381 191477 387861 194310 107593 142928 -41024
2417 -41024 32672 294102 224455 -203699 -209389 -73709 -43065 81346 -20100 357776 81160
2406 81160 205125 3332 -96279 -186905 -494767 -440557 -193049 59870 -65048 97350
2396 97350 231827 25915 128292 37726 -196115 -123978 -240626 -588642 -320645 179400
2386 179400 -126801 -222635 7081 -348929 90092 125111 -124523 -4417 288578 562638
2376 562638 405223 430879 -40168 -157187 -171207 -269898 182254 14469 -205786 -55019
2366 -55019 -240992 -125265 39761 23955 -19652 -177809 1650 209825 -57358 124932
2356 124932 353764 170757 -50571 12633 -144450 -66196 -25827 -100494 -93209 45100 165382
2345 165382 418987 163758 29282 30320 -156079 -174656 -468476 -367042 -292482 -272820 132916
2334 132916 105614 143694 18554 -802517 -241399 404212 418164 219443 40971 -179792
2324 -179792 -274503 342067 539264 577249 245447 -106271 -275707 -23094 101481 296923
2314 296923 235411 32754 263988 160099 -110084 -205049 -100729 47124 225717 -216913
2304 -216913 -649613 -420723 -290869 -728810 -330611 76295 -139674 -44690 -74493 -62778
2294 -62778 -228161 -752497 -1006315 -517443 -121980 -52920 -132333 -599249 -519654 -268084
2284 -268084 -189077 -17846 18826 191538 -19558 -33105 204095 517920 2792 -479333
2274 -479333 -496962 59073 127673 27777 153804 -28651 30032 13200 170668 33752 -154529
2263 -154529 -169506 82302 226810 19323 381224 358551 199732 216243 -219050 -261817
2253 -261817 226248 -95334 214759 -60506 -249674 -413428 -132376 -133198 -476055 -245648
2243 -245648 52499 191967 208201 132042 -210977 -265042 -97596 -313419 -359742 -324641 140945
2232 140945 157955 -3944 141745 -261390 -150178 -523590 -170034 -122809 -6172 -177227
2222 -177227 92284 354504 283245 361281 153320 -181259 33508 55781 275738 396789
2212 396789 649022 697442 258602 48223 323278 321647 480109 213349 428468 692388
2202 692388 488872 717451 548414 407604 -159936 -208056 74511 55177 -21843 -15837 144548
2191 144548 -175114 81967 395194 195104 -38219 234513 758278 1040589 797394 301545
2181 301545 -229281 -154432 364315 420342 208323 325486 5474 -249549 202485 485890
2171 485890 109505 -84129 170841 288862 29274 177214 812435 610998 631255 817145
2161 817145 1020926 984012 672136 679630 464165 413555 550716 325293 271491 252347 19682
2150 19682 -342320 -59694 316022 266523 270936 479140 588063 518819 661952 393659 441815
2139 441815 797747 942549 695400 580555 268133 803851 1087695 657758 832753 923489
2129 923489 1011423 1103797 1096838 1115428 1471978 1418693 1405647 1159374 1556478 1671698 1366630
2118 1366630 1429636 1997526 2563543 2564484 2255217 2073077 2299447 2244541 2371195 2634235
2108 2634235 2272842 2620844 3281516 3600405 3836824 4125433 4303734 4472002 5077217 5341928
2098 5341928 5626301 5870843 6451407 7343484 7886094 8703291 9977419 11984675 13595174
2089 13595174 15126475 16364950 17296958 17071215 15883386 13873363 11664248 10213382
2081 10213382 8939283 7758811 6441527 5597560 5352108 4984502 4699243 4438793 4324859
2072 4324859 3849991 3756900 3331563 3028836 2435184 2120535 2191659 2302554 1976142 2224616
2062 2224616 2088779 1690242 1984434 1962165 1599366 1387234 1569248 1232359 1657163 1456465
2052 1456465 1623855 1817416 1451854 1279344 1245737 1220854 958628 1255112 1162816 681817
2042 681817 898583 1058642 1251435 984555 804511 942958 627666 89865 270627 508032
2032 508032 647229 651040 803939 828859 805108 454490 463387 663368 311140 -7356 90190
2021 90190 -41449 -149236 293451 660527 355664 -70619 -409237 -262878 255032 403753
2011 403753 277611 429522 302037 97539 92798 225041 520450 705103 663137 778688
2001 778688 540443 271263 274342 -222558 117890 388188 273789 365515 161480 217652
1991 217652 -104815 113711 293077 230278 227351 153290 -116026 45938 252021 270196 185685
1980 185685 258202 512612 286664 394754 -53300 -263876 -33407 558766 236895 170283
1970 170283 516767 337093 -82668 -194677 287037 145454 166178 167433 222670 701960
1960 701960 348264 -322529 -165052 407698 280687 48079 -152762 -422893 -411047 174807
1950 174807 37081 -2800 184622 -34516 -143053 -39197 52947 -29631 163130 108842
1940 108842 -398819 -627220 -189902 81036 64637 -139110 -125134 216950 256962 -31941
1930 -31941 -124214 -216144 254346 272880 24466 113389 184367 230435 298862 59026 -175621
1919 -175621 -189187 -550149 -356338 58487 -68001 -161973 129142 -1516 -173404 -289830
1909 -289830 -122098 -66346 -111558 -456437 -352730 67836 -1353 -144153 -27186 -141031
1899 -141031 -145386 480970 497322 57593 286122 366621 -69657 -38934 -198136 -77984 21081
1888 21081 -163394 15289 69031 -203336 237659 513984 152489 329171 256586 202572
1878 202572 287832 413531 227178 19677 -167693 -259281 -106043 -470314 133390 310066
1868 310066 222795 -207751 -289337 155333 248852 -248585 -416824 -603374 -208001 112929
1858 112929 -326735 -337924 -151709 -42831 15067 -28189 -135067 -18790 -317986 -274121
1848 -274121 -45839 103252 -38205 -160905 190382 175247 120172 -71030 -285484 -330743
1838 -330743 138372 431466 361434 748374 264037 148073 -307611 -629192 -348646 -69989
1828 -69989 -145703 21557 329428 417685 94402 -154990 -79527 160734 -103027 -7744 334792
1817 334792 348875 226917 372063 67802 -11651 160816 -12526 -226124 -428372 -56488
1807 -56488 -245873 -98116 293799 14134 -162866 -458863 -413402 -449780 -121731 445877
1797 445877 -103667 118166 153776 -93559 -224695 -350501 -145878 294434 20653 -432573
1787 -432573 -188069 175117 359854 462136 280425 162387 -239563 -392753 -279339 -255220
1777 -255220 -231515 -335308 -144118 -247154 -468626 -141541 130880 -84785 114965 -103299
1767 -103299 -419199 -644549 -109801 -132494 -214263 -337055 -434268 -432218 -649433 -660943 -653695
1756 -653695 -594349 -760284 -60049 129849 2440 -133686 -254582 -170830 -593572 -249442
1746 -249442 -304611 12363 -51027 -4635 -96174 -183787 -297347 -726006 -670232 -411654 -445689
1735 -445689 -93448 470205 -338105 -463112 -157223 272527 175156 -316693 -412288 -271445
1725 -271445 -218455 -57190 28643 127173 2497 -254077 -932694 -822591 -449286 -121802
1715 -121802 -75633 129938 -74690 -52552 15602 116645 -218113 12936 -139804 -452855
1705 -452855 -573649 -364733 -60204 504607 604007 255198 -55570 -318381 -312261 -20725
1695 -20725 -27111 -290996 -102810 344848 153480 -239394 -278709 32646 241449 -37097
1685 -37097 -435866 -199669 71566 74682 453185 435842 -58675 -99932 -81602 -100121 -133623
1674 -133623 -54207 337498 433188 -12231 -441995 -162485 -380617 -234260 -111878 -164106
1664 -164106 -100395 -168934 -342716 139729 9435 -36036 -452035 -364507 -275861 30467 -290474
1653 -290474 -399415 -335549 -310740 105505 100512 -153592 -30423 121832 93180 -9026 -108236
1642 -108236 -404171 -117050 -434157 -329915 -164256 -180883 -278093 -297221 -160345 9128
1632 9128 160222 -125168 -499668 -404599 -347450 -488198 -325771 -58315 318391 281386 32229
1621 32229 -593906 -781945 -886736 -780487 -516119 -556980 -559163 -293806 -245262 8509 -11572
1610 -11572 -253702 -269550 -60812 -72777 53721 339461 397997 238335 240748 481211 508137
1599 508137 224081 -657226 -647457 143499 -142294 -397122 -146260 20798 324599 670011
1589 670011 445703 56303 163903 17364 -490130 -873046 -986807 -587301 -386417 46919
1579 46919 37945 -19580 -187127 178698 136661 -556845 -67457 -70505 -195176 -43044 184388
1568 184388 -201942 -282544 -247802 -131050 -88801 -541148 -272618 -367614 -55586 602973
1558 602973 234409 -321346 3712 79674 22406 -86912 -45971 49029 61332 -23885 4742
1547 4742 40335 126640 233722 -144736 34433 288891 277028 58076 -155974 -262219 -274292
1536 -274292 -461678 -241176 372940 370424 167474 366463 671170 526231 200131 265270
1526 265270 140363 64983 29646 -270214 -87418 -60866 -367209 -87397 227757 79979
1516 79979 -35809 181265 6842 -74052 -117981 -21965 -145437 -431407 -214059 -142621 -144037
1505 -144037 -100643 211809 -123656 28483 -108442 -206763 77761 -360299 -358012 -529879
1495 -529879 -888456 -581519 -482499 -167660 -29611 -58690 -509519 -345507 -412939 -287572
1485 -287572 7653 -40276 -292633 -220442 -434217 -323602 -177348 -179662 501205 -249577
1475 -249577 -189955 -61182 -36824 125334 184230 -95508 -333217 -346882 -499936 -511382 -657497
1464 -657497 -285581 -229881 -133409 173219 106037 248141 281146 -44528 -43987 -106897 155418
1453 155418 85696 -330032 -107077 -27211 -10008 -102150 -203017 -275629 -147854 -202768 -721428
1442 -721428 -378942 -149842 -349022 -294655 -23128 496081 389903 141943 313967 197924
1432 197924 -374956 -424443 -517814 -471140 -634366 -118295 123022 -31258 81394 -17857
1422 -17857 376468 644434 470376 86846 58637 198011 -276472 -360942 -233187 -115190
1412 -115190 -310900 -446243 -32708 78753 -40099 489152 672367 162386 226476 182464
1402 182464 361762 278731 -82998 -249651 -114893 -282354 -25075 -53625 -176412 -318046
1392 -318046 -479011 -137863 188850 396292 86270 -170456 -73898 433208 220842 -3620
1382 -3620 -141307 20329 18765 -138071 -155510 17737 -122682 -107227 126245 24579 -293984
1371 -293984 -138076 57406 149234 -53832 -52876 168035 189684 46501 403700 279907 281787
1360 281787 16741 -126573 -70151 -201826 -207261 114059 -58337 -388679 361678 177466
1350 177466 149410 283726 364305 591441 358898 172164 -353290 -672615 -143027 207450
1340 207450 335213 128246 -369419 -345295 -335445 -183212 625385 312959 54821 220054
1330 220054 220556 -151054 -153312 -73031 250821 375455 105259 42374 214015 583564 299582
1319 299582 126879 124885 -168247 156613 164674 -189964 -138918 25678 117584 -381412 -316504
1308 -316504 -603944 -470666 -296453 -525879 -431304 -437656 -48495 -273934 -189191 -132584 -163824
1297 -163824 -63241 -32372 129595 148699 -27863 478171 337167 245266 -97166 -370256
1287 -370256 -586976 -25267 376893 100834 276560 243503 73328 182965 -131009 -313382
1277 -313382 -252913 181909 -6004 113673 293074 24197 -438848 -347387 -375942 -614542
1267 -614542 -485909 -592657 -93133 557950 635984 6489 -22593 -125725 -143933 121105
1257 121105 148517 232759 37019 -159864 -374968 -140635 148707 -265768 49338 -37319
1247 -37319 -157240 -341256 -316395 -250071 -721126 -399024 38652 82236 339429 -93394
1237 -93394 -219770 -23084 115242 -845 -40815 -35396 -488499 -287510 299521 -67893
1227 -67893 -26279 41280 -140000 -214115 196236 289759 -49850 -138548 174250 500932 384822
1216 384822 152718 -203221 100166 84468 202167 132509 -123799 -67772 -156912 -125227 -45589
1205 -45589 -480863 -246777 -378818 -568665 -73222 -208668 60254 149176 141529 -366948
1195 -366948 -161651 86586 390219 600173 374355 269303 269805 208367 47583 -96265
1185 -96265 -284609 -626490 -397997 -105879 78652 42223 -306015 -110232 75254 305284
1175 305284 431890 240721 79507 -39016 48002 96425 -118177 125835 150319 -387631
1165 -387631 -222687 -72421 45982 181953 57804 -155778 -210899 -376275 -127482 301883
1155 301883 516678 351787 -119974 -325604 -455602 -49347 536893 111779 -59655 -238544
1145 -238544 -245081 -291368 -5168 225841 150917 241995 8093 -300003 -273056 -265203 -253658
1134 -253658 492 -419378 -419574 75826 247518 394117 163784 112355 108613 476419 334346
1123 334346 28493 156469 -226969 -124470 -192723 -14129 209886 378604 476497 428609
1113 428609 -19957 -156339 -444689 -679414 -906811 -265417 -87574 -390398 -429285 -141556
1103 -141556 -43678 296209 -80233 111948 180343 -9863 -85543 14971 247086 -123219
1093 -123219 -734578 -4691 98951 300355 -99192 -400676 -117840 -33696 324325 201585
1083 201585 -376709 -209499 392579 -56808 -462238 -772687 -395822 -116129 -64270 128587
1073 128587 59101 33004 20203 206110 481436 355369 272943 32764 415970 301334
1063 301334 144430 -333050 -74022 -250625 -390936 47857 262282 7730 -90065 -189100
1053 -189100 -174945 -6142 -262750 -211407 -305367 -456420 -48038 394815 167210 -87314
1043 -87314 -268070 -355426 -515113 -464213 -1312 132841 151763 -108353 -331086 84479
1033 84479 400249 257433 -61200 -115518 -38094 212018 203027 419038 -210470 -424159 374916
1022 374916 237071 152756 221392 390287 380869 -10530 -153582 246387 202745 36298 -94083
1011 -94083 199523 188133 -175070 -109182 -29611 -290093 -90538 -272499 -573708 -150267
1001 -150267 -359822 -394810 -297528 -204042 -341695 -147634 -215386 -311984 -123778 -460971 62442
990 62442 191402 194049 -43690 -37173 424686 363419 -257755 -153070 104612 -395260 -468024
979 -468024 135699 -421958 -551473 -325881 -235562 -100609 -178999 129961 181338 125834 172203
968 172203 -311383 -723002 -537892 -456337 -99395 405954 198126 -149918 -53027 86025
958 86025 246496 278092 43966 -355283 -452251 -466117 -259517 -141143 -252928 194757 310349
947 310349 18441 -248595 -31080 -124253 -586618 -418435 122777 64838 279095 558898
937 558898 139819 -298394 -211631 422951 279758 110789 -57669 -185865 -370417 -184780
927 -184780 -277156 245407 320692 1905 -361428 -120087 -271072 -541530 -380415 -865730
917 -865730 -469872 -103615 -382658 -139899 307687 324739 23243 305260 373708 311952
907 311952 275238 384848 345596 431143 177018 -282550 82406 490174 447454 -29172 -272911
896 -272911 -413891 -178377 21625 -259877 128933 128298 83579 -118881 243998 526759 48002
885 48002 -233423 123614 40491 -210449 -431238 -483974 -78557 -369845 -133790 -326704
875 -326704 -384875 113455 446972 -228459 -233147 131135 -139472 -286190 -21479 -19966 -212057
864 -212057 -350239 -68097 358276 296011 -133884 -55056 183999 -4167 43047 390216
854 390216 246606 -335541 -208977 -113366 -166137 -272333 -140679 -53253 291910 663262
844 663262 787695 448394 363792 463151 366163 95093 -435904 168962 337830 -64839
834 -64839 -125639 -68482 413666 300202 -32399 -192626 -331328 157714 -133808 -172003 315929
823 315929 525994 321736 370305 197074 79088 -286439 -349487 -138041 -86067 -2071 -239897
812 -239897 -312231 -236137 -101255 290600 474930 236396 32868 171789 191842 220017 479158
801 479158 312151 79236 171977 362110 561742 615785 335801 23524 38910 -33363 -20188
790 -20188 21524 -38598 -259671 -7439 34918 -142895 303900 149473 -518053 -344267 -318783
779 -318783 -265603 -299273 -595399 -573127 -673251 -200140 157639 -260097 -632676 -613062 -581966
768 -581966 -651102 -587258 -484123 -76250 16743 129167 430371 -200202 -325111 -566732
758 -566732 -190525 88949 -269597 -81098 358246 348713 77226 490768 326491 225579
748 225579 570799 76710 96198 -53255 8465 -118537 -340960 -310892 82365 380943
738 380943 130795 333212 256926 79157 222314 -178061 17760 6085 247193 -10369
728 -10369 -105836 -35632 68046 353168 591221 484896 332071 261325 352691 317971 230465
717 230465 162814 -290187 -476392 -365821 -4992 146081 119076 -260783 -101275 -62090
707 -62090 -48245 -485604 -514214 -140365 -372571 -313212 232156 230625 184505 61909 49460
696 49460 -168374 -93379 -327796 -588147 -472182 -265990 -467904 10402 273666 96257
686 96257 4303 -430442 4439 195815 -52594 324703 584329 206997 -170475 -101987
676 -101987 26468 165717 40572 302853 498002 248451 265907 156758 433929 411141
666 411141 82709 -277235 31611 417275 370234 273191 96686 -91752 -84113 91030 208154
655 208154 61247 124549 -283113 -509594 -159745 58623 500429 152284 34286 -151855
645 -151855 196941 -43449 -286621 -268868 -62032 367767 126939 121557 429951 494812 356697
634 356697 464190 314597 121146 -127967 136792 313887 427571 368313 5723 -123103
624 -123103 -62007 141505 96271 235688 -224741 79367 393425 53972 -55592 215391
614 215391 171146 -326099 -418384 -480515 -109192 -106111 -377501 -347940 171039 344901 122008
603 122008 -17178 298405 289605 -88948 -30518 69823 78439 -236157 -526154 102884 230593
592 230593 -35845 51754 472130 649699 704069 362174 145057 332093 295483 446555
582 446555 407701 479727 264353 617937 384833 202966 197109 193544 92201 -389511 -25585
571 -25585 265305 438289 592771 271445 212915 539898 307597 66169 -375484 -56498
561 -56498 -113361 108435 91599 -196709 -197736 366985 -142812 -165116 -333952 141088 92800
550 92800 -267163 154267 167961 -456221 -635869 -420367 -470836 -296176 -435226 -251049
540 -251049 -276781 -101349 -238723 332524 666579 -116457 -509249 -3989 62046 229281
530 229281 468984 502793 195661 23536 80997 -10772 147534 297727 31553 -10924 -129802
519 -129802 45179 -61113 85041 -318702 -304587 -37363 33113 99744 120735 124822 312977
508 312977 -176421 -209919 55808 -251508 -99359 -28069 -455789 -356887 -182961 -78720
498 -78720 -224988 -35252 199964 354874 -150980 -312803 209879 -24561 64539 180352
488 180352 206916 143122 343144 233715 -61537 -155810 125613 179102 -82943 161270 -98999
477 -98999 -158355 287763 762819 628737 23342 -122598 -674687 -722275 -519474 -5035
467 -5035 119104 136312 413141 513753 145283 79251 -97908 107018 -174774 87684 -122135
456 -122135 -257164 -233656 -449055 -366783 -346941 107878 -279286 -250643 -213921 405894 137665
445 137665 -296201 330634 273325 219188 -156833 -199979 447773 6881 -28001 -78420 -23522
434 -23522 276733 23551 -111057 -111242 -214848 419970 339761 348699 515555 145520 160422
423 160422 -93684 -420049 -360962 367801 357893 481634 415991 -241341 -334493 -93390 -273712
412 -273712 -271918 -154387 -14324 -140468 -328108 -20625 -192100 -445773 -329387 -125412
402 -125412 241001 154022 172213 235449 116037 432340 268533 88293 249886 497120
392 497120 464089 958270 349192 120657 263105 302083 534395 432827 185735 74316
382 74316 191832 241640 226505 397887 512362 356410 308593 46993 191744 -307969 27144
371 27144 -308335 -295482 -6083 -60343 88592 -94988 -278281 -81797 125890 512118
361 512118 191003 102520 -146588 -328669 -417702 -373603 -28767 61791 182937 -87133 -153371
350 -153371 426660 279282 102651 82111 587923 676817 238548 157717 33017 253687
340 253687 -213772 -405843 245050 278050 60953 175765 -396813 -350524 -293427 -48827
330 -48827 331542 289413 22614 230604 -228821 -338752 -69565 40777 358684 367511 80452
319 80452 38933 -275691 95738 187292 -38592 421186 596414 630852 1014802 653819 193914
308 193914 590027 50962 -55045 96478 -10067 -161804 -299306 -270442 221073 585040
298 585040 149361 -191403 -460608 294286 312602 56659 -155082 -110352 323540 20749
288 20749 186403 105738 -10934 127867 312365 493667 -41939 -118209 -71193 -167289 50568
277 50568 321768 -30428 -80978 48067 118520 480608 229538 69704 117071 -101805 -106316
266 -106316 89538 234118 13955 370745 524075 226104 84811 167858 -54637 -243133
256 -243133 185154 -72775 115413 -192415 -99500 55713 560043 462733 221520 397620
246 397620 319436 1442 22643 174387 44981 75471 -139118 240057 307599 22826 111408
235 111408 285973 -68386 -118341 8423 370759 398973 120151 -57807 -97240 -268718
225 -268718 -144552 217320 407325 46330 -275091 -2160 250802 190673 293128 387880
215 387880 553610 433085 229568 445572 194981 -5108 42109 346256 274411 -284263
$$ [...]
##END NTUPLES=NMR SPECTRUM
##END=
