##TITLE=1H_CA-9172-2
 CDCl3
 8 sc, 
 10.7.2023
##JCAMPDX= 6.0         $$ Bruker NMR JCAMP-DX V2.0
##DATA TYPE= NMR SPECTRUM
##DATA CLASS= NTUPLES
##ORIGIN= UXNMR, Bruker Analytische Messtechnik GmbH
##OWNER= root
$$ XWIN-NMR		Version 3.5
$$ Mon Jul 10 15:58:29 2023 Russian Standard Time (UT+4h)  she@DPX200
##.OBSERVE FREQUENCY= 200.13135
##.OBSERVE NUCLEUS= ^1H
##.ACQUISITION MODE= SIMULTANEOUS
##.ACQUISITION SCHEME= undefined
##.AVERAGES= 8
##.DIGITISER RES= 18
##SPECTROMETER/DATA SYSTEM= spect
##.PULSE SEQUENCE= zg30
##.SOLVENT NAME= CDCl3
##.SHIFT REFERENCE= (INTERNAL, CDCl3, 0, 15.6929)
##AUDIT TRAIL= $$ (NUMBER, WHEN, WHO, WHERE, WHAT)
$$ ##TITLE= Audit trail, XWIN-NMR		Version 3.5
$$ ##JCAMPDX= 5.01
$$ ##ORIGIN= Bruker BioSpin GmbH
$$ ##OWNER= she
$$ F:/spectra/data/she/nmr/H-F/1/pdata/1/auditp.txt
$$ ##AUDIT TRAIL=  $$ (NUMBER, WHEN, WHO, WHERE, WHAT)
(   1,<2023-07-10 15:57:08.25 +0400>,<she>,<DPX200>,
      <created by zg, POWCHK disabled, PULCHK disabled
       configuration hash MD5:
       00 E9 B6 7A A2 85 ED C7 34 08 36 98 17 FE 4E 26
       data hash MD5: 16K
       99 0D E2 22 82 7D E9 87 23 83 F7 56 68 6C 6B 28>)
(   2,<2023-07-10 15:57:12.10 +0400>,<she>,<DPX200>,
      <Start of raw data processing
       efp BC_mod = 2 LB = 0.24 FT_mod = 6 PKNL = 1 PHC0 = -20994.04 PHC1 = 16.65272 SI = 16K 
       data hash MD5: 16K
       0E CA 75 58 E8 AF 36 3D 36 83 55 2A F8 84 1E FA>)
(   3,<2023-07-10 15:57:44.21 +0400>,<she>,<DPX200>,
      <pk PHC0 = -153.9212 PHC1 = -5.199999 
       data hash MD5: 16K
       66 7A 76 5C 30 02 F4 2C 05 5A 42 13 21 8E AD 03>)
(   4,<2023-07-10 15:57:47.68 +0400>,<she>,<DPX200>,
      <abs ABSG = 5 
       data hash MD5: 16K
       4E 3F 22 2D 80 8C F3 F4 5E A9 A5 28 DE 55 84 B0>)
$$ ##END=
$$ 
$$ hash MD5
$$ 7D 5A 9A 0E EC 37 26 B7 4B 6D 7E B8 57 D3 E9 0E
##$RELAX= 
##$RELAX= 
##$RELAX= 
##$RELAX= 
##$RELAX= 
##$RELAX= 
$$ Bruker specific parameters
$$ --------------------------
##$DU= <F:/spectra>
##$EXPNO= 1
##$NAME= <H-F>
##$PROCNO= 1
##$TYPE= <nmr>
##$USER= <she>
##$AMP= (0..31)
100 100 100 100 100 100 100 100 100 100 100 100 100 100 100 100 100 100 
100 100 100 100 100 100 100 100 100 100 100 100 100 100 
##$AQSEQ= 0
##$AQ_mod= 1
##$AUNM= <au_zg>
##$AUTOPOS= <>
##$BF1= 200.13
##$BF2= 200.13
##$BF3= 200.13
##$BF4= 200.13
##$BF5= 200.13
##$BF6= 200.13
##$BF7= 200.13
##$BF8= 200.13
##$BYTORDA= 1
##$CFDGTYP= 0
##$CFRGTYP= 5
##$CHEMSTR= <none>
##$CNST= (0..31)
1 1 145 1 1 1 1 1 1 1 1 1 1 1 1 1 1 1 1 1 1 1 1 1 1 1 1 1 1 1 1 1 
##$CPDPRG= <>
##$CPDPRG1= <>
##$CPDPRG2= <>
##$CPDPRG3= <>
##$CPDPRG4= <mlev>
##$CPDPRG5= <mlev>
##$CPDPRG6= <mlev>
##$CPDPRG7= <mlev>
##$CPDPRG8= <mlev>
##$CPDPRGB= <>
##$CPDPRGT= <>
##$D= (0..31)
0 1.2 0 0 0 0 0 0 0 0.06 0 0.03 0 0 0 0 0.0002 0 0 0 0 0 0 0 0 0 0 0 0 
0 0 0 
##$DATE= 1688990227
##$DBL= (0..7)
120 120 120 120 120 120 120 120 
##$DBP= (0..7)
150 150 150 150 150 150 150 150 
##$DBP07= 0
##$DBPNAM0= <>
##$DBPNAM1= <>
##$DBPNAM2= <>
##$DBPNAM3= <>
##$DBPNAM4= <>
$$ [...]
##$SUBNAM3= <"">
##$SUBNAM4= <"">
##$SUBNAM5= <"">
##$SUBNAM6= <"">
##$SUBNAM7= <"">
##$SUBNAM8= <"">
##$SUBNAM9= <"">
##$SW= 18.05172834244
##$SWIBOX= (0..15)
0 0 2 0 0 0 0 0 0 0 0 0 0 0 0 0 
##$SW_h= 3612.71676300578
##$TD= 16384
##$TD0= 1
##$TE= 0
##$TE2= 300
##$TE3= 300
##$TEG= 300
##$TL= (0..7)
0 120 120 120 120 120 120 120 
##$TP= (0..7)
150 150 150 150 150 150 150 150 
##$TP07= 0
##$TPNAME0= <>
##$TPNAME1= <>
##$TPNAME2= <>
##$TPNAME3= <>
##$TPNAME4= <>
##$TPNAME5= <>
##$TPNAME6= <>
##$TPNAME7= <>
##$TPOAL= (0..7)
0.5 0.5 0.5 0.5 0.5 0.5 0.5 0.5 
##$TPOFFS= (0..7)
0 0 0 0 0 0 0 0 
##$TUNHIN= 0
##$TUNHOUT= 0
##$TUNXOUT= 0
##$USERA1= <user>
##$USERA2= <user>
##$USERA3= <user>
##$USERA4= <user>
##$USERA5= <user>
##$V9= 5
##$VALIST= <valist>
##$VCLIST= <CCCCCCCCCCCCCCC>
##$VD= 0
##$VDLIST= <DDDDDDDDDDDDDDD>
##$VPLIST= <PPPPPPPPPPPPPPP>
##$VTLIST= <TTTTTTTTTTTTTTT>
##$WBST= 1024
##$WBSW= 4
##$XGAIN= (0..3)
0 0 0 0 
##$XL= 0
##$YL= 0
##$YMAX_a= 340374
##$YMIN_a= -332921
##$ZGOPTNS= <>
##$ZL1= 120
##$ZL2= 120
##$ZL3= 120
##$ZL4= 120
##$ABSF1= 15.70833
##$ABSF2= -2.343519
##$ABSG= 5
##$ABSL= 3
##$ALPHA= 0
##$AQORDER= 0
##$ASSFAC= 0
##$ASSFACI= 0
##$ASSFACX= 0
##$ASSWID= 0
##$AUNMP= <proc_1d>
##$AZFE= 0.1
##$AZFW= 0.1
##$BCFW= 0
##$BC_mod= 2
##$BYTORDP= 0
##$COROFFS= 0
##$CY= -3
##$DATMOD= 1
##$DC= 0
##$DFILT= <>
##$DTYPP= 0
##$F1P= 0
##$F2P= 0
##$FCOR= 1
##$FTSIZE= 16384
##$FT_mod= 6
##$GAMMA= 0
##$GB= 0
##$INTBC= 1
##$INTSCL= 3.70164e-10
##$ISEN= 128
##$LB= 0.24
##$LEV0= 0
##$LPBIN= 0
##$MAXI= 10000
##$MC2= 0
##$MEAN= 0
##$ME_mod= 0
##$MI= 1.114404
##$NCOEF= 0
##$NC_proc= -8
##$NLEV= 6
##$NOISF1= 3.799351
##$NOISF2= 2.8
##$NSP= 0
##$NTH_PI= 0
##$NZP= 0
##$OFFSET= 15.6929
##$PC= 1
##$PHC0= -21147.96
##$PHC1= 11.45272
##$PH_mod= 1
##$PKNL= yes
##$PPARMOD= 0
##$PSCAL= 0
##$PSIGN= 0
##$REVERSE= no
##$SF= 200.130015738632
##$SI= 16384
##$SIGF1= 3
##$SIGF2= 2
##$SINO= 5.538805
##$SIOLD= 16384
##$SREGLST= <1H.CDCl3>
##$SSB= 0
##$STSI= 16384
##$STSR= 0
##$SW_p= 3612.71676300578
##$SYMM= 0
##$S_DEV= 0
##$TDeff= 16384
##$TDoff= 0
##$TI= <>
##$TILT= no
##$TM1= 0
##$TM2= 0
##$TOPLEV= 0
##$USERP1= <user>
##$USERP2= <user>
##$USERP3= <user>
##$USERP4= <user>
##$USERP5= <user>
##$WDW= 1
##$XDIM= 16384
##$YMAX_p= 513522076
##$YMIN_p= -444402
$$ End of Bruker specific parameters
$$ ---------------------------------
##NTUPLES= NMR SPECTRUM
##VAR_NAME=  FREQUENCY,     SPECTRUM/REAL,   SPECTRUM/IMAG
##SYMBOL=    X,             R,               I
##VAR_TYPE=  INDEPENDENT,   DEPENDENT,       DEPENDENT
##VAR_FORM=  AFFN,          ASDF,            ASDF
##VAR_DIM=   16384,         16384,           16384
##UNITS=     HZ,            ARBITRARY UNITS, ARBITRARY UNITS
##FACTOR=    0.220516191357247, 1,           1
##FIRST=     3140.62026474219, 0,            0
##LAST=      -472.096498263591, 0,           0
##MIN=       -472.096498263591, -444402,     0
##MAX=       3140.62026474219, 513522076,    0
$$ Real data points
##PAGE= N=1
##DATA TABLE= (X++(R..R)), XYDATA
$$ [...]
7280A1895r4046K26938o4683j52465l7345J35891k6684L5549J14571j3300M4127
7269A80448l9636j24437K565J60088j9861j62283M5544Q5372q6229K7206J2222
7258H0999K6791J22803n4674r7335k9318O5799N0289m94o8341j6953n0708j01544
7246g2686J17445M5416r3717J30941J79499j52367j38340K07446L349j70095P823
7235F4714m0775M2410q6196P2548Q8643j11874p4388L7460N9270J16093q5925
7224H1980n6872L920n2892l0090Q0687J17029r8717m6717J19097O0750j00098
7213G8077m3751r496n4610J25004P7706r0J21764r6004r5995J62185O0524m9280
7201B76034j48026K20153q7937o4387l4977j06646M114O4821j0598n4132J45995
$$ y = [11895, -82151, 144787, 80104, -72361, -109706, 26185, -499, 35050, 149621, 136321, 180448, 140812, 16375, 18940, 179028, 159167, -3116, 42428, 127800, 41571, 68777, 80999, 107790, 230593, 175919, 78584, 49266, 115065, 165354, 164860, 96519, 79566, 28858, -72686, 44759, 90175, -3542, 127399, 306898, 154531, 16191, 223637, 226986, 56891, 64714, 23939, 66349, -19847, 52701, 141344, 29470, -44918, -7458, 51812, 167905, 81980, 25108, 29028, -23864, -53954, 26733, 143762, 45045, -1672, 117425, 178175, 78077, 34326, 24830, -29780, 95224, 172930, 172840, 294604, 198600, 102605, 264790, 325314, 276034, 128008, 348161, 260224, 195837, 160860, 54214, 58328, 123149, 112551, 58419, 204414]
7190B04414n2313J6528J23093Q480J2258j18709n2489R9929o6323J53863o7686
7179B61045o4550O2153k5878m521l6283o7793k2277R5826J19694o4133m2794j47715
7167F2774J0465L4235P7763k3436j3108j01957M8551J20898k0160k4417J30639
7156C02247K8492q3059L7117r983p1987J10291J8543j04809m8238J39526j2216
7145C05924n9461j6529l6402J8890N3161P0845j50034J9954L6313l7276q4669
7134A20716J20024J79230J05705j33918r8061o4252l3844J1622N4757J0296J35621
7123D07896k1462j6745P7842o8031j50778l8209k792r4058o5088K71845N7109
7112C57529r4210j8408L7224j51054n3316J35655M4180q337n598j44300p0127
$$ y = [204414, 152101, 168629, 291722, 300202, 312460, 193751, 141262, 241191, 174868, 328731, 261045, 196495, 258648, 232770, 228249, 191966, 124173, 101896, 197722, 317416, 253283, 210489, 62774, 73239, 107474, 185237, 161801, 148693, 46736, 95287, 216185, 196025, 171608, 302247, 330739, 247680, 284797, 274814, 202827, 313118, 331661, 226852, 178614, 318140, 305924, 246463, 229934, 193532, 212422, 265583, 336428, 186394, 206348, 242661, 205385, 120716, 240740, 419970, 525675, 391757, 293696, 229444, 195600, 207222, 261979, 272275, 407896, 386434, 369689, 447531, 379500, 228722, 190513, 187721, 93663, 28575, 300420, 357529, 263319, 244911, 282135, 131081, 77765, 213420, 257600, 249263, 243665, 99365, 29238]
7101B9238J11516R0434j82340M5918J85366j02785P7668p0431M5085m3035k1396
7090A65238k298m8880K9054o1219J6610l4432J53539O0314j47176K1096r846l1215
7078A10785N4680L4895o2371P7547J03787L3085p0845J20969k9376j9378l6381
7067C17397j03920N8647N9303p5880M1396K0857k991J40519J50512k94776l02238
7056H826m3687R7838M4508L2900O9783q8846P2507N1019n7538L953O3422N2562
7044C07247P8677k76631R6777J02474n2306K4n3142N0818j1495O21O6772L8472
7032C48308o5613q7361L0580J03628O7169K528j31276J00504r7625J1092P0562
7021C52496n3879L2949R902Q1825M6983m4902j09484Q652j36071O5592M5863n1686
$$ y = [29238, 140754, 231188, 48848, 94766, 280132, 177347, 255015, 184584, 229669, 186634, 165238, 162940, 114060, 143114, 81895, 98505, 64073, 217612, 277926, 130750, 151846, 142000, 110785, 165465, 200360, 137989, 215536, 319323, 352408, 281563, 402532, 373156, 353778, 317397, 213477, 272124, 331427, 255547, 296943, 317800, 314809, 455328, 605840, 311064, 8826, -34861, 62977, 107485, 140385, 210168, 121322, 193829, 244848, 187310, 191263, 254685, 307247, 385924, 109293, 206070, 308544, 256238, 256262, 203120, 253938, 242443, 243064, 309836, 348308, 282695, 195334, 225914, 329542, 396711, 399239, 267963, 368467, 270842, 281934, 352496, 298617, 331566, 341468, 423293, 470276, 425374, 315890, 324542, 188471, 254063, 299926, 248240]
7009B48240o125m4996K02554l8284J6417J3025k00625L674L4923L7108L8551j45253
6997A59209M1409J58218L1615r5427L9911m3522j9682J18464Q0270j32140j7184
6986C21141p692j094N8421o0428O395k3431p3244r7826K3079J67591K6742O8635
6974D08289K16026j10769M6818N9043k57936l8746M8048m7419N1333N2506P9763
6963E06956j8047k021n0676J50135n470j5650N8441P844o7925N1359K9525N1283
6951F95754K2500j28400M8980P398j8898O7642J08262j71218J4380J12992n7517
6940G01875k4849L2425J03142r2583l1364L0700Q124L5414p7478m9496M8296K2698
6928G06904Q4844k7872M1631j06558l4266p4582l7766P5146j6308k8219P9592
$$ y = [248240, 242115, 197119, 399673, 361389, 377806, 390831, 190206, 193880, 228803, 265911, 304462, 159209, 200618, 358836, 390451, 295024, 334935, 291413, 271731, 390195, 470465, 338325, 321141, 313449, 312355, 370776, 310348, 316743, 293312, 220068, 122242, 145321, 312912, 339654, 408289, 624315, 513546, 560364, 619407, 361471, 322725, 370773, 323354, 374687, 427193, 506956, 488909, 486888, 436212, 586347, 580877, 565227, 623668, 631512, 563587, 614946, 644471, 695754, 718254, 589854, 638834, 646232, 627334, 694976, 803238, 632020, 646400, 759392, 701875, 677026, 709451, 812593, 720010, 688646, 719346, 727470, 762884, 685406, 635910, 684206, 706904, 791748, 763876, 805507, 698949, 664683, 590101, 552335, 627481, 611173, 582954, 662546]
6917F62546Q6960j10160R737K9019M0626L078j01328j13058R4279M1371L3537
6906F76607k0483m0037O4359m9707n7052N8199p1046K3150R699Q1059o0279J172
6894F15641J893j26728k3514N5205J07377o1586K7797n4566n9928K60037J7186
6883G58814l4023m725l8495L9758n7344j17153L0562J5643J6219K6874N9420L6093
6871G31643l1364j18483K0353j16157q2964J52998P7238m7820N4903j09057q4911
6860D46379J13941J30715J3834j8610k8334q2751j3602r528Q6822J19819o3949
6849F94736j04216Q8321j7855n234k8954J4189J21o062j7086o2875j32270K15038
6837F37853J2903j02287q3613j0889Q1700J11245p4635M9530P2618q5615p3394
$$ y = [662546, 749506, 639346, 649083, 678102, 718728, 721806, 620478, 507420, 601699, 643070, 676607, 656124, 616087, 680446, 630739, 573687, 631886, 560840, 583990, 593689, 674748, 614469, 615641, 617534, 490806, 467292, 522497, 629874, 568288, 596085, 541519, 481591, 741628, 758814, 724791, 720066, 681571, 721329, 663985, 546832, 577394, 593037, 609256, 636130, 695550, 731643, 700279, 581796, 602149, 485992, 403028, 556026, 633264, 585444, 640347, 531290, 446379, 560320, 691035, 704869, 686259, 657925, 575174, 561572, 552044, 638866, 758685, 694736, 590520, 678841, 660986, 655752, 626798, 640987, 641108, 635046, 617960, 555085, 422815, 637853, 650756, 548469, 464856, 453967, 535667, 646912, 572277, 621807, 694425, 608810, 535416]
6826E35416J3824L7162j39741n9052k0595P2324J9242J49012N2921l9338j10070
6815E11105p6741J71470m1436M253q3840k6822p2016l0460J45579O2876q6970
6804D76998j297j3937m7565N2400O4186J4403J19043l9110k24701N4048Q0347
6793E34815k7131O8683J2873J56988q9978j93626M0230J08234o3465q7320J17219
6782E77522j0491J8272n8874P6214k666k0210L3717O4747l5965L8454p4879j22193
6770D83648Q3833l4956Q2886J26096r9416L6647q7952J7382j6186N5169J79667
6759H26818O2436j27585j33498Q6295J57322r6806j59425n5956O8999P0062L5690
6748G34352j8893j26959O4830O9044n9302m260M6132L1696J04705j40626j53001
$$ y = [535416, 549240, 586402, 446661, 387609, 367014, 439338, 458580, 607592, 660513, 621175, 511105, 434364, 605834, 564398, 568651, 484811, 457989, 385973, 355513, 501092, 563968, 476998, 475701, 461764, 414199, 466599, 530785, 545188, 664231, 625121, 400420, 454468, 534815, 507684, 576367, 589240, 746228, 656250, 462624, 502854, 611088, 547623, 460303, 577522, 567031, 585303, 526429, 602643, 599977, 579767, 613484, 678231, 642266, 680720, 605841, 483648, 567481, 532525, 615411, 741507, 642091, 678738, 590786, 608168, 591982, 647151, 826818, 889254, 761669, 628171, 714466, 871788, 774982, 615557, 559601, 628600, 698662, 734352, 715459, 588500, 653330, 722374, 663072, 658812, 704944, 736640, 841345, 700719, 547718]
6737E47718O4437O880p3065r1476K8410J94895J08210q452O100j02175J2775j01369
6725E92888j12787j5432o9582J15906J3655Q0575K4619r7105M1650n1529Q4913
6714F07771N0317n8298K717l8462J76224L141r030J08664m4832J7298j01088N9678
6702G74100j10462R0431R3897m1457M7316r8265j7714l7322J08649m7777M1960
6691H03356J13375q0352j23437L3772L7404o7026q4165l0574m6694p2495Q5825
6680E68989J35538k9875p8183N5104p869n6809l031O6760J7099k22644o4914J48691
6668E28856J34565l3199j8294J70607P5460k33651n7445j6433M6329J3461J9583
6657F29839J12972Q3886n7620j06611l6750p822R0101M4264J44729r984k22460
$$ y = [547718, 612155, 619035, 545970, 454494, 482904, 677799, 786009, 777557, 783657, 681482, 694257, 592888, 480101, 464669, 395087, 510993, 524648, 605223, 629842, 532737, 574387, 522858, 607771, 658088, 599790, 602507, 564045, 740269, 743410, 734380, 843044, 798212, 815510, 714422, 774100, 663638, 754069, 847966, 806509, 853825, 755560, 737846, 700524, 809173, 761396, 803356, 916731, 836379, 712942, 746714, 784118, 717092, 632927, 602353, 555659, 483164, 568989, 704527, 674652, 596469, 651573, 643704, 586895, 583864, 650624, 667723, 445079, 380165, 528856, 663421, 630222, 611928, 782535, 857995, 624344, 566899, 550466, 596795, 610256, 629839, 742811, 826697, 769077, 662466, 625716, 617894, 707995, 752259, 896988, 887004, 664544]
6646F64544k73O8273L1391j434o9437J70028J5126o0048l9421j63058J8008J9758
6634F53457M98N8642o1561O5380J85410j94101n9560Q8748o2149M4137J41984
6623H60885q6857o4061Q2311l6163j4425K3715J42049o5211j44759J9035Q0880
6612G97399K0892J58917p2399q2987J16064n5074j08443J14898m2421p925Q6758
6601I25679o24P0306r9227J33276R5142p2269p9924q244q1791j9313q0269K4010
6589H06752n947n6587J36784L9407J43634j53907j25687K44333K3952j23134P35
6578I30335n175j20730O2079J54655r1369m8103J31772P8200q4483j47314j8082
6567H41785J19160P1349k9720k7169p6722M6930N9133n1582M6030j37189N945
$$ y = [664544, 664271, 732544, 763935, 762501, 693064, 863092, 878218, 818170, 778749, 615691, 633699, 653457, 653955, 712597, 651036, 716416, 901826, 707725, 648165, 736913, 674764, 718901, 860885, 774028, 709967, 792278, 756115, 741690, 765405, 907454, 842243, 697484, 716519, 797399, 818291, 977208, 904809, 821822, 937886, 882812, 774369, 889267, 846846, 838921, 925679, 925055, 995361, 896134, 1029410, 1124552, 1052283, 972359, 964115, 882324, 863011, 782742, 806752, 800805, 744218, 881002, 920409, 1064043, 910136, 784449, 1028782, 1052734, 929600, 930335, 925160, 804430, 866509, 1021164, 929795, 881692, 1013464, 1091664, 1007181, 859867, 841785, 960945, 1032294, 1002574, 975405, 898683, 945613, 1004746, 953164, 999194, 862005, 867950]
6556H67950n8523M1494K5016m5561N2639O2293J27304O6904p6220k2062O0573
6545A101807J4872l2562l7987j58349n8619J00164j3693J54359L3178m0302P9387
6534A142255J12281j05064o2016j22599Q1706L3436j11442N1701n5054L8558J55349
6523A159111j50924m6097M1260M7096j2282q5787K0826J12362R880l1250Q3660
6512A147855j06410l4631m580J24833J29639L5913r9366j53674K8522J09110M0952
6501A218163K2056q8462o2715j34251J37212L4096p2786J6064k3255l5483J09478
6490A120117K7977J2222O3078j08686N3685Q6669J666K3151j11046O0973J00833
6479A330639j79953O2468P5830Q7539n9417j04150n0128M4569K3162L7957P3551
$$ y = [867950, 809427, 850921, 875937, 830376, 883015, 945308, 1072612, 1139516, 1063296, 1041234, 1101807, 1116679, 1084117, 1046130, 887781, 829162, 929326, 915633, 1069992, 1103170, 1062868, 1142255, 1254536, 1149472, 1087456, 964857, 1046563, 1079999, 968557, 1020258, 965204, 1003762, 1159111, 1008187, 962090, 1003350, 1050446, 1038164, 952377, 973203, 1085565, 1095445, 1064195, 1147855, 1041445, 1006814, 1002234, 1127067, 1256706, 1292619, 1193253, 1039579, 1068101, 1177211, 1218163, 1240219, 1151757, 1089042, 954791, 1092003, 1126099, 1053313, 1069377, 1046122, 1010639, 1120117, 1148094, 1160316, 1223394, 1114708, 1168393, 1255062, 1256728, 1279879, 1168833, 1229806, 1330639, 1150686, 1213154, 1288984, 1376523, 1317106, 1212956, 1162828, 1207397, 1230559, 1268516, 1342067]
6468A342067q8700m397l099n8497n1152p033R6869L2782J19808P8979P640r7123
6456A368144j62989J6501n0380N7028K01613q3686q6311n9529L4615J52931j13856
6445A274081j0935j4308N1394R4153J1658j20842J34767q313j13434j7011J7642
6434A298852J2180J42602L8540o4492J8931j31374j9035J04995Q1529k7522Q666
6423A463872K54O7018j4035o6108p4897r365J24396K035m1850l9937K4328L9011
6411A474722o2493J93191M7329L0802j00318K2219K2148N4466n5176J47658r3065
6400A681483j26667m9865n9072K8948j174K5258r5753K3300R2401L28O198K6234
6388A551619j11708n3603k9770J30324J11694J04034n8101j52809K4901L9452
$$ y = [1342067, 1253367, 1248970, 1245871, 1187374, 1136222, 1129189, 1226058, 1258840, 1378648, 1457627, 1465267, 1368144, 1205155, 1221656, 1171276, 1228304, 1429917, 1346231, 1259920, 1200391, 1235006, 1387937, 1274081, 1263146, 1248838, 1300232, 1394385, 1406043, 1285201, 1419968, 1411655, 1298221, 1281210, 1298852, 1311032, 1453634, 1492174, 1427682, 1446613, 1315239, 1296204, 1401199, 1482728, 1455206, 1463872, 1464126, 1531144, 1517109, 1451001, 1376104, 1366739, 1491135, 1493170, 1451320, 1411383, 1435711, 1474722, 1412229, 1605420, 1652749, 1683551, 1583233, 1605452, 1627600, 1682066, 1626890, 1774548, 1681483, 1554816, 1504951, 1445879, 1474827, 1473653, 1498911, 1403158, 1426458, 1518859, 1519187, 1525385, 1551619, 1439911, 1386308, 1356538, 1486862, 1598556, 1702590, 1644489, 1491680, 1516581, 1556033]
6378A556033N5609J9257l7445n2527J47904p6822P0549J9099k7471N5263M8039
6367A777488L5776j27437j2671Q7095Q2249k16729Q4493N7521L3758q0829J95132
6356A915846o7731j34125r5488j87k2466J02362M0784p6674J4457k6147O7806
6345A718437N1930o2354Q5324O6859j77690j9609r314Q8217M1016m7261K2297
6334A757852M0245k9037J05450J34036k36531k4749J95645k9377r8966J17871
6324A932439N8952p9928Q8203J4841j59064N1485J11612j34362J34894K9128J9857
6313B068057l5682k2969R0823O0662n2499j64336M838j26701J3356J6540P7533
6302A929622P9005p3401J09534l330k1790n6139J4543K6913o0617r394O3874p5086
$$ y = [1556033, 1611642, 1630899, 1593454, 1540927, 1688831, 1612009, 1682558, 1701657, 1674186, 1729449, 1777488, 1813264, 1685827, 1673156, 1760251, 1842500, 1625771, 1710264, 1767785, 1801543, 1720714, 1915846, 1848115, 1713990, 1618502, 1618315, 1595849, 1698211, 1738995, 1662321, 1676778, 1650631, 1718437, 1770367, 1708013, 1793337, 1860196, 1682506, 1662897, 1653583, 1741800, 1782816, 1735555, 1757852, 1798097, 1769060, 1874510, 2008546, 1772015, 1747266, 1942911, 1913534, 1814568, 1932439, 1991391, 1911463, 1999666, 2014507, 1855443, 1906928, 2018540, 1884178, 2019072, 2048200, 2068057, 2032375, 2009406, 2100229, 2160891, 2108392, 1944056, 1948894, 1822193, 1835549, 1852089, 1929622, 2008627, 1935226, 2044760, 2041430, 2019640, 1963501, 1978044, 2004957, 1944340, 1934946, 1998820, 1923734]
6290A923734O9083Q9053P3454L6975j45950q459L3635j05237p7220O3367l5334
6279A917101N7565K2318j2041j15235K2474N7106r680J24830J02678r0926l734
6268B072456L4613j24224J07981k0269l0523J00177l895p6133j01829K8305J27941
6257B114600m8931n6894P8743J85281P6693j10418n3441j01419j08291J34085
6247B110008L7606j696j9965K42846r0049k19910q6934K23672J5782R2970n1048
6236B253282o1408J04183o5249m8991j02806N0166J0668O6367P8544l0186p0475
6225B184095J7845M5065j02315J34196J73270q7778J78158l1787P0824j32919
6215B448654q7414J27626l4121M2378N3905M7122j62951j199q2741p9973K9078
$$ y = [1923734, 1992817, 2081870, 2155324, 2192299, 2046349, 2037890, 2071525, 1966288, 1889068, 1952435, 1917101, 1974666, 1996984, 1984943, 1869708, 1892182, 1949288, 1939608, 2064438, 2167116, 2076190, 2072456, 2107069, 1982845, 2090826, 2070557, 2040034, 2140211, 2136316, 2060183, 1958354, 1986659, 2114600, 2065669, 2008775, 2087518, 2272799, 2349492, 2239074, 2185633, 2084214, 1975923, 2110008, 2147614, 2145918, 2125953, 2368799, 2278750, 2058840, 1971906, 2195578, 2211360, 2304330, 2253282, 2191874, 2296057, 2230808, 2181817, 2079011, 2129177, 2139845, 2206212, 2284756, 2254570, 2184095, 2201940, 2247005, 2144690, 2278886, 2452156, 2364378, 2542536, 2510749, 2581573, 2448654, 2361240, 2488866, 2454745, 2497123, 2551028, 2598150, 2435199, 2434000, 2351259, 2271286, 2300364]
6204B300364R530Q7466L6023N4256J2548J17911K2241J45828n4204R4542J3849
6193B840354K7176n2165l3806j03898O1820Q4269L516p9357q9697O3389R1585
6182B813186J13847j01265o5713Q7531k07588r9601J34460P6346q8618J9084O3365
6171B745034R9263l9932n3484j7350J5057O5968J3341J26723N6931O3332J1912
6160C086795j68495P2635K72471p8189j01531K0332j31483P419p337K396N3670
6149C028683r9476k6324r9224m8366j9033J24063n6671N5315M0617j507k3346
6138B874731M0049J29649Q7282j11174j55757n7287j2997J8159J79510q4123M715
6127B912757k3145K3712L573k2066R6662J37547P76l3428k0089P664k1411J68173
$$ y = [2300364, 2309894, 2397360, 2433383, 2487639, 2500187, 2618098, 2640339, 2786167, 2731963, 2826505, 2840354, 2867530, 2815365, 2781559, 2677661, 2739481, 2823750, 2827266, 2747909, 2658212, 2721601, 2813186, 2927033, 2825768, 2760055, 2847586, 2639998, 2540397, 2674857, 2751203, 2662585, 2681669, 2745034, 2844297, 2804365, 2750881, 2733531, 2748588, 2814556, 2827897, 2954620, 3011551, 3074883, 3086795, 2918300, 2990935, 3263406, 3185217, 3083686, 3104018, 2972535, 2979954, 2972617, 2975013, 3028683, 2929207, 2902883, 2803659, 2755293, 2736260, 2860323, 2803652, 2858967, 2899584, 2898077, 2874731, 2914780, 3044429, 3131711, 3020537, 2864780, 2807493, 2794496, 2812655, 2992165, 2908042, 2912757, 2889612, 2913324, 2916897, 2894831, 2991493, 3129040, 3129816, 3096388, 3076299, 3083963, 3062552, 3230725]
6115C230725J05221p7828m1331o8926L7232P5449n9134J0694l6861N1286O4598
6104C291125j81635j9889J27820R1987M4951J1573p8446n2005J33446l1633j69705
6093C167589K5713O3447N3304K2903o3175r5555J65254n2147L0978L4038Q2009
6082C434358R8075j20098j30027Q9838O2285R8905M9772j4181J5427m7983K0973
6071C557344L0280o0869J2200J14476M2332R0068q016p8660P1429P4288m0484
6060C804388k7468J4348J8926P4481j28605J91313k1116j46934N1174k1125O7286
6049C876668j01289l2537K00473J01241l7911r2502M2393J92259m2843j71706
6039C934246R6351J96907k38914Q0984J96012j44455J90921L4307j7883K6475
$$ y = [3230725, 3335946, 3258118, 3216787, 3147861, 3185093, 3260542, 3201408, 3212102, 3175241, 3226527, 3291125, 3109490, 3089601, 3217421, 3309408, 3354359, 3365932, 3287486, 3235481, 3368927, 3337294, 3167589, 3193302, 3256749, 3310053, 3332956, 3269781, 3174226, 3339480, 3287333, 3318311, 3352349, 3434358, 3532433, 3412335, 3282308, 3372146, 3434431, 3533336, 3583108, 3568927, 3584354, 3536371, 3557344, 3587624, 3526755, 3538955, 3653431, 3695763, 3785831, 3777815, 3699155, 3770584, 3844872, 3804388, 3776920, 3791268, 3810194, 3884675, 3756070, 3947383, 3926267, 3779333, 3830507, 3809382, 3876668, 3775379, 3742842, 3943315, 4044556, 4006645, 3914143, 3956536, 4148795, 4105952, 3934246, 4030597, 4227504, 3988590, 4069574, 4265586, 4121131, 4312052, 4346359, 4328476, 4354951]
6029D354951j92878J94698L9850J5470q8355N0585N8506J20843N7528k03233P9131
6018D487096Q7733L7737N8636p9015O474K29576j10946R2409J26746q2827P477
6007D861096m4558J3739O6687j9215j32638j07291J52183J38224O313Q8828J19281
5996E142649r5551j4104J05820L8689j3510l3655k2924R1050N4283k9966j1384
5985E211397N8476j5879L9317k4659M8599J17165J33106l0839j29684R1509q7686
5974E410822k8742J50192J33598m5797m9353J23109m9657R54o0207J47672P699
5963E740290l8679J65183J6249J276P4901Q270M9468j8170o4115J26868J10372
5952F171913r2022L9975J03528j24268q715L9173N8315M171O7196M730K1736n2733
$$ y = [4354951, 4162073, 4356771, 4396621, 4412091, 4323736, 4374321, 4432827, 4553670, 4611198, 4407965, 4487096, 4574829, 4612566, 4671202, 4592187, 4598661, 4828237, 4717291, 4809700, 4936446, 4853619, 4861096, 4816538, 4830277, 4896964, 4877749, 4745111, 4637820, 4790003, 4928227, 4934540, 5023368, 5142649, 5047098, 5032994, 5138814, 5177503, 5163993, 5130338, 5107414, 5198464, 5252747, 5222781, 5211397, 5269873, 5253994, 5293311, 5268652, 5317251, 5434416, 5567522, 5536683, 5406999, 5498508, 5410822, 5382080, 5532272, 5665870, 5620073, 5570720, 5693829, 5644172, 5645126, 5584919, 5732591, 5740290, 5701611, 5866794, 5883043, 5884319, 5959220, 5967490, 6016958, 5998788, 5934673, 6061541, 6171913, 6079891, 6119866, 6223394, 6099126, 6090411, 6129584, 6187899, 6192070, 6259266, 6263996, 6285732, 6232999]
5940F232999P0671j36419J47919L8193K4191J00844j18187o6455J1564J46328
5930F451648J19085J4881p2426j24652o851J47081J07058O32j55596O6595N5716
5919F603171R8419J4760q0709Q3287q99O3870L2106J32849J69280J00552J46151
5908G362837J10996R6378J03819j17808P423k4363q4294p4556M9739J65130n8078
5897G537223N0700J74245j5026J19054P5960q6540J8997M7072P8876Q9011l4119
5886H055453N7084M4062k4001R4694J2173J2408Q8642n7685N8135J30819K5644
5875H497428j97854k7001J43589M0163P2604J54880l253k3746J10387r0175J57289
5864H834311J85567M9818N805K2366r0013N4609J23880K00427M0998J29664J30246
$$ y = [6232999, 6303670, 6167251, 6315170, 6353363, 6377554, 6478398, 6360211, 6293756, 6305320, 6451648, 6570733, 6585614, 6513188, 6388536, 6381685, 6528766, 6635824, 6636456, 6480860, 6547455, 6603171, 6701590, 6716350, 6635641, 6718928, 6718029, 6781899, 6814005, 6946854, 7116134, 7216686, 7362837, 7473833, 7570211, 7674030, 7556222, 7563645, 7539282, 7454988, 7380432, 7430171, 7595301, 7537223, 7587923, 7762168, 7747142, 7866196, 7942156, 7855616, 7874613, 7921685, 8000561, 8089572, 8055453, 8112537, 8156599, 8132598, 8227292, 8239465, 8251873, 8340515, 8282830, 8340965, 8471784, 8497428, 8299574, 8272573, 8416162, 8456325, 8528929, 8683809, 8680556, 8656810, 8767197, 8677022, 8834311, 9019878, 9069696, 9075501, 9097867, 9007854, 9062463, 9186343, 9386770, 9427768, 9557432, 9687678]
5853I687678K6148n5728J19904J44349J7338j55973J28504J12463M7556j09319
5843I962920L1772J69034N1486J19357p9332n5911J65311J66125P7514j3342Q3036
5832A0677970J4737O4727J57607J12654K01250M2867J32372J74068N3255N5755
5822A1687262J69203J55378J68309n1882K53017K10098M9079R5968K06485J30657
5812A3073574K82011J57752R2122J76923M4824J78640J63391J59131L36160K00965
5802A4865493K61962K39956L06472K30041K55297L82240K47733L29513L37773
5793A7456480J70101K15178L20466K24786K69258K63710L42099L00509L53632
5784A9916219K99653L00575L47836L20132M09500M49028N02300M53817L98698
$$ y = [9687678, 9713826, 9658098, 9778002, 9922351, 9939689, 9783716, 9912220, 10024683, 10072239, 9962920, 9994692, 10163726, 10215212, 10334569, 10255237, 10199326, 10364637, 10530762, 10608276, 10594934, 10677970, 10692707, 10757434, 10915041, 11027695, 11228945, 11271812, 11404184, 11578252, 11631507, 11687262, 11856465, 12011843, 12180152, 12128270, 12381287, 12591385, 12640464, 12736432, 12942917, 13073574, 13355585, 13513337, 13605459, 13782382, 13827206, 14005846, 14169237, 14328368, 14664528, 14865493, 15127455, 15367411, 15673883, 15903924, 16159221, 16541461, 16789194, 17118707, 17456480, 17626581, 17841759, 18162225, 18387011, 18656269, 18919979, 19262078, 19562587, 19916219, 20215872, 20516447, 20864283, 21184415, 21593915, 22042943, 22545243, 22999060, 23397758]
5775B3397758M92443P04856P37232O34666O87291O80212N08115N09008O51088
5766B9002669O44455P79626P13760Q37641R71338P92397P80094O47932M14039
5757C5583951L51547p788l43752m84404n85256o29610m96676n42034m77616l14870
5747C2053492k39941k69221k6077k6087r6723K61504J74866L20077K54323M21052
5737C2827265M80640L56380O27946O60703N79552N80778Q44993J049756R41807
5728C8949820J084135J221987J351278J315520J369027J496735J558414J747050
5720E0093966J820606J949728K146795K177596K181066K210077J927561J512449
5712F6019844J220581R75054L08698M1655m65234o72070q37457p75950p62137
$$ y = [23397758, 23890201, 24595057, 25332289, 25966955, 26654246, 27334458, 27842573, 28351581, 29002669, 29647124, 30426750, 31140510, 31978151, 32949489, 33741886, 34521980, 35169912, 35583951, 35935498, 35927710, 35583958, 35099554, 34514298, 33884688, 33388012, 32845978, 32368362, 32053492, 31813551, 31544330, 31518253, 31492166, 31395443, 31656947, 31831813, 32151890, 32406213, 32827265, 33307905, 33664285, 34292231, 34952934, 35532486, 36113264, 36958257, 38008013, 38949820, 40033955, 41255942, 42607220, 43922740, 45291767, 46788502, 48346916, 50093966, 51914572, 53864300, 56011095, 58188691, 60369757, 62579834, 64507395, 66019844, 67240425, 68215479, 68524177, 68565832, 68100598, 67428528, 66591071, 65815121, 65052984]
5703F5052984r70537q57366p48084q11928p92806q13664p71685o43451p14801
5694E7928662n66163l03191k09410j31039R3289K50057M05164M78733N65723R12855
5684E9424680J148675J225532J211319J288505J499132J362687J249155J098212
5676F9507897R13461N85268K64565k60354o49393q81808j136231j377426j479854
5667F5486125j519239j389368j301048j137464j025895r49028o74051m24525l61744
5658E6703763k65411l6182L16498L20556L98860P28834Q66359J052632J213293
5649F1299202J289471J628095J583856K161724K176915K206455K114600K120800
5641G6581118J825131J399112Q61710K32213l24988j045213j557654k059029k204634
$$ y = [65052984, 64082447, 63225081, 62476997, 61665069, 60872263, 60058599, 59286914, 58643463, 57928662, 57362499, 57059308, 56849898, 56718859, 56812148, 57062205, 57467369, 57946102, 58511825, 59424680, 60573355, 61798887, 63010206, 64298711, 65797843, 67160530, 68409685, 69507897, 70421358, 71006626, 71271191, 71010837, 70361444, 69479636, 68343405, 66965979, 65486125, 63966886, 62577518, 61276470, 60139006, 59113111, 58164083, 57490032, 57065507, 56703763, 56438352, 56402170, 56718668, 57039224, 57438084, 58166918, 59033277, 60085909, 61299202, 62588673, 64216768, 65800624, 67962348, 70139263, 72345718, 74460318, 76581118, 78406249, 79805361, 80667071, 80899284, 80574296, 79529083, 77971429, 75912400, 73707766]
5632G3707766k608541k190635k140897j950581j623697j780102j428670j321677
5624E8662966j001545r10077q03421o43236l58355k16267l36663J93987J84432
5615E4771821M04633M37447O07828N46476Q18193J075577J093349J142533J203677
5606F2101534J257876J092437J046888J253252J240620J236209J338263J457980
5598G2025059J508408J229258J200255J272779J216001J159076Q31811Q17155
5590H1259802M30619K38346J87765R8386J38506K6410k41212k51971l62641q49362
5580H0674648r29356r82417j256969j355335j422221j430943j663654j622093
5572G0011660j644397j942856j719632j624445j662777j631720j474446j412850
$$ y = [73707766, 71099225, 68908590, 66767693, 64817112, 63193415, 61413313, 59984643, 58662966, 57661421, 56751344, 55947923, 55304687, 54946332, 54730065, 54393402, 54587389, 54771821, 55176454, 55613901, 56221729, 56768205, 57586398, 58661975, 59755324, 60897857, 62101534, 63359410, 64451847, 65498735, 66751987, 67992607, 69228816, 70567079, 72025059, 73533467, 74762725, 75962980, 77235759, 78451760, 79610836, 80442647, 81259802, 81690421, 81928767, 82116532, 82214918, 82353424, 82379834, 82138622, 81886651, 81524010, 80674648, 79745292, 78762875, 77505906, 76150571, 74728350, 73297407, 71633753, 70011660, 68367263, 66424407, 64704775, 63080330, 61417553, 59785833, 58311387, 56898537]
5564E6898537j208770j099635r72014r89393r35909q23201q78042o57615q35687
5555D8498271j048352o66373o91549n39328o63352q00334o77043m83234m93223
5546D2435483m83125m14380m56268l68457k36933r8459j77179l73627l15592k97061
5536C9214402n33506k97336k38866l76378j99442k39603l41886j97819j88283
5527C6601283k77980q6943j01697k23901m3028k08006o9859r2371k60953j69167
5517C5067378m6242J059r5615k2305j71913n4928Q3838J65631K58534J28803P5857
5506C5390097K61232J93078L37620J73432L37312M37857K09068J92355M40144
5497C7972195O15100M38532N76562M09358N69247N50349N58410P05909P50027
$$ y = [56898537, 55689767, 54590132, 53618118, 52628725, 51692816, 50869615, 49991573, 49333958, 48498271, 47449919, 46783546, 46091997, 45552669, 44889317, 44088983, 43411940, 42928706, 42435483, 41952358, 41537978, 41081710, 40713253, 40476320, 40377861, 40200682, 39827055, 39511463, 39214402, 38680896, 38383560, 38144694, 37768316, 37568874, 37329271, 36987385, 36789566, 36601283, 36323303, 36236360, 36134663, 35910762, 35867734, 35659728, 35589869, 35497498, 35236545, 35067378, 35021136, 35022195, 34926580, 34904275, 34732362, 34677434, 34761272, 34926903, 35185437, 35314240, 35390097, 35651329, 35844407, 36182027, 36355459, 36692771, 37130628, 37339696, 37532051, 37972195, 38587295, 39025827, 39602389, 40011747, 40580994, 41131343, 41689753, 42395662, 43145689]
5488D3145689N95315Q06896Q89470J006381Q78422J142364J105598J103033J132397
5479E1805565J111510J265662J122217R59698R48199Q41227N99449N82390L92154
5470E9628071L33156K51873L00108L07363K85839L06054M61646N37596M20529
5461F2832235O01644P94092O62491Q26820R70127J187359J230414J284740J418758
5452G1808680J582830J579059J872823K113878K102057J967534K650451K745466
5444H8422778K877999L189669L511187L806936M095689M583464N225519N760998
5436A21474239O220537P046339P816401Q473412R393985J0260438J1001194J1608742
5428A93295287J2077545J2266604J2336240J2388322J2149126J1787268J1000216
$$ y = [43145689, 43741004, 44547900, 45437370, 46443751, 47322173, 48464537, 49570135, 50673168, 51805565, 52917075, 54182737, 55304954, 56264652, 57212851, 58054078, 58653527, 59235917, 59628071, 59961227, 60213100, 60513208, 60820571, 61106410, 61412464, 61874110, 62411706, 62832235, 63433879, 64227971, 64890462, 65717282, 66687409, 67874768, 69105182, 70389922, 71808680, 73391510, 74970569, 76843392, 78957270, 81059327, 83026861, 85677312, 88422778, 91300777, 94490446, 98001633, 101808569, 105904258, 110487722, 115713241, 121474239, 127694776, 134741115, 142557516, 151030928, 160424913, 170685351, 181686545, 193295287, 205372832, 217639436, 229975676, 242363998, 254513124, 266300392, 277300608]
5421B77300608R613482P481314M672860J571853j200779l385987m743852o133941
5413B85175558p030033p955803q942980r509205r515371r620139r150892q560994
5405B14890141p884932o974951n890411n246280m451642l717201l300332k759800
5397A74664592k420457k369105k772664k736790l025173l460177l760857l780789
5389A50338580m252890m866644n311909n764752n825033n774886n497087n169889
5381A07875490m744767m296349m075488l780440l439501l274518k775820k541959
5373G8946648k486591k273784k066802j739810j665047j494771j177267j149793
5365F4892783j170385q94857p25088n51703m82048l14243k60440k87433m01547
$$ y = [277300608, 286914090, 294395404, 299068264, 300640117, 299439338, 296053351, 291309499, 285175558, 278145525, 270189722, 261246742, 251737537, 242222166, 232602027, 223451135, 214890141, 207005209, 200030258, 194139847, 188893567, 184441925, 180724724, 177424392, 174664592, 172244135, 169875030, 167102366, 164365576, 161340403, 157880226, 154119369, 150338580, 146085690, 141219046, 135907137, 130142385, 124317352, 118542466, 113045379, 107875490, 103130723, 98834374, 94758886, 90978446, 87538945, 84264427, 81488607, 78946648, 76460057, 74186273, 72119471, 70379661, 68714614, 67219843, 66042576, 64892783, 63722398, 62827541, 62102453, 61550750, 61068702, 60754459, 60494019, 60206586, 59805039]
5356E9805039o29626j148608j410595j461298j557307j276584j132268r41415
5348E0247338q22757p82447n74663m68531k17126r9259j27793M6690l3294J15032
5338D7283190J63715J86230O7631P0269j8627l3624l61924m19752l87147o50689
5328D5899272o59123p27093o76081o94786j061266j263345j193074j189080j092574
5319C7342850j161059j034193q52659p84510o95587p16376m90521n64722m33712
5310C0609511m21023n42507m59533m75719n80413m69740m34672m26190l46410
5301B6453304m37566l91857l98297l40382l02876m17853l62142j99148l55451
5292B3247732l10269l28275k01188j12173k87203l23122l65799j82114j62081
$$ y = [59805039, 59175413, 58026805, 56616210, 55154912, 53597605, 52321021, 51188753, 50247338, 49424581, 48642134, 48067471, 47598940, 47381814, 47282555, 47154762, 47201452, 47168158, 47283190, 47446905, 47633135, 47700766, 47771035, 47752408, 47718784, 47356860, 46937108, 46549961, 45899272, 45240149, 44513056, 43836975, 43142189, 42080923, 40817578, 39624504, 38435424, 37342850, 36181791, 35147598, 34294939, 33510429, 32814842, 32098466, 31607945, 31043223, 30609511, 30188488, 29645981, 29186448, 28710729, 28130316, 27660576, 27225904, 26799714, 26453304, 26015738, 25623881, 25225584, 24885202, 24582326, 24164473, 23802331, 23603183, 23247732, 22937463, 22609188, 22408000, 22295827, 22008624, 21685502, 21319703, 21137589, 20975508]
5283B0975508l20511j19455j00250j14244k50353j59931n2207j45783k02902k52568
5273A9257304k30508r8813J24195o2322j44439o3641j64874q8188j02892j47633
5263A8278189J5208r4754K2709l2610j75550j2742J06250L0722j25985p1750j56896
5252A7782791N0855j27261j95582m2330K8335p709j03638r1020q7421Q653P7317
5241A7292990j69516j54612l3956J48148L2033J6337p3774j9414K3145l9240J11394
5230A7133535j37996q1013p4477r3356n4645J22947P6920J30080O2095r895n438
5219A7068757J46945j63871N2421J06812q0928J33834l2352P1985k28642K7593
5209A7102554P1028J401o7634j7626j08450r2820j26488K3411k6204k69262l6992
$$ y = [20975508, 20654997, 20535542, 20435292, 20321048, 20070695, 19910764, 19858557, 19712774, 19509872, 19257304, 19026796, 18927983, 19052178, 18989856, 18845417, 18781776, 18616902, 18528714, 18425822, 18278189, 18293397, 18198643, 18221352, 18188742, 18013192, 18000450, 18106700, 18137422, 18011437, 17939687, 17782791, 17833646, 17706385, 17510803, 17468473, 17496808, 17489099, 17385461, 17294441, 17207020, 17215673, 17292990, 17123474, 16968862, 16934906, 17083054, 17115087, 17131424, 17057650, 17038236, 17061381, 17022141, 17133535, 16995539, 16914526, 16840049, 16746693, 16692048, 16814995, 16891915, 17021995, 17084090, 17074195, 17068757, 17215702, 17051831, 17104252, 17211064, 17130136, 17263970, 17231618, 17303603, 17074961, 17102554, 17173582, 17174983, 17107349, 17089723, 16981273, 16888453, 16761965, 16785376, 16759172, 16489910, 16452918]
5198A6452918L5921k08646j34885j20153l7075m0000j56663j88465p0795M4577
5188A5576734j16525j87454m8506j40776l3145j52655j22590J8054j22286j6880
5178A4653971L2198P5229n3683j40969j32671J74224r9827j14647p1479J416n7483
5167A4266279R2053k4611p7509N2025K3661r129Q3605N6171q8334n3514O074j7550
5155A4309221J16822K3435L2829R1214O0523P4596L2355L3716J22199K0231j0011
5144A4907130J62085M4391m1178m3749J66717O9450r0653O4169M0422P1020J39801
5133A5489605p202n0204J83199K09637K07658J35727L74328M41364O15943O00312
5123A8200367Q93288O67147N09975q6406n53816p75961j141145p21441o03858
$$ y = [16452918, 16488839, 16280193, 16145308, 16025155, 15988080, 15948080, 15791417, 15602952, 15532157, 15576734, 15460209, 15272755, 15224249, 15083473, 15050328, 14897673, 14775083, 14793137, 14670851, 14653971, 14686169, 14761398, 14707715, 14566746, 14434075, 14608299, 14508472, 14393825, 14322346, 14323762, 14266279, 14358332, 14333721, 14256212, 14308237, 14331898, 14322769, 14406374, 14462545, 14374211, 14320697, 14326771, 14309221, 14426043, 14449478, 14482307, 14573521, 14634044, 14708640, 14740995, 14774711, 14896910, 14917141, 14907130, 15069215, 15113606, 15072428, 15028679, 15195396, 15264846, 15174193, 15238362, 15278784, 15349804, 15489605, 15482403, 15432199, 15615398, 15825035, 16032693, 16168420, 16542748, 16984112, 17600055, 18200367, 19093655, 19760802, 20270777, 20184371, 19630555, 18854594, 17713449, 16992008, 16388150]
5114A6388150o47053k69185l48288l70690j90895k25804l57740k75823l1849k03654
5104A3467169j69132j14519j05443j22987k04045j5652j87668k67175L9840m045
5094A2316343j10831j57461j642k78447k2337J30734Q9102j05731o3227o5389
5084A1731114j26841J2600O8848j76757k09266q5586O2772j49545K5102p0898
5074A1081543q2808q9619L5818k3483j64681r1968m160j30303n5793o1884L7320
5063A0449982Q8451P4216m1057J1571M388o5702m0923r098j63496p3496J17292
5052A0352128L7974j61446j68210K04276j30348N6981p0101j0244P556j04452
5042A0014114n7544j33807L9972K7679j7672Q7p3814J50492J5219J8012J73185
$$ y = [16388150, 15741097, 15471912, 15123624, 14752934, 14562039, 14336235, 13978495, 13702672, 13670823, 13467169, 13298037, 13183518, 13078075, 12955088, 12751043, 12735391, 12547723, 12280548, 12320388, 12316343, 12205512, 12048051, 12046409, 11767962, 11745625, 11876359, 11965461, 11859730, 11796503, 11731114, 11604273, 11616873, 11685721, 11508964, 11299698, 11214112, 11276884, 11127339, 11152441, 11081543, 10998735, 10909116, 10944934, 10921451, 10756770, 10664802, 10660642, 10530339, 10474546, 10412662, 10449982, 10538433, 10612649, 10571592, 10583163, 10587551, 10521849, 10480926, 10471828, 10308332, 10234836, 10352128, 10390102, 10228656, 10060446, 10264722, 10134374, 10191355, 10121254, 10111010, 10118566, 10014114, 9956570, 9822763, 9862735, 9890414, 9872742, 9872829, 9799015, 9949507, 9964726, 9982738, 10155923]
5031A0155923J7993j19963O117n2080j62257o9580J8070K5338K0262j2304J59534
5020I987053k6740j64726L8998q6435j8050l7322j3070o9831J13515o0648j03385
5009I559359J36018m4750j38580j00122l4457p1923O5028K06588o9360k48549
4999I259252Q0938l0157Q889O5487J1950n6807l8744q0912J9040l7365O7651O7382
4987I336604j08031K8924j08911O1867o823k9665O6521o6217j1074P3055N7036
4976I293286j88828k1928Q9669m0802l6471M7330m940P8078J36295J04112j10559
4965I345242r4805N4710J19147M0142r5191M0029q5450K1161M6684n8551P4271
4954I407389M4794m6115N411k671R7405j37835q1600N1388m3936M366R2935N2774
$$ y = [10155923, 10173916, 10053953, 10060070, 10007990, 9845733, 9776153, 9794223, 9819561, 9839823, 9827519, 9987053, 9960313, 9795587, 9834585, 9748150, 9730100, 9692778, 9679708, 9609877, 9723392, 9662744, 9559359, 9695377, 9650627, 9512047, 9411925, 9377468, 9305545, 9370573, 9577161, 9507801, 9259252, 9340190, 9310033, 9318922, 9384409, 9396359, 9339552, 9300808, 9219896, 9238936, 9201571, 9269222, 9336604, 9228573, 9257497, 9148586, 9210453, 9203630, 9173965, 9240486, 9174269, 9163195, 9236250, 9293286, 9104458, 9082530, 9172199, 9131397, 9094926, 9142256, 9137316, 9215394, 9351689, 9455801, 9345242, 9250437, 9305147, 9424294, 9464436, 9369245, 9409274, 9323824, 9344985, 9391669, 9333118, 9407389, 9452183, 9406068, 9411479, 9408808, 9506213, 9368378, 9286778, 9338166, 9294230, 9298596, 9391531, 9444305]
4942I444305j88877j49447K25726J74802j25617p7416k0653p263r9802K1308r5585
4931I101481N0637k410n5501N2975p5459m9147Q7667J31850j6310m5886q2765
4920I097132l207Q6268o3412L5278J01891j34057k26212R7734J11090q1396K0544
4909I041653J11467k1221r5803l2550q1724J01034M3286j6717k2160m4225R3289
4898I076329J40915k2526O9980k6205q8262N7589J51869n2395q264K01386J26200
4887I626616j72612J4970m0769M1661n7267N9747J97187P3607J74571J340p0173
4876I848878p568n3400K1370J35515J35865J04299r2767J29392J50052j9933J1312
4865A0363015R7752Q4908J99318k3421j30819k2719J85492j13390M3711L9596
$$ y = [9444305, 9255428, 9105981, 9331707, 9506509, 9380892, 9303476, 9282823, 9275560, 9175758, 9197066, 9101481, 9152118, 9149708, 9094207, 9147182, 9071723, 9022576, 9110243, 9242093, 9225783, 9179897, 9097132, 9093925, 9180193, 9116781, 9152059, 9253950, 9119893, 8893681, 8991415, 9102505, 9021109, 9041653, 9153120, 9131899, 9036096, 9003546, 8921822, 9022856, 9066142, 9049425, 9027265, 8983040, 9076329, 9217244, 9194718, 9264698, 9238493, 9150231, 9207820, 9359689, 9307294, 9299030, 9500416, 9626616, 9454004, 9468974, 9428205, 9469866, 9412599, 9472346, 9669533, 9743140, 9917711, 9919051, 9848878, 9841310, 9787910, 9809280, 9944795, 10080660, 10184959, 10092192, 10221584, 10371636, 10351703, 10363015, 10460767, 10545675, 10744993, 10721572, 10590753, 10568034, 10753526, 10640136, 10683847, 10723443]
4855A0723443k21319O6572O3878K9540p0130l2920N7827O4521K7130L9316P7230
4844A0825088O0235L6771j2678N9746R3654J8304r102j969J51511j2868J08501
4833A1317193Q0267k9984M6579J66830O644Q2834r5804j7908K11497l2321m414
4822A1731413K7363L7661P2335k7253L0176Q9232L7036J99249K3838J37301K53358
4811A2611709O1238j94046L8012J59634K15096L889J12825k676J96762J82285
4801A3384728o9682J29639J23156J18443M5391J00269L12410K58436l0284J10923
4791A4483429K04488J73827K21609J58642J93145K91872J63097K37845J28711
4782A6256665K50853K35190K55317K52767J63060L78140K86404L23920K72641
$$ y = [10723443, 10502124, 10568696, 10632574, 10662114, 10591984, 10559064, 10616891, 10681412, 10708542, 10747858, 10825088, 10885323, 10922094, 10909416, 10969162, 11062816, 11081120, 11072018, 11070049, 11221560, 11208692, 11317193, 11397460, 11367476, 11414055, 11580885, 11587529, 11670363, 11574559, 11556651, 11768148, 11735827, 11731413, 11758776, 11796437, 11868772, 11841519, 11871695, 11960927, 11997963, 12197212, 12221050, 12358351, 12611709, 12672947, 12478901, 12516913, 12676547, 12891643, 12895532, 13008357, 13005681, 13202443, 13384728, 13315046, 13444685, 13567841, 13686284, 13731675, 13831944, 14144354, 14402790, 14372506, 14483429, 14687917, 14861744, 15083353, 15241995, 15435140, 15727012, 15890109, 16127954, 16256665, 16507518, 16742708, 16998025, 17250792, 17413852, 17791992, 18078396, 18402316, 18674957]
4773A8674957J72134K46767L17127K75350J71714M65983L13524L73013M06072
4764B1416641J58810L49124L73102K92901L63233K45948L58801N85513M13177
4755B4557250K72626L23132N05566L85282L87003M54332L23353M38855O81269
4746B8328668M03226M68546M78313M82456N27125N24263L69554N97441M80068
4737C2659660K89905L90887L31457L18918K44562L01259J95285J70648J51727
4728C5054308j76969k24078q6019j87465j43850N8305P0664J08322K48939K74067
4718C4996224K24469K90969L38338L70734L17227L71578O02090M43579M52079
4709C8407287L73279O14969O80760O51256M22592O17822N50640N59014O04489
$$ y = [18674957, 18847091, 19093858, 19410985, 19686335, 19858049, 20324032, 20637556, 21010569, 21416641, 21575451, 21924575, 22297677, 22590578, 22953811, 23199759, 23558560, 24144073, 24557250, 24829876, 25153008, 25658574, 26043856, 26430859, 26885191, 27208544, 27647399, 28328668, 28731894, 29200440, 29678753, 30161209, 30688334, 31212597, 31582151, 32179592, 32659660, 32949565, 33340452, 33671909, 33990827, 34235389, 34536648, 34731933, 34902581, 35054308, 34877339, 34653261, 34567242, 34379777, 34235927, 34294232, 34364896, 34473218, 34722157, 34996224, 35220693, 35511662, 35850000, 36220734, 36537961, 36909539, 37511629, 37955208, 38407287, 38780566, 39395535, 40076295, 40727551, 41150143, 41767965, 42318605, 42877619, 43482108]
4700D3482108K91553K82141L51189J87904K43813K05345L02057K34760J07945
4691D5688815J61127J66708K67405K17171R7955J22516J13958J80641K09189L77395
4681D7602880L88934L26999K68685N07139N63122L95039O75913Q16557P00030
4672E2245298P67215Q76648O35913O85485P04596O24991M87781K28634J19053
4663E7375614L7767k13319k54856k46130m06918k25504m74896n61810j48507k47838
4653E4633603j87953j95626O0897O1685Q2304J49026L66486L11392M75663L47129
4643E6104606K86449L74102K54659L92209L75079M06393K74791J39620Q0985K74640
4633E8963533J17781J35494K3977k651j01115j47778r7240r6294J0593l9637m3083
$$ y = [43482108, 43773661, 44055802, 44406991, 44594895, 44838708, 45044053, 45346110, 45580870, 45688815, 45849942, 46016650, 46284055, 46501226, 46599181, 46721697, 46835655, 47016296, 47225485, 47602880, 47991814, 48318813, 48587498, 49094637, 49657759, 50052798, 50728711, 51545268, 52245298, 53012513, 53889161, 54525074, 55210559, 55915155, 56540146, 57027927, 57256561, 57375614, 57413381, 57200062, 56945206, 56699076, 56292158, 56066654, 55591758, 55029948, 54881441, 54633603, 54445650, 54250024, 54310921, 54372606, 54454910, 54603936, 54970422, 55281814, 55757477, 56104606, 56391055, 56765157, 57019816, 57412025, 57787104, 58193497, 58468288, 58607908, 58688893, 58963533, 59081314, 59216808, 59240785, 59238134, 59137019, 58989241, 58892001, 58795707, 58806300, 58766663, 58723580]
4622E8723580j07267K43058J67325M20970L68129N28544M79660O52314Q10602
4613F2286915Q53955R78022J153814J192008J431189J515421J495526J724961
4605G2631811J790575J833004K116470K277249K081729K364145K764636K806117
4597I0665736K823744K882379K965465L286871L159827L134368K946770K778917
4589A14644077K524490K288398K071185J917832J902413J836974J661337J775127
4581A30621833J629955J874671J986041K255724K739341K831575L053932L551404
4573A50544476L915376M146056M481296M956370N105948N144805N296385N142185
4565A88732897N043205M609756M123527L238544J774873Q7630j610326l245246
$$ y = [58723580, 58616313, 58859371, 59026696, 59447666, 59815795, 60344339, 60823999, 61476313, 62286915, 63140870, 64118892, 65272706, 66464714, 67895903, 69411324, 70906850, 72631811, 74422386, 76255390, 78371860, 80649109, 82730838, 85094983, 87859619, 90665736, 93489480, 96371859, 99337324, 102624195, 105784022, 108918390, 111865160, 114644077, 117168567, 119456965, 121528150, 123445982, 125348395, 127185369, 128846706, 130621833, 132251788, 134126459, 136112500, 138368224, 141107565, 143939140, 146993072, 150544476, 154459852, 158605908, 163087204, 168043574, 173149522, 178294327, 183590712, 188732897, 193776102, 198385858, 202509385, 205747929, 207522802, 207610432, 206000106, 202754860]
4557B02754860m319031m747889m633037m423723l487375k840605k247880j592268
4549A74463052j004493m57618j54562L74983J051518J502364J736335J972975
4541A79484554J772485J459970R81037j16929j189995k082603l094828m007892
4533A73205799m419526m676865n035600m556596m280414l727621l192977k489677
4525A40826523k052352j338110o22405k45479L00201R13149J208873J680310J974741
4516A42645451K316301K365210K460543K252050J883434J434097J021348M42914
4508A56821348o6801j87359m00945n36469n63315j57326M751K55665O41465Q98162
4498A56709176J188448J490065J670330J968320J990221J972271J860883J525563
$$ y = [202754860, 198435829, 193687940, 189054903, 184631180, 181143805, 178303200, 176055320, 174463052, 173458559, 173000941, 172846379, 173221362, 174272880, 175775244, 177511579, 179484554, 181257039, 182717009, 183698046, 183581117, 182391122, 180308519, 177213691, 173205799, 168786273, 164109408, 159073808, 154517212, 150236798, 146509177, 143316200, 140826523, 138774171, 137436061, 136813656, 136568177, 136868378, 137781527, 138990400, 140670710, 142645451, 144961752, 147326962, 149787505, 152039555, 153922989, 155357086, 156378434, 156821348, 156754547, 156567188, 156166243, 155629774, 155066459, 154909133, 154913884, 155169549, 155811014, 156709176, 157897624, 159387689, 161058019, 163026339, 165016560, 166988831, 168849714, 170375277]
4490A70375277J172888O66965L02668r1704l19856l24468j49727m2476J99008
4481A71788575P67457R41260J437183J835991K356778K456991K700455L015500
4473A87300190L046278L384012L551334L616852L673639L878493L769708L828089
4465B16048595L783824L994697L873035L681679L689354L435965L470839L173735
4457B45151723L117714K873818K685664K489517K551734K645153K652055K691445
4449B66858823K711608K743549L062318K835288K863888K758784K929788K563961
4441B89328007K327950K146985J436251O08690k55693j227683k111625k481537
4433B89771345l176795l546901l646594m108831m219675m192267l834044l352770
$$ y = [170375277, 171548165, 172215130, 172517798, 172426094, 172106238, 171781770, 171632043, 171589567, 171788575, 172556032, 173497292, 174934475, 176770466, 179127244, 181584235, 184284690, 187300190, 190346468, 193730480, 197281814, 200898666, 204572305, 208450798, 212220506, 216048595, 219832419, 223827116, 227700151, 231381830, 235071184, 238507149, 241977988, 245151723, 248269437, 251143255, 253828919, 256318436, 258870170, 261515323, 264167378, 266858823, 269570431, 272313980, 275376298, 278211586, 281075474, 283834258, 286764046, 289328007, 291655957, 293802942, 295239193, 295847883, 295592190, 294364507, 292252882, 289771345, 286594550, 283047649, 279401055, 275292224, 271072549, 266880282, 263046238, 259693468]
4425B59693468k976779k481779j819268j250642o93409l9361K55486Q54990R36118
4416B52478824J255892J342902J273872J600128J897611K232844L062845L832669
4408B68977587M787797O162665P659126Q989736J0530891J2498537J4784180J7495388
4400C51885907K0578669K3870049K7052302K8807436K7891014K2244262J1192437
4393E13522076l484651j8599512k9853673l5654207l6806698l4419901l0869580
4386C23833854k6823306k2705158j9407954j6558726j4348928j2637560j1061821
4379B00290401r905430q954580q226722p347305o868372o195799n342661m767531
4371A42682001m487920l914662l406620l173617k920774k768403k541366k661408
$$ y = [259693468, 256716689, 254234910, 252415642, 251165000, 250471591, 250432230, 250687716, 251542706, 252478824, 253734716, 255077618, 256351490, 257951618, 259849229, 262082073, 265144918, 268977587, 273765384, 279928049, 287587175, 296576911, 307107802, 319606339, 334390519, 351885907, 372464576, 396334625, 423386927, 452194363, 480085377, 502329639, 513522076, 510037425, 491437913, 461584240, 425930033, 389123335, 354703434, 323833854, 297010548, 274305390, 254897436, 238338710, 223989782, 211352222, 200290401, 190384971, 181430391, 173203669, 165856364, 158987992, 152792193, 147449532, 142682001, 138194081, 134279419, 130872799, 127699182, 124778408, 122010005, 119468639, 116807231]
4363A16807231k627585k695269k598868k547388k307769k380624k199018j956850
4355I7493860j606680j518853j177577j071942r06005p26498p54126p57736n79723
4346H8394720o27524p68579m59219l89475n49863l98430k86770l10752n929k0847
4336H4577332P3476J20281K41189N53623O13179Q21708Q83474J066760J234645
4327I0185667J319519J809755J815173K027950K373866K722250K918682L491523
4319A08664385L714729M140886M731736N508580O129153O743262P512369Q614257
4311A55759357R741657J0904862J2439214J3867624J5452070J6842112J8136701
4304B53143597J8746027J8471281J6602898J2662304O639832o46055q042453j4366305
$$ y = [116807231, 114179646, 111484377, 108885509, 106338121, 104030352, 101649728, 99450710, 97493860, 95887180, 94368327, 93190750, 92118808, 91212803, 90486305, 89732179, 88974443, 88394720, 87767196, 86998617, 86539398, 86149923, 85600060, 85201630, 84914860, 84604108, 84598179, 84577332, 84650808, 84771089, 85012278, 85565901, 86179080, 87000788, 87884262, 88951022, 90185667, 91505186, 93314941, 95130114, 97158064, 99531930, 102254180, 105172862, 108664385, 112379114, 116520000, 121251736, 126760316, 132889469, 139632731, 147145100, 155759357, 165501014, 176405876, 188845090, 202712714, 218164784, 235006896, 253143597, 271889624, 290360905, 306963803, 319626107, 326265939, 325619884, 317577431, 303211126]
4296C03211126j8672791k0544958k0648338j9894456j8425644j6432948j4403417
4289A74188574j2959795j1503803j0122935q863608q149266p282194o587277n966366
4281A02753330n363538m848193m370500m101845l871005l312302l175197k887258
4273G0823492k604124k427212k236475j940807k017510j828578j832886j760623
4265E4175277j621552j609514j398261j332449j088476j169347j047774j025307
4257D3882597r78242r14074p68006o52652o82372q01246q40991o98514n79886
4248C6966614p67330o45436p37136o12375p03642n73334n83269n63260o74186
4239C1106646m31688m04357l45746m42186k40250l09423l40287k15991j22521
$$ y = [303211126, 284538335, 263993377, 243345039, 223450583, 205024939, 188591991, 174188574, 161228779, 149724976, 139602041, 130738433, 122589167, 115306973, 108719696, 102753330, 97389792, 92541599, 88171099, 84069254, 80198249, 76885947, 73710750, 70823492, 68219368, 65792156, 63555681, 61614874, 59597364, 57768786, 55935900, 54175277, 52553725, 50944211, 49545950, 48213501, 47125025, 45955678, 44907904, 43882597, 42904355, 41990281, 41222275, 40569623, 39887251, 39086005, 38245014, 37546500, 36966614, 36199284, 35553848, 34816712, 34204337, 33500695, 32927361, 32344092, 31780832, 31106646, 30674958, 30270601, 29924855, 29482669, 29242419, 28932996, 28592709, 28376718, 28254197]
4230B8254197m8829n5617k25446j02605j37255l00412k96819l60404m69617l74222
4220B5882971m30011n12195n49103l17175l04774l34552j51730k78361k20220
4211B2784850k61546l57735k21054k51471l86889l00799l21329k57654k93236
4202B0133137k17065q3331k82415j22512j33810j17700j0869j3649q4427j84607
4192A8882752j9249k72705o1002j50405j8868J6559j00331j66974j29811j73844
4182A7806122l4294n3664m597j23539j3322n0589j78464m4778q1415L0875l7897
4171A7214438M679J05993j07186l0181r9860l1306j56589o7999O4P4450o0896
4160A6845607l4721n1620p0147k6488l0092L7581n9347J8622N6193Q8881K68065
$$ y = [28254197, 28205368, 28149751, 27924305, 27821700, 27684445, 27384033, 27087214, 26726810, 26257193, 25882971, 25452960, 24940765, 24391662, 24074487, 23769713, 23435161, 23283431, 23005070, 22784850, 22523304, 22165569, 21944515, 21693044, 21306155, 21005356, 20684027, 20426373, 20133137, 19916072, 19832741, 19550326, 19427814, 19294004, 19176304, 19165435, 19151786, 19067359, 18882752, 18863503, 18590798, 18529796, 18379391, 18360523, 18377082, 18276751, 18109777, 17979966, 17806122, 17771828, 17718164, 17713567, 17590028, 17576706, 17526117, 17347653, 17302875, 17221460, 17252335, 17214438, 17219117, 17325110, 17217924, 17187743, 17087883, 17056577, 16899988, 16831989, 16832053, 16906503, 16845607, 16810886, 16759266, 16689119, 16662631, 16632539, 16670120, 16610773, 16629395, 16685588, 16774469, 17042534]
4149A7042534J56297J60813L18747O4389m4612m6813m2848j02549K435j06193
4139A7402200R5223J34765j33732l85J64448L8005N5710l9621m7489l2229n5833
4128A7581062m6481q5148l477k5509N6884j127j09248j55197O605O8671K3889
4117A7310924L049L765J86899K32134J34720J79760L0950l5125M4584R6785o2988
4106A8125457l7074k6778K09550J48436P833L1427q5703K11648j6289J38650K92155
4095A8999312J43369J22114L08164L60131J92794R7225J29403j09511K8020N4883
4085B0325904J68333j25511p0048j21384n7545R7190L4733Q0457K9110J88935
4075B0550174J24978Q7954m5639K38267K62850Q6406J03606J69117K24705J51159
$$ y = [17042534, 17198831, 17359644, 17678391, 17742780, 17698168, 17651355, 17608507, 17505958, 17508393, 17402200, 17497423, 17632188, 17498456, 17498071, 17662519, 17700524, 17756234, 17716613, 17669124, 17636895, 17581062, 17534581, 17449433, 17445956, 17420447, 17477331, 17476204, 17366956, 17211759, 17218364, 17287035, 17310924, 17313973, 17317738, 17504637, 17736771, 17871491, 18051251, 18082201, 18047076, 18091660, 18188445, 18125457, 18088383, 18061605, 18271155, 18419591, 18427424, 18458851, 18373148, 18584796, 18568507, 18707157, 18999312, 19142681, 19264795, 19572959, 19933090, 20125884, 20223109, 20352512, 20243001, 20271021, 20325904, 20494237, 20368726, 20298678, 20177294, 20119749, 20216939, 20251672, 20332129, 20361239, 20550174, 20675152, 20763106, 20717467, 20955734, 21218584, 21304990, 21408596, 21577713, 21802418, 21953577]
4065B1953577K60339J41929K07044K93912K18943L31763J75267M11342K89254
4056B4283370L67812L25830K59555L46345K31166K18876K26842L33199K16208
4047B6809203L81626J97288R1857K80857L09822M00532L96298M47479L93637M52619
4037C0161218N35126N84173M76776O13646P37657O35586N96794P98372P11771
4028C5851119O91170R33532R04243Q10202R17743Q65796J026868J135521J024037
4019D4160231J295002J295765J344067J233263J337791J627299J571036J607320
4011E5471774J558176J718079J894947J998230K116954J956118K022650K173185
4003G0910113K382158K425671K627008K399363K565295K730525K636292K619991
$$ y = [21953577, 22213916, 22355845, 22562889, 22856801, 23075744, 23407507, 23582774, 23994116, 24283370, 24651182, 24977012, 25236567, 25582912, 25814078, 26032954, 26259796, 26592995, 26809203, 27190829, 27388117, 27479974, 27760831, 28070653, 28471185, 28867483, 29314962, 29708599, 30161218, 30696344, 31280517, 31757293, 32370939, 33108596, 33744182, 34340976, 35139348, 35851119, 36542289, 37475821, 38380064, 39190266, 40108009, 40973805, 42000673, 43136194, 44160231, 45455233, 46750998, 48095065, 49328328, 50666119, 52293418, 53864454, 55471774, 57029950, 58748029, 60642976, 62641206, 64758160, 66714278, 68736928, 70910113, 73292271, 75717942, 78344950, 80744313, 83309608, 86040133, 88676425, 91296416]
3995I1296416K828994K681338K637481K727352K900504K854575K623780K866407
3987A13416847K844369K694912K684823K703289K607106K506777K634060K443755
3979A34535938K313784K298508K174556K215595K008851K110974J937250J864703
3971A51460159J692173J519433J467076J373081J470084J300572J247861J341959
3963A62872398J270492J129053J234719J411836J253853J346554J316769J289481
3955A73125155J212307J371066J183780J185070J383910J269777J406523J611011
3947A83748599J592005J654129J488756J594601J535053J427849J309656J091627
3939A95442275R74895J132183Q93635P22472M38689L16991L87541k0157j09682
$$ y = [91296416, 94125410, 96806748, 99444229, 102171581, 105072085, 107926660, 110550440, 113416847, 116261216, 118956128, 121640951, 124344240, 126951346, 129458123, 132092183, 134535938, 136849722, 139148230, 141322786, 143538381, 145547232, 147658206, 149595456, 151460159, 153152332, 154671765, 156138841, 157511922, 158982006, 160282578, 161530439, 162872398, 164142890, 165271943, 166506662, 167918498, 169172351, 170518905, 171835674, 173125155, 174337462, 175708528, 176892308, 178077378, 179461288, 180731065, 182137588, 183748599, 185340604, 186994733, 188483489, 190078090, 191613143, 193040992, 194350648, 195442275, 196417170, 197549353, 198442988, 199165460, 199604149, 199921140, 200308681, 200288524, 200178842]
3930B00178842l96304n76541j012078j268785j584177j908615k233064k490245
3922A88709033k590663k819043l023546l233673l392009l670036l650898l805322
3914A62523843m031426m102104m366824m475098m560896m514695m552325m660719
3906A27259756m621273m386716m378555m292916m183555m068915m227679m100184
3898I2999963l783590l504179l753417l607797l257298l178295k959875l042961
3890F5912551k769252k510341k491457k375763k240994j979608j923848j923312
3882D7697976j676796j651814j491159j473337j493222j357865j165837j151874
3874C6236072j035083j115097r36345r65771r62425p45635p24877n48444p54857
$$ y = [200178842, 199782538, 199205997, 198193919, 196925134, 195340957, 193432342, 191199278, 188709033, 186118370, 183299327, 180275781, 177042108, 173650099, 169980063, 166329165, 162523843, 158492417, 154390313, 150023489, 145548391, 140987495, 136472800, 131920475, 127259756, 122638483, 118251767, 113873212, 109580296, 105396741, 101327826, 97100147, 92999963, 89216373, 85712194, 81958777, 78350980, 75093682, 71915387, 68955512, 65912551, 63143299, 60632958, 58141501, 55765738, 53524744, 51545136, 49621288, 47697976, 46021180, 44369366, 42878207, 41404870, 39911648, 38553783, 37387946, 36236072, 35200989, 34085892, 33149547, 32183776, 31221351, 30475716, 29750839, 29202395, 28447538]
3865B8447538o47997p45082o73709m65136m08601n91618l57704m28528n50747
3856B3578416l78875l57583k93653m38265k54092k88914j99966k62954k84017
3847B0820097j51317j98604k63070k86414j73575k03831j78423N3743l2366j42072
3837A9244168j09573p917r0727j70639N9032m6338n4988J3140l5896k6927O3860
3826A8837195j24663j90538j60918j18290L3904j37859j62653j53381m6960n3622
3816A7722215j15893q4107j50374j91246r4124j61798j34683k20885j28369k06264
3806A6234472k07276p4866n8609j09994j76263K149p9589o6084m6233q4860n3609
3795A5279238n39p5363j30961j8939L8925o6121j75680M1819J75437R6158j12397
$$ y = [28447538, 27799541, 27054459, 26380750, 25915614, 25507013, 24915395, 24557691, 24129163, 23578416, 23199541, 22841958, 22548305, 22110040, 21855948, 21567034, 21367068, 21104114, 20820097, 20668780, 20470176, 20207106, 19920692, 19747117, 19543286, 19364863, 19418606, 19386240, 19244168, 19134595, 19126678, 19035951, 18865312, 18924344, 18878006, 18823018, 18836158, 18800262, 18773335, 18837195, 18712532, 18521994, 18361076, 18242786, 18276690, 18138831, 17976178, 17822797, 17775837, 17722215, 17606322, 17522215, 17371841, 17180595, 17086471, 16924673, 16789990, 16569105, 16440736, 16234472, 16027196, 15952330, 15893721, 15783727, 15607464, 15609613, 15530024, 15463940, 15417707, 15332847, 15279238, 15278699, 15203336, 15072375, 15053436, 15092361, 15026240, 14850560, 14892379, 15067816, 15163974, 15051577]
3784A5051577K5428p8498j7031q137J02592J88570J21712N9113M9258J02314L4949
3773A5631847J23770R9683L5825L7267K2048N1897K23938M0711J14876J76897
3763A6558759J24575P5306R3083J50110J78554R4220J63713Q4082K31030J21099
3753A7874531J15413K15794R2811J45066K33126J26867K51398J40486J46523J68638
3743A9510653L28526K02665K26685J09150K18037L10731K10324K82905L69658
3734B1769334J82316K47670K71963K26425K75005L80722L28186K53652M90593
3725B4425866K55346L40991M54361L36023L27436K82655M47795N15596K99030
3716B7685099M38436K84771N36652L76810M73150M19641O53347M46501M87633
$$ y = [15051577, 15077005, 14998507, 14981476, 14973339, 15075931, 15264501, 15386213, 15445326, 15494584, 15596898, 15631847, 15755617, 15855300, 15891125, 15928392, 15950440, 16002337, 16226275, 16266986, 16381862, 16558759, 16683334, 16758640, 16851723, 17001833, 17180387, 17274607, 17438320, 17522402, 17753432, 17874531, 17989944, 18205738, 18298549, 18443615, 18676741, 18803608, 19055006, 19195492, 19342015, 19510653, 19839179, 20041844, 20268529, 20377679, 20595716, 20906447, 21116771, 21399676, 21769334, 21951650, 22199320, 22471283, 22697708, 22972713, 23353435, 23681621, 23935273, 24425866, 24681212, 25022203, 25476564, 25812587, 26140023, 26422678, 26870473, 27386069, 27685099, 28123535, 28408306, 28944958, 29321768, 29794918, 30214559, 30867906, 31314407, 31802040]
3707C1802040N03323M60782O77226N31489M78088O46831O82235O85292N47263
3698C7014569N49002O16161O70635O93150O65115P65312R21677P97099O58732
3689D3351452P02574R04646Q23496Q71737R24082R89709J113264Q52390J061562
3680E1594912J103138J253629J251403J134651J286294J461971J443545J470248
3672F1999791J442171J607953J684569J809947J781780J785107J957137K052981
3664G6121436J855285K001822K009249K009868K066900J957595K082562K232953
3656I2337670K192464K205788K302610K291797K340441K339306K281776K270654
3648A10562506K444959K267620K435867K424057K277280K451753K427850K114442
$$ y = [31802040, 32305363, 32766145, 33443371, 33974860, 34452948, 35099779, 35782014, 36467306, 37014569, 37563571, 38179732, 38850367, 39543517, 40208632, 40973944, 41895621, 42692720, 43351452, 44054026, 44958672, 45782168, 46653905, 47577987, 48567696, 49680960, 50533350, 51594912, 52698050, 53951679, 55203082, 56337733, 57624027, 59085998, 60529543, 61999791, 63441962, 65049915, 66734484, 68544431, 70326211, 72111318, 74068455, 76121436, 77976721, 79978543, 81987792, 83997660, 86064560, 88022155, 90104717, 92337670, 94530134, 96735922, 99038532, 101330329, 103670770, 106010076, 108291852, 110562506, 113007465, 115275085, 117710952, 120135009, 122412289, 124864042, 127291892, 129406334]
3640A29406334K305003K293395K162067K147235K283903K257937K113632K292681
3632A47262187K221026K072125K145290K171409K001437K079219K108235K129671
3624A64190599K167875K208258K275317K522969K545407K761517L034548L180017
3616A84886507L522272L694057L707707L915717M166052M307930M296753M531408
3608B17028403M657348M931292M929876N156024N321708N326965N609298N867184
3600B58828098N968685N964119O256523O305173O229324O160763O396476O282088
3592C08391249O264232O330652O200646O073109N978290N960185N706520N596486
3584C56501369N456504N183123N106091M994646M668022M721791M440995L980603
$$ y = [129406334, 131711337, 134004732, 136166799, 138314034, 140597937, 142855874, 144969506, 147262187, 149483213, 151555338, 153700628, 155872037, 157873474, 159952693, 162060928, 164190599, 166358474, 168566732, 170842049, 173365018, 175910425, 178671942, 181706490, 184886507, 188408779, 192102836, 195810543, 199726260, 203892312, 208200242, 212496995, 217028403, 221685751, 226617043, 231546919, 236702943, 242024651, 247351616, 252960914, 258828098, 264796783, 270760902, 277017425, 283322598, 289551922, 295712685, 302109161, 308391249, 314655481, 320986133, 327186779, 333259888, 339238178, 345198363, 350904883, 356501369, 361957873, 367140996, 372247087, 377241733, 381909755, 386631546, 391072541, 395053144]
3576C95053144L756940L612307L105697K568753K223348J872184J537483J550417
3568D15280273J161611R48092J278093J318940J486192J880305K072107K355502
3560D27781115K714422L011729L434361L837398M212963M443241M843555N071238
3552D59350022M872638M925109M939919M095057L492021K937658K011870J287784
3544D87912078M21114m77855j029791j709379k124841k742132l324041l892350
3536D73032803m540157n394473o501016p477384q240450r238533j0163544j0933804
3528D10543442j1289662j1667377j1943983j1699411j1656927j1305395j1178785
3521C29801902j0700862j0281100r918842r406770r029032q644841q234826p881985
$$ y = [395053144, 398810084, 402422391, 405528088, 408096841, 410320189, 412192373, 413729856, 415280273, 416441884, 417389976, 418668069, 419987009, 421473201, 423353506, 425425613, 427781115, 430495537, 433507266, 436941627, 440779025, 444991988, 449435229, 454278784, 459350022, 464222660, 469147769, 474087688, 478182745, 481674766, 484612424, 486624294, 487912078, 488333192, 487855337, 486825546, 485116167, 482991326, 480249194, 476925153, 473032803, 468492646, 463098173, 456597157, 449119773, 440879323, 431640790, 421477246, 410543442, 399253780, 387586403, 375642420, 363943009, 352286082, 340980687, 329801902, 319101040, 308819940, 298901098, 289494328, 280465296, 271820455, 263585629, 255703644]
3513B55703644p619693p341050p001576o535695o063171n829209n427689m918038
3505B04967523m568548m048605l713835l321144l101299k809883k761745k567848
3497A78074616k352749k177117j880700j672964j408727j353870j249495r66837
3489A65012157j082615r45156r89575j197002j288660j208997j377622j333131
3481A55589399j102981j380072j065617j082844j195969j188942j214615j276879
3473A46081480j378153j277431j538396j694491j699942j650051j615154j564101
3465A33663761j508146j485176j559418j470903j294729j386106j419783j287775
3457A22251725j173581j099925r29435j007483r00650o72998n19700m64760j32969
$$ y = [255703644, 248083951, 240742901, 233741325, 227205630, 221142459, 215313250, 209885561, 204967523, 200398975, 196350370, 192636535, 189315391, 186214092, 183404209, 180642464, 178074616, 175721867, 173544750, 171664050, 169991086, 168582359, 167228489, 165978994, 165012157, 163929542, 162984386, 161994811, 160797809, 159509149, 158300152, 156922530, 155589399, 154486418, 153106346, 152040729, 150957885, 149761916, 148572974, 147358359, 146081480, 144703327, 143425896, 141887500, 140193009, 138493067, 136843016, 135227862, 133663761, 132155615, 130670439, 129111021, 127640118, 126345389, 124959283, 123539500, 122251725, 121078144, 119978219, 119048784, 118041301, 117140651, 116467653, 115947953, 115483193, 115350224]
3448A15350224L2540J38784L82754M53164Q83583J091679R94177J455303J721064
3439A22503272J986291K207165K551362K932975L209756L734498L961756M450377
3431A47537452N046065N701927O076534O762104P449751Q210238R157465R905119
3423B05846655J0851951J1743283J2571891J3746170J4642646J5319811J5939464
3416C00661871J5968558J6023213J5308302J4434486J3338404J1654968R624770
3409C97014572P870552O070664M087614K304731J081089l2690j271440k392984
3401D14732108l483118m767910o031764p580211r097380j0668820j2303189j3982338
3393C46817378j5138275j5853375j6491264j6679069j6573114j6000071j5331362
$$ y = [115350224, 115382764, 115521548, 115904302, 116357466, 117241049, 118332728, 119326905, 120782208, 122503272, 124489563, 126696728, 129248090, 132181065, 135390821, 139125319, 143087075, 147537452, 152583517, 158285444, 164361978, 171124082, 178573833, 186784071, 195941536, 205846655, 216698606, 228441889, 241013780, 254759950, 269402596, 284722407, 300661871, 316630429, 332653642, 347961944, 362396430, 375734834, 387389802, 397014572, 404885124, 410955788, 415043402, 417348133, 418429222, 418396532, 417125092, 414732108, 411248990, 406481080, 400449316, 392869105, 383771725, 373102905, 360799716, 346817378, 331679103, 315825728, 299334464, 282655395, 266082281, 250082210, 234750848]
3386B34750848j4490665j3679399j2624062j1535756j0742892r922166r046976
3379A52708932q268511p592334o923050o391965n809762n239185m939796m547781
3371A02996548m076146l622023l510218l332071k979537k658734k570541k304617
3363G7942661k212509k205768j922933j862304j873015j565755j577377j569716
3355F3153284j504235j383530j420477j466260j232706j187963j089981j151453
3347E2716679j047568j249815j108500r55244j112799j029873j050609r89878
3339D4172393j017187r14977r84419q35096q93559p94921q84840j111825p68823
3330C5966746p87191q26020o43496p32130q47949o33023m51672o53375o21666
$$ y = [234750848, 220260183, 206580784, 193956722, 182420966, 171678074, 161755908, 152708932, 144440421, 136848087, 129925037, 123533072, 117723310, 112484125, 107544329, 102996548, 98920402, 95298379, 91788161, 88456090, 85476553, 82817819, 80247278, 77942661, 75730152, 73524384, 71601451, 69739147, 67866132, 66300377, 64723000, 63153284, 61649049, 60265519, 58845042, 57378782, 56146076, 54958113, 53868132, 52716679, 51669111, 50419296, 49310796, 48355552, 47242753, 46212880, 45162271, 44172393, 43155206, 42240229, 41255810, 40420714, 39527155, 38732234, 37847394, 36735569, 35966746, 35179555, 34353535, 33710039, 32977909, 32129960, 31496937, 31045265, 30391890, 29770224]
3321B9770224n25984m19537l42183m68003l77249k72484l36042k28624k90694
3312B6509424l41919l59693m13327k65641k02590k87546k30026j74921k32362
3303B4001399k23345j37877q3841k40471R9100k10218j27782k6643n4368j20899
3293B2875055J0561J35339K23984L7588P1979J11284N2337K05301J79727K15616
3283B4118771L07664K85825K70680K84844Q2583n7087k31094n7563j83648l14257
3273B4506718l19477k83291k92641l19797l93510l35812l26461k04527k83383
3264B1747819k63547l49120k14230m21669m83374k96461l30098k51275l83106
3255A8754939m44907k63743l69850l59144l06088l02986k24118j59866j54625
$$ y = [29770224, 29244240, 28824703, 28482520, 28014517, 27637268, 27364784, 27028742, 26800118, 26509424, 26167505, 25807812, 25394485, 25128844, 24926254, 24638708, 24408682, 24233761, 24001399, 23778054, 23640177, 23556336, 23315865, 23414965, 23204747, 23076965, 23050322, 22995954, 22875055, 22885616, 23020955, 23244939, 23282527, 23354506, 23465790, 23518127, 23723428, 23903155, 24118771, 24426435, 24712260, 24982940, 25267784, 25350367, 25293280, 25062186, 25004623, 24820975, 24506718, 24187241, 23903950, 23611309, 23291512, 22898002, 22562190, 22235729, 22031202, 21747819, 21484272, 21135152, 20920922, 20499253, 20015879, 19719418, 19389320, 19138045, 18754939, 18310032, 18046289, 17676439, 17317295, 17011207, 16708221, 16484103, 16324237, 16169612]
3246A6169612m42726k35076j70807k84666k39021j38697j66937l47249l60410
3237A3784023k5717j55410l00356Q124k03069j99859k86711r9731o9319k24163
3227A2227812n4863o7239k24188j36483j36549j58485J1099k54392j47578J61817
3217A1220951k48677j57202r7346L2182P5402R4921P3309j6153J01988Q5998m0353
3206A1125020K32356K87473J63355M56534M75263M48868O32825P69000N47687
3197A5138381o3311o05915p26217p78740n97170o85862m67818j46989j95554l11415
3187A0559390k25427k21834o1743j17728P6538J9806P3478j11361J58830J40663
3177A0290612J65644K98071M18846L17255M38954P73444Q19087J010822J263620
$$ y = [16169612, 15726886, 15491810, 15321003, 15036337, 14797316, 14658619, 14491682, 14144433, 13784023, 13758306, 13602896, 13302540, 13310664, 13107595, 12907736, 12621025, 12521294, 12451975, 12227812, 12172949, 12105710, 11881522, 11745039, 11608490, 11450005, 11461104, 11206712, 11059134, 11220951, 10972274, 10815072, 10717726, 10749908, 10825310, 10920231, 10993540, 10977387, 11079375, 11165373, 11125020, 11357376, 11644849, 11808204, 12264738, 12740001, 13188869, 13821694, 14590694, 15138381, 15075070, 14469155, 13742938, 12964198, 12367028, 11681166, 11213348, 11066359, 10870805, 10559390, 10333963, 10112129, 10050386, 9932658, 10009196, 10029002, 10102480, 9991119, 10149949, 10290612, 10456256, 10754327, 11173173, 11490428, 11929382, 12702826, 13521913, 14532735, 15796355]
3168A5796355J369481J418981Q98715k46425j187743j340563j493555j411747
3160A3803499r60695r04925q41988n03857l81473m08384l70747l04333J0497k34386
3150H903208k59902Q295k2528j00738l8086J66294J63641Q110K38258K58069K38441
3139I563062L77294M36854O66171O56382M31670L05351j61852m24281n65719q54918
3129A0430014o87805l46069l59679k85441m16657l48054j81707k1726p779n265
3119G769832l40116j27223J9186r3963j02264j37499j68950l9292j18099j63291
3109F498321K9551j57861p9721q4472p3937j29730j31263N9562k2531k20296r4452
3098E593171j09313j36576J06086p5468j27774j98925j78805l909L7421r5794
$$ y = [15796355, 17165836, 18584817, 19483532, 19237107, 18049364, 16708801, 15215246, 13803499, 12842804, 11937879, 11095891, 10592034, 10210561, 9802177, 9431430, 9127097, 9137594, 8903208, 8643306, 8651601, 8629073, 8528335, 8490249, 8656543, 8820184, 8828294, 9066552, 9324621, 9563062, 9940356, 10377210, 11043381, 11699763, 12131433, 12436784, 12274932, 11850651, 11284932, 10430014, 9742209, 9396140, 9036461, 8751020, 8334363, 7986309, 7804602, 7782876, 7775097, 7769832, 7429716, 7302493, 7321679, 7227716, 7125452, 6987953, 6819003, 6779711, 6661612, 6498321, 6527872, 6370011, 6290290, 6205818, 6131881, 6002151, 5870888, 5930450, 5907919, 5687623, 5593171, 5483858, 5347282, 5453368, 5377900, 5250126, 5051201, 4872396, 4868487, 4905908, 4810114]
3088D810114j3011l8890o5340p5057Q1255l8399n2964N5219K6457L1656o2033
3077D659007l714o5131j68952M5441r8169r7889m1431j78513r3904n9015p5816
3066C821914l147P5206q0093j80545Q0403k679k02526J7858o9366J1911P2456
3055C541392M358r4416k06587j52682l5024J8249n3946O2819q2108m2169j22910
3044B836976J49884L8138j51017q454j2814m1993r1183m4675p4372j405o266L5066
3032B627885j2286M8796o5521j40832p2312J20209j00528n748J97876J2925m5187
3021B565277R779p5245M7031M830o5455j4108L1901M7025M4537k99326O8951j266
3009B363931R5366p4567M2258n171l8568J28572p0155j1984J6843j33612q8468
$$ y = [4810114, 4797103, 4758213, 4692873, 4617816, 4699071, 4660672, 4607708, 4662927, 4689384, 4721040, 4659007, 4655293, 4590162, 4421210, 4466651, 4368482, 4270593, 4229162, 4050649, 3956745, 3897730, 3821914, 3818767, 3893973, 3813880, 3633335, 3713738, 3711059, 3508533, 3526391, 3457025, 3468936, 3541392, 3545750, 3451334, 3244747, 3092065, 3057041, 3075290, 3021344, 3084163, 3002055, 2959886, 2836976, 2986860, 3024998, 2873981, 2865527, 2852713, 2810720, 2719537, 2674862, 2600490, 2599085, 2592819, 2627885, 2615599, 2664395, 2598874, 2458042, 2385730, 2505939, 2405411, 2399663, 2597539, 2610464, 2565277, 2575056, 2499811, 2546842, 2551672, 2486217, 2472109, 2504010, 2551035, 2595572, 2296246, 2365197, 2363931, 2459297, 2384730, 2426988, 2421817, 2383249, 2511821, 2441666, 2429682, 2446525, 2312913, 2224445]
2998B224445J33021p9129K3515j33077K8823J15358k2128J46115j12291N4411
2988B379063j9540o1915J7370m6249n7079M1502j4268l0103J54194k5942j9905
2977B317128r3730O402P1046P8760M5370J87398j26024k7961K28873j4467n1811
2966B620984j52879J38084k8663j30960k0841P1393n8061r6610L4578l7358J19077
2955B458744L7591o8771K4571R3040L8450M387L709M0022O2289N1394l1358J53353
2943B867421L8483J86492o8312j24182R5423J86716j04097m2763m1478j38421
2933B855282O714j34659j16226J1789J19370k29857n2945k2101Q4861R423l0500
2922B501151P9477k5335J63221m7275J7052n3134l592O5297Q1498J9388j41600
$$ y = [2224445, 2357466, 2278337, 2301852, 2168775, 2197598, 2312956, 2290828, 2436943, 2324652, 2379063, 2359523, 2297608, 2314978, 2268729, 2211650, 2253152, 2238884, 2208781, 2362975, 2337033, 2317128, 2223398, 2229800, 2300846, 2379606, 2424976, 2612374, 2486350, 2458389, 2687262, 2672795, 2620984, 2468105, 2606189, 2577526, 2446566, 2425725, 2497118, 2439057, 2342447, 2377025, 2339667, 2458744, 2496335, 2427564, 2452135, 2545175, 2583625, 2588012, 2591721, 2631743, 2694032, 2745426, 2714068, 2867421, 2905904, 3092396, 3024084, 2899902, 2995325, 3182041, 3077944, 3035181, 2993703, 2855282, 2861996, 2727337, 2611111, 2622900, 2742270, 2512413, 2459468, 2437367, 2522228, 2531651, 2501151, 2580628, 2555293, 2718514, 2671239, 2688291, 2635157, 2631565, 2696862, 2778360, 2797748, 2656148]
2911B656148j3445k4315K0360k5087K5790m410r2272k604r5353j8224Q8241n6862
2899B457967j41448k710l138j38271p2290J07796L8913J8419J033q3202k7189
2888B155880L3069o8919J00701m9577n7668M9507J46821m9531m7098j25267J31786
2877B219704p2159L5609J50015L7722o6173q6471N0469m7246m8365K44825J86259
2866B604189m5055M5366R3269J71891O7946k6845p0709N9015J15432K21096p6954
2855C158641M3018m9959j8608j17901l2353p7201j13118j3107j98675k16623j24288
2844B239826j79494J7396K7124o9934k31392j23966m6395j01959Q6161p1556j66281
2833A379530J0376j2590j7481Q060o3488j00373M8007m2276O5976r0637P7639
$$ y = [2656148, 2642703, 2618388, 2638748, 2613661, 2639451, 2635041, 2542769, 2540165, 2444812, 2426588, 2514829, 2457967, 2316519, 2313809, 2310671, 2172400, 2100110, 2207906, 2246819, 2265238, 2266271, 2183069, 2155880, 2188949, 2120030, 2220731, 2171154, 2113486, 2162993, 2309814, 2260283, 2213185, 2087918, 2219704, 2147545, 2183154, 2333169, 2370891, 2304718, 2218247, 2268716, 2221470, 2173105, 2417930, 2604189, 2559134, 2604500, 2697769, 2869660, 2937606, 2910761, 2840052, 2899067, 3014499, 3235595, 3158641, 3201659, 3151700, 3133092, 3015191, 2982838, 2905637, 2792519, 2779412, 2580737, 2364114, 2239826, 2060332, 2077728, 2104852, 2034918, 1803526, 1679560, 1633165, 1531206, 1617367, 1545811, 1379530, 1389906, 1377316, 1359835, 1367895, 1304407, 1204034, 1252041, 1209765, 1275741, 1185104, 1262743]
2822A262743N8260j7820k56296m7563k7910J7582p7346K1406K05669J1251j91282
2811I58694p2685q3852o8830J22714L7438K543M5379q4672q7617p4119k6880J00700
2799G68813j0505L7260k8387J42011k7394m4546j38259J6340J73228j30605k5890
2788G32066Q3175m2596Q3220p1637k3808q6706N4891m3632j02681P0987L5971
2777F89250R2556k714r004m7961r7333o9988P6715R3924m2822L9702j11378p2772
2765E38175L4616N0265j54183k2262m5388K7823P3470N1192m0917Q8831P6592
2754F78214L3662k06719n25P8695J4440k7271Q2875n4308N931L743l6307J09679
2742F82109k7843O655p9069J11593p5887j02445K5454P166l0899n2984O6171J3417
$$ y = [1262743, 1321003, 1303183, 1046887, 999324, 971414, 988996, 911650, 933056, 1138725, 1149976, 958694, 886009, 802157, 733327, 856041, 893479, 896022, 941401, 856729, 769112, 694993, 668113, 768813, 758308, 795568, 767181, 909192, 881798, 837252, 698993, 715333, 888561, 757956, 732066, 815241, 772645, 855865, 784228, 760420, 673714, 728605, 684973, 582292, 653279, 689250, 781806, 779092, 770088, 722127, 624794, 554806, 631521, 725445, 682623, 722325, 610947, 538175, 572791, 623056, 468873, 446611, 401223, 429046, 502516, 553708, 512791, 601622, 678214, 711876, 505157, 504632, 583327, 597767, 570496, 653371, 599063, 604994, 608737, 572430, 682109, 654266, 660921, 581852, 693445, 617558, 515113, 540567, 547733, 516834, 463850, 530021, 543438]
2730E43438M6302j18194K255n3908j67272N1418J02907K28194j48644n0370Q2248
2719E18374L3745l0103n1108j32090K6679J16575k2826l8885M0025n4439k2896
2708C83051O6769N7407r7306M9389J25283P6096r5546j57885J46684o8538j22792
2697C62612N9846j2038Q3265J8344K5607o4470O153o1619M096j2933M0060M4603
2685D93526m9372R6390q6358L3913k781M8271J3851j1067j59529o748J25238K8053
2673E23387n1198j43810N9262L5349n2959j52792p1013J81347R4628N993L1927
2662D60121J1184r5790o9131p2902k6655J79063Q2931k5353n4996n4211J31517
2651D65778P3179j20226j29369R069R5181k0139J2932J2100j5707n2389Q6046
$$ y = [543438, 589740, 471546, 473801, 419893, 252621, 304039, 406946, 635140, 486496, 436126, 518374, 552119, 522016, 470908, 338818, 365497, 482072, 459246, 420361, 460386, 405947, 383051, 449820, 507227, 409921, 459310, 584593, 660689, 565143, 407258, 553942, 485404, 362612, 422458, 410420, 493685, 512029, 537636, 473166, 479319, 417700, 421796, 408863, 448923, 493526, 444154, 540544, 454186, 488099, 485318, 533589, 547440, 536373, 376844, 370096, 495334, 523387, 472189, 328379, 387641, 422990, 370031, 217239, 146226, 327573, 422201, 428194, 460121, 471305, 375515, 306384, 233482, 206827, 385890, 468821, 443468, 388472, 334261, 465778, 538957, 418731, 289362, 298431, 393612, 373473, 386405, 398505, 382798, 330409, 416455]
2640D16455p085J63466m481r4688j43054m2409N9810L1797O7611o5112m5204l475
2628C33631O1496M0222j66350L3521q3392Q8129L3967k4044J61098j36913l9253
2617C02112j1751M4318o7975o4686P0044L3727J18561J1536n7563j7428m8853
2606C12042j29430Q8325K072n197O4819p6982M3306j07316Q717J19593J26084
2595D46033l0229K8697o8660P287o7476r040N0745M2662q9514k5050p2793m9719
2583A62943q7743M8922J26855K9732k06983M4391J59984p0839k5365J4982n0565
2572A46314J60429j6721n4904L7147j385j21989N5845J14933m4608n7677q308
2561B09076J72594P565n3074j17847j43436M0803J35348j5848J2709n239R3817
$$ y = [416455, 409370, 572836, 568355, 473667, 330613, 288204, 348014, 379811, 447422, 382310, 337106, 333631, 395127, 435349, 268999, 302520, 219128, 307257, 341224, 317180, 478278, 341365, 302112, 290361, 334679, 266704, 202018, 272062, 305789, 424350, 435886, 378323, 360895, 312042, 182612, 270937, 273009, 267812, 332631, 255649, 298955, 191639, 200356, 319949, 446033, 415804, 444501, 375841, 383128, 315652, 306612, 357357, 400019, 310505, 285455, 212662, 162943, 75200, 124122, 250977, 280709, 73726, 118117, 278101, 207262, 181897, 196879, 146314, 306743, 290022, 235118, 272265, 270880, 148891, 204736, 319669, 275061, 217384, 209076, 381670, 389235, 336161, 218314, 74878, 115681, 251029, 235181, 247890, 242651, 336468]
2550C36468j9450R5200k9758j71648j10599M7521o988L7982O3064M8787k2814
2539B67765j11939L7578M6014j3586k3080N9630N7202J941j65922Q6667K13598
2528D55868j21335r6892L9027p287N3463n2941k16197J26179M9731j2853P0925
2517B87688q0723p4017J88481Q506j28589n1861J02774J18307q9624k8641R1835
2506C44136j00228m9744N2851j5316m6671J2976o0258k0343J12039n8860J20727
2495B91309Q3646o9116J3245m2049n8806N35O6389q6327j52576O6411J16522n0105
2483A79078O6637J9715M7124l9508O697k7175j44010m6787p029l3682Q0714n238
2471I6536n7596k633Q7673p8161N6073O8267k2506J24284O6735l8433j22144J18631
$$ y = [336468, 317018, 412218, 382460, 210812, 100213, 147734, 140746, 178728, 241792, 290579, 267765, 155826, 193404, 239418, 225832, 202752, 262382, 319584, 321525, 155603, 242270, 455868, 334533, 237641, 276668, 269381, 322844, 269903, 53706, 179885, 229616, 216763, 287688, 206965, 132948, 321429, 329935, 201346, 149485, 252259, 370566, 280942, 252301, 344136, 243908, 194164, 247015, 231699, 185028, 198004, 137746, 117403, 229442, 170582, 291309, 374955, 305839, 319084, 277035, 218229, 218764, 285153, 198826, 46250, 112661, 229183, 179078, 245715, 265430, 312554, 273046, 279743, 252568, 108558, 61771, 54742, 21060, 101774, 96536, 38940, 36307, 123980, 45819, 101892, 170159, 147653, 271937, 338672, 300239, 178095, 296726]
2459B96726P112j06904N6397n7307j10507j6244N2419L9635M3406J8058j40335
2448H2456q5866M3720P8066J52561J4219k0444j42489r9844J72766n7794J10439
2437B47790J20251J7813j56582j4835q8941r3693L6316J10882M6998j4697j13553
2426I7749N2963r8812j5242K24237p4709j1051J0163M7789K3908K1958M3034j01071
2414B20916n5703O2152P9442j45600P5808l7999j58165J25474L521j31089R0527
2403A29284r714k174P4255l7434p3937J78j27663N0485J22428l2024O8494N543
2391A67721N8392m7015j99027P1130J00522O6755L250l4327k8901p8182Q3905
2380A64223o1017M4911K9279K9852L5188O747j09365o4418k9568Q975J25451p4911
$$ y = [296726, 303838, 196934, 253331, 196024, 85517, 69273, 121692, 161327, 204733, 222791, 82456, -3410, 40310, 118376, 270937, 285156, 264712, 122223, 22379, 195145, 137351, 247790, 368041, 385854, 229272, 214437, 125496, 31803, 68119, 179001, 225999, 211302, 97749, 150712, 51900, 36658, 260895, 186186, 175135, 185298, 233087, 256995, 278953, 321987, 220916, 165213, 227365, 306807, 161207, 237015, 199016, 40851, 166325, 169846, 38757, 129284, 119570, 117396, 191651, 154217, 80280, 80458, -47205, 3280, 125708, 93684, 162178, 167721, 226113, 179098, -19929, 51201, 151723, 218478, 221728, 187401, 158500, 80318, 164223, 103206, 148117, 177396, 207248, 242436, 249183, 139818, 75400, 45832, 54807, 180258, 105347]
2368A05347K4935M4833P2272r0048N8965j3576r1701K3932K0419j32000L6903
2357F0281J23357m0896N5980r7040M6777J098k8346n1784O6910Q581L4017j4629
2345A64306J0572k8990M0891o2130l8313m3294L4546K7080J6J04125L8731q9324
2333A58216r5408P379l1378J8741J06602L4173k7762P4609j7147p6709r8777j43571
2321i1032J1941J63326Q3930R6282j17827j36542K00639K3541M184j72954O9383
2310A34871p2738O5609J64650L6358J1155j70088j4362P4362N9957O0246O1115
2299D11135j15080k9606O9980J3146p2707p4653p1491l4966P2740J01068k9682
2288B39884K8424r2435k42290O1296J32797K3210R9192l9209L6397j37018Q5296
$$ y = [105347, 130282, 175115, 247387, 157339, 216304, 202728, 111027, 134959, 155378, 23378, 60281, 183638, 142742, 198722, 101682, 148459, 149557, 121211, 69427, 136337, 144918, 178935, 164306, 174878, 145888, 186779, 124649, 86336, 43042, 77588, 104668, 104684, 208809, 247540, 158216, 62808, 70187, 38809, 57550, 164152, 198325, 170563, 245172, 228025, 151316, 52539, -91032, -79091, 84235, 168165, 264447, 146620, 10078, 210717, 234258, 238442, 65488, 134871, 62133, 127742, 292392, 328750, 339905, 169817, 155455, 229817, 289774, 350020, 411135, 296055, 266449, 336429, 349575, 276868, 202215, 130724, 95758, 168498, 269566, 239884, 268308, 175873, -66417, -5121, 127676, 150886, 250078, 210869, 247266, 110248, 195544]
2277A95544l2838K9737P0718j05895N314l8560J12764j46442J2479R3479j4563
2266A81737j1443K690J74516j31705P2014r13q7679N6735r8506P9637J27114L1216
2254C95413k6155L849j79149M9164q7044r766J25623j2499n9184j18J66802l9810
2242C27126j42050J08986O465Q2789O3267j42386Q55l2657J18176o9075k393P6743
2230C95846J30275n6172P502J00759N7531j976j45994m3315Q8867o8946M4164
2219E08541P1730O0629J0336j9418j225K9748J17079P8468J4103q1261o2565J01456
2207H27621m8441n5274J80296L1350k7814q5210N1026m4555P8178J90280j689
2196A095768J5608r2557l4951P9900L7617N1279k6305l6180k2052k0414J61976
$$ y = [195544, 162706, 192443, 263161, 157266, 162580, 124020, 236784, 90342, 102821, 196300, 181737, 170294, 172984, 347500, 215795, 287809, 286896, 199217, 255952, 157446, 237083, 364197, 395413, 369258, 373107, 193958, 243122, 156078, 146312, 271935, 259436, 200252, 200134, 366936, 327126, 185076, 294062, 300527, 383316, 446583, 304197, 305052, 272395, 390571, 321496, 319103, 395846, 526121, 469949, 477451, 578210, 635741, 633765, 487771, 444456, 533323, 464377, 508541, 580271, 640900, 651236, 631818, 630593, 660341, 777420, 855888, 869991, 788730, 726165, 827621, 779180, 723906, 904202, 935552, 907738, 822528, 873554, 828999, 907177, 1097457, 1095768, 1111376, 1018819, 983868, 1063768, 1101385, 1152664, 1126359, 1090179, 1068127, 1047713, 1209689]
2185A209689Q4901P3602L993M5812R6704N2117J73334N5232k8914O8442O6721
2174A901633J23240N1610J28625l2111m7495J79727L3764J85448J06558K22256
2164B853255K03909K07551K1506J82551M53014K00124L60180K65045K00464L43737
2154E291336L98455L81965M75334P80229Q20223J181253J221821J455659J986866
2145A3993141K429782L061484L185410K066300j98143k235968l091244l280824
2137A5929938k650868k041507j668835j288904j066911p97733n79574n19182k47964
2128E068460k64461l87411k62914k35351j97025k63460k18802k89903k11250j31461
2118B606422n0733j58787k21627k29092O812J4119k24707j14250m6417r296j06106
$$ y = [1209689, 1294590, 1368192, 1372185, 1417997, 1514701, 1566818, 1740152, 1795384, 1766470, 1834912, 1901633, 2024873, 2076483, 2205108, 2172997, 2125502, 2305229, 2338993, 2524441, 2630999, 2853255, 3057164, 3264715, 3286221, 3468772, 3921786, 4121910, 4482090, 4747135, 4947599, 5291336, 5689791, 6071756, 6547090, 7327319, 8147542, 9328795, 10550616, 12006275, 13993141, 16422923, 19484407, 22669817, 24736117, 24537974, 22302006, 19210762, 15929938, 13279070, 11237563, 9568728, 8279824, 7212913, 6415180, 5835606, 5316424, 5068460, 4803999, 4416588, 4153674, 3918323, 3721298, 3457838, 3239036, 2949133, 2737883, 2606422, 2555689, 2396902, 2175275, 1946183, 1952995, 1967114, 1742407, 1628157, 1581740, 1572444, 1466338]
2107A466338j46089j220j19161j37535j45774J02018J4402j04871l6915j5142
2097H76051l2486p711o083O9744k1059l7209O4752M8574k0535j46137j12475K5470
2085G00896N6760p1605L543j14731m2700Q2177j18450j03586J13843m0038j39886
2074C26223L5586J67930J6150j11896j95489Q166N5880J27067O9209P1199j71286
2063C98739L1242M8856k24574j4701J08103J3246j4096l0642J37132r4037j86257
2052A73011J07065O1127o0406k0613l801j44384p978P6504n1569M7525J6964j14108
2040G9337P1774P000r0264m1052J75781P6196l3905l7377j09557M228P9670j59646
2028B2185m2758P7250Q5574j20198J9744L3127M8309r3824O6994J03411J3446
$$ y = [1466338, 1320249, 1319029, 1199868, 1062333, 916559, 1018577, 1032979, 928108, 891193, 876051, 843565, 835854, 829771, 899515, 878456, 841247, 905999, 954573, 934038, 787901, 675426, 700896, 757656, 686051, 689594, 574863, 532163, 614340, 495890, 392304, 506147, 466109, 326223, 361809, 529739, 545889, 433993, 238504, 246670, 302550, 429617, 498826, 570025, 398739, 429981, 478837, 254263, 239562, 347665, 360911, 346815, 316173, 453305, 359268, 173011, 280076, 341203, 280797, 260184, 256383, 111999, 104021, 180525, 128956, 176481, 193445, 79337, 151111, 158111, 67847, 26795, 202576, 278772, 244867, 207490, 97933, 102161, 181831, 22185, -20573, 56677, 142251, 22053, 41797, 74924, 123233, 29409, 96403, 199814, 213260]
2017B13260J4219j37095l0199k9491R9514J6601r9458J7963n1350M6470L8032
2006I8466o4639m2322M8573O5230l9497M4900N5053L0773J167l2007J2106M551
1994A82354j28765p649k1045J35708r2949j05015N0484J73607n1517j80904J3286
1983c2405P6541J46472L4376o2770l6635R3952m2392j46422l8507P5104J9741
1972H7055N587l8360J09114j533Q7192k2475m6117j40925K2445O7165N6829j16257
1960F9720j46579P845R0683M2167k8002j1675L3829N2539n789Q8455J01940r6817
1948A98316m7287O0521j36788J4118J9075K1006j21024N4159o3128P4567J6786
1937I0321L3774m1846N3339k6740J0983J8666j25386j4196M6339p5880R965l8613
$$ y = [213260, 227479, 90384, 60185, 30694, 130208, 146809, 47351, 65314, 13964, 60434, 98466, 33827, -8495, 40078, 105308, 65811, 110711, 165764, 196537, 197704, 165697, 177803, 182354, 53589, 45940, 24895, 160603, 67654, -37361, 13123, 186730, 135213, -45691, -32405, 44136, 190608, 224984, 162214, 125579, 219531, 177139, 30717, -7790, 67314, 87055, 92642, 54282, 163396, 161863, 249055, 226580, 180463, 39538, 61983, 129148, 185977, 69720, -76859, -69014, 21669, 63836, 35834, 24159, 57988, 110527, 104738, 193193, 295133, 198316, 151029, 211550, 74762, 88880, 107955, 128961, 7937, 62096, -1032, 73535, 90321, 124095, 82249, 135588, 108848, 119831, 138497, 13111, -1085, 45254, -30626, -20661, -59274]
1925e9274o167P2407o5195P1844j5259O4725P6639o158p4819L9262n5541n3944
1913a1480M471M4227r2561P1170J63841k7598j52773j07940J37230j5685m0006
1902b7104p7928P0455P0852L4145j28727p3434q1307m9107K41052m5610K9796
1891c6917J75968j37007o7524N3180L2120J91118j6906j60470m0659Q9045o1172
1880B0776L172O4312J10137n3983K4992L3580k2768l3810O1678j32251L6839Q0317
1868A92991j21342J7765l0962P0426L0724k17556Q5352N3630j43260L6813m7310
1857g2729R006k5858P7741J53176m6321j56768J14378k8971o8278j29n1290J14193
1845A8150J20179m4423J25758j44352p1328N4382k997O7349j41571M3177P0582
$$ y = [-59274, -65441, 6966, -58229, 13615, -1644, 63081, 139720, 133562, 58743, 98005, 42464, -11480, -7009, 37218, -55343, 15827, 179668, 152070, -703, -108643, 28587, 12902, -27104, -105032, -34577, 36275, 70420, -58307, -131741, -213048, -262155, -21103, -66713, -36917, 139051, 2044, -65480, -12300, 19820, 210938, 194032, 33562, -7097, 81948, 20776, 23948, 88260, 198397, 144414, 169406, 202986, 180218, 146408, 208086, 75835, 112674, 192991, 71649, 89414, 58452, 128878, 159602, -57954, 27398, 81028, -62232, -25419, -72729, -63723, -89581, -11840, 141336, 95015, -61753, 52625, 23654, -44624, -44753, -96043, 18150, 138329, 93906, 219664, 75312, 3984, 58366, 55369, 122718, -18853, 24324, 94906]
1834I4906k1134J13404r9788l2939m5151j2076j1489M4748j16919J32280K6951
1823G2793o9710p0299M938O4304m4433R3166j45367L92N6090O3078l2121R180
1811B011l673l6366K2071J20112j14194M9898p6743q3838J73425k9644J9376N8432
1799A00867r2061p2577p4642J19183J14576j11501m8653N8690o3491J2412n3592
1788a10789J0606N315p9136J42063O424m773l378j8975j2201j3477P6472j5514
1776a7363p2589n0598m0502L1750J3236r0619J16998p8538J39821M1059k0509
1765b7854R9323n8691K9109l5194K1868L3252L1413p1628M2329o5003o3682L6937
1753b7821j6144r0279o2175J16654J62543l5730l9116N8068L2752L7975q6787
$$ y = [94906, 73772, 187176, 87388, 54449, 9298, -2778, -14267, 30481, -86438, 45842, 72793, 3083, -67216, -62278, 2026, -42407, 50759, -94608, -94216, -38126, 24952, -7169, 2011, -1662, -38028, -15957, 104155, -10039, 39859, -36884, -120722, 52703, 23059, 42435, 100867, 8806, -63771, -138413, -19230, 95346, -16155, -64808, -6118, -69609, -57197, -110789, -100183, -94868, -174004, -31941, -25517, -30290, -33668, -52643, -64844, -78321, -1849, -17363, -89952, -140550, -181052, -149302, -136066, -226685, -109687, -188225, -48404, -7345, -27854, 71469, 12778, 41887, 6693, 28561, 61813, 93226, 21598, 63927, -1076, -64758, -27821, -43965, -134244, -196419, -79765, 82778, 47048, 7932, 66000, 98752, 136727, 49940]
1742D9940M7371L8812j23499J54943j30805m0770j0178n9404J460O6766R548r1267
1730h7083J4701L3456N5272j53064n9540O7607J26284p1997m85J12585M083k2514
1718A9305P6226j13753k7528R7956n647J895o6667j37628M1462J31832l3480J5217
1706h10n1420K8307q351J381n2953M820m284J15671p279o0459L8423j14738j07772
1693b19464J37176J21092O3586n8276r993j7829o545j24971j4006P8639n7043
1682a07634J26840k6737L2105o3411J18168L168p537p809K223m0192q3032j41548
1670a95396j16286J40164J65924L8779j04826j6933j8388p9921n0965J10067J35681
1659G900r7857k0541L9607l4496j13723J38305j29876L9641Q5511L0500o4475
$$ y = [49940, 97311, 136123, 12624, 167567, 36762, -4008, -14186, -73590, -72130, -5364, 4184, -87083, -72382, -38926, 16346, -136718, -196258, -128651, -2367, -74364, -74849, 37736, 41819, 19305, 95531, -18222, -45750, 52206, 46559, 48454, -18213, -155841, -114379, 17453, -16027, -810, -52230, -23923, -32274, -30893, -83846, -79026, -83310, 32361, 25082, -35377, 3046, -111692, -219464, -82288, 38804, 102390, 44114, 34121, 16292, 9747, -115224, -129230, -50591, -107634, 19206, -7531, 24574, -38837, 79331, 82499, 74962, 67153, 69376, 29184, -53848, -195396, -311682, -171518, -5594, 33185, -71641, -88574, -106962, -186883, -237848, -127781, 7900, -89957, -110498, -70891, -105387, -219110, -80805, -210681, -171040, -85529, -55029, -119504]
1648a19504J6669m3958j21142L7287O4589J88868J2188j00853M6347J27059n6226
1637E1324j06889l798J36279n8105l6124k6798L2795j11157O0529L1301J4257
1626a6386p1756m9849q7150n427L3668R0310J20235o3038p7527L7000m331O3699
1614c0552j1687j20088K12820Q6097j38028k1057L238O0379o2341N5408j15863
1603h1674N3869L4178j08948j15330P8249N9874Q7336p9507j15492J34057O258
1592d7130p6874R6995o487L8898l0784q9317N7691J7106n7477k6697R7074j08095
1580a35097K6883o9344M9153J16796m6166K882k3794k5021O6583q0556P9105l807
1568d2383R9631p4056l7892K4947J60184J04175m8299j53147l0057o2904O6733
$$ y = [-119504, -102835, -146793, -267935, -230648, -166059, 22809, 34997, -65856, -19509, 107550, 51324, -55565, -59363, 76916, 18811, -17313, -44111, -11316, -122473, -61944, -30643, -16386, -88142, -137991, -225141, -230568, -196900, -106590, 13645, -49393, -126920, -89920, -94251, -30552, -42239, -162327, 50493, 136590, -1438, -22495, -19257, 41122, -21219, 34189, -81674, -27805, 6373, -102575, -217905, -139656, -79782, 7554, -71953, -187445, -53388, -47130, -124004, -27009, -33496, 5402, -25382, -114699, -57008, -39902, -97379, -124076, -27002, -135097, -108214, -177558, -128405, -11609, -57775, -54893, -78687, -103708, -37125, -117681, -38576, -42383, 57248, -16808, -54700, -29753, 130431, 234606, 186307, 33160, 3103, -59801, 6932]
1557F932o1829q1805Q7447k4269L3798M4969j37210L6496Q3981M2499p3532J6111
1545b6412J05719p184j02491K2701K1499k8245j34327q1635l2483J60651J88135
$$ y = [6932, -54897, -136702, -49255, -73524, -39726, 5243, -131967, -95471, -11490, 31009, -42523, -26412, 79307, 72123, -30368, -7667, 13832, -14413, -148740, -230375, -262858, -102207, 85928]
$$ [...]
##END NTUPLES=NMR SPECTRUM
##END=
