##TITLE=1H_CA-9172-1
 CDCl3
 8 sc, 
 10.7.2023
##JCAMPDX= 6.0         $$ Bruker NMR JCAMP-DX V2.0
##DATA TYPE= NMR SPECTRUM
##DATA CLASS= NTUPLES
##ORIGIN= UXNMR, Bruker Analytische Messtechnik GmbH
##OWNER= root
$$ XWIN-NMR		Version 3.5
$$ Mon Jul 10 16:04:27 2023 Russian Standard Time (UT+4h)  she@DPX200
##.OBSERVE FREQUENCY= 200.13135
##.OBSERVE NUCLEUS= ^1H
##.ACQUISITION MODE= SIMULTANEOUS
##.ACQUISITION SCHEME= undefined
##.AVERAGES= 8
##.DIGITISER RES= 18
##SPECTROMETER/DATA SYSTEM= spect
##.PULSE SEQUENCE= zg30
##.SOLVENT NAME= CDCl3
##.SHIFT REFERENCE= (INTERNAL, CDCl3, 0, 15.7315)
##AUDIT TRAIL= $$ (NUMBER, WHEN, WHO, WHERE, WHAT)
$$ ##TITLE= Audit trail, XWIN-NMR		Version 3.5
$$ ##JCAMPDX= 5.01
$$ ##ORIGIN= Bruker BioSpin GmbH
$$ ##OWNER= she
$$ F:/spectra/data/she/nmr/H-F/1/pdata/1/auditp.txt
$$ ##AUDIT TRAIL=  $$ (NUMBER, WHEN, WHO, WHERE, WHAT)
(   1,<2023-07-10 16:03:15.96 +0400>,<she>,<DPX200>,
      <created by zg, POWCHK disabled, PULCHK disabled
       configuration hash MD5:
       00 E9 B6 7A A2 85 ED C7 34 08 36 98 17 FE 4E 26
       data hash MD5: 16K
       4A B1 65 2B 06 D6 21 6B BE 9F E5 16 11 B2 21 64>)
(   2,<2023-07-10 16:03:18.50 +0400>,<she>,<DPX200>,
      <Start of raw data processing
       efp BC_mod = 2 LB = 0.24 FT_mod = 6 PKNL = 1 PHC0 = -21147.96 PHC1 = 11.45272 SI = 16K 
       data hash MD5: 16K
       24 56 D6 84 4B 26 C4 CF B5 A3 59 38 53 34 90 A7>)
(   3,<2023-07-10 16:03:36.09 +0400>,<she>,<DPX200>,
      <pk PHC0 = -3.435354 PHC1 = 4.8 
       data hash MD5: 16K
       92 9C 80 60 19 A1 AF 6E E5 D5 A4 C8 40 49 1E B6>)
(   4,<2023-07-10 16:03:39.54 +0400>,<she>,<DPX200>,
      <abs ABSG = 5 
       data hash MD5: 16K
       28 7C E6 17 EB 45 68 42 F0 3F B0 CE 14 1F 3F 6B>)
$$ ##END=
$$ 
$$ hash MD5
$$ DA 82 5F 36 55 F8 E5 41 0A D2 1D BD CC CE 95 5A
##$RELAX= 
##$RELAX= 
##$RELAX= 
##$RELAX= 
##$RELAX= 
##$RELAX= 
$$ Bruker specific parameters
$$ --------------------------
##$DU= <F:/spectra>
##$EXPNO= 1
##$NAME= <H-F>
##$PROCNO= 1
##$TYPE= <nmr>
##$USER= <she>
##$AMP= (0..31)
100 100 100 100 100 100 100 100 100 100 100 100 100 100 100 100 100 100 
100 100 100 100 100 100 100 100 100 100 100 100 100 100 
##$AQSEQ= 0
##$AQ_mod= 1
##$AUNM= <au_zg>
##$AUTOPOS= <>
##$BF1= 200.13
##$BF2= 200.13
##$BF3= 200.13
##$BF4= 200.13
##$BF5= 200.13
##$BF6= 200.13
##$BF7= 200.13
##$BF8= 200.13
##$BYTORDA= 1
##$CFDGTYP= 0
##$CFRGTYP= 5
##$CHEMSTR= <none>
##$CNST= (0..31)
1 1 145 1 1 1 1 1 1 1 1 1 1 1 1 1 1 1 1 1 1 1 1 1 1 1 1 1 1 1 1 1 
##$CPDPRG= <>
##$CPDPRG1= <>
##$CPDPRG2= <>
##$CPDPRG3= <>
##$CPDPRG4= <mlev>
##$CPDPRG5= <mlev>
##$CPDPRG6= <mlev>
##$CPDPRG7= <mlev>
##$CPDPRG8= <mlev>
##$CPDPRGB= <>
##$CPDPRGT= <>
##$D= (0..31)
0 1.2 0 0 0 0 0 0 0 0.06 0 0.03 0 0 0 0 0.0002 0 0 0 0 0 0 0 0 0 0 0 0 
0 0 0 
##$DATE= 1688990595
##$DBL= (0..7)
120 120 120 120 120 120 120 120 
##$DBP= (0..7)
150 150 150 150 150 150 150 150 
##$DBP07= 0
##$DBPNAM0= <>
##$DBPNAM1= <>
##$DBPNAM2= <>
##$DBPNAM3= <>
##$DBPNAM4= <>
$$ [...]
##$SUBNAM3= <"">
##$SUBNAM4= <"">
##$SUBNAM5= <"">
##$SUBNAM6= <"">
##$SUBNAM7= <"">
##$SUBNAM8= <"">
##$SUBNAM9= <"">
##$SW= 18.05172834244
##$SWIBOX= (0..15)
0 0 2 0 0 0 0 0 0 0 0 0 0 0 0 0 
##$SW_h= 3612.71676300578
##$TD= 16384
##$TD0= 1
##$TE= 0
##$TE2= 300
##$TE3= 300
##$TEG= 300
##$TL= (0..7)
0 120 120 120 120 120 120 120 
##$TP= (0..7)
150 150 150 150 150 150 150 150 
##$TP07= 0
##$TPNAME0= <>
##$TPNAME1= <>
##$TPNAME2= <>
##$TPNAME3= <>
##$TPNAME4= <>
##$TPNAME5= <>
##$TPNAME6= <>
##$TPNAME7= <>
##$TPOAL= (0..7)
0.5 0.5 0.5 0.5 0.5 0.5 0.5 0.5 
##$TPOFFS= (0..7)
0 0 0 0 0 0 0 0 
##$TUNHIN= 0
##$TUNHOUT= 0
##$TUNXOUT= 0
##$USERA1= <user>
##$USERA2= <user>
##$USERA3= <user>
##$USERA4= <user>
##$USERA5= <user>
##$V9= 5
##$VALIST= <valist>
##$VCLIST= <CCCCCCCCCCCCCCC>
##$VD= 0
##$VDLIST= <DDDDDDDDDDDDDDD>
##$VPLIST= <PPPPPPPPPPPPPPP>
##$VTLIST= <TTTTTTTTTTTTTTT>
##$WBST= 1024
##$WBSW= 4
##$XGAIN= (0..3)
0 0 0 0 
##$XL= 0
##$YL= 0
##$YMAX_a= 155890
##$YMIN_a= -144914
##$ZGOPTNS= <>
##$ZL1= 120
##$ZL2= 120
##$ZL3= 120
##$ZL4= 120
##$ABSF1= 15.6929
##$ABSF2= -2.35895
##$ABSG= 5
##$ABSL= 3
##$ALPHA= 0
##$AQORDER= 0
##$ASSFAC= 0
##$ASSFACI= 0
##$ASSFACX= 0
##$ASSWID= 0
##$AUNMP= <proc_1d>
##$AZFE= 0.1
##$AZFW= 0.1
##$BCFW= 0
##$BC_mod= 2
##$BYTORDP= 0
##$COROFFS= 0
##$CY= -3
##$DATMOD= 1
##$DC= 0
##$DFILT= <>
##$DTYPP= 0
##$F1P= 0
##$F2P= 0
##$FCOR= 1
##$FTSIZE= 16384
##$FT_mod= 6
##$GAMMA= 0
##$GB= 0
##$INTBC= 1
##$INTSCL= 3.70164e-10
##$ISEN= 128
##$LB= 0.24
##$LEV0= 0
##$LPBIN= 0
##$MAXI= 10000
##$MC2= 0
##$MEAN= 0
##$ME_mod= 0
##$MI= 1.114404
##$NCOEF= 0
##$NC_proc= -9
##$NLEV= 6
##$NOISF1= 3.799351
##$NOISF2= 2.8
##$NSP= 0
##$NTH_PI= 0
##$NZP= 0
##$OFFSET= 15.73146
##$PC= 1
##$PHC0= -21151.4
##$PHC1= 16.25272
##$PH_mod= 1
##$PKNL= yes
##$PPARMOD= 0
##$PSCAL= 0
##$PSIGN= 0
##$REVERSE= no
##$SF= 200.130008020888
##$SI= 16384
##$SIGF1= 3
##$SIGF2= 2
##$SINO= 5.538805
##$SIOLD= 16384
##$SREGLST= <1H.CDCl3>
##$SSB= 0
##$STSI= 16384
##$STSR= 0
##$SW_p= 3612.71676300578
##$SYMM= 0
##$S_DEV= 0
##$TDeff= 16384
##$TDoff= 0
##$TI= <>
##$TILT= no
##$TM1= 0
##$TM2= 0
##$TOPLEV= 0
##$USERP1= <user>
##$USERP2= <user>
##$USERP3= <user>
##$USERP4= <user>
##$USERP5= <user>
##$WDW= 1
##$XDIM= 16384
##$YMAX_p= 500752930
##$YMIN_p= -941718
$$ End of Bruker specific parameters
$$ ---------------------------------
##NTUPLES= NMR SPECTRUM
##VAR_NAME=  FREQUENCY,     SPECTRUM/REAL,   SPECTRUM/IMAG
##SYMBOL=    X,             R,               I
##VAR_TYPE=  INDEPENDENT,   DEPENDENT,       DEPENDENT
##VAR_FORM=  AFFN,          ASDF,            ASDF
##VAR_DIM=   16384,         16384,           16384
##UNITS=     HZ,            ARBITRARY UNITS, ARBITRARY UNITS
##FACTOR=    0.220516191357247, 1,           1
##FIRST=     3148.33713945351, 0,            0
##LAST=      -464.379623552265, 0,           0
##MIN=       -464.379623552265, -941718,     0
##MAX=       3148.33713945351, 500752930,    0
$$ Real data points
##PAGE= N=1
##DATA TABLE= (X++(R..R)), XYDATA
$$ [...]
6221B278366o7544J03244r2687J9752K62480L24514J51624K65537J76776J25964
6211C548026L04034k23495R9497Q0910k42732m74196j05437L18023j48102l25229
6201B831299J62184p2699k21417J47285J03248j13638k453L1186N8141K95527
6191C218663n898k24061J80482k87133j34658R5663l04347l6465L77220J45274
6181C024740m2058j78240Q8420N51n9414N6291J313N952L30886K61486L1694l74909
6169C146712K06981L10163k3026K3043J40368K26578K13567M64950J66519K82502
6159E158357L95781N40846N88450N24902K01993m56909m77533r24802n79808m28033
6149D543244k91859J96015j46717k16782n3495j17852k90367R0032J57262k5567
$$ y = [2278366, 2210822, 2314066, 2221379, 2241131, 2503611, 2828125, 2979749, 3245286, 3422062, 3548026, 3852060, 3628565, 3728062, 3808972, 3566240, 3092044, 2986607, 3304630, 3156528, 2831299, 2993483, 2920784, 2699367, 2846652, 2949900, 2836262, 2833809, 2864995, 2923136, 3218663, 3212765, 2988704, 3169186, 2882053, 2747395, 2843058, 2538711, 2502246, 2879466, 3024740, 2982682, 2804442, 2892862, 2893413, 2833999, 2890290, 2891603, 2897555, 3228441, 3489927, 3521621, 3146712, 3353693, 3663856, 3640830, 3663873, 3804241, 4030819, 4244386, 4709336, 4875855, 5158357, 5554138, 6094984, 6683434, 7208336, 7410329, 6953420, 6475887, 5551085, 4971277, 4543244, 4251385, 4447400, 4300683, 4083901, 4030406, 3912554, 3622187, 3712219, 3869481, 3843914]
6139C843914k09396j27619P0005j10383L63907K40207l05093J15k74752r4984
6129C395921j28154k1978K8585P7488l3994R7185n8901j57375l0797K21264q1374
6118C307870k95534j20863L54129j43519j09585J04632p6932j8044j2975r197
6108B979982K1833k6704J1424N9359k82819O1516O9195l53677R4727j75772l38882
6097B120182N10125Q9775J47842n7489k0599N5302k18952K765k03403k88214k0827
6086B116507K87980N54000p4708L1469j99561Q2893J23002J72517j5012j16642
6076B962445J61959l41536n3906J45603j8490L34014l3419j91895N1724M0525
6066C057024J79907m4029J45872r8806j02718R8246J12150m0949K9304Q3112q3604
$$ y = [3843914, 3634518, 3506899, 3576904, 3466521, 3830428, 4070635, 3765542, 3765657, 3490905, 3395921, 3267767, 3245789, 3274374, 3351862, 3317868, 3415053, 3356152, 3198777, 3167980, 3389244, 3307870, 3012336, 2891473, 3245602, 3102083, 2992498, 3097130, 3020198, 3002154, 2989179, 2979982, 3001815, 2975111, 2986535, 3045894, 2763075, 2824591, 2893786, 2540109, 2634836, 2459064, 2120182, 2630307, 2720082, 2867924, 2810435, 2789836, 2845138, 2626186, 2628951, 2425548, 2137334, 2116507, 2404487, 2958487, 2883779, 2915248, 2715687, 2798580, 2921582, 3094099, 3079087, 2962445, 3124404, 2782868, 2728962, 2874565, 2856075, 3190089, 3156670, 2964775, 3016499, 3057024, 3236931, 3192902, 3338774, 3239968, 3137250, 3235496, 3347646, 3306697, 3336001, 3419113, 3335509]
6055C335509K40003O703j9817j29N2395k12633R9320r3797j01109M23780O5439
6044C795664l03607K55908P0542j8752N319K72386J24027k60431l5386l3443J92601
6033D064828O9760m902r4953J31670N8433j0720J14116P2105j64734J00651j57691
6022D178563K02893J46534j66460K34246j72735r7365M8039K64134j74648k13698
6012D249503K44163J5272j33536o4483Q8655J928k87133R4760O2020J11172K50398
6001D632719j58744o1827K35231J16541m44980Q9344J16901j43507J21142K8750
5991D531570J03Q9273J84155J4346k93495J35136n1746K05k32469L7585K44017
5980D658680M05065k19377j91527N9523O3902M9274J44417J00549R5949j04871
$$ y = [3335509, 3575512, 3582215, 3562398, 3562269, 3614664, 3402031, 3501351, 3407554, 3306445, 3730225, 3795664, 3492057, 3747965, 3818507, 3799755, 3805074, 4077460, 4201487, 3941056, 3905670, 3872227, 4064828, 4134588, 4129686, 4034733, 4166403, 4224836, 4214116, 4328232, 4400337, 4235603, 4336254, 4178563, 4381456, 4527990, 4361530, 4595776, 4423041, 4325676, 4373715, 4637849, 4463201, 4249503, 4493666, 4508938, 4375402, 4310919, 4399574, 4401502, 4114369, 4209129, 4271149, 4382321, 4632719, 4473975, 4412148, 4647379, 4763920, 4318940, 4408284, 4525185, 4381678, 4502820, 4531570, 4531673, 4620946, 4805101, 4819447, 4525952, 4661088, 4609342, 4609547, 4377078, 4414663, 4658680, 5063745, 4844368, 4652841, 4712364, 4776266, 4825540, 4969957, 5070506, 5166455, 5061584]
5970E061584j74440j89836O7657J80004k8319q669p8215K89168n6689O0498O4705
5959E187448P3756M5081K29707O1596J47959n7769q2001P6842r4082j35970K6747
5948E479314K95865J32039J33919k94894J21376j41400J29928k65192K6075l2925
5938E584105k5977L55600j3909J13823l16126K88762M22464m4961j6775L71117
5928F718123K98931J67921Q2336J46065J93782P25268P45707P65026Q26381M34914
5918A1104454L34505k3191p36416p11136q42203o24319o70779R145R7399k51157
5908G686302k17047l45288p4225J55105o0572k01065k294J7083k25717J6898K67935
5897G017115J56781M0817Q2471L48862N67813L8320K72437L38605n0706K53339
$$ y = [5061584, 4887144, 4697308, 4764965, 4944969, 4916650, 4907981, 4829766, 5118934, 5062245, 5122743, 5187448, 5261204, 5306285, 5535992, 5597588, 5745547, 5687778, 5605777, 5682619, 5588537, 5452567, 5479314, 5775179, 5907218, 6041137, 5746243, 5867619, 5726219, 5856147, 5590955, 5617030, 5584105, 5558128, 5913728, 5899819, 6013642, 5697516, 5986278, 6408742, 6363781, 6347006, 6718123, 7017054, 7184975, 7267311, 7413376, 7607158, 8332426, 9078133, 9843159, 10669540, 11104454, 11438959, 11415768, 10679352, 9968216, 9126013, 8501694, 7830915, 7840060, 7937459, 7686302, 7469255, 7123967, 7049742, 7204847, 7144275, 6943210, 6940916, 6957999, 6732282, 6749180, 7017115, 7173896, 7214713, 7297184, 7646046, 8213859, 8252179, 8524616, 8863221, 8812515, 9065854]
5887I065854P0220L99824O8525l0201k91916k33310j5374k15308q1563m3570Q5935
5876H779116K02535J2730j21623R6282m5522K0145L95389K86927O6221J38110
5866I830310J57729K02875K06287K20137K27165J71882L15200M47277k4132k45280
5856A1509450L405J08642j94305k73878j81281r17j28122j12168k79488p883J44896
5845A0588351p8358k31801K14855J50095Q1281K9873K14768K85764J74123j8190
5835A1410761J45581N707j30841l6979K73170K35509O4142R4488l1468N35327
5825A2565397K54203K61830k7510J11131L06997J2334L0158M99280K69372L44951
5815A4628143L99688J84472K61088J66616N8955J5444J30442K09829K56475M93391
$$ y = [9065854, 9136074, 9535898, 9604423, 9574222, 9282306, 9048996, 9033622, 8818314, 8736751, 8693181, 8779116, 8981651, 8994381, 8872758, 8969040, 8923518, 8943663, 9339052, 9625979, 9692200, 9830310, 9988039, 10190914, 10397201, 10617338, 10844503, 11016385, 11331585, 11778862, 11754730, 11509450, 11512855, 11621497, 11427192, 11153314, 10972033, 10971116, 10842994, 10730826, 10451338, 10443455, 10588351, 10509993, 10278192, 10493047, 10643142, 10724423, 10754296, 10969064, 11254828, 11428951, 11410761, 11556342, 11562049, 11431208, 11394229, 11667399, 11902908, 11967050, 12061538, 12030070, 12565397, 12819600, 13081430, 13053920, 13165051, 13472048, 13484382, 13514540, 14013820, 14283192, 14628143, 15027831, 15212303, 15473391, 15640007, 15698962, 15714406, 15844848, 16054677, 16311152, 16804543]
5805A6804543K74399L74034J87585N12654K29049L52892K84051K20047M76104
5796A9715358J87403R3269M124K27225K47963L17809L34136M94054Q62446O22203
5786B3105990Q98088J093297Q35258J077171J026966J214234J195603J269086
5778C1715693Q09321J50327m02564p61086j140108j045493p60507n23250q06245
5769B7236088l63155m39220m11630O8148J57940j41651L95040M09639r3646M84168
5759B7301721M22672O40965O01871M32549O23984R65921N30712J097494J071879
5750C3689768Q64233Q22459J137775J080405J130534J526084J955130K010776
5742D4217164K469580K723972K760112L088687K622469K301107J769646N76068
$$ y = [16804543, 17078942, 17452976, 17640561, 18153215, 18382264, 18735156, 19019207, 19239254, 19715358, 19902761, 19996030, 20000154, 20227379, 20475342, 20793151, 21127287, 21621341, 22483787, 23105990, 24004078, 25097375, 25932633, 27009804, 28036770, 29251004, 30446607, 31715693, 32525014, 32675341, 32272777, 31511691, 30371583, 29326090, 28565583, 28042333, 27236088, 26872933, 26433713, 26022083, 26090231, 26248171, 26106520, 26501560, 26911199, 26817553, 27301721, 27724393, 28365358, 28967229, 29399778, 30023762, 30989683, 31520395, 32617889, 33689768, 34554001, 35376460, 36514235, 37594640, 38725174, 40251258, 42206388, 44217164, 46686744, 49410716, 52170828, 55259515, 57881984, 60183091, 61952737, 62528805]
5734F2528805J81738l66456q70787r81977o32126m71991J47511M33134R01595
5725F0869446Q01180J202207J443781J658201K099393J867066K240783J768977
5717G3951034J873590R38964N53919m23708j504469k028004k272734k299338j871639
5708F6917615j854673j646294q38518j107993m90995n05457r17869n81688k93509
5699E8680619m86895r9051l00152l79176J6465K79332M54695P36096J449300J734708
5689F2085941K240078K074591K610473K743541K507558J919824J010339p00832
5681G6491513k077821k821478l055216l803909l502135l181812k877595k174171
5673E2997376k313331j923049j414385j401481j293015j095461j156300r33809
$$ y = [62528805, 62710543, 62344087, 61473300, 60491323, 59859197, 59387206, 59534717, 59967851, 60869446, 61670626, 62872833, 64316614, 65974815, 68074208, 69941274, 72182057, 73951034, 75824624, 76763588, 77317507, 76893799, 75389330, 73361326, 71088592, 68789254, 66917615, 65062942, 63416648, 62578130, 61470137, 60979142, 60473685, 59555816, 58974128, 58680619, 58193724, 58094673, 57794521, 57415345, 57431810, 57711142, 58165837, 58901933, 60351233, 62085941, 64326019, 66400610, 69011083, 71754624, 74262182, 76182006, 77192345, 76491513, 74413692, 71592214, 68536998, 64733089, 61230954, 58049142, 55171547, 52997376, 50684045, 48760996, 47346611, 45945130, 44652115, 43556654, 42400354, 41466545]
5665D1466545p52864q08177n75572p78844o90495k17341r7871m31144k09910R6191
5655C7000518l25384j85621K18924O56383L38757M01053N81138R35868J209615
5646D0831251J274873J475716J736036J412991J743398J964625J390617J296058
5638E3125565R22929M78534O0137L81517M12646M74533k14696N9472K15342J74683
5628E6090662J58060K65057K44647L23716M63622j90139j75255n27681j041517
5619E5611172j547724j416020j696025j427426j371923j347471m08312n63825
5611D5832446o75947l11002m53092n94015l72172m20387q21395q94667o87051
5602D0602718q13521q27775r89206n79501m65101o11171k6902k46182o2285j20607
$$ y = [41466545, 40713681, 39905504, 39329932, 38551088, 37860593, 37643252, 37545381, 37114237, 36904327, 37000518, 36675134, 36489513, 36708437, 37364820, 37703577, 38104630, 38685768, 39621636, 40831251, 42106124, 43581840, 45317876, 46730867, 48474265, 50438890, 51829507, 53125565, 54048494, 54527028, 54587165, 54968682, 55381328, 55855861, 55641165, 55700637, 55915979, 56090662, 56248722, 56513779, 56758426, 57082142, 57545764, 57355625, 57180370, 56652689, 55611172, 54063448, 52647428, 50951403, 49523977, 48152054, 46804583, 46396271, 45832446, 45156499, 44845497, 44392405, 43798390, 43426218, 43005831, 42184436, 41289769, 40602718, 39789197, 38961422, 37972216, 37392715, 36927614, 36316443, 36289541, 36043359, 35981074, 35860467]
5592C5860467j69152k87598k44895k41401p24619o82929o65147n98657l17055
5583C1929014j89716p29854n06429k3394k98184l2680m9965l02331o59932n66833
5573B8569696m6460n63165r28731l22578p08042n97241n06796n21934n47589m57890
5563B3369270k80933j13224J06589k35124j82958R4044p4709m19710j48558n94217
5553B1520470l25645j30687m27238n04696k60673m10424j82757j06572l82123
5544A8789655P5082j53672K0316j0600j73968J16427q9899k8628R6517L80223
5534A9021453L36166m04310p6450m911L29815K42458L31098K00561l4563k25733
5524A9715584J72337K28052j26639j63399j31843l7327J09439j12236l57444P5076
$$ y = [35860467, 35691315, 35403717, 35158822, 34917421, 34192802, 33509873, 32844726, 32246069, 31929014, 31739298, 31009444, 30503015, 30479621, 30181437, 30148757, 30098792, 29796461, 29136529, 28569696, 28523236, 27960071, 27031340, 26708762, 26000720, 25403479, 24896683, 24374749, 23827160, 23369270, 23088337, 22975113, 23081702, 22846578, 22663620, 22757664, 22682955, 22263245, 22114687, 21520470, 21194825, 21064138, 20636900, 20132204, 19871531, 19461107, 19278350, 19171778, 18789655, 18864737, 18711065, 18731381, 18720781, 18546813, 18663240, 18573341, 18544713, 18641230, 19021453, 19357619, 18953309, 18876859, 18871948, 19201763, 19444221, 19775319, 19975880, 19941317, 19715584, 19887921, 20115973, 19989334, 19825935, 19694092, 19656765, 19766204, 19653968, 19296524, 19371600]
5514A9371600K22142o7527L50436L3924o1481k13072M1764P6296K43347K81096
5504B0278525L76883p1104l21745j52364J8585N23653J85960R78j81324L0854
5494B0688901r7868m9909K91627L04121r2750K99582O9086K07724K38435K3259
5484B1882208J77775N45396N8616J77943K37589K47988L48050L00426M2787K76838
5474B4295616M22274J28825K49274L74096N60894N57901L69108N32779O14051
5465B8104818N62014Q50949Q97771M76819P16907O89062R76100J298336J126160
5456C5698936J013548J299136J018381J050586J404570J017445R70850R77153
5448D4450605P63803Q73432O51671J37829J14182N18305L36719M88713N55970
$$ y = [19371600, 19593742, 19526215, 19876651, 19910575, 19849094, 19636022, 19677786, 19754082, 19997429, 20278525, 20655408, 20584304, 20262559, 20110195, 20128780, 20652433, 20838393, 20839371, 20658047, 20688901, 20591033, 20541124, 20832751, 21136872, 21044122, 21343704, 21412790, 21620514, 21858949, 21882208, 22059983, 22605379, 22663995, 22841938, 23079527, 23327515, 23675565, 23975991, 24018778, 24295616, 24717890, 24846715, 25095989, 25470085, 26030979, 26588880, 26957988, 27490767, 28104818, 28666832, 29517781, 30415552, 30892371, 31609278, 32298340, 33274440, 34572776, 35698936, 36712484, 38011620, 39030001, 40080587, 41485157, 42502602, 43473452, 44450605, 45214408, 46087840, 46739511, 46877340, 46991522, 47509827, 47846546, 48335259, 48891229]
5439D8891229L80267N57951N30899M51184K97893K90234K2343J42443L06330M42098
5429E2312871N72001O79703L68540L29538M30734Q16315P64695J083367J316902
5420E8674666J401096J596801J777936J847819K372582L035796L048780L547861
5412G7303337L718069L562069L506115L881474L822668M130933L863491L646337
5404A07434493K100020R11039j0766k09964K74787N54894Q59685J053970J852111
5395A14820269J833451K067453K225731K751281K678190K398644J859651J349967
5387A31984637M70603j01400k22190m12339n58612o80306q81358p58215l73282
5378A28467538r08792r43064j069940k129240k561342l320138m265885m804126
$$ y = [48891229, 49271496, 49829447, 50360346, 50811530, 51109423, 51399657, 51422000, 51564443, 51870773, 52312871, 52884872, 53564575, 53933115, 54262653, 54693387, 55509702, 56274397, 57357764, 58674666, 60075762, 61672563, 63450499, 65298318, 67670900, 70706696, 73755476, 77303337, 81021406, 84583475, 88089590, 91971064, 95793732, 99924665, 103788156, 107434493, 109534513, 110445552, 110434786, 110224822, 110499609, 111054503, 111914188, 112968158, 114820269, 116653720, 118721173, 120946904, 123698185, 126376375, 128775019, 130634670, 131984637, 132455240, 132353840, 132131650, 131719311, 131160699, 130480393, 129599035, 128840820, 128467538, 127558746, 126615682, 125545742, 123416502, 120855160, 117535022, 113269137, 108465011]
5370A08465011m633767m647095n011510m703510m645999m599915m538199l965035
5362G1719981l508991l519936l118912k706216k404872k274668k095317j849544
5354E0241525j600894j308474j102467j266899p60298p95541j053275p83109j064655
5345D0505913l96050o07390k21512n73926o84735m72796m76056m01337n53916
5336C6118195n34805r06242k98649n47131p73296k48799m55980m06053k05780
5327C1741460l29736J4803k75678K16372k70658N0624l1413J5760j13587L11641
5317C1329588P45426m6806j22016K67029m4960j16521m08047o47296n64095o67074
5307B9725228m14355n01971o33647r48554j79062o0943l15453l07154m2991j38200
$$ y = [108465011, 103831244, 99184149, 94172639, 89469129, 84823130, 80223215, 75685016, 71719981, 68210990, 64691054, 61572142, 58865926, 56461054, 54186386, 52091069, 50241525, 48640631, 47332157, 46229690, 44962791, 44202493, 43406952, 42353677, 41570568, 40505913, 40109863, 39502473, 39280961, 38707035, 38022300, 37549504, 37073448, 36672111, 36118195, 35583390, 34677148, 34378499, 33831368, 33058072, 32809273, 32353293, 31947240, 31741460, 31411724, 31426527, 31150849, 31367221, 31096563, 31147187, 31115774, 31131534, 31017947, 31329588, 32075014, 32028208, 31906192, 32173221, 32128261, 32011740, 31603693, 30956397, 30392302, 29725228, 29310873, 28808902, 28175255, 27226701, 27047639, 26986696, 26671243, 26364089, 26321098, 26182898]
5297B6182898l63846j58695q0010k43893o64211K52417R6730k30228J66683K2357
5287B4980202j68174p8999J30740J92166P0602J18819M69202L03178K82301k4185
5277B6275852P2046K66316J98977j49995K4269l44097n57491m26507m48699l47917
5267B4562754m82645k93745m84641m27325l7891k58305j73349J31469l70699j20341
5257B2045282m5440J62391j9977l51889o7304k9821k873q785j41329k34929l92783
5246B0912543j26156j66096l77271M8074Q1393j79226k81586N5516L9626J53218
5236B0160035J8915P3561J9418O3028k72799N0972K45535J62405j11813o08333
5226A9800924p5674K50172j55630j49741l82258O7699P5442j12880j45910j23745
$$ y = [26182898, 25819052, 25660357, 25580347, 25336454, 24672243, 24924660, 25021390, 24791162, 24957845, 24980202, 24812028, 24733029, 24863769, 25055935, 25126537, 25245356, 25714558, 26017736, 26300037, 26275852, 26347898, 26614214, 26813191, 26663196, 26687465, 26343368, 25785877, 25359370, 24910671, 24562754, 24080109, 23786364, 23301723, 22874398, 22836507, 22578202, 22404853, 22536322, 22165623, 22045282, 21999842, 22162233, 22142256, 21790367, 21723063, 21693242, 21690369, 21681584, 21540255, 21305326, 20912543, 20786387, 20620291, 20243020, 20291094, 20372487, 20193261, 19911675, 19967191, 20006817, 20160035, 20178950, 20252511, 20271929, 20334957, 20062158, 20113130, 20358665, 20521070, 20409257, 19800924, 19725250, 19975422, 19819792, 19670051, 19287793, 19355492, 19430934, 19318054, 19172144, 19048399]
5216A9048399K74715J97022j21299k07425O0235J31197m60927j19266J42884M2570
5206A8988105J49628L98692N998q078J73019j62586j40961p876j19262L9627J17245
5195A9433551Q584j24674j54814m58732J7462J41121m9624N111J09451J12122
5185A9039558k19861l6148k3956o2072K35803J37928k43418K23319J63203K65383
5175A9479739j98315k06310J46340M02703j62079r5217L75814l8123R1662k75322
5165A9520892M5171L11939L0469L65396O6618m4340p0704R400k81124l20668k50158
5154A9382891J14422j62998K94667K28754j69058k40142J6575J88022k03366p4175
5144A9375592k46856J47680q9896j70047N04624l9526n1081n4446K29532N1855
$$ y = [19048399, 19323114, 19520136, 19398837, 19191412, 19251647, 19382844, 18921917, 18802651, 18945535, 18988105, 19137733, 19536425, 19542423, 19534345, 19707364, 19544778, 19403817, 19395941, 19276679, 19316306, 19433551, 19442135, 19317461, 19162647, 18703915, 18721377, 18862498, 18812874, 18817985, 18927436, 19039558, 18819697, 18783549, 18759593, 18697521, 18933324, 19071252, 18827834, 19051153, 19214356, 19479739, 19281424, 19075114, 19221454, 19624157, 19462078, 19366861, 19742675, 19704552, 19796214, 19520892, 19566063, 19878002, 19908471, 20273867, 20340485, 20296145, 20225441, 20234841, 19953717, 19633049, 19382891, 19497313, 19334315, 19628982, 19857736, 19688678, 19448536, 19465111, 19653133, 19449767, 19375592, 19128736, 19276416, 19186520, 19016473, 19521097, 19481571, 19430490, 19376044, 19605576, 19657431]
5134A9657431j06827J84272P4800K82004J24189j61452r4399j28381l86228k16159
5124A9229250L29478p4829q2031k04996m8436K65705n9148r991J22014n7659q1593
5113A9327764R227n7401J50346K13529m6376J60232J82628k5460j6373K4802k16164
5102A9706754l8436K70556n7292L30578k9274J45636p4628R8360K00212K23165
5092B0775631J12213K58680K72368K45071J12613q0715M4853l81308P1071J69120
5082B1599597k76230J5730J66522j66816j2201l000j42923k43067J75527k40662
5072B0872477m37654R7037l70309l59298k0133o3600l10256n9138P9792k10167
5062A9218751J1680m5550M7453J24348R225K0551k05707m1973K29686j63102j06933
$$ y = [19657431, 19550604, 19734876, 19809676, 20091680, 20215869, 20054417, 19960018, 19831637, 19445409, 19229250, 19558728, 19483899, 19401868, 19196872, 19148436, 19414141, 19354993, 19345002, 19467016, 19409357, 19327764, 19336991, 19279590, 19429936, 19643465, 19597089, 19757321, 19939949, 19914489, 19898116, 19922918, 19706754, 19668318, 19938874, 19881582, 20212160, 20182886, 20328522, 20253894, 20352254, 20552466, 20775631, 20887844, 21146524, 21418892, 21663963, 21776576, 21695861, 21740714, 21359406, 21430477, 21599597, 21323367, 21339097, 21505619, 21338803, 21326602, 21323602, 21180679, 20937612, 21113139, 20872477, 20434823, 20531860, 20161551, 19802253, 19782120, 19718520, 19408264, 19349126, 19428918, 19218751, 19230431, 19184881, 19232334, 19356682, 19365907, 19386458, 19180751, 19138778, 19368464, 19205362, 19098429]
5051A9098429J55615k30318J21626J83234k8612l03752J17192J3429j78457j35971
5041A8812415l8048K76710J56218J39522l0921j65437J79655Q6212j37196J34527
5031A9413657L8394J99799J59391j52589j27954J80297L87620q61j23499J43247
5021B0117502o5448M5555j00742j60437K2515j93092o4570j78917m5649j0230
5011A9366487M65456P1940j65741j91408l78695N0260K5568r1314l09858J07308
5001A8950003l0025j56841n4716Q1073K77219r5736j99578q1734K51462j07813
4991A8833314l71280P7012r4948Q0466J19781R1577R2565j03293J75076K07938
4981A9108208j03445O4606j30833M3231p4170J74370J96893O9378J52746K18601
$$ y = [19098429, 19254044, 19023726, 19145352, 19328586, 19299974, 18996222, 19113414, 19126843, 18948386, 18812415, 18774367, 19051077, 19207295, 19346817, 19315896, 19150459, 19330114, 19416326, 19279130, 19413657, 19452051, 19651850, 19811241, 19658652, 19530698, 19710995, 20098615, 20097754, 19974255, 20117502, 20052054, 20097609, 19996867, 19836430, 19858945, 19665853, 19601283, 19422366, 19376717, 19366487, 19831943, 19903883, 19738142, 19546734, 19168039, 19218299, 19243867, 19152553, 18842695, 18950003, 18919978, 18763137, 18708421, 18789494, 19066713, 18970977, 18771399, 18689665, 18941127, 18833314, 18462034, 18539046, 18444098, 18524564, 18644345, 18735922, 18828487, 18725194, 18900270, 19108208, 19004763, 19069369, 18938536, 18981767, 18907597, 19081967, 19278860, 19348238, 19500984, 19719585]
4971A9719585j72726k67717K17698k83202J17626J44597j37513K82733j95170
4962A9425911k5351j5314k56628J06442m8229j25616n2801j8710J36492l02842
4952A8823354J305N86l67661J79640L66247j79395l55213J69805J66049J05790
4942A8910507K4726k30526j44491Q3834j83906M4100O6362J43728J83976M0322
4932A8938632R18M7997K42822m13594k95527M9976j11691J23953J9824K27267
4922A8830577j32911j91024j01251L29900K46484J41349J06908O0104L9949Q5578
4912A9415663r3946k26762J27557Q9123j076J11905j2068k18722j50080l249N0394
4901A9088739k32574j43621N0080j4026j21817m18442L4803L14552j12372k61096
$$ y = [19719585, 19546859, 19279142, 19496840, 19213638, 19331264, 19475861, 19338348, 19621081, 19425911, 19400560, 19385246, 19128618, 19235060, 19186831, 19061215, 19008414, 18989704, 19126196, 18823354, 18824659, 18825245, 18457584, 18637224, 19003471, 18824076, 18468863, 18638668, 18804717, 18910507, 18935233, 18704707, 18560216, 18644050, 18460144, 18504244, 18570606, 18714334, 18898310, 18938632, 18939550, 18987547, 19230369, 18816775, 18521248, 18571224, 18459533, 18583486, 18603310, 18830577, 18697666, 18506642, 18405391, 18735291, 18981775, 19123124, 19230032, 19290136, 19330085, 19415663, 19321717, 19094955, 19222512, 19311635, 19310559, 19422464, 19410396, 19191674, 19041594, 19038345, 19088739, 18856165, 18712544, 18762624, 18748598, 18626781, 18208339, 18243142, 18557694, 18445322, 18184226]
4891A8184226j65910K77350P3070J91457J00764J34425j24045L9643k4016l65179
4881A8321785J02115k80549m4373K71896N38372l5403j36727K07642K86883k58193
4871A8973448J53888M78818m67118L18260r2522J61892K44970j68805j03886j10213
4861A9388732J72109J52535J47543O5220n0106k46460L29544J30146Q9526L46726
4851B0525515L34799N2265l75418K64570K3704J84151j10486J22507K21568j40550
4841B1102625L75607M26532J1842l48095L4662M4851J78941K5073n131L20610
4831B2167517j74817r3110J40023K85158J00138M57208J75353L9119M73131K10350
4821B3780070K46220M33975R2764J99484J98546J76634J4111P5023j43825J02608
$$ y = [18184226, 18018316, 18295666, 18368736, 18560193, 18660957, 18795382, 18671337, 18710980, 18686964, 18321785, 18423900, 18143351, 18098978, 18370874, 18909246, 18873843, 18737116, 18944758, 19231641, 18973448, 19127336, 19606154, 19139036, 19457296, 19364774, 19526666, 19771636, 19602831, 19498945, 19388732, 19560841, 19713376, 19860919, 19926139, 19876033, 19629573, 19959117, 20089263, 20178789, 20525515, 20860314, 20912579, 20537161, 20801731, 20825435, 21009586, 20899100, 21021607, 21243175, 21102625, 21478232, 21904764, 21916606, 21568511, 21603173, 21648024, 21826965, 21852038, 21846907, 22167517, 21992700, 21899590, 22039613, 22324771, 22424909, 22882117, 23057470, 23096589, 23569720, 23780070, 24026290, 24460265, 24553029, 24752513, 24951059, 25127693, 25141804, 25216827, 25073002, 25175610]
4811B5175610L93030M18304O68333K27464L18457L20351J70515O64312M13576
4802B8769952L59332L63988M32429O07081N18555O03087M39191O67677N20271
4793C3281563P16515P44770P22151L86597M60128Q07118O03892N33814N85595
4784C8842143P30191J145880J140446J116542J557045J793109K405663K639243
4776E1370262K966363L769930M085690M968356O970778R412090J2660320J3996652
4768A10200441Q457981O11608p349210j3688674j3638278j0452686p338570m934874
4760F1867738l566878k720578k181788j476403j325955r28686r49182q91011n44296
4751D7282961m39656k03811j88748O5610L34730J42381J28067O1899M73906M19660
$$ y = [25175610, 25568640, 25986944, 26655277, 26882741, 27201198, 27521549, 27692064, 28356376, 28769952, 29129284, 29493272, 29925701, 30532782, 31051337, 31654424, 32093615, 32761292, 33281563, 33998078, 34742848, 35464999, 35851596, 36311724, 37118842, 37722734, 38256548, 38842143, 39572334, 40718214, 41858660, 42975202, 44532247, 46325356, 48731019, 51370262, 54336625, 58106555, 62192245, 67160601, 74131379, 83543469, 96203789, 110200441, 118658422, 119270030, 111920820, 98232146, 84593868, 74141182, 66802612, 61867738, 58300860, 55580282, 53398494, 51922091, 50596136, 49667450, 48718268, 47827257, 47282961, 46843305, 46639494, 46450746, 46516356, 46851086, 46993467, 47121534, 47183433, 47657339, 48076999]
4741D8076999O75803L36864M32107P32094O54395O45047K76402L33702M68370
4732E2631783O00110O04565Q61438N28497N91745N75469N87440J201430J158787
4723E9341264J352879J294998J780875J615418J964591K121513K314600K844398
4715G4630536L669047M351290O301263Q994459J1826372J1451481M583305M09701
4707A26217454k026072q702030j2318638r709651o667116m150178k495333j533891
4699G8614545o94973l33517n37783k97143J78866J85857K39672j24116r23463
4690G6307945j151105j179010j275108j341644r54687j123042r07868j000448
4682F7375033j009401p31849n67330n51031l68333l01767J08568K01574K54216
$$ y = [48076999, 48752802, 49089666, 49521773, 50253867, 50908262, 51553309, 51829711, 52163413, 52631783, 53231893, 53836458, 54697896, 55226393, 55818138, 56393607, 56981047, 58182477, 59341264, 60694143, 61989141, 63770016, 65385434, 67350025, 69471538, 71786138, 74630536, 78299583, 82650873, 88952136, 97946595, 109772967, 121224448, 125807753, 126217454, 124191382, 115489352, 103170714, 93461063, 86793947, 82643769, 80148436, 78614545, 77919572, 77586055, 77048272, 76751129, 76929995, 77115852, 77355524, 77231408, 76307945, 75156840, 73977830, 72702722, 71361078, 70406391, 69283349, 68375481, 67375033, 66365632, 65633783, 65066453, 64515422, 64147089, 63845322, 63953890, 64155464, 64409680]
4673F4409680K13877K78304L47419J45068L74347R38724Q89350K67264J89775
4664F8053808M35601K16748K32009n3079k60785o87144l41870k40583n07289j99750
4654F6647666l22659m78968m80274m00329l78411k79390n21355m08135p8090L2959
4644F3333014R1677k23771m0296L72916M30674M49715N48173N78163N35146M49638
4634F6525049R87966J020685R02360J082985O90589J141810Q75503P21052Q41827
4625G4789826J45248N67063L07049n3214j48567j46711J68507k2973K16900L06997
4615G6130125M49271M65554L85950P38110J175039J299939J961708K322761K242850
4606H7171307K245175K369918K926176L724512L913200L783270L865929M519781
$$ y = [64409680, 64623557, 64901861, 65249280, 65394348, 65768695, 66707419, 67596769, 67864033, 68053808, 68489409, 68706157, 68938166, 68885087, 68624302, 67937158, 67595288, 67354705, 66847416, 66647666, 66325007, 65846039, 65365765, 64965436, 64587025, 64307635, 63786280, 63378145, 63300055, 63333014, 63424691, 63200920, 63160624, 63533540, 63964214, 64413929, 64962102, 65540265, 66075411, 66525049, 67513015, 68533700, 69436060, 70519045, 71209634, 72351444, 73226947, 73947999, 74789826, 74935074, 75502137, 75809186, 75755972, 75607405, 75460694, 75629201, 75606228, 75823128, 76130125, 76579396, 77044950, 77430900, 78169010, 79344049, 80643988, 82605696, 84928457, 87171307, 89416482, 91786400, 94712576, 98437088, 102350288, 106133558, 109999487, 114519268]
4598A14519268N571568O651820O744632O064939M999763L482088J860568P65146
4590A50659792j216049l341902m512449n905785o174245o214753o217385o017764
4582A11059460n825357n504767m889412l976229l510916k887965k244618k142781
4574H0077415j691469o94145o08181o53099j49417l29278J1284k53640o5846j96001
4564G5447623k36609k50737l13534m0642K90134M86031Q04878J098881J117030
4555G8403055R93835P29459J001022J310186R94689N58027L38427l58604l17862
4546H3652234j56192j06369m04545O91654J093348J263338J772049J838459K491921
4537I2135897K572956K741448L064039K097676J730171Q15451K01617p54896j504889
$$ y = [114519268, 120090836, 126742656, 133487288, 139552227, 144551990, 148034078, 149894646, 150659792, 149443743, 146101841, 141589392, 135683607, 129509362, 123294609, 117077224, 111059460, 105234103, 99729336, 94839924, 90863695, 87352779, 84464814, 82220196, 80077415, 78385946, 77691801, 77083620, 76430521, 76281104, 75951826, 75963110, 75709470, 75643624, 75447623, 75211014, 74960277, 74646743, 74606101, 74896235, 75382266, 76187144, 77286025, 78403055, 79396890, 80126349, 81127371, 82437557, 83432246, 83990273, 84328700, 83970096, 83652234, 83496042, 83389673, 82985128, 83676782, 84770130, 86033468, 87805517, 89643976, 92135897, 94708853, 97450301, 100514340, 102612016, 104342187, 105157638, 105359255, 104604359, 103099470]
4528A03099470j679063j936192j788598j385539j164183q80617l94984K01709
4520I4072003O95706J248384J301472R50529O57145Q20841P9656l03989j46217
4511I9375530k37386l9013J70490Q1455L70274M51053J58776j60678k79453p09696
4501I9181352p40654q11884j416689j276628j246158j033168j036165p28901j15736
4492I0775369J14284P77028P69037J255163J823814J884024K138671K878870K956289
4483A05372549K399919L115273K980277K555058K129096J300265R64749J071413
4475A21888599K85497J62063J4964l41171j052968j519858j768744k045662j943476
4466A13679244k100105k300143k319805k479028k224181k114963k504633k110026
$$ y = [103099470, 101420407, 99484215, 97695617, 96310078, 95145895, 94265278, 93870294, 94072003, 94767709, 96016093, 97317565, 98268094, 98925239, 99746080, 99825736, 99521747, 99375530, 99138144, 99099131, 99269621, 99351076, 99721350, 100172403, 100331179, 100170501, 99891048, 99181352, 98440698, 97628814, 96212125, 94935497, 93689339, 92656171, 91620006, 90891105, 90775369, 90889653, 91666681, 92435718, 93690881, 95514695, 97398719, 99537390, 102416260, 105372549, 107772468, 110887741, 113868018, 116423076, 118552172, 119852437, 120817186, 121888599, 122174096, 122336159, 122351123, 122009952, 120956984, 119437126, 117668382, 115622720, 113679244, 111579139, 109278996, 106959191, 104480163, 102255982, 100141019, 97636386, 95526360]
4458I5526360j584593j834272j609772j343339p74259r22361j148122j373045
4450H4936597q80277n31153r45730q67347p08359j497503r47757j298717j415745
4441G5844009r06094m39173j75576n51151q1124N44372N40472Q01585J180412
4432G6757732J558992J802160K387107K546776K915702K627063K434143K703269
4424I5732944K306868K303779K142431K263583J793359J378654N70023L37023
4416A08828664l63175j018809j654758k085776j749259j529746j107670j052478
4408I8266993j183238j055078j098371j406335q21370k28157L88614J189055J661604
4399I5713717K093763K874201L175040L674053M089407M269670N492936P214119
$$ y = [95526360, 93941767, 92107495, 90497723, 89154384, 88380125, 87457764, 86309642, 84936597, 84056320, 83525167, 82579437, 81712090, 81003731, 79506228, 78558471, 77259754, 75844009, 74937915, 74498742, 74323166, 73772015, 73690891, 74235263, 74775735, 75577320, 76757732, 78316724, 80118884, 82505991, 85052767, 87968469, 90595532, 93029675, 95732944, 98039812, 100343591, 102486022, 104749605, 106542964, 107921618, 108491641, 108828664, 108465489, 107446680, 105791922, 103706146, 101956887, 100427141, 99319471, 98266993, 97083755, 96028677, 94930306, 93523971, 92702601, 92474444, 92863058, 94052113, 95713717, 97807480, 100681681, 103856721, 107530774, 111620181, 115889851, 121382787, 128596906]
4391A28596906R216110J1873960J3559665J2020653M056047p172143j3741721
4384A58409477j4802474j3109786j0834097q891951p070724n683711m445517l270670
4376I0300547k617638k442185k103340j704738j860055j827428k012966j657949
4368G4074248j715185j762028j778087k017516j847525j824078j684745j286142
4360F0158942j222241q82776n70367m50807p72071l19339n20589k7093n6998j55825
4350E5180836r0475L9261J93691j5960k31145n2259M59553J34837N05880O10227
4340E6734446Q96038Q58132J145166J414409P06844J139854R04151P63285O87521
4331F5249846M76859K44629L7781J90648M87274P89501R18416Q48311J112132
$$ y = [128596906, 137813016, 149686976, 163246641, 175267294, 179323341, 172151198, 158409477, 143607003, 130497217, 119663120, 110771169, 103700445, 98016734, 93571217, 90300547, 87682909, 85240724, 83137384, 81432646, 79572591, 77745163, 75732197, 74074248, 72359063, 70597035, 68818948, 66801432, 64953907, 63129829, 61445084, 60158942, 58936701, 58053925, 57483558, 57032751, 56260680, 55941341, 55420752, 55393659, 55336661, 55180836, 55090361, 55129622, 55323313, 55307353, 55076208, 55023949, 55483502, 55618339, 56124219, 56734446, 57630484, 58488616, 59633782, 61048191, 61755035, 62894889, 63799040, 64562325, 65249846, 65726705, 65971334, 66009115, 66199763, 66687037, 67476538, 68394954, 69243265, 70355397]
4322G0355397J809589K001777J607815K057578K204897K528639L025226L495476
4314H9086394L925962N184919N484191N993518P077979Q294505R672360J1238413
4306A45958241J3222464J5431823J7891138K0962311K3799299K5940081K5994547
4299B89199904K1267993R991514n980098j9786200k7864191k9650161k7437312
4292B09741449k3997442k0015199j6348653j3239070j1214145r725603p893742
4285A07307595p138031o306455n485690m693453m149867l221830l348875k475615
4277G0487779k611462k174771j765441j468983j351145p96988j72391j97830j13115
4268E9835653j40178o25847j299617k209810k467278k710985k438891j988721
$$ y = [70355397, 72164986, 74166763, 75774578, 77832156, 80037053, 82565692, 85590918, 89086394, 93012356, 98197275, 103681466, 109674984, 116752963, 125047468, 134719828, 145958241, 159180705, 174612528, 192503666, 213465977, 237265276, 263205357, 289199904, 310467897, 320459411, 314479313, 294693113, 266828922, 237178761, 209741449, 185744007, 165728808, 149380155, 136141085, 124926940, 115201337, 107307595, 100169564, 93863109, 88377419, 83683966, 79534099, 76312269, 72963394, 70487779, 67876317, 65701546, 63936105, 62467122, 61115977, 60318989, 60146598, 59948768, 59835653, 59695475, 59069628, 57770011, 55560201, 53092923, 50381938, 47943047, 45954326]
4260D5954326j862126j688740j283300j434523j080221q16501j088551j076519
4252C5623845p37915r39428r90776l58212m62383o29695p21602o08197k80861
4243B9894776l1533o44038j73546l24700j00745k62956L0458O3333r3404K69416
4233B8627061k64749o37246r31758o00843p85819n36586m86644n40650k61080
4224B3581686k82688j72637m25121m6724l44883l11910j39460l27305k29942q9242
4214B1211774k01653J0416j36331m05571o2278m3131j99181j52186Q1273O8862
4204B0171994J82502j40109j74124j8969k77260j14848L07k78503l31442Q9346
4194A9108894j95306l6856j49647k42768R2345j67080j79275q6323j45338l46635
$$ y = [45954326, 44092200, 42403460, 41120160, 39685637, 38605416, 37788915, 36700364, 35623845, 34885930, 33946502, 32955726, 32597514, 32135131, 31505436, 30783834, 30175637, 29894776, 29863243, 29219205, 29045659, 28720959, 28620214, 28357258, 28387716, 28451049, 28357645, 28627061, 28362312, 27725066, 26793308, 26192465, 25406646, 24870060, 24383416, 23842766, 23581686, 23298998, 23126361, 22701240, 22654516, 22309633, 21997723, 21858263, 21530958, 21301016, 21211774, 21010121, 21020537, 20884206, 20478635, 20416357, 20373226, 20174045, 20021859, 20103132, 20171994, 20354496, 20214387, 20040263, 20021294, 19744034, 19629186, 19629493, 19350990, 19019548, 19108894, 18913588, 18876732, 18727085, 18484317, 18576662, 18409582, 18230307, 18143984, 17998646, 17652011]
4184A7652011j6658L17828M7130l3610J09132J79463K81475k86174j9913m9052
4174A8181632L916J36877J62489j9924j25344p0252j98434l65159j48774j86488
4164A7370539J99662O9172m3001J72065k9822j14561K18671J42348r8251K0246
4154A7907068M08952N34666K88173M25626J40524N15211M35486j14002l76041
4145B0165663l90741o81444k67603k53005n64036l14611J2557n1236l48909J46939
4135A7453574L08285k37071M00439J52339j6236j61053L19191K58410J60708M10994
4125A9049580K53668j37863J5728l4332N1345J11052K42953J24027j04471l9780
4115A9531907L8629J35275L73520O1987K23004J18463Q3311J69917L66940L75501
$$ y = [17652011, 17635353, 17953181, 18000311, 17966701, 18075833, 18255296, 18536771, 18250597, 18230684, 18181632, 18185548, 18322425, 18484914, 18464990, 18339646, 18269394, 18070960, 17705801, 17557027, 17370539, 17570201, 17639373, 17596372, 17768437, 17738615, 17624054, 17842725, 17985073, 17886822, 17907068, 18316020, 18850686, 19138859, 19564485, 19705009, 20220220, 20655706, 20541704, 20165663, 19774922, 19093478, 18825875, 18572870, 18008834, 17694223, 17706780, 17655544, 17306635, 17453574, 17761859, 17524788, 17925227, 18077566, 18061330, 17900277, 18219468, 18477878, 18638586, 19049580, 19303248, 19165385, 19181113, 19146781, 19198126, 19309178, 19552131, 19676158, 19571687, 19531907, 19570536, 19705811, 20079331, 20141318, 20364322, 20482785, 20566096, 20736013, 21102953, 21478454]
4105B1478454K31885J85980K01303J75254K5182k14939l59812L08940l1940j94396
4095B1805911l22986K41941J22129r7766R9847K26593j33884Q0541K50897J94357
4085B2467580N9853N4286J52444J82252j30992J73968J27904M88253J28914j63427
4075B3541035q5418k80527O8509J62999L07057J03668M02568J25142J04600J52838
4065B4602471j25665J83521L42028K59862L30025K22085K34406K21775K39119
4056B6509627M36361N8370K03823K65306N94627M28112L78011N26249J91541L36926
4046B9928953K81708L43410L67649M13053O64742N63889N51484Q31578N57503
4037C4503969M89736P24491J029776Q65320P56388O38618R77757J274983J188706
$$ y = [21478454, 21710339, 21896319, 22097622, 22272876, 22298058, 22083119, 21723307, 22032247, 22000307, 21805911, 21482925, 21724866, 21846995, 21749229, 21849076, 22075669, 21941785, 22022326, 22273223, 22467580, 22527433, 22581719, 22734163, 22916415, 22785423, 22959391, 23087295, 23575548, 23704462, 23541035, 23455617, 23175090, 23243599, 23406598, 23713655, 23817323, 24219891, 24345033, 24449633, 24602471, 24476806, 24660327, 25002355, 25262217, 25592242, 25814327, 26048733, 26270508, 26509627, 26945988, 27004358, 27208181, 27473487, 28068114, 28496226, 28874237, 29400486, 29592027, 29928953, 30210661, 30554071, 30921720, 31334773, 31999515, 32563404, 33114888, 33946466, 34503969, 34993705, 35718196, 36747972, 37613292, 38369680, 39008298, 39986055, 41261038, 42449744]
4028D2449744Q98212R89687J232930Q51665J200407J110138J092162J416797J811932
4019E3053674J301706J287176J709385J413345J258828J235531J472790J623538
4011F4355973J506853J358494J438522J577302J562418J959259K010234K125463
4003G7894518K147929K347617K032310K276683K196990K437408K841806K508020
3995I6683281K567894K542545K755979K379249K463075K513668K218278K345229
3987A16469198K732318K390094K549865K208980K059190K156958J976878J678705
3979A34222186J280682J553882J310476J433346J416219O80581Q72425M99165
3971A43268962P84599N09476J88690K57927n2562l24641l37571l06827o62065
$$ y = [42449744, 43347956, 44337643, 45570573, 46422238, 47622645, 48732783, 49824945, 51241742, 53053674, 54355380, 55642556, 57351941, 58765286, 60024114, 61259645, 62732435, 64355973, 65862826, 67221320, 68659842, 70237144, 71799562, 73758821, 75769055, 77894518, 80042447, 82390064, 84422374, 86699057, 88896047, 91333455, 94175261, 96683281, 99251175, 101793720, 104549699, 106928948, 109392023, 111905691, 114123969, 116469198, 119201516, 121591610, 124141475, 126350455, 128409645, 130566603, 132543481, 134222186, 135502868, 137056750, 138367226, 139800572, 141216791, 141897372, 142769797, 143268962, 144053561, 144563037, 144751727, 145009654, 144957092, 144632451, 144294880, 143988053, 143325988]
3962A43325988n35051p43433l74162k95542n57712n57738m51922n44928o26693
3953A38638807r55249n97829m91787l87053j05741j96770j98886J75886K99882
3944A36181260K79307O11020N29036N67262P32458Q22283R95485J447340J328543
3935A43493994J337276J406580J468518J738921J681404J551447J522926J638412
3927A55839478J145669J002566R43658R71302J007699P17812O28844O76734L04509
3918A63238271L37066M45306R971j26762o16461j292411j354553j791656j769788
3909A57078983j930470k176671k328058k556623k291627k827055k955210l193438
3901A36819831l286585l373754l258771l379216l594264l553705m146429m042145
$$ y = [143325988, 142790937, 142047504, 141673342, 141377800, 140820088, 140262350, 139810428, 139265500, 138638807, 137683558, 137085729, 136593942, 136206889, 136101148, 135904378, 135705492, 135881378, 136181260, 136460567, 137071587, 137600623, 138167885, 138900343, 139722626, 140718111, 142165451, 143493994, 144831270, 146237850, 147706368, 149445289, 151126693, 152678140, 154201066, 155839478, 156985147, 157987713, 158931371, 159902673, 160910372, 161628184, 162257028, 162933762, 163238271, 163575337, 164020643, 164030614, 163903852, 163287391, 161994980, 160640427, 158848771, 157078983, 155148513, 152971842, 150643784, 148087161, 145795534, 142968479, 140013269, 136819831, 133533246, 130159492, 126900721, 123521505, 119927241, 116373536, 112227107, 108184962]
3893A08184962l565398l733033l222275l017432l287860l458115k885516l133822
3885H1881511l167112l099256k931061k624783k545439k302702k406767k265632
3877F0538759j902859k216122j631014j568878j383647j252916j299502j053694
3869D8230127j072511q00125p97084r30942p17408n22519o63980n87238k66011
3860D1872309l94465Q421l14150j16110R656J829R5946R1002k1062l09147k60219
3849D0664010n13609k46364n97339m43121k87476m35288m39219l21525l07356
3840C7072713k31028n13236l58449n65689n51999n61825r30871o89602o52278
3831C2017736j055056o21250p18851n03862m37035n27909n83407o71031m51306
$$ y = [108184962, 104619564, 100886531, 97664256, 94646824, 91358964, 87900849, 85015333, 81881511, 78714399, 75615143, 72684082, 70059299, 67513860, 65211158, 62804391, 60538759, 58635900, 56419778, 54788764, 53219886, 51836239, 50583323, 49283821, 48230127, 47157616, 46357491, 45560407, 44629465, 43912057, 43389538, 42725558, 42138320, 41872309, 41477844, 41486265, 41172115, 41056005, 41065661, 41067490, 41163436, 41254438, 41233376, 40924229, 40664010, 40150401, 39904037, 39306698, 38863577, 38576101, 38140813, 37701594, 37380069, 37072713, 36841685, 36328449, 35970000, 35404311, 34852312, 34290487, 33359616, 32670014, 32017736, 30962680, 30341430, 29622579, 29118717, 28681682, 28153773, 27570366, 26899335, 26448029]
3822B6448029n84396k93567l81549l77345r4393m94269n2605j41627k53008l71681
3812B3403589j49408k37230j72434k13931n47101k62603Q9446l52906l08829k47172
3802B1001421j16445l31331j33503j60379q849O860m11761o4059L46392m2698
3792B0085648O5055k63200k47846l5259l05802m9301K66814O8688j86401L35988
3782A9734384k20558J73595M4301j43820J29460r770n6443L23056K26741j055
3772B0199891K93658J14703j04782L17811K98150K08650J06647N11213K49435
3763B2195376J27345L83980L67724M96430K42164K40797N08217O33751L84299
3754B5580083L92158K29183J56111M34810R6196K46583K01845L42340K47592M16927
$$ y = [26448029, 25863633, 25570066, 25188517, 24811172, 24716779, 24222510, 24169905, 24028278, 23775270, 23403589, 23254181, 23016951, 22844517, 22630586, 22083485, 21820882, 21910328, 21557422, 21248593, 21001421, 20884976, 20553645, 20420142, 20259763, 20250914, 20257774, 19846013, 19781954, 20128346, 20085648, 20150703, 19887503, 19639657, 19604398, 19298596, 19249295, 19516109, 19584797, 19398396, 19734384, 19513826, 19687421, 19731722, 19587902, 19717362, 19707592, 19651149, 19974205, 20200946, 20199891, 20493549, 20608252, 20503470, 20821281, 21119431, 21328081, 21434728, 21945941, 22195376, 22322721, 22706701, 23074425, 23570855, 23813019, 24053816, 24562033, 25195784, 25580083, 25972241, 26201424, 26357535, 26792345, 26888541, 27135124, 27336969, 27679309, 27926901, 28343828]
3744B8343828J99071K75533K12286K13880K47134L30144j12540J56215L69559
3735C0235110J61951k32371p6844L72620J10018M08504J19017Q8076L19752M20550
3725C1926383L76883O41296R7526M90208M66697L62026L12080K38438O16768L05002
3715C5833307P42326M73976N46333O73047M68924J85327J83429M27974O28773
3706D0163416N51605L26182Q09726N50391M22201L64947N32028P52532M32757
3697D4905785N46671N84157L75170M49850N44763O39408O26992N43874M93433
3688D9710103R60261O14176O05835J018515P68510P41092J057256Q48972Q07451
3679E7132171P08353P88711J135104J120309J298174J086076J128207J621026
$$ y = [28343828, 28542899, 28818432, 29030718, 29244598, 29491732, 29821876, 29709336, 29865551, 30235110, 30397061, 30164690, 30087846, 30460466, 30570484, 30978988, 31098005, 31186081, 31505833, 31926383, 32303266, 32944562, 33042088, 33532296, 33998993, 34361019, 34673099, 34911537, 35528305, 35833307, 36575633, 37049609, 37595942, 38268989, 38737913, 38923240, 39106669, 39534643, 40163416, 40715021, 41041203, 41850929, 42401320, 42823521, 43188468, 43720496, 44473028, 44905785, 45452456, 46036613, 46411783, 46861633, 47406396, 48045804, 48672796, 49216670, 49710103, 50670364, 51284540, 51890375, 52908890, 53677400, 54418492, 55475748, 56324720, 57132171, 57840524, 58629235, 59764339, 60884648, 62182822, 63268898, 64397105, 66018131]
3671F6018131J295218J304223J430092J562065J508705J377522J629794J769100
3663G7894850J853973K033167K167694J916710K225190K365807K259117K267131
3655I4983639K259130K541337K350358K187562K473918K473891K476847K422059
3647A14168741K917747K424100K572966K802831L013910K979841K754418K775233
3639A36409787K555138K573638K633908K659432K372821K070250K550247K934022
3631A56759243K701079L112720L104323L063775L401359L406868L396992K889252
3623A81835611K659663L017633K846509K789162K755402K907385K938824L101011
3615B04851200L667386L459197L921269M076515L839183L981157M274359L914229
$$ y = [66018131, 67313349, 68617572, 70047664, 71609729, 73118434, 74495956, 76125750, 77894850, 79748823, 81781990, 83949684, 85866394, 88091584, 90457391, 92716508, 94983639, 97242769, 99784106, 102134464, 104322026, 106795944, 109269835, 111746682, 114168741, 117086488, 119510588, 122083554, 124886385, 127900295, 130880136, 133634554, 136409787, 138964925, 141538563, 144172471, 146831903, 149204724, 151274974, 153825221, 156759243, 159460322, 162573042, 165677365, 168741140, 172142499, 175549367, 178946359, 181835611, 184495274, 187512907, 190359416, 193148578, 195903980, 198811365, 201750189, 204851200, 208518586, 211977783, 215899052, 219975567, 223814750, 227795907, 232070266, 235984495]
3607B35984495L841403M036223M268850M037602M234586M217247M462834M715280
3599B69798520M495596M827027M853120N243038M748323N001796N201544N475411
3591C09644375N262664N425171N537735N288280N451497N431498N523106N589110
3583C53153436N450879N734444N684987O241237O219336O769490P226318O840094
3575D03320221P621920P898595P865122Q136632Q206576P910802P794470P814370
3567D66568708P196304O099941N483367M755073L778360K994570K065183J355985
3559E00297491M55439j89058j265699j778388k359287l376554m588151n735351
3551D81460442o593316p791542q583250r426550j0263782j0438232j0675166j0593269
$$ y = [235984495, 239825898, 243862121, 248130971, 252168573, 256403159, 260620406, 265083240, 269798520, 274294116, 279121143, 283974263, 289217301, 293965624, 298967420, 304168964, 309644375, 314907039, 320332210, 325869945, 331158225, 336609722, 342041220, 347564326, 353153436, 358604315, 364338759, 370023746, 376264983, 382484319, 389253809, 396480127, 403320221, 410942141, 418840736, 426705858, 434842490, 443049066, 450959868, 458754338, 466568708, 473765012, 479864953, 485348320, 490103393, 493881753, 496876323, 498941506, 500297491, 500752930, 500563872, 499298173, 497519785, 495160498, 491783944, 487195793, 481460442, 474867126, 467075584, 458492334, 449065784, 438802002, 428363770, 417688604, 407095335]
3543D07095335j0624478j0342154j0049050r273386q923632q549041q268199p358908
3535C33706487o805581o337024o155956n364069m624548m496205l951876l658436
3527B92312792l395126k956157k365071k401146j801219j578023j186850q43400
3519B75785800j068569j195393r84142j587850j749212k370769k758976k992156
3511B61078733l240058l914060l913510m096374m256295m684343m533422m684346
3503B27756325m686431m690685m643186m714972m320208m279881m965879m716806
3495A90738277m616431m514636m489942m565726m271737m018519l540307l330150
3487A57390829l271444k876359k023796k352880k261849j634692j613543j220052
$$ y = [407095335, 396470857, 386128703, 376079653, 366806267, 357882635, 349333594, 341065395, 333706487, 326900906, 320563882, 314407926, 309043857, 304419309, 299923104, 295971228, 292312792, 288917666, 285961509, 283596438, 281195292, 279394073, 277816050, 276629200, 275785800, 274717231, 273521838, 272537696, 270949846, 269200634, 266829865, 264070889, 261078733, 257838675, 253924615, 250011105, 245914731, 241658436, 236974093, 232440671, 227756325, 223069894, 218379209, 213736023, 209021051, 204700843, 200420962, 195455083, 190738277, 186121846, 181607210, 177117268, 172551542, 168279805, 164261286, 160720979, 157390829, 154119385, 151243026, 149219230, 146866350, 144604501, 142969809, 141356266, 140136214]
3479A40136214j153964p69241n76252p94420m21465m75334n12252n10694n64910
3470A34357682o75768p40930m03815r0809p87284n28322l0700j87890k15378n62742
3460A30134044n16201p65520q03573j110561j127122j415576j248953j161221
3452A21985317j287142q54868j243053j022532r74932j276554r71240m74742r37235
3443A12943019o76011n30490o01822l19501l30325k86561P2036N45275O65157
3434A11480777R04443Q83433J444976K075389K408376K689260L358274L903654
3426A29148582M548572M705288N616662O132860P352765Q294481Q897536R867814
3418A84564560J0868739J1676836J3159064J3508404J4039171J4494539J3885280
$$ y = [140136214, 138982250, 138213009, 137636757, 136842337, 136420872, 135945538, 135433286, 134922592, 134357682, 133681914, 132940984, 132537169, 132446360, 131659076, 131130754, 131100054, 130912164, 130696786, 130134044, 129617843, 128852323, 128048750, 126938189, 125811067, 124395491, 123146538, 121985317, 120698175, 119843307, 118600254, 117577722, 116602790, 115326236, 114354996, 113880254, 112943019, 112267008, 111736518, 111134696, 110815195, 110484870, 110198309, 110270345, 110815620, 111480777, 112385220, 113268653, 114713629, 116789018, 119197394, 121886654, 125244928, 129148582, 133697154, 138402442, 144019104, 150151964, 157504729, 165799210, 174696746, 184564560, 195433299, 207110135, 220269199, 233777603, 247816774, 262311313, 276196593]
3411B76196593J3478089J2510315J0933231R632646P185583N293510L594618K186388
3403C41010973J362809L9782r43836j441854k446512l208818m012706n647996
3395C24711842p053876q200866j0067131j1347758j2809294j3835327j4105562
3388B47292028j4446857j4325650j3912914j3006196j2523234j1395418j0209324
3381A57472435r220143q737213p382917o926301o553091n853637m905118m697242
3373A03196773m260969l742059l357771l112156k917664k360711k338309k098495
3365G9008639k352046j644099j383268j745274j630394j201144j400799j351179
3357F6300436j264655j141802q69497r80746j131434j005976q71706r59211q12324
$$ y = [276196593, 289674682, 302184997, 313118228, 322750874, 329936457, 335229967, 338824585, 341010973, 342373782, 342413564, 341469728, 340027874, 337581362, 334372544, 330359838, 324711842, 317657966, 309457100, 299389969, 288042211, 275232917, 261397590, 247292028, 232845171, 218519521, 204606607, 191600411, 179077177, 167681759, 157472435, 148252292, 139515079, 132132162, 125205861, 118652770, 112799133, 107894015, 103196773, 98935804, 95193745, 91835974, 88723818, 85806154, 83445443, 81107134, 79008639, 76656593, 75012494, 73629226, 71883952, 70253558, 69052414, 67651615, 66300436, 65035781, 63893979, 63024482, 62043736, 60912302, 59906326, 59034620, 58075409, 57263085]
3348E7263085j296513p66444j004030r49137r27164j254734q82600o33818q16409
3339D8732236q70633r40722j056194p96258n19366o92582j013869p06842n10922
3330D1624848r23159p99670n82658q21027m61265k97284q19979n37207l75984
3321C6006615j71332l97048o53209q1401r5377r5061m28118p92089J44147P5547
3311C3512674n38576m13779o6524o5448n5493q035n01097j56340K0499o2461j77349
3300C1488071j02526p0015j47156k43406k02613j55514j64197m54477j38982M20450
3290C0229635j26610p3441M7269J53482k94074n4913K72359j07216K45295L84067
3280C0675853n2187K64081N58769R4175J28007J30204P3384N68816O45009O70870
$$ y = [57263085, 55966572, 55200128, 54196098, 53246961, 52319797, 51065063, 50182463, 49548645, 48732236, 47861603, 46920881, 45864687, 45068429, 44549063, 43856481, 42842612, 42135770, 41624848, 40701689, 39902019, 39319361, 38498334, 38037069, 37739785, 36919806, 36382599, 36006615, 35835283, 35438235, 34785026, 34703625, 34608248, 34513187, 34085069, 33292980, 33437127, 33512674, 32974098, 32560319, 32493795, 32428347, 32372854, 32364819, 31863722, 31707382, 31727881, 31665420, 31488071, 31385545, 31315530, 31168374, 30924968, 30722355, 30566841, 30402644, 29948167, 29809185, 30229635, 30103025, 30029584, 30076853, 30230335, 29936261, 29881348, 30153707, 30046491, 30291786, 30675853, 30623666, 30887747, 31446516, 31540691, 31668698, 31798902, 31872286, 32441102, 33086111, 33756981]
3270C3756981Q3293Q4535N90520M61526O91132L50303M72131O64671O80992J070960
3260C8907044J058249J100518J208507R37460J547056J669973K195544K230032
3252E0854383J891839K153744K453634K372144K354821K539111K032075J256825
3244F7908576k18023j581922k813926l575763m005503l574734l056605k562176
3236D6519924j825223j833161k002990j526139j655967j526232r16948j252425
3228C3980839j429139p90495r34266q19584j217770o02323m81502q14008o33857
3219B6257895n62156n6257q79397p32443n69010m17686n62936k10805j57424o04417
3209B1505364m65174k90970p47748p43888k21517m31895n85607k70692k8196l82333
$$ y = [33756981, 33840274, 33924809, 34515329, 34976855, 35667987, 36018290, 36490421, 37155092, 37836084, 38907044, 39965293, 41065811, 42274318, 43211778, 44758834, 46428807, 48624351, 50854383, 52746222, 54899966, 57353600, 59725744, 62080565, 64619676, 66651751, 67908576, 67690553, 66108631, 63294705, 59718942, 55713439, 52138705, 49082100, 46519924, 44694701, 42861540, 40858550, 39332411, 37676444, 36150212, 35233264, 33980839, 32551700, 31761205, 30826939, 30007355, 28789585, 28187262, 27705760, 26891752, 26257895, 25695739, 25639482, 24760085, 24027642, 23458632, 23040946, 22478010, 22267205, 22109781, 21505364, 21040190, 20749220, 20001472, 19257584, 19036067, 18604172, 18018565, 17747873, 17719677, 17337344]
3199A7337344m57542j90814l66654m15749j86417j23943m51055r6517q876j1310
3189A5028467k93795j65630m10372l41944l07998j80124l24704o2766J210j39024
3179A2803320l22713m11873j53427j88960q206j32272q7164k67789P807K20758
3169A1459481k91888m46265J99335M6549l35116j2513p2618k16227J43496j38970
3159A0335264K52522j76219n36056K75037L1273l58816l14261k9113J53041k84846
3149I347826P3889j31109r6878J03280k88090k84445j26904J44710k4725r954
3139H707600l26137K43578j17704J83166K85728l04921l02632J52361J50242k06057
3129H465224J36881r9138Q2434J54327k47679p8507J70186k21875K06131k4477
$$ y = [17337344, 16879802, 16688988, 16322334, 15906585, 15720168, 15596225, 15145170, 15048653, 15039777, 15028467, 14734672, 14569042, 14158670, 13816726, 13508728, 13328604, 13003900, 12941134, 12942344, 12803320, 12480607, 12068734, 11915307, 11726347, 11718141, 11585869, 11498705, 11230916, 11238723, 11459481, 11167593, 10721328, 10920663, 10967212, 10632096, 10619583, 10546965, 10330738, 10474234, 10335264, 10587786, 10411567, 9875511, 10150548, 10181821, 9823005, 9508744, 9479631, 9632672, 9347826, 9421715, 9290606, 9193728, 9297008, 9008918, 8724473, 8597569, 8742279, 8717554, 8707600, 8381463, 8625041, 8507337, 8690503, 8976231, 8671310, 8368678, 8521039, 8671281, 8465224, 8602105, 8502967, 8585401, 8739728, 8492049, 8413542, 8583728, 8361853, 8567984, 8543507]
3119H543507P9419l2030n4964j73085K86925m2151O5277j4074J6758k8198p0539
3108H576845J19600k08151k98705n2k4115r5302J57947j98223n6810Q0472j96531
3097G856975k31913k21088j56483o3066K11545J16818K6773j03254l6469j74560
3087G225278J47972J38667o51315J07742L39891j84007P5540K2579M8770J91773
3077G462890J2274K58621l36591j8980O3023r3694K66248J14201l22181l49845
3067G055966j43680K78934r5550j82236j17952q2659K8222J85193j83360j14546
3057F628332J53379J33230P2888j61789j40543k38502p4177N7339J73513J52763
3047F756433k2922J2682j02292j83988m5003m6787J2800J7887K8572J16011j15761
$$ y = [8543507, 8622926, 8590896, 8535932, 8362847, 8649772, 8607621, 8672898, 8658824, 8675582, 8647384, 8576845, 8696445, 8488294, 8189589, 8189537, 8165422, 8070120, 8228067, 8029844, 7973034, 8053506, 7856975, 7625062, 7403974, 7247491, 7184425, 7395970, 7512788, 7539561, 7436307, 7399838, 7225278, 7373250, 7511917, 6860602, 6968344, 7308235, 7124228, 7199768, 7222347, 7271117, 7462890, 7475164, 7733785, 7397194, 7378214, 7441237, 7347543, 7613791, 7727992, 7405811, 7055966, 6912286, 7191220, 7095670, 6913434, 6795482, 6712823, 6741045, 6926238, 6742878, 6628332, 6781711, 6914941, 6987829, 6826040, 6685497, 6446995, 6372818, 6430157, 6603670, 6756433, 6733511, 6746193, 6643901, 6459913, 6414910, 6368123, 6380923, 6398810, 6427382, 6543393, 6427632]
3036F427632K49402p6772k14928N27722K18601P4227J51472J49027j30384P2623
3026G448622O7879L8068K17942k40005K53239J46043n3901K53758J49666r0688
3016H190623J07670O35611J10839K21253J16673R5644J94499M62326M26593K50524
3006A0812255L66003K27187J18056M87450K38084j15730J59203J05523r899P8039
2996A2466171M34957K2099P3855O7548J54115l80259m42584j29304J61670O2083
2986A2490351p5183P8657K37995L18528k30775p0361P188J86390L34760M98263
2976A3775813K83931n9388N27196M84831M03075N02908N30414O26931P94611K18982
2966A8089304M26648J93092m89127l53597j87552K39242j53879l73202l86694
$$ y = [6427632, 6677034, 6600262, 6385334, 6913056, 7131657, 7205884, 7357356, 7506383, 7375999, 7448622, 7516501, 7554569, 7772511, 7532506, 7785745, 7931788, 7877887, 8131645, 8281311, 8190623, 8298293, 8933904, 9044743, 9265996, 9382669, 9478313, 9672812, 10135138, 10561731, 10812255, 11178258, 11405445, 11523501, 12010951, 12249035, 12133305, 12292508, 12398031, 12388132, 12466171, 12901128, 12923227, 12997082, 13064630, 13218745, 12838486, 12395902, 12266598, 12428268, 12490351, 12415168, 12493825, 12731820, 13050348, 12819573, 12749212, 12756400, 12942790, 13277550, 13775813, 14059744, 14000356, 14527552, 15012383, 15415458, 15918366, 16448780, 17075711, 17870322, 18089304, 18515952, 18709044, 18219917, 17866320, 17678768, 17918010, 17764131, 17390929, 17004235]
2957A7004235k35941n63680r97370q42570n51161j34200j14174k21162k13206
2948A3130771o3043j95177L20965K32878k29689K3305m0788J23920K06368L52051
2938A3861561L92385J90549K01962M94162J96151O2488K51759O0019O1808L1781
2928A5804625j78932q2328j52553j5545j92120m31766l91300m52517m69187k09586
2918A3228791l72969l5544n7256o5034K39368Q1855k29807Q7682o7030L96013
2908A3206069K51308J93440J48784J57074J4624o60760l72454n43076m87767k37139
2898A1670103m74883k15603k22197k84719K53421k31820l9086R4985J72702R9128
2888A0822031J22737L9287Q280K33350M98413j94802j24724Q9004J69215K72360
$$ y = [17004235, 16768294, 16204614, 15207244, 14364674, 13813513, 13679313, 13565139, 13343977, 13130771, 13067728, 12872551, 13193516, 13426394, 13196705, 13220010, 13179222, 13303142, 13509510, 13861561, 14253946, 14444495, 14646457, 15140619, 15336770, 15399258, 15651017, 15711036, 15772844, 15804625, 15625693, 15543365, 15390812, 15375267, 15183147, 14751381, 14360081, 13907564, 13438377, 13228791, 12855822, 12820278, 12763022, 12697988, 12937356, 13019211, 12789404, 12877086, 12810056, 13206069, 13457377, 13650817, 13799601, 13956675, 13971299, 13310539, 12938085, 12395009, 11907242, 11670103, 11195220, 10979617, 10757420, 10472701, 10726122, 10494302, 10455216, 10550201, 10722903, 10822031, 10944768, 10984055, 10992335, 11225685, 11724098, 11529296, 11404572, 11493576, 11662791, 11935151]
2878A1935151j02305M0056l9465l05204k20590k184k49746k69307k33961q2967
2868A0469478m15343l87595m31626j90153J68114p3757Q004J32825K41337J61814
2858I683098j7940j93232j22516J67706K17957k11923j03343j58555l62280k35730
2848H663242m8255j26019k72496j32126j93109k42131j99292m51925j09454J79204
2838G067639J55497j62885j51940L45407M23001J7134J09651m6308m01475P122
2828G362843k70137l66261m98330m72631j91782p0676k69914l95790m12884j3319
2818D401119l3041k08818L7969l0694j87165n7558j05110l8397K8014j53367K5989
2807C678941k22721k91232L8884l4525k73092Q122K45402j56725J01780r4354
$$ y = [11935151, 11832846, 11872902, 11833437, 11528233, 11307643, 11305459, 11055713, 10786406, 10552445, 10469478, 10054135, 9666540, 9234914, 9044761, 9212875, 9139118, 9147122, 9279947, 9521284, 9683098, 9665158, 9471926, 9349410, 9517116, 9735073, 9523150, 9419807, 9261252, 8898972, 8663242, 8614987, 8488968, 8216472, 8084346, 7891237, 7649106, 7449814, 6997889, 6888435, 7067639, 7223136, 7060251, 6908311, 7253718, 7676719, 7693853, 7803504, 7757196, 7355721, 7362843, 7092706, 6726445, 6228115, 5755484, 5563702, 5493026, 5223112, 4827322, 4414438, 4401119, 4368078, 4159260, 4197229, 4166535, 3979370, 3921812, 3816702, 3778305, 3806319, 3652952, 3678941, 3456220, 3164988, 3203872, 3169347, 2896255, 2904377, 3149779, 2993054, 3094834, 3000480]
2797C000480k26003K6713J61955k83555k74313r7118O8322K80685k02079k7501
2787B427586n2349N5410k9951j41341R3713J32016j73058k15412J14497J06414
2777B317525l40283j62532J3228J05340N6235L12310j08834k26819j35349q5369
2767A745452R7319M3257J5095k5774N8057q3760J04283j81790j19711K74070k9562
2756A896936j42185k61060J36177L77217J66221k55977j38621m2961J74851k96354
2746A614244j7815R2573j50971j11900J40580l862J5495J54752k13633O9505J82364
2735A771332k835k23634j62165J04088j99397o890J07060l14827L15055O8145
2725A455932J75823O2206J02883j92089K5211j86581k11535j71824L15344J2643
$$ y = [3000480, 2774477, 2801190, 2963145, 2679590, 2405277, 2308159, 2376481, 2657166, 2455087, 2427586, 2375237, 2430647, 2400696, 2259355, 2353068, 2485084, 2312026, 2096614, 2211111, 2317525, 1977242, 1814710, 1827938, 1933278, 1989513, 2301823, 2192989, 1966170, 1830821, 1745452, 1842771, 1886028, 1901123, 1875349, 1933406, 1849646, 1953929, 1772139, 1652428, 1926498, 1896936, 1754751, 1493691, 1629868, 2007085, 2173306, 1917329, 1778708, 1735747, 1910598, 1614244, 1596429, 1689002, 1538031, 1426131, 1566711, 1562849, 1578344, 1733096, 1519463, 1588968, 1771332, 1768497, 1544863, 1382698, 1486786, 1287389, 1280499, 1387559, 1072732, 1387787, 1455932, 1631755, 1693961, 1796844, 1604755, 1629966, 1443385, 1231850, 1060026, 1375370, 1388013]
2715A388013K1880K9380j32479J02465O7622J40326O3217k96693R7203K16375
2705A697309K25837j53037k13040J75922o5568R073n0066K30747J58987r868j86496
2694A819800J41592Q2807J26313L1448j78800K18799M0457j33357J05931J91139
2684B446129k81428J10741Q5639j00049K23480K5699O6549K14997p1632m0241
2674B679884L2957J00693J67110k00476K20173q9277K18094J60381k69478J11313
2664C131374P9204j86313K50612Q8150r4672K18045K03975J0997J79517J64354
2654D045243j22605J51806j02191Q957J35675K58113L21224j18699L3603J34652
2644D745778J0110k18575J19205o6891o1634j5613M6509n5697K19208J68475J18460
$$ y = [1388013, 1409893, 1439273, 1306794, 1409259, 1476881, 1617207, 1680424, 1383731, 1480934, 1697309, 1923146, 1770109, 1557069, 1732991, 1667423, 1676496, 1626430, 1857177, 2016164, 2006296, 1819800, 1961392, 2044199, 2170512, 2201960, 2023160, 2241959, 2282416, 2149059, 2254990, 2446129, 2164701, 2275442, 2361081, 2261032, 2484512, 2510211, 2576760, 2791757, 2720125, 2679884, 2712841, 2813534, 2980644, 2780168, 3000341, 2911064, 3129158, 3289539, 3020061, 3131374, 3210578, 3024265, 3274877, 3363027, 3268355, 3486400, 3690375, 3701372, 3880889, 4045243, 3922638, 4074444, 3972253, 3981210, 4116885, 4374998, 4696222, 4577523, 4611126, 4745778, 4755888, 4537313, 4656518, 4589627, 4527993, 4512380, 4558889, 4503192, 4722400, 4890875, 5009335]
2633E009335L8529M32886J66488N2969m8842l39832J42253J15033J51884K62836
2623E983539J48735j17651Q2777N79729n6031k93500J87922r2996J82029k42498
2613F362055k7010k38551j4457O981q7718P7456K008p326J9368l09156j63693
2602E619957K76909M07925j061K5857K20901j73943Q3568K2696M4769K00624k0038
2591F708164q7670O1925j47370k69055J04184K02924m3219N7569k14193n52528
2581E820731J8188j06923k9040J17868m2901m37267q1473R9244j99080r2955m1727
2570E024665J3510j94850p9651L6927p4310J27044R2229p1468o9357k60282j77140
2559D367317o4489J41357j37946L03825m2311k19461R814O4258o46l85858k91082
$$ y = [5009335, 5047864, 5480750, 5647238, 5700207, 5651365, 5311533, 5453786, 5568819, 5720703, 5983539, 6132274, 6014623, 6097400, 6677129, 6621098, 6327598, 6515520, 6422524, 6604553, 6362055, 6335045, 6096494, 6082037, 6089018, 6001300, 6078756, 6080764, 6073438, 6092806, 5783650, 5619957, 5896866, 6304791, 6303730, 6329587, 6550488, 6376545, 6460113, 6482809, 6527578, 6728202, 6708164, 6620494, 6682419, 6535049, 6265994, 6370178, 6573102, 6529883, 6587452, 6373259, 5820731, 5838919, 5731996, 5702956, 5820824, 5777923, 5340656, 5259183, 5358427, 5159347, 5066392, 5024665, 5038175, 4843325, 4763674, 4800601, 4726291, 4853335, 4945564, 4874096, 4804739, 4544457, 4367317, 4302828, 4444185, 4306239, 4610064, 4567753, 4348292, 4358106, 4422364, 4421718, 4035860, 3744778]
2548C744778j15547q2997k10586k37658J19168j25036l87086K87920L3432j43509
2538B882879q640j81488O8310R0968l04750j34581J81435j04374P819j45789j19117
2527B232672j88630j8473J99649J40163J66827k36447k04966k00465J33201j5741
2517B007790k13069J144j48687r6294q517m6054l6452L65024j43572j78960L3538
2506A535891j35701r3690o108k4534l0982K03441j22661k01736j26038o6578K25828
2495A157132p5k39568j33359k2759k0057M4504k16420M28295j08491o29189M3042
2484C03055R0433J0464K7390Q9489K79054j04997m0018L02460j36027r5897k46963
2473D78443k21375j2101R3828M1359R0009r8635K71997L1897n0864k84411m3656
$$ y = [3744778, 3629231, 3546234, 3335648, 3097990, 3217158, 3092122, 2705036, 2992956, 3026388, 2882879, 2874239, 2692751, 2761061, 2852029, 2547279, 2412698, 2594133, 2489759, 2497578, 2351789, 2232672, 2044042, 2025569, 2225218, 2365381, 2532208, 2295761, 2090795, 1890330, 2023531, 2007790, 1794721, 1795865, 1647178, 1550884, 1542367, 1496313, 1459861, 1824885, 1681313, 1502353, 1535891, 1400190, 1306500, 1300392, 1275858, 1244876, 1448317, 1325656, 1123920, 997882, 931304, 1157132, 1157057, 917489, 784130, 761371, 741314, 785818, 569398, 997693, 889202, 260013, 303055, 393488, 403952, 431342, 520831, 799885, 694888, 654870, 957330, 821303, 725406, 478443, 257068, 244967, 338795, 380154, 470163, 371528, 643525, 675422, 624558, 340147, 296491]
2462B96491P4601J22987L08792q1953l76360k8835J55016p2710k16188K02814
2452C84655j92599J10714J98559r3450J24070l4014j28683Q2608N3097k82923
2442B22034l1772j20069q026m8505L3363L93543Q4481j8289K3742k06936j8547
2431C05019J68313l54943J0556J60807n7434j060j03796k37127J23609K42972
2421B56916Q5621K10057j8234j75949n1860q5972o1693j8240J3332M6896Q0360
2410B81234N4185J77515j25692r9198o184k52554J03489J16864j98800k97451
2400b46592L07932J06347j11723K46759J89171n7525K6457j48151j4937k42272
2390E5466O9045K04374K93085j49967j13475O1072J73154k16197J18841j30227
$$ y = [296491, 371092, 494079, 802871, 720918, 344558, 315723, 470739, 398029, 181841, 384655, 192056, 302770, 501329, 407879, 531949, 497935, 369252, 451860, 504957, 222034, 190262, 70193, 62167, 13662, 47025, 440568, 525049, 506760, 530502, 323566, 305019, 473332, 118389, 128945, 289752, 232318, 231258, 127462, -109665, 13944, 256916, 342537, 552594, 534360, 358411, 306551, 220579, 158886, 140646, 153978, 200874, 281234, 335419, 512934, 387242, 288044, 281860, 29306, 132795, 249659, 50859, -246592, 61340, 167687, 55964, 302723, 491894, 434369, 460826, 312675, 297738, 55466, 124511, 328885, 621970, 472003, 358528, 419600, 592754, 376557, 495398, 365171]
2380C65171j52728J05567K30875M0456k43610o31J02202J96278J78004j08014
2370G13570j2855k16201j29346J45220J0163m8213k50119J59487L01322n6318
2360F16710j10322L280l34557p0961K35358n0148N9781J17990r331J18295k63293
2349C12802j66987J21817k9435J0929J91478j05182o1246Q7605n70q7382k33599
2338D0230N3485l02L8987o6210j35556K64881O6997k36704J33619J02112j50618
2327A10921P9614O8298L2843j25478J09760k32718j76704J65768p8809l1480L05040
2316B27055j44895R85l7478N7250N6135j18248q8297L91723o7283q55J83475j08175
2304C51392J53608j06433j38722k22878k39678J76833J98899m1592r1860J28245
$$ y = [365171, 212443, 318010, 548885, 589341, 345731, 345100, 447302, 643580, 821584, 713570, 700715, 484514, 355168, 500388, 510551, 462338, 212219, 371706, 673028, 616710, 506388, 509668, 175111, 104150, 339508, 289360, 349141, 467131, 457800, 576095, 312802, 145815, 267632, 238197, 249126, 440604, 335422, 274176, 361781, 361211, 273829, 40230, 93715, 93413, 132400, 66190, -69366, 195515, 262512, 25808, 159427, 261539, 110921, 190535, 258833, 291676, 166198, 275958, 43240, -133464, 32304, -46505, -77985, 227055, 82160, 83145, 45667, 102917, 159052, 40804, -47493, 344230, 276947, 276092, 459567, 351392, 505000, 398567, 259845, 36967, -202711, -25878, 173021, 131429, 39569, 167814]
2294A67814N7745R4652M0696p7641J41379P7766o1274j34565Q1976J01859n9099
2283D31308m36549l1548J38584j92575O7754L33111J85790j68693O9893J16164
2273E13239j13627o1809l3884q7159J61816k14877j23875K05809J47070P8677
2263D71380p1525j91929n2928j48902J58817J40187J0389N667j32550J30470P8905
2252C97981J99543O2902j47229j17124j23644k46887J26392J99257p6844l3165
2242B41182K84139R6621M4469J33043j28508k48439j28520K00790M63388r2245
2232H65920r1951j9534k00633k62006l4295K03223K96358k58783m5482K28956
2222F81773k7465k7587k96308L4937K24167l4455Q5245m5189m7240K59269j31272
$$ y = [167814, 225559, 320211, 360907, 283266, 424645, 502411, 441137, 306572, 388548, 490407, 431308, -5241, -36789, 101795, -90780, -23026, 310085, 495875, 327182, 397075, 513239, 399612, 337803, 303919, 216760, 378576, 163699, 39824, 245633, 392703, 471380, 399855, 207926, 154998, 6096, 164913, 305100, 315489, 321156, 188606, 319076, 397981, 597524, 660426, 513197, 396073, 272429, 25542, 151934, 351191, 274347, 241182, 525321, 621942, 666411, 799454, 670946, 422507, 293987, 494777, 958165, 865920, 773969, 754435, 553802, 291796, 257501, 460724, 757082, 498299, 452817, 681773, 654308, 626721, 330413, 365350, 589517, 555062, 640307, 595118, 547878, 807147, 675875]
2211F75875k4429j71534L0350L81297r2006J06403J2726l05644k13562M46507
2201H45983K24087j0044m0017j17958p7413k55148O2355j6082L34940J20514j3839
2190A057378p185q0820m7073J72192J20813K04942j29991o2469m4370K43712K07966
2179A635095l18422K8331Q3071K36772Q7550J07483P1440L9590j54566O2009j64565
2168A713788M7397N12675m3518l10268J58532j07001K59744J16019j21214n175
2158B220979J89502O6111m5491l06528J12604M41342N36053J91129O4501j23039
2148C347163j58628K03028n9002K90843J43292J12053J06197R9288M256M50317
2138D538807L71460R6872J08073L60311L54865P0214M12210K73769M50706K56079
$$ y = [675875, 651446, 479912, 510262, 891559, 799553, 905956, 918682, 613038, 399476, 845983, 1070070, 1060026, 1020009, 902051, 824638, 569490, 631845, 615763, 950703, 1071217, 1057378, 1050193, 969373, 922300, 1094492, 1215305, 1420247, 1290256, 1227787, 1183417, 1427129, 1635095, 1316673, 1345004, 1428075, 1664847, 1752397, 1859880, 1931320, 1970910, 1816344, 1878353, 1713788, 1761185, 2273860, 2230342, 1920074, 2078606, 1971605, 2231349, 2347368, 2226154, 2220979, 2410481, 2476592, 2431101, 2124573, 2237177, 2678519, 3214572, 3405701, 3470202, 3347163, 3188535, 3391563, 3332561, 3623404, 3766696, 3878749, 3984946, 4084234, 4088490, 4538807, 4910267, 5007139, 5115212, 5475523, 5830388, 5900602, 6312812, 6586581, 7037287, 7293366]
2128G293366N27818L32739N02585K44898P66745R41097R90499O24027N12702P30598
2118A3467074R22121J284142J623362K214509K714896L521351M282948N444389
2110C5474792P564712J1562721J6216170J7931914k007441j8390531j6931506
2103E1420831j2034436q147284n683000m003901k850663k104840j373300j463375
2095A3760032j174553p59478p21758J39668o18219r89388r60951p31268p27265
2086G216820m73196k72453o17313m92759q3281j79850n6899J0881j05770m31027
2076D515153j99428j38544l77342k19432k77778k74356j62810j30914Q4691K28074
2066C047314j04846k51059k24602l95043K39422k14983M6644L4669r1991K26002
$$ y = [7293366, 7821184, 8153923, 8656508, 8901406, 9668151, 10609248, 11599747, 12223774, 12736476, 13467074, 14389195, 15673337, 17296699, 19511208, 22226104, 25747455, 30030403, 35474792, 43039504, 54602225, 70818395, 88750309, 86742868, 68352337, 51420831, 39386395, 31239111, 25556111, 21552210, 18701547, 16596707, 15223407, 13760032, 12585479, 11826001, 11104243, 11243911, 10625692, 9636304, 8675353, 7944085, 7216820, 6743624, 6471171, 5853858, 5361099, 5277818, 5097968, 5041069, 5051950, 4946180, 4515153, 4315725, 4177181, 3799839, 3580407, 3302629, 3028273, 2865463, 2734549, 2819240, 3047314, 2942468, 2691409, 2466807, 2071764, 2311186, 2096203, 2142847, 2177516, 2085525, 2311527]
2056B311527k71781M2547J302j23276j51588r5879P44K7377R5418k92422P2941
2045A616910j30719k56190K19779K2081r8487J11172j65592j29616j80037K19240
2035A228541j43394Q685o2644M4176p5647r1838J08087q3237q6510J27001R457
2024I82677k94439J0866j53476O5197j814q1217j22782K23884l0525J9404k6200
2013E91575o5824r4241j08521n7560K64277Q9458n5045O062k6057K00021L4583
2002G78728l70309M8386k60491j67834J04600K40008k26993K18343k5871l85816
1992d7249L37904J00037L7653l67185O57l0884L57455R0174p001j36029j51841
1981A83691L3580J77847Q6310p4200L8437n807j95066q0422k77414M22942Q6592
$$ y = [2311527, 2039746, 2082293, 2083595, 1960319, 1808731, 1712852, 1713596, 1740973, 1836391, 1543969, 1616910, 1486191, 1230001, 1449780, 1471861, 1373374, 1484546, 1318954, 1189338, 1009301, 1228541, 1085147, 1093832, 1031188, 1075364, 999717, 907879, 1015966, 932729, 846219, 973220, 982677, 688238, 699104, 545628, 610825, 609011, 527794, 405012, 628896, 598371, 617775, 591575, 525751, 431510, 322989, 265429, 529706, 619164, 564119, 570181, 544124, 744145, 778728, 408419, 456805, 196314, 28480, 133080, 373088, 146095, 364438, 338567, -47249, 290655, 390692, 428345, 61160, 61817, 30933, 388388, 478562, 471561, 335532, 183691, 217271, 395118, 481428, 407228, 445665, 439858, 244792, 164370, -113044, 309898, 396490]
1970C96490p980N1715k70781j30757K95004o5697j73011q1046J15134J56874l512
1959B82433K88967k37803k10316q0113K589N1969J5922K63383j15223j36726k9135
1948I5947k1049m0685k10755L32542Q5626P5260j32328L829l026o3744N992N6240
1936A83849J56125l08833Q9372K8844k35295K33090J35998K6179r0495L7180m3211
1925B12803j51626j04505K73103o1840M238Q9045K6359o6160p6771j13206q7012
1914e5572L53468k47908J00681j64666k57531K46902J73564j3512k33102R5888
1904a788Q733J4366m8725N3822r435L43287O3788k51769j26990k17346k6488K62896
1892F4351K26794j96197l71180Q8047k7602n9478m4358J09067R2469o8062K6717
$$ y = [396490, 388510, 440225, 169444, 38687, 333691, 267994, 94983, 13937, 129071, 285945, 282433, 571400, 333597, 123281, 43168, 45757, 97726, 113648, 377031, 261808, 125082, 95947, 74898, 34213, -176542, 156000, 241626, 316886, 184558, 188387, 185361, 121617, 127609, 183849, 339974, 31141, 120513, 149357, -85938, 147152, 283150, 309329, 218834, 256014, 212803, 61177, -43328, 229775, 167935, 172173, 261218, 287577, 221417, 144646, 31440, -55572, 297896, 49988, 150669, -13997, -271528, -24626, 148938, 135426, -97676, -1788, 6945, 21311, -27414, 26408, 16973, 360260, 424048, 172279, 45289, -172057, -198545, 64351, 291145, 94948, -276232, -188185, -215787, -275265, -319623, -210556, -118087, -186149, -159432]
1881a59432N5327k32611J91889J49990m9351K63317j51917l45728j02028J65039
1871b15505J38792l9905q5774K37801K39924l63282K34420P720k33904K78702
1861A98989l8276J37393N0948j48585j20763m0004J61045m95694j51209K05637
1851b40519k0884K41947r5825j05425Q0372K53402J831J05046l7169J84145k41908
1840A25013J65853J30003M5438K15392o93j43974J6705q9706j49234q9848k03940
1829B1009L7735K38272j49345M3158M13048r0360j33316k27231r5758J17149J89939
1818C64300j76871k14391l1675j63182k39476J89503m9926L60147J02881Q4375
1808B25685k13002j39522K74230j26036j91898Q6475K69163k33914J59282N057
$$ y = [-159432, -104105, -336716, -144827, 5163, -44188, 219129, 67212, -278516, -380544, -215505, -76713, -116618, -202392, 35409, 275333, -87949, 146471, 154191, -79713, 198989, 160713, 298106, 349054, 200469, 79706, 39702, 200747, -294947, -446156, -240519, -261403, -19456, -115281, -220706, -140334, 113068, 114899, 219945, 182776, 366921, 125013, 290866, 420869, 466307, 681699, 681006, 537032, 553737, 464031, 314797, 224949, 21009, 58744, 297016, 147671, 190829, 603877, 513517, 380201, 152970, 57212, 174361, 364300, 187429, -26962, -58637, -221819, -461295, -271792, -321718, 38429, 141310, 225685, 12683, -126839, 147391, 21355, -170543, -84068, 185095, -48819, 110463, 115520]
1798A15520k95246P3560J21297j6063R6422j46635R2695k08521J63209j06633
1788a10395j77073K45628K60466k33520l49110j4128J08936M6643J74901J99693
1778A52041l47334o8826J02842J70454k6068k57494L35008K24381k19770q8698
1768b3464K18030q0143j09561J81684j22848O000J8953J2171N1202J6779J08958
1757B77761K7516j56733j76315j35696L66346r3712p0765J82932j24176m26244
1747c29086L7519L9621J87718K05003j46744n372R3499K13490j08059J7439J12043
1736C17071k58041j228K2748O5253j94165j19498L63859O8609j92928k05354K87682
1725A54008j39333l89j57899n9660k7151J26501L55861N1121j96599k71613k6507
$$ y = [115520, -179726, -106166, 15131, -932, 95490, -51145, 41550, -166971, -3762, -110395, -287468, -41840, 218626, -14894, -364004, -378132, -269196, -222553, -47652, 152041, -195293, -264119, -161277, 9177, -16891, -274385, 60623, 285004, 65234, -23464, 194566, 114423, 4862, 186546, 63698, 69698, 88651, 100822, 152024, 168803, 277761, 305277, 148544, -27771, -163467, 202879, 109167, 38402, 221334, 97158, -329086, -291567, -251946, -64228, 140775, -5969, -11341, 82158, 295648, 187589, 205028, 317071, 59030, 57802, 80550, 145803, -48362, -167860, 195999, 264608, 71680, -133674, 154008, 14675, 14286, -143613, -203273, -230424, -103923, 251938, 303059, 106460, -165153, -191660]
1714a91660Q8502k15683N18237K3400p2456Q6182k07399Q3344k63605J42797O0925
1703E2584k75653J74236o3225q1137M2815J66817J8134j1350O7604j3638j3593
1692F3594k33515J48836m5469J25313K9303k15055R5792K85594Q7209q6319k00162
1681E5121m8203j01232j01930j77808N96368p4357k73607P2283M6714l30978k5136
1670c62765m4686N3712K73225O7698k2974O8076j79113Q5499q0265j15573M36326
1659A79160J553k38825o2785q3659L17223J32392j66847j44309K98402J6928k84895
1648c5662K48665n9419n8645j59636p1642q6783M1494N28450M9449l75187k58942
1637b37858K4466j5887l4190j91332l8896Q6086L15160J10626k46180q6815j76028
$$ y = [-191660, -103158, -318841, 199396, 222796, 150340, 236522, 29123, 112467, -151138, -8341, 52584, -223069, -48833, -112058, -193195, -150380, 16437, 34571, 23221, 90825, 77187, 63594, -169921, -21085, -66554, 58759, 88062, -126993, -31201, 254393, 341602, 255283, 55121, 6918, -94314, -196244, -374052, 222316, 147959, -125648, -53365, -6651, -337629, -362765, -407451, -353739, -80514, -12816, -35790, 32286, -146827, -61328, -141593, -257166, 179160, 180713, -58112, -120897, -204556, 112667, 245059, 78212, -66097, 232305, 249233, -35662, 213003, 153584, 94939, -64697, -136339, -223122, -181628, 346822, 396271, 21084, -237858, -213392, -229279, -263469, -454801, -493697, -407611, -92451, 18175, -228005, -314820, -490848]
1626d90848l9801L09418N7356k26789L88956R903N6138J72222k08863k69811L26335
1615H4216r8764J7359r4515K55367k63910K16J34841J55356k38743K2652l6212
1604f2137l2262k9271j12865k18475j15426L92970J92710J38135k51791m8247
1594a46659R8880q0247N0123L63318k61584m07310K25612L51270k97890k27730
1584c32217m3963K37473J36960j67005J74954k01748j72178J53063J4802j73151
1574c73010L18886J90324j44179P441L03075j51628J3576l00660j51903J44355
1564a43723K63584J45780n7305q7971j07438J48929j72551J05493j71538j44169
1554b20909k32038M03319o2035J86122K9227J24799k40381k79763K31402J05926
$$ y = [-490848, -530649, -221231, -163875, -390664, -1708, 8195, 64333, 236555, 27692, -242119, 84216, -14548, 2811, -91704, 163663, -100247, -100031, 34810, 190166, -48577, -25925, -62137, -94399, -123670, -236535, -455010, -570436, -177466, 15244, 153379, -98412, -146659, -47779, -128026, -77903, 285415, 23831, -383479, -157867, 193403, -104487, -332217, -376180, -138707, -1747, -168752, 6202, -195546, -367724, -214661, -199859, -373010, -54124, 136200, -7979, -538, 302537, 150909, 164485, -136175, -288078, -143723, 119861, 265641, 208336, 120365, 12927, 161856, -10695, 94798, -76740, -220909, -452947, -49628, -111663, 74459, 103686, 228485, -11896, -291659, -60257, 45669]
1544D5669M6921M6789m812p1838k282L1383n3850p2743j43422p0720p903J18433
1532a38375j01554L8026J08968k05548K9586J12251P22j39145M74829l03402j46127
1521b69769o9817J70707L74828Q7238l57815j00495J31531q5024L31033k50625
1511c8208k18076J88256K53307m7696N8989k32267M0016M2523o4302J43626n5982
1500G0186j93866J61727L9654k95378j13535j34485J88021Q6290J25983P6828
1490A1425Q4425K22207k73627M7340K35775j69226j07089k3861m4574k97174J23974
1479a90405J60492j74979P5399J81454J57985j46763P2311j19757j35404J17335
1469b332J31996J48716j37259j92839p5203K46996o784n0222M9213r5064j50067
$$ y = [45669, 92590, 139379, 134567, 62729, 60447, 91830, 37980, -34763, -178185, -248905, -256808, -138375, -239929, -201903, -92935, -298483, -268897, -156646, -155924, -295069, 179760, -123642, -269769, -339586, -168879, 205949, 293187, -64628, -165123, -33592, -118616, 212417, -38208, -256284, -68028, 185279, 137583, 196572, -35695, 4321, 46844, -17458, 126168, 70186, -123680, 38047, 77701, -217677, -331212, -465697, -277676, -191386, -65403, 11425, 95850, 318057, 44430, 91770, 327545, 158319, 51230, 27369, -17205, -314379, -190405, -29913, -204892, -129493, 51961, 209946, 63183, 135494, 15737, -119667, -2332, 129664, 278380, 141121, -51718, -126921, 120075, 113291, 63069, 112282, 17218, -132849]
1458a32849k47505J62706L01185j5732j45663K03380j12391k73077m005K03558
1448f0393R3690l6923Q6112l3188k85358k9683p8019J43165J48919Q965p1370
1437a14083m890K51471r001J50147k03621k2660J45204l49427l3795J13974m3665
1426a20346K13876j38609J11263r862j53332k44440p2555L96165p9684J8897m0208
1415a18835O2769K68378J7363Q0112o7133k30589j68139R2206j27793J85722j12352
1404a18291R7843K1625K6562j14119j37947J52261J63129M01867l36288k37476
1394h0834L30980O596k33247j24894j92516K38959N0925J12343q5924j98596l6255
1383b12463M9676m2042N6399M1130j5626k1117o1723J41342o97K26394M757k00159
$$ y = [-132849, -380354, -217648, 83537, 67805, -77858, 125522, 13131, -259946, -263951, -60393, 33297, -3626, 82486, 49298, -236060, -265743, -343762, -200597, -51678, -42713, -114083, -118973, 132498, 123497, 273644, 70023, 47363, 192567, -156860, -190655, -76681, -120346, 93530, -45079, 66184, 56322, -97010, -341450, -414005, -17840, -97524, -78627, -118835, -56066, 212312, 229675, 309787, 242654, 12065, -156074, -63868, -191661, -5939, -118291, -20448, 1177, 27739, -86380, -224327, -72066, 91063, 492930, 156642, -80834, 250146, 256742, 23495, -101399, -293915, -54956, -4031, 108312, 22388, -176208, -212463, -162787, -204829, -148430, -107300, -122926, -144043, -205766, -64424, -65121, 161273, 166030, -34129]
1371c4129n7482n3923k18724L45574K03080k11697N1357N4716l8312n3906r4367
1360a07813j44375r2599O56535O3179k64848J02097J1095m11387Q3392L5252j42546
1349b12018p600p223n9966J51968J53054k51310j28189J75009R1428j92119J14525
1338a72441J16992j14806R1255J66706j21283K07550j80532k1924k56906J97320
1328h8069l05215m9290j14057R2465J53037j15043M23643j4231n7112J50067m02667
1317c26472n3369K00771p269L9296m0666J04318L1837j26171Q8690L75882o9644
1306B17203k83621K07183r3504q5956J69322M4774J20708j53168j49662O6449
1296E9728j4544j65330j29360j91713J82735N4059p6363k45490K78271J97727
$$ y = [-34129, -91611, -145534, -364258, -18684, 184396, -27301, 24056, 78772, 40460, -13446, -107813, -252188, -344787, 311748, 374927, 110079, 212176, 223271, -188116, -104724, -69472, -212018, -219618, -226841, -286807, -134839, 18215, -233095, -361284, -186275, -94847, -286966, -172441, -55449, -170255, -79000, 87706, -33577, 173973, -6559, -28483, -285389, -88069, -393284, -442574, -556631, -464166, -311129, -426172, -2529, -16760, -73872, 76195, -326472, -379841, -179070, -186339, -147043, -187709, -83391, -51554, -177725, -89035, 286847, 217203, -66418, 140765, 47261, -38695, 130627, 175401, 296109, 142941, -6721, 59728, 45184, -120146, -249506, -441219, -258484, -204425, -280788, -526278, -248007, -50280]
1286e0280q9047p2503R3151k8034n7891j32427J95947m1900m1894L38312q0301
1275C3133l15718J05679J25251j97780J05719j19464J33967K15804q5989L1797
1265C2399R0420k79355L30471r5813k55546J536J06294n0380q0602K23126j32484
1254a09934L6589m8883J72481O6747j41393m9015K44909j24192j14811J28478
1244F0976j66299J01880P3272l9886j71520K98595L78027l20876j69251k7213
1234A7705j88323J25100j12956j16540L3339m0769M5748J42228j85369J00332
1224a79505L30093j09528l42541j59579J34670j01019J33747m7822N5483K43511
1214d2490K224j04992L30944k32146k47510L88653n0430R0880K3511M0546l00252
$$ y = [-50280, -139327, -211830, -118679, -146713, -204604, -337031, -141084, -182984, -224878, 113434, 33133, -282585, -176906, -51655, -249435, -143716, -263180, -129213, 86591, 602, 32399, 122819, -156536, 173935, 78122, -177424, -175888, -69594, -119974, -200576, 22550, -109934, -73345, -122228, 50253, 117000, -24393, -73408, 171501, 47309, -67502, 60976, -105323, -3443, 69829, 29943, -141577, 157018, 535045, 214169, 44918, 17705, -170618, -45518, -158474, -275014, -241675, -282444, -236696, -94468, -279837, -179505, 150588, 41060, -301481, -461060, -326390, -427409, -293662, -341484, -286001, -42490, -40266, -145258, 185686, -46460, -293970, 94683, 44253, 135133, 158644, 199190, -101062]
1203a01062r971O1015O1628j08650k59740K09420o972J06289Q8749j9709K18384
1192B39381m0617q1141K1597Q5110O7020m49650j78514K50668N8177l63370M73506
1181H2167K13937k46189j92717r342J97455m27592k16216L50299o2137K79690
1171c0645J31315o6086Q8461L9497q507m71194k4773M2209l6727o4398L7366L6185
1159c27297M2279J4310j46741K223J39000J59131j07353n6770J53510r7599J42640
1148h2667N0779j72456j18771R0277J75551J44771N3048j27262O9113n9296N7980
1137H1067j24657l4204P0446j08470k59932Q7356K32522L2082O0367J66378m7905
1126A55050k21845o8926j20693J12394P7234K34422j26615K3634N5253J06410
$$ y = [-101062, -111033, -50018, 11610, -97040, -356780, -147360, -154332, -48043, 40706, 20997, 239381, 198764, 117623, 139220, 224330, 291350, -158300, -336814, -86146, -27969, -391339, 82167, 296104, 49915, -142802, -152144, 45311, -382281, -598497, -248198, -310335, -30645, 100670, 34584, 123045, 162542, 154035, -317159, -341932, -299723, -336450, -400848, -363482, -327297, -285018, -270708, -417449, -415226, -276226, -117095, -224448, -281218, -127708, -225307, -82667, -31888, -204344, -323115, -232838, -57287, 87484, 140532, 13270, 82383, 23087, 81067, -43590, -77794, -7348, -115818, -375750, -288394, -55872, -23790, 36577, 202955, 155050, -66795, -135721, -256414, -144020, -66786, 167636, 41021, 64655, 119908, 226318]
1116B26318l14195j62836R4694L31918O5221j35368L7695J33829j8852k1845K2317
1105B58896j84882M7367p6985k4784k57932j56480L10263l8516R8587K7285j09143
1094a06324J72147k21392J8742L24992J79646k12879j40535k36506N0910L0879
1084a40320k261J77740J15748j02229J04489j4744Q6560j17469k4252k65307K4287
1073a57758L82809j19338j68939j47341J55386j46825j46448J90003J02578m7894
1063a03767K349K0391j97868K68693L9790j94902p7453J24324p7562J8385K20657
1052D3037m4020j66712J18816P9320n537J26704j15389K18735q6293M6324j2775
1041B02210P4973o697j95142O0558Q0671r4083l02380R7401J29352j70012k08793
$$ y = [226318, -87877, -250713, -156019, 175899, 241120, 105752, 143447, 277276, 258424, 236579, 258896, 74014, 121381, 44396, 19612, -238320, -394800, -84537, -123053, -24466, 2819, -106324, 65823, -155569, -136827, 188165, 367811, 154932, 14397, -222109, -171199, -140320, -142581, 35159, 150907, 48678, 153167, 138423, 224983, 107514, 83262, -182045, -157758, 225051, 105713, -63226, -210567, -55181, -202006, -348454, -158451, -55873, -103767, -101418, -81027, -278895, -10202, 29588, -165314, -242767, -118443, -196005, -177620, 43037, -983, -167695, -48879, 30441, 24904, 151608, 36219, 254954, 168661, 214985, 202210, 277183, 270486, 75344, 135902, 216573, 122490, -179890, -82489, 46863, -123149, -331942]
1030c31942Q1784K27255j49011k5867L10795L2828j63097j34952J86843o0103
1020b5467J83819K31758k32776K029j55002l2477K6456K76941k67662L9706J60375
1009B07700k79754k03667L22234o2461q1154j41683K2251o4361P0827K18196l8870
998c0742m8643J4570J69759o0196O2310P392P0660k06070k86132K16672Q4188
987f232P7009Q7699l92415J40584P5863j15586j5413K29625q333M3626o8411j35136
975h7120P3223q0305K35052J6257q1053l00717l5602j33631L77523J1432K7830
964B2889j33276p0432J07072L6160r0782M2328L11103j74384J7588j09690p8381
953a19805J23230J27512j23866p6564q6441q5300J69866K10705M814j84528J14999
$$ y = [-331942, -250158, -22903, -171914, -197781, 113014, 145842, -17255, -152207, 34636, -25467, 158352, 390110, 157334, 159363, 4361, -28116, -1660, 275281, 7619, 47325, 207700, -72054, -275721, 46513, -15948, -97102, -238785, -216534, -280895, -210068, 8128, -30742, -79385, -64815, 104944, 44748, 107058, 114450, 185110, -20960, -307092, -90420, -6232, 70777, 158476, -233939, -93355, -17492, -133078, -148491, 81134, 72801, 116427, 48016, -87120, -13897, -94202, 140850, 157107, 76054, -224663, -260265, -393896, -16373, -4941, 22889, -110387, -180819, -73747, -37587, -128369, -86041, 225062, 50678, 68266, -41424, -119805, 3425, 130937, 7071, -69493, -155934, -241234, -71368, 139337, 144151, -40377, 74622]
942G4622L00736j80146J48923j59087R9571O5537j54360K2380m0382n8892l3813
931H5089m39095R4650j13006K79124J56836K12774j22216J35840k24831k36623
921a71458K58490J80j26766J10088l50034m4694M05979m2619j5482P4527r2995
910E216k20974K28150J8657o1293l06829L98826L1563j29694o4373k3693K7434
899i7010j09998J9565Q6318L37317k96558j66886K78473n5604k2113k3663K27309
888A77150k6915k90827K12872k1242l32539M38387j76969O1565k11745r6954Q8611
877a78606J77579O9619J99157J33259k68983J16866j30511l4299j0804L6084K18167
866C27528J56694l96894j48598Q5306k10920m8461J33633j9104K66418j949l36823
$$ y = [74622, 375358, 195212, 344135, 185048, 284619, 350156, 195796, 218176, 177794, 118902, 85089, -354006, -259356, -372362, -93238, 63598, 276372, 154156, 289996, 65165, -171458, 87032, 87212, -39554, 70534, -279500, -324194, 81785, 39166, 23684, 98211, 5216, -215758, 12392, 31049, -30244, -337073, 61753, 93316, -36378, -100751, -124444, -97010, -207008, -187443, -101125, 236192, -60366, -227252, 51221, -4383, -26496, -50159, 177150, 150235, -140592, 72280, 51038, -281501, 156886, -20083, 41482, -170263, -267217, -178606, -1027, 68592, 267749, 401008, 132025, 248891, 118380, 84081, 73277, 109361, 327528, 484222, 87328, -61270, 24036, -186884, -235345, -101712, -120816, 145602, 143653, -193170]
855a93170p1594R2425J14009k67347j68515K54486K0887P2307K5033J60018k51939
844b13400j28775K34241k0075K23044L062j18116L08901J42371l74878l42922
834b86547M6756Q1637k82184N74983o5687j13311j73253J30078N00837k50772
824A62537k25874k9483P7046J02434k42145j8486K27186J39169o7142j12255j10695
813i7708q9087J87889n6161k7299k01880K11575K65392n9175k38032K5537K43033
802A64084j34606k44391J60054Q3023N7151K0172j6360J49405n8522J6956M3727
791B40693j84257j81227K908m3451l414L98750J934m27886K03794r139j29448
780a30743n3999L33857j51659J3920K7145l01840L60244J80000l45672p9228o0663
$$ y = [-193170, -264764, -172339, -58330, -325677, -494192, -239706, -218819, -146512, -121479, 38539, -213400, -342175, -107934, -128009, 95035, 98097, -20019, 288882, 431253, 56375, -286547, -239791, -158154, -440338, 134645, 68958, -44353, -217606, -87528, 413309, 162537, -63337, -92820, -15774, 86660, -155485, -173971, 53215, 192384, 125242, 12987, -97708, -186795, 1094, -55067, -82366, -284246, -72671, 192721, 133546, -104486, -78949, 164084, 29478, -214913, -54859, 28164, 85315, 105487, 89127, 238532, 180010, 196966, 240693, 56436, -124791, -121883, -165334, -168748, 230002, 231936, -195950, 7844, -1295, -130743, -184742, 149115, -2544, 11376, 38521, -263319, 96925, 276925, -68747, -147975, -208638]
769b08638m4249K31733J13336q7310J44438r4964k41189Q3127J41233J57097P9386
758B74000k60168j84474K89218j42825q3182Q9386L24472k26915J53244j10584
748A22172r708o5877l1149n815j08338J01988K68399l66781J07308q9258J15044
737C7985L71628j93325j08233j00003k51706j4402K21591J67257j8532l8410n3816
726B0034l04343K15971j97926P6469K16558J3834K6711N4785p9113K46101k04208
715H4873R1366j40196j19842J97202K2524k15920J96622K01489l39507o8653m747
704i4789r85N4444K34883k34604j24862K39046J6236q6109r2566Q6771R9168o8101
692B8532q1730J08214R5312l23055M2380K84226M5578m5682k0740k24379k72096
$$ y = [-208638, -252887, -21154, 92182, 4872, 149310, 54346, -186843, -103716, 37517, 194614, 274000, 13832, -170642, 118576, -24249, -107431, -18045, 306427, 79512, 232756, 122172, 112464, 46587, 15438, 9623, -98715, 3273, 271672, -95109, 12199, -77059, 37985, 409613, 216288, 108055, 8052, -243654, -258056, -36465, 130792, 112260, 73850, 20034, -284309, -68338, -266264, -189795, 26763, 40597, 67308, 122093, 42980, 289081, 84873, 176239, 36043, -83799, 113403, 135927, -79993, 116629, 318118, -21389, -90042, -94789, -95774, -41330, 193553, -41051, -165913, 73133, 89369, 3260, -89306, -2535, 96633, 28532, -53198, 55016, 150328, -172727, -130347, 153879, 199457, 153775, 133035, -91344, -363440]
681c63440K18043O8408k26842J74288L10994j25346j68407M5787J04500m597J30260
670A63648L5278j64878K64168j13945j68923J45138m0094K59134K86058j32789
660E32795o6015j97244n0219j86181l7223K57940k29901j56030k04486o6861j67279
649e70704r000L06788O177L0800j73554m9411K20354J446J05372P4166Q2635J38439
637A63508J30408l02020j73826J12220J0533J07022n961J13311o8346k57200k92052
$$ y = [-363440, -145397, -76989, -303831, -129543, 181451, 56105, -112302, -66515, 37985, 33388, 163648, 198926, 34048, 298216, 184271, 15348, 160486, 120392, 379526, 665584, 532795, 466780, 269536, 219317, 33136, -4087, 253853, 23952, -132078, -336564, -403425, -570704, -579704, -272916, -266739, -235939, -409493, -458904, -238550, -237104, -131732, -57566, 25069, 163508, 293916, -8104, -181930, -69710, -59177, 47845, 41884, 155195, 86849, -170351, -462403]
$$ [...]
##END NTUPLES=NMR SPECTRUM
##END=
