##TITLE=1H_CA-9170x-2
 DMSO
 8 sc, 
 7.7.2023
##JCAMPDX= 6.0         $$ Bruker NMR JCAMP-DX V2.0
##DATA TYPE= NMR SPECTRUM
##DATA CLASS= NTUPLES
##ORIGIN= UXNMR, Bruker Analytische Messtechnik GmbH
##OWNER= root
$$ XWIN-NMR		Version 3.5
$$ Fri Jul  7 14:23:49 2023 Russian Standard Time (UT+4h)  she@DPX200
##.OBSERVE FREQUENCY= 200.13135
##.OBSERVE NUCLEUS= ^1H
##.ACQUISITION MODE= SIMULTANEOUS
##.ACQUISITION SCHEME= undefined
##.AVERAGES= 8
##.DIGITISER RES= 18
##SPECTROMETER/DATA SYSTEM= spect
##.PULSE SEQUENCE= zg30
##.SOLVENT NAME= DMSO
##.SHIFT REFERENCE= (INTERNAL, DMSO, 0, 15.7557)
##AUDIT TRAIL= $$ (NUMBER, WHEN, WHO, WHERE, WHAT)
$$ ##TITLE= Audit trail, XWIN-NMR		Version 3.5
$$ ##JCAMPDX= 5.01
$$ ##ORIGIN= Bruker BioSpin GmbH
$$ ##OWNER= she
$$ F:/spectra/data/she/nmr/H-F/1/pdata/1/auditp.txt
$$ ##AUDIT TRAIL=  $$ (NUMBER, WHEN, WHO, WHERE, WHAT)
(   1,<2023-07-07 14:22:36.64 +0400>,<she>,<DPX200>,
      <created by zg, POWCHK disabled, PULCHK disabled
       configuration hash MD5:
       00 E9 B6 7A A2 85 ED C7 34 08 36 98 17 FE 4E 26
       data hash MD5: 16K
       9A 66 A5 86 7F 4F CA E6 59 28 A5 5A 50 75 7A C7>)
(   2,<2023-07-07 14:22:41.15 +0400>,<she>,<DPX200>,
      <Start of raw data processing
       efp BC_mod = 2 LB = 0.24 FT_mod = 6 PKNL = 1 PHC0 = -20986.68 PHC1 = 1.852719 SI = 16K 
       data hash MD5: 16K
       01 CF 6C 07 DB 24 21 17 8D F0 1E BF ED 63 3A 15>)
(   3,<2023-07-07 14:22:56.10 +0400>,<she>,<DPX200>,
      <pk PHC0 = -3.56329 PHC1 = 4.8 
       data hash MD5: 16K
       6A 9D 2F 96 0F C8 98 CA D5 B9 94 7C FA F5 38 52>)
(   4,<2023-07-07 14:22:59.62 +0400>,<she>,<DPX200>,
      <abs ABSG = 5 
       data hash MD5: 16K
       0D DC EC 39 E9 A1 9D D4 22 69 CF 5C F6 55 10 AB>)
$$ ##END=
$$ 
$$ hash MD5
$$ 41 C2 34 6E 80 24 54 8F E3 A4 0F 31 E1 8C 01 94
##$RELAX= 
##$RELAX= 
##$RELAX= 
##$RELAX= 
##$RELAX= 
##$RELAX= 
$$ Bruker specific parameters
$$ --------------------------
##$DU= <F:/spectra>
##$EXPNO= 1
##$NAME= <H-F>
##$PROCNO= 1
##$TYPE= <nmr>
##$USER= <she>
##$AMP= (0..31)
100 100 100 100 100 100 100 100 100 100 100 100 100 100 100 100 100 100 
100 100 100 100 100 100 100 100 100 100 100 100 100 100 
##$AQSEQ= 0
##$AQ_mod= 1
##$AUNM= <au_zg>
##$AUTOPOS= <>
##$BF1= 200.13
##$BF2= 200.13
##$BF3= 200.13
##$BF4= 200.13
##$BF5= 200.13
##$BF6= 200.13
##$BF7= 200.13
##$BF8= 200.13
##$BYTORDA= 1
##$CFDGTYP= 0
##$CFRGTYP= 5
##$CHEMSTR= <none>
##$CNST= (0..31)
1 1 145 1 1 1 1 1 1 1 1 1 1 1 1 1 1 1 1 1 1 1 1 1 1 1 1 1 1 1 1 1 
##$CPDPRG= <>
##$CPDPRG1= <>
##$CPDPRG2= <>
##$CPDPRG3= <>
##$CPDPRG4= <mlev>
##$CPDPRG5= <mlev>
##$CPDPRG6= <mlev>
##$CPDPRG7= <mlev>
##$CPDPRG8= <mlev>
##$CPDPRGB= <>
##$CPDPRGT= <>
##$D= (0..31)
0 1.2 0 0 0 0 0 0 0 0.06 0 0.03 0 0 0 0 0.0002 0 0 0 0 0 0 0 0 0 0 0 0 
0 0 0 
##$DATE= 1688725356
##$DBL= (0..7)
120 120 120 120 120 120 120 120 
##$DBP= (0..7)
150 150 150 150 150 150 150 150 
##$DBP07= 0
##$DBPNAM0= <>
##$DBPNAM1= <>
##$DBPNAM2= <>
##$DBPNAM3= <>
##$DBPNAM4= <>
##$DBPNAM5= <>
$$ [...]
##$SUBNAM3= <"">
##$SUBNAM4= <"">
##$SUBNAM5= <"">
##$SUBNAM6= <"">
##$SUBNAM7= <"">
##$SUBNAM8= <"">
##$SUBNAM9= <"">
##$SW= 18.05172834244
##$SWIBOX= (0..15)
0 0 2 0 0 0 0 0 0 0 0 0 0 0 0 0 
##$SW_h= 3612.71676300578
##$TD= 16384
##$TD0= 1
##$TE= 0
##$TE2= 300
##$TE3= 300
##$TEG= 300
##$TL= (0..7)
0 120 120 120 120 120 120 120 
##$TP= (0..7)
150 150 150 150 150 150 150 150 
##$TP07= 0
##$TPNAME0= <>
##$TPNAME1= <>
##$TPNAME2= <>
##$TPNAME3= <>
##$TPNAME4= <>
##$TPNAME5= <>
##$TPNAME6= <>
##$TPNAME7= <>
##$TPOAL= (0..7)
0.5 0.5 0.5 0.5 0.5 0.5 0.5 0.5 
##$TPOFFS= (0..7)
0 0 0 0 0 0 0 0 
##$TUNHIN= 0
##$TUNHOUT= 0
##$TUNXOUT= 0
##$USERA1= <user>
##$USERA2= <user>
##$USERA3= <user>
##$USERA4= <user>
##$USERA5= <user>
##$V9= 5
##$VALIST= <valist>
##$VCLIST= <CCCCCCCCCCCCCCC>
##$VD= 0
##$VDLIST= <DDDDDDDDDDDDDDD>
##$VPLIST= <PPPPPPPPPPPPPPP>
##$VTLIST= <TTTTTTTTTTTTTTT>
##$WBST= 1024
##$WBSW= 4
##$XGAIN= (0..3)
0 0 0 0 
##$XL= 0
##$YL= 0
##$YMAX_a= 158259
##$YMIN_a= -173683
##$ZGOPTNS= <>
##$ZL1= 120
##$ZL2= 120
##$ZL3= 120
##$ZL4= 120
##$ABSF1= 15.7513
##$ABSF2= -2.30055
##$ABSG= 5
##$ABSL= 3
##$ALPHA= 0
##$AQORDER= 0
##$ASSFAC= 0
##$ASSFACI= 0
##$ASSFACX= 0
##$ASSWID= 0
##$AUNMP= <proc_1d>
##$AZFE= 0.1
##$AZFW= 0.1
##$BCFW= 0
##$BC_mod= 2
##$BYTORDP= 0
##$COROFFS= 0
##$CY= -3
##$DATMOD= 1
##$DC= 0
##$DFILT= <>
##$DTYPP= 0
##$F1P= 0
##$F2P= 0
##$FCOR= 1
##$FTSIZE= 16384
##$FT_mod= 6
##$GAMMA= 0
##$GB= 0
##$INTBC= 1
##$INTSCL= 3.70164e-10
##$ISEN= 128
##$LB= 0.24
##$LEV0= 0
##$LPBIN= 0
##$MAXI= 10000
##$MC2= 0
##$MEAN= 0
##$ME_mod= 0
##$MI= 1.114404
##$NCOEF= 0
##$NC_proc= -6
##$NLEV= 6
##$NOISF1= 3.799351
##$NOISF2= 2.8
##$NSP= 0
##$NTH_PI= 0
##$NZP= 0
##$OFFSET= 15.7557
##$PC= 1
##$PHC0= -20990.24
##$PHC1= 6.652719
##$PH_mod= 1
##$PKNL= yes
##$PPARMOD= 0
##$PSCAL= 0
##$PSIGN= 0
##$REVERSE= no
##$SF= 200.130003169017
##$SI= 16384
##$SIGF1= 3
##$SIGF2= 2
##$SINO= 5.538805
##$SIOLD= 16384
##$SREGLST= <1H.CDCl3>
##$SSB= 0
##$STSI= 16384
##$STSR= 0
##$SW_p= 3612.71676300578
##$SYMM= 0
##$S_DEV= 0
##$TDeff= 16384
##$TDoff= 0
##$TI= <>
##$TILT= no
##$TM1= 0
##$TM2= 0
##$TOPLEV= 0
##$USERP1= <user>
##$USERP2= <user>
##$USERP3= <user>
##$USERP4= <user>
##$USERP5= <user>
##$WDW= 1
##$XDIM= 16384
##$YMAX_p= 283726418
##$YMIN_p= -433176
$$ End of Bruker specific parameters
$$ ---------------------------------
##NTUPLES= NMR SPECTRUM
##VAR_NAME=  FREQUENCY,     SPECTRUM/REAL,   SPECTRUM/IMAG
##SYMBOL=    X,             R,               I
##VAR_TYPE=  INDEPENDENT,   DEPENDENT,       DEPENDENT
##VAR_FORM=  AFFN,          ASDF,            ASDF
##VAR_DIM=   16384,         16384,           16384
##UNITS=     HZ,            ARBITRARY UNITS, ARBITRARY UNITS
##FACTOR=    0.220516191357247, 1,           1
##FIRST=     3153.18831322239, 0,            0
##LAST=      -459.528449783386, 0,           0
##MIN=       -459.528449783386, -433176,     0
##MAX=       3153.18831322239, 283726418,    0
$$ Real data points
##PAGE= N=1
##DATA TABLE= (X++(R..R)), XYDATA
$$ [...]
$$ plain form
8480 1383346 1435059 1472164 1445560 1486424 1471563 1450109 1408881 1264630 1323280 1412199 1440700
8469 1440700 1489870 1521064 1557675 1577042 1605145 1610357 1619616 1726225 1812610 1831431 1927419 1851191
8457 1851191 1823432 1817591 1792072 1923882 1960137 1951534 1952750 2136139 2187970 2054943 2218542
8446 2218542 2281827 2413881 2466120 2608668 2571012 2596576 2691828 2823612 3039701 3083474 3113579
8435 3113579 3237201 3292806 3535351 3733776 3873221 4116749 4355730 4735861 4944136 5324131
8425 5324131 5819140 6253597 6674720 7055252 7245891 7273115 7196908 7019969 6930562 6836451
8415 6836451 6864600 6889509 6995654 7122575 7336442 7530544 7507252 7193126 6810217 6384800
8405 6384800 6120527 5898452 5638509 5552638 5421209 5279985 5234463 5280975 5222183 5173550
$$ packed form
8480A383346N1713L7105k6604M0864j4861k1454m1228j44251N8650Q8919K8501
8469A440700M9170L1194L6611J9367K8103N212R259J06609Q6385J8821R5988p6228
8457A851191k7759n841k5519J31810L6255q603J216J83389N1831j33027J63599
8446B218542O3285J32054N2239J42548l7656K5564R5252J31784K16089M3773L0105
8435C113579J23622N5605K42545J98425J39445K43528K38981L80131K08275L79995
8425E324131M95009M34457M21123L80532J90639K7224p6207j76939q9407r4111
8415F836451K8149K4909J06145J26921K13867J94102k3292l14126l82909m25417
8405F384800k64273k22075k59943q5871j31429j41224m5522M6512n8792m8633
$$ plain form
8395 5173550 5205021 5376887 5474305 5605119 5754592 6017528 6287614 6688467 6946116 7367673
8385 7367673 7892430 8393471 8996865 9593900 10170261 10648408 10953329 11073511 11082298 11000626
8375 11000626 10776947 10453472 10420379 10555018 10531611 10498734 10455634 10347358 10196853 9882720
8365 9882720 9459609 8911257 8254847 7631618 7083425 6674471 6254618 5832186 5556834 5255419
8355 5255419 5044987 4837256 4652947 4595912 4502001 4379242 4518752 4553987 4513649 4525248
8345 4525248 4641203 4793089 4895844 5072952 5309752 5645873 5936028 6099666 6276723 6086546
8335 6086546 5918423 5730159 5518834 5306531 5237600 5356135 5440653 5509279 5483165 5464184
8325 5464184 5247258 5020985 4700587 4327329 3888553 3640791 3376685 3024490 2782411 2756609
$$ packed form
8395E173550L1471J71866R7418J30814J49473K62936K70086M00853K57649M21557
8385G367673N24757N01041O03394N97035N76361M78147L04921J20182Q787q1672
8375A1000626k23679l23475l3093J34639k3407l2877m3100j08276j50505l14133
8365I882720m23111n48352o56410o23229n48193m08954m19853m22432k75352l01415
8355E255419k10432k07731j84309n7035r3911j22759J39510L5235m0338J1599
8345D525248J15955J51886J02755J77108K36800L36121K90155J63638J77057j90177
8335F086546j68123j88264k11325k12303o8931J18535Q4518O8626k6114j8981
8325E464184k16926k26273l20398l73258m38776k47762k64106l52195k42079k5802
$$ plain form
8315 2756609 2593692 2436763 2310585 2134631 2073723 1893882 1778865 1737053 1689462 1691938
8305 1691938 1623502 1616632 1478815 1456345 1502181 1437496 1334966 1384248 1277953 1198346 1368095
8294 1368095 1227438 1242481 1199128 1081628 1113832 1138122 1100092 1170433 1109388 1076917 1077662
8283 1077662 1045223 904574 898355 920653 1031109 1063152 855145 747219 844089 759205 745623
8272 745623 820948 878557 928610 902489 843758 727520 734957 812766 781953 701822 689088 624695
8260 624695 632164 623643 669175 595724 623800 571287 476687 610744 637261 627400 596629 630065
8248 630065 590697 541137 638963 633886 535516 532090 497495 384314 437425 499165 530000 455394
8236 455394 417438 393978 426689 405098 445616 316333 373072 302181 321607 357913 283724
$$ packed form
8315B756609j62917j56929j26178j75954o0908j79841j15017m1812m7591K476
8305A691938o8436o870j37817k2470M5836o4685j02530M9282j06295p9607J69749
8294A368095j40657J5043m3353j17500L2204K4290l8030P0341o1045l2471P45
8283A077662l2439j40649o219K2298J10456L2043k08007j07926R6870q4884j3582
8272G45623P5325N7609N0053k6121n8731j16238P437P7809l0813q0131j2734o4393
8260F24695P469q521M5532p3451K8076n2513r4600J34057K6517r861l0771L3436
8248F30065l9368m9560R7826n077r8370l426l4595j13181N3111O1740L0835p4606
8236D55394l7956k3460L2711k1591M0518j29283N6739p0891J9426L6306p4189
$$ plain form
8225 283724 328427 287851 334323 416587 424441 338755 409550 354553 341129 473992 410340 317215
8213 317215 249918 282505 333487 339490 259788 215432 284438 365113 409739 404742 307874 253811
8201 253811 258619 251994 299663 336344 325946 335888 285906 291730 429231 -369808 -433176 17965
8189 17965 100016 118260 88483 197245 122480 106434 157198 171129 214835 181158 101059 154305
8177 154305 209857 194882 192664 110854 83109 108639 70782 122573 94592 205598 231317 222737
8165 222737 269351 258929 246545 138159 76804 181650 111798 53620 96287 172812 112823
8154 112823 49200 51712 -33261 12591 112017 165410 131604 148694 191773 170274 118566 115711
8142 115711 36906 76388 83881 24223 71501 175743 171284 118697 110304 158051 212960 103196
$$ packed form
8225B83724M4703m0576M6472Q2264P854q5686P0795n4997j3424J32863o3652r3125
8213C17215o7297L2587N0982O003p9702m4356O9006Q0675M4626m997r6868n4063
8201B53811M808o625M7669L6681j0398R942m9982N824J37501p99039o3368M51141
8189A7965Q2051J8244k9777J08762p4765j6046N0764J3931M3706l3677q0099N3246
8177A54305N5552j4975k218q1810k7745K5530l7857N1791k7981J11006K5719q580
8165B22737M6614j0422j2384j08386o1355J04846o9852n8178M2667P6525n9989
8154A12823o3623K512q4973M5852R9426N3393l3806J7090M3079k1499n1708k855
8142A15711p8805L9482P493n9658M7278J04242m459n2587q393M7747N4909j09764
$$ plain form
8130 103196 8682 86907 105389 112193 106999 124743 152957 115111 190915 130607 126998 84874
8118 84874 109916 134051 139085 160070 142963 126648 117289 99879 73982 89215 65808 98468
8106 98468 89861 39492 39250 -12876 -1584 8924 -50845 -36517 34117 137950 191839 71941
8094 71941 51052 100475 110294 76444 -9244 63467 109196 127926 134840 213513 110951 -17329
8082 -17329 81457 129708 65587 93761 38195 1073 56035 86447 38279 97998 119442 20617
8070 20617 49565 67999 58449 7932 -41198 72545 -29088 -63244 52360 -7149 28866
8059 28866 112655 -37682 7101 -36593 -15866 44742 54435 45439 81225 71161 68416 80782
8047 80782 117665 141211 177408 165691 93828 123165 123830 169553 95337 41471 -2812 -12000
$$ packed form
8130A03196r4514P8225J8482O804n194J7744K8214l7846P5804o0308l609m2124
8118H4874K5042K4135N034K0985j7107j6315r359j7410k5897J5233k3407L2660
8106I8468q607n0369k42n2126J1292J0508n9769J4328P0634J03833N3889j19898
8094G1941k0889M9423R819l3850q5688P2711M5729J8730O914P8673j02562j28280
8082a7329R8786M8251o4121K8174n5566l7122N4962L0412m8168N9719K1444r8825
8070B0617K8948J8434r550n0517m9130J13743j01633l4156J15604n9509L6015
8059B8866Q3789j50337M4783m3694K0727O0608R693q996L5786j0064k745J2366
8047H0782L6883K3546L6197j1717p1863K9337O65M5723p4216n3866m4283r188
$$ plain form
8035 -12000 105822 126526 155408 168610 16165 83085 72228 94025 75751 -45286 60475
8024 60475 80463 83607 168780 82500 53091 12986 -15362 31965 15458 -39835 18695 -14033
8012 -14033 26901 49159 79172 66973 40647 41747 2695 13913 68418 73390 56772 -41808
8000 -41808 -36610 37160 57159 -21993 12622 -68705 21382 37498 -409 3656 35510 43323
7988 43323 57133 62076 108219 121863 74514 -6727 48783 54339 -14785 -67909 40992 89838
7976 89838 53305 72501 -29111 76319 -16094 -121804 -11425 -15741 -94639 -155596 -142982
7965 -142982 -55586 -19453 10097 80457 2400 -68935 12606 39744 86439 78580 64585 31824
7953 31824 55735 37650 13950 55093 62703 72619 74646 24044 85329 64648 89595 108626
$$ packed form
8035a2000J17822K0704K8882J3202j52445O6920j0857K1797j8274j21037J05761
8024F0475J9988L144Q5173q6280k9409m0105k8348M7327j6507n5293N8530l2728
8012a4033M0934K2258L0013j2199k6326J100l9052J1218N4505M972j6618r8580
8000d1808N198P3770J9999p9152L4615q1327R0087J6116l7907M065L1854P813
7988D3323J3810M943M6143J3644m7349q1241N5510N556o9124n3124J08901M8846
7976H9838l6533J9196j01612J05430r2413j05710J10379m316p8898o0957J2614
7965a42982Q7396L6133K9550P0360p8057p1335Q1541K7138M6695p859j3995l2761
7953C1824K3911j8085k3700M1143P610R916K027n0602O1285k0681K4947J9031
$$ plain form
7941 108626 138183 82256 10850 5303 43417 -2525 49492 47315 -835 65369 -10711 8031
7929 8031 -16042 -44709 41428 73373 103665 -4115 54388 -37316 -92547 3746 65625 110297
7917 110297 140742 47114 -21795 -89097 -81646 -82161 -114935 -103447 -65819 -60054 -40261 9799
7905 9799 103654 89122 -28784 37866 28471 58362 94724 75340 28427 -43103 -14004 17729
7893 17729 -8904 -36586 -21502 -45119 -1056 35990 10542 109962 106487 4592 -8875 -5564
7881 -5564 -92139 -49318 -21752 -122931 -84183 -66513 -70097 -17700 2975 -95459 -52264 -140153
7869 -140153 -135690 -96028 -104634 -17483 3050 38032 -33314 -33802 -43826 -74667 4739 89970
7857 89970 106630 76145 4050 -33925 -3192 52827 96332 65462 65338 76621 87556 6339
$$ packed form
7941A08626K9557n5927p1406n547L8114m5942N2017k177m8150O6204p6080J8742
7929H031k4073k8667Q6137L1945L0292j07780N8503r1704n5231R6293O1879M4672
7917A10297L0445r3628o8909o7302P451n15l2774J1488L7628N765J9793N0060
7905I799R3855j4532j17906O6650r395K9891L6362j9384m6913p1530K9099L1733
7893A7729k6633k7682J5084k3617M4063L7046k5448R9420l475j01895j3467L311
7881e564q6575M2821K7566j01179L8748J7670l584N2397K0675r8434M3195q7889
7869a40153M463L9662q606Q7151K0533L4982p1346m88j0024l0841P9406Q5231
7857H9970J6660l0485p2095l7975L0733N6019M3505l0870j24J1283J0935q1217
$$ plain form
7845 6339 1224 100978 -22211 -36317 5019 8905 -32639 9305 -85921 -95386 -27642 -37404 -87484
7832 -87484 -170021 -107480 -130622 -69358 28077 14655 -78737 -23336 -112310 -80994 41736 27851
7820 27851 14717 -14712 -91179 -113254 -71690 -65671 39716 181547 163823 -134823 2968
7809 2968 -54416 -54651 15305 21282 12043 21872 -53637 -143164 -171573 -18695 7765 -844 24649
7796 24649 14638 22453 -2868 -63184 67743 13867 12722 56849 -43137 36038 -36569 -40994
7784 -40994 -108055 -49581 -52893 -49731 -5304 -88426 -2110 -111 82501 87230 -2821 -24886 8450
7771 8450 -51631 -77323 17363 -36437 1799 81887 -11799 52260 65286 -20239 -108323 -144596
7759 -144596 -22386 -28979 -23008 -62653 52466 106450 49 -99075 8161 8829 -49032 -50984
$$ packed form
7845F339n115R9754j23189j4106M1336L886m1544M1944r5226r465O7744r762n0080
7832h7484q2537O2541k3142O1264R7435j3422r3392N5401q8974L1316J22730j3885
7820B7851j3134k9429p6467k2075M1564O019J05387J41831j7724k98646J37791
7809B968n7384k35O9956N977r239R829p5509q9527k8409J52878K6460q609K5493
7796B4649j0011P815k5321o0316J30927n3876j145M4127r9986P9175p2607m425
7784d0994o7061N8474l312L162M4427q3122Q6316J999Q2612M729r0051k2065L3336
7771H450o0081k5692R4686n3800L8236Q0088r3686O4059J3026q5525q8084l6273
7759a44596J22210o593N971l9645J15119N3984j06401r9124J07236O68n7861j952
$$ plain form
7747 -50984 -47101 -79225 -54043 -1508 -109789 -66729 -65244 -73759 1916 -1173 110914 58305
7735 58305 -16695 -32495 -105458 -158446 -167655 -133938 -157310 -102478 20521 -28130 -44658 -14229
7723 -14229 18469 50918 23504 14943 -7461 -17074 3154 15009 1756 -44123 63691 21762
7711 21762 -32140 -80970 -80983 -42007 -61684 -93470 19203 -15096 -74172 25315 61782 52599
7699 52599 91225 62089 8832 -60237 23286 98410 94028 27611 94225 27588 -86646 43157
7687 43157 68661 149359 107808 31843 -47072 -10126 83979 47504 54508 78096 -7203 14598
7675 14598 60346 10196 40698 52740 132234 118908 105176 -41525 -81068 -44370 -82533 -127158
7663 -127158 22137 38588 -48638 68341 85237 104037 84759 16848 -130965 -61130 56820
$$ packed form
7747e0984L883l2124K5182N2535j08281M3060J485q515P5675l089J12087n2609
7735E8305p5000j5800p2963n2988r209L3717k3372N4832J22999m8651j6528L0429
7723a4229L2698L2449k7414q561k2404r613K0228J1855j3253m5879J07814m1929
7711B1762n3902m8830j3L8976j9677l1786J12673l4299n9076R9487L6467r183
7699E2599L8626k9136n3257o9069Q3523P5124m382o6417O6614o6637j14234J29803
7687D3157K5504Q0698m1551p5965p8915L6946R4105l6475P004K3588q5299K1801
7675A4598M5748n0150L0502J2042P9494j3326j3732j46701l9543L6698l8163m4625
7663a27158J49295J6451q7226J16979J6896J8800j9278o7911j47813O9835J17950
$$ plain form
7652 56820 42356 -80076 -40049 53883 63267 63107 53614 -43799 -72757 -53220 -17424 -40751
7640 -40751 -36678 -95726 -32694 -103835 -174322 -103830 -111397 -98503 -37384 -68263 -41369 -11113
7628 -11113 -24630 11996 -64373 -96988 -90535 -55627 -86574 -137086 -17185 -76013 -132808 -25376
7616 -25376 -53760 -72361 -76101 45396 55249 -55291 -45954 -60479 46870 59926 -11224 -27627
7604 -27627 -88294 -64809 -87135 -100446 -79265 -87799 -57261 -11599 -49556 21822 -25865 -79198
7592 -79198 -36868 -38408 37883 -32663 -85215 -34277 23785 -96615 -61764 17736 38217 28537
7580 28537 -17524 72466 113037 12902 -38791 -80402 -105563 -77730 -150675 -87118 -33492 20496
7568 20496 1484 -43293 69842 6408 34330 35126 -49281 -115934 -84710 -21156 -81162 -197213
$$ packed form
7652E6820j4464j22432M0027R3932R384j60r493r7413k8958J9537L5796k3327
7640d0751M073n9048O3032p1141p0487P0492p567J2894O1119l0879K6894L0256
7628a1113j3517L6626p6369l2615O453L4908l0947n0512J19901n8828n6795J07432
7616b5376k8384j8601l740J21497R853j10540R337j4525J07349J3056p1150j6403
7604b7627o0667K3485k2326j3311K1181q534L0538M5662l7957P1378m7687n3333
7592g9198M2330j540P6291p0546n2552N0938N8062j20400L4851P9500K0481r680
7580B8537m6061Q9990M0571j00135n1693m1611k5161K7833p2945O3557N3626N3988
7568B0496j9012m4777J13135o3434K7922P96q4407o6653L1224O3554o0006j16051
$$ plain form
7556 -197213 -46554 -154464 -182291 -93185 -82907 -65498 -93723 -51761 -30088 -3683 59115
7545 59115 -21993 -67718 -28994 5297 -10624 -66765 75395 16986 -112833 -71775 -42847
7534 -42847 -116049 -40494 1758 -223431 -182750 -84077 -169610 -16214 -64687 -62243 29172 -1615
7522 -1615 -98934 -112385 -18083 -9842 -75745 62332 94812 2175 -87980 10639 108717 122555
7510 122555 51800 -78958 5649 -127913 -192566 -95227 -35911 1652 -60976 -10199 80493
7499 80493 90906 42594 -87888 -56560 -30790 -76166 60547 60453 26943 3498 82283 85412
7487 85412 3727 -27003 2017 25493 -17330 -60729 78950 12823 54565 63563 6142 11555
7475 11555 -16015 22642 67239 111396 47919 -45553 -46449 -53813 21477 -3755 -20005 -26660 -74441
$$ packed form
7556a97213J50659j07910k7827Q9106J0278J7409k8225M1962K1673K6405O2798
7545E9115q1108m5725L8724L4291j5921n6141J42160n8409j29819M1058K8928
7534d2847p3202P5555M2252k25189M0681R8673q5533J53396m8473K444R1415l0787
7522a615r7319j3451R4302Q241o5903J38077L2480r2637r0155R8619R8078J3838
7510A22555p0755j30758Q4607j33562o4653R7339N9316L7563o2628N0777R0692
7499H0493J0413m8312j30482L1328K5770m5376J36713r4l3510k3445P8785L129
7487H5412q1685l0730K9020K3476m2823m3399J39679o6127M1742Q998n7421N413
7475A1555k7570L8657M4597M4157o3477r3472q96p364P5290k5232j6250o655m7781
$$ plain form
7462 -74441 -8763 2565 -79372 16398 101090 41776 95584 65981 37193 -33651 -54857 -36024
7450 -36024 -29854 -42759 -41852 13166 47713 -108037 -160910 -79387 -80092 -9164 23633 -38241 -49563
7437 -49563 -70299 -45505 36728 52632 89573 -46424 -89581 -149284 -51627 17078 24415 118215
7425 118215 73339 129861 107128 100807 89582 43409 -52329 -80840 4989 111521 68131 33159
7413 33159 -9364 22495 -81215 -91368 -54789 -8187 30695 -55348 -46419 20269 20153 47657
7401 47657 10372 22044 21212 37894 82842 25088 -69555 -9790 -37760 -96357 -53901 -15624
7389 -15624 -76018 -71473 -20399 -21554 12159 21778 -32460 -4800 5404 38367 64579 67514 4059
7376 4059 -56603 -132584 16820 14343 -63484 28005 31576 6029 -45680 -66526 -77785 -31447
$$ packed form
7462g4441O5678J1328q1937R5770Q4692n9314N3808k9603k8788p0844k1206J8833
7450c6024O170j2905R07N5018L4547j55750n2873Q1523p05P0928L2797o1874j1322
7437d9563k0736K4794Q2233J5904L6941j35997m3157n9703R7657O8705P337R3800
7425A18215m4876N6522k2733o321j1225m6173r5738k8511Q5829J06532m3390l4972
7413C3159m2523L1859j03710j0153L6579M6602L8882q6043Q929O6688j16K7504
7401D7657l7285J1672q32J6682M4948n7754r4643N9765k7970n8597M2456L8277
7389a5624o0394M545N1074j155L3713R619n4238K7660J0204L2963K6212K935o3455
7376D059o0662p5981J49404k477p7827R1489L571k5547n1709k0846j1259M6338
$$ plain form
7364 -31447 21978 44196 84539 123529 10432 25261 7066 -23250 -9817 55696 81589 57720
7352 57720 70174 52150 -15532 -38591 72320 115183 31020 -14505 -30673 -24625 -52725 -2592
7340 -2592 137689 90154 67873 15254 -52912 44477 23575 -36289 38456 -53315 -44093 -59555
7328 -59555 -78175 25726 37760 99115 20704 -120255 -97871 -61752 -132764 -129906 -69900 -27283
7316 -27283 -71275 -96509 -166868 -36400 41660 -22167 -93065 2741 -44062 29809 -12097 48482
7304 48482 73081 9281 29337 -6261 -12069 8053 -44309 -65947 -107478 -161517 -3192 -21487
7292 -21487 -54469 -68803 -58873 14115 -17560 -26941 -23304 -14618 17007 -398 52052 111346 52313
7279 52313 11743 -61297 -996 26967 -44772 58820 36227 -1747 34670 38596 -32954 593
$$ packed form
7364c1447N3425K2218M0343L8990j13097J4829j8195l0316J3433O5513K5893k3869
7352E7720J2454j8024o7682k3059J10911M2863q4163m5525j6168O048k8100N0133
7340b592J40281m7535k2281n2619o8166R7389k0902n9864P4745r1771R222j5462
7328e9555j8620J03901J2034O1355p8411j40959K2384L6119p1012K858O0006M2617
7316b7283m3992k5234p0359J30468P8060o3827p0898R5806m6803P3871m1906O0579
7304D8482K4599o3800K0056l5598n808K0122n2362k1638m1531n4039J58325j8295
7292b1487l2982j4334R930P2988l1675r381L637Q686L1625j7405N2450N9294n9033
7279E2313m0570p3040O0301K7963p1739J03592k2593l7974L6417L926p1550L3547
$$ plain form
7267 593 154913 143299 30066 -19952 -61799 19895 24920 -30756 -56018 58424 155475 157183
7255 157183 113189 17559 -14793 49273 119699 -10043 9833 96150 115972 71233 -11381
7244 -11381 -27646 -13196 -32052 19347 36627 -51515 -20346 -27025 -4452 -37475 -5101 17024
7232 17024 17955 -8761 87830 95336 22483 -75131 -35264 81097 67164 12767 92572 65090
7220 65090 -46647 994 13534 -48419 -68052 -34141 -60255 -76264 -89646 -46167 -151253
7209 -151253 -89495 -18425 -35051 -129 66480 44120 59812 121113 151446 119068 40102 5285
7197 5285 -19210 -20117 -39181 -19394 66694 40801 79910 -72880 -73430 45822 -18152 -1328
7185 -1328 93704 49479 -15618 12683 -71597 -70226 -11736 47058 -58746 -78547 52909 29173
$$ packed form
7267E93J54320j1614j13233n0018m1847Q1694N025n5676k5262J14442R7051J708
7255A57183m3994r5630l2352O4066P0426j29742J9876Q6317J9822m4739q2614
7244a1381j6265J4450j8856N1399J7280q8142L1169o679K2573l3023L2374K2125
7232A7024R31k6716R6591P506p2853r7614L9867J16361j3933n4397P9805k7482
7220F5090j11737M7641J2540o1953j9633L3911k6114j6009j3382M3479j05086
7209a51253O1758P1070j6626L4922O6609k2360J5692O1301L0333l2378p8966l4817
7197E285k4495r07j9064J9787Q6088k5893L9109j52790n50J19252o3974J6824
7185a328R5032m4225o5097K8301q4280J371N8490N8794j05804j9801J31456k3736
$$ plain form
7173 29173 -125707 -112211 -59903 -8164 32012 15855 26748 60065 37740 105233 41582 -5370
7161 -5370 -40137 29000 23687 -105244 -34998 -80015 -75807 -32925 -80896 74462 72734 57960
7149 57960 159535 126175 112960 181383 155452 138415 39582 -601 1249 56516 162250 3389
7137 3389 -27297 -5521 3887 169367 9178 -779 1876 14433 4251 83262 103756 2457
7125 2457 107197 104710 100418 60960 6587 -51500 12355 4297 10918 4837 -68003 59229 37845
7112 37845 46628 19050 15575 84980 73740 169025 131479 75807 -30732 -7231 36665 -6692
7100 -6692 -72361 49433 82381 118728 74462 -10669 19562 62604 -29668 -32768 -87749 -7685
7088 -7685 73140 146382 45905 31137 104679 82313 39507 -26046 -58325 -69465 3602 -1400
$$ packed form
7173B9173j54880J3496N2308N1739M0176j6157J0893L3317k2325O7493o3651m6952
7161e370l4767O9137n313j28931P0246m5017M208M2882m7971J55358j728j4774
7149E7960J01575l3360j3215O8423k5931j7037r8833m0183J850N5267J05734j58861
7137C389l0686K1776R408J65480j60189r957K655J2557j0182P9011K0494j01299
7125B457J04740k487m292l9458n4373n8087O3855q058O621o081p2840J27232k1384
7112C7845Q783k7578l475O9405j1240R5285l7546n5672j06539K3501M3896m3357
7100f692o5669J21794L2948L6347m4266q5131L0231M3042r2272l100n4981Q0064
7088g685Q0825P3242j00477j4768P3542k2366m2806o5553l2279j1140P3067n002
$$ plain form
7076 -1400 -72768 10769 94667 94671 60749 15150 -76131 -37856 -22908 59532 43000 -10023 103617
7063 103617 99547 52078 14540 9823 44331 38535 -7916 137153 152300 44132 32008 124593
7051 124593 91928 56705 6527 16690 -9206 21603 81460 12837 -43895 -38939 -85969 -115187
7039 -115187 -24577 -26301 34532 85390 48765 66917 16428 -10361 26041 -38339 -131103 -58700
7027 -58700 -28645 -10231 -45534 -23466 -47761 -56994 -21770 46136 35065 92145 7197 38099
7015 38099 13104 52814 53484 56022 11432 39854 72779 52427 93697 56522 70907 73343 52538
7002 52538 50843 159958 74021 47018 20360 -1660 65354 -14550 19135 63691 -32442 -23845
6990 -23845 18140 34154 -9099 33317 39318 31187 73075 60804 13900 -3970 -8602 77290
$$ packed form
7076a400p1368Q3537Q3898Ml3922m5599r1281L8275J4948Q2440j6532n3023J13640
7063A03617m070m7469l7538m717L4508n796m6451J45069J5147j08168j2124R2585
7051A24593l2665l5223n0178J0163k5896L0809N9857o8623n6732M956m7030k9218
7039a15187R0610j724O0833N0858l6625J8152n0489k6789L6402o4380r2764P2403
7027e8700L0055J8414l5303K2068k4295r233L5224O7906j1071N7080q4948L0902
7015C8099k4995L9710O70K538m4590K8422L2925k0352M1270l7175J4385K436k0805
7002E2538j695J09115q5937k7003k6658k2020O7014p9904L3685M4556r6133Q597
6990b3845M1985J6014m3253M2416O001q131M1888j2271m6904j7870m632Q5892
$$ plain form
6978 77290 59451 97709 135963 49599 61214 33676 4495 125798 79584 181156 179452 88570
6966 88570 128296 148127 144860 79860 106113 118477 33475 -66500 -25260 -2595 -49491 45006
6954 45006 88039 146504 79333 62565 13345 76415 84047 76333 145841 3481 47296 75818
6942 75818 30050 2018 -13741 58997 38465 23640 -14831 -13332 -10084 92563 153177 106480
6930 106480 19531 6743 -41421 -35728 -16803 7833 49361 6058 -83734 -46353 -1756 -1620
6918 -1620 61520 6928 99005 89691 132975 63198 91568 99863 139289 146603 62397 134043 102038
6905 102038 36906 51109 36655 10484 -6988 27630 -12630 -10886 622 16045 10070 35124
6893 35124 14328 -71127 -92465 -31081 -105076 17924 54429 -62299 -118173 17656 112261
$$ packed form
6978G7290j7839L8258L8254q6364J1615k7538k9181J21303m6214J01572j704r0882
6966H8570L9726J9831l267o5000K6253J2364q5002r9975M1240K2665m6896R4497
6954D5006M3033N8465o7171j6768m9220O3070P632p714O9508j42360M3815K8522
6942G5818m5768k8032j5759P2738k0532j4825l8471J499L248J02647O0614m6697
6930A06480q6949j2788m8164N693J8925K4636M1528m3303q9792L7381M4597J36
6918a620O3140n4592R2077r314M3284o9777K8370Q295L9426P314q4206P1646l2005
6905A02038o5132J4203j4454k6171j7472L4618m0260J744J1508J5423n975K5054
6893C5124k0796q5455k1338O1384p3995J23000L6505j16728n5874J35829R4605
$$ plain form
6882 112261 119646 130144 115063 55954 27744 30064 81046 65573 -59657 47549 -2564 51503
6870 51503 142698 42545 16160 -5023 -37185 44405 90691 84107 105386 43376 123533 74834
6858 74834 60967 163011 135406 167299 182468 162556 120588 6354 53919 121635 62561
6847 62561 42636 -45943 -13327 44435 104992 55169 -60474 79999 176755 38196 78709
6836 78709 84343 98257 116717 134989 74657 32794 52707 85753 55523 166169 159987 136512
6824 136512 46052 29841 41427 40147 88217 105943 130323 105032 77343 134923 241785 169583
6812 169583 54712 72148 100252 100880 72507 50998 10278 82306 135414 63492 103548 154228
6800 154228 144423 118174 180675 147184 133264 62362 90320 107955 -9140 67290 189537
$$ packed form
6882A12261P385J0498j5081n9109k8210K320N0982j5473j25230J07206n0113N4067
6870E1503R1195j00153k6385k1183l2162Q1590M6286o584K1279o2010Q0157m8699
6858G4834j3867J02044k7605L1893J5169j9912m1968j14234M7565O7716n9074
6847F2561j9925q8579L2616N7762O0557m9823j15643J40473R6756j38559M0513
6836G8709N634J3914J8460J8272o0332m1863J9913L3046l0230J10646o182k3475
6824A36512r0460j6211J1586j280M8070J7726K4380k5291k7689N7580J06862p2202
6812A69583j14871J7436K8104O28k8373k1509m0720P2028N3108p1922M0056N0680
6800A54228r805k6249O2501l3491j3920p0902K7958J7635j17095P6430J22247
$$ plain form
6789 189537 273784 143198 126320 225631 181774 38944 51599 67097 89901 128867 71475
6778 71475 118675 118160 66445 94341 161110 161845 238091 148782 152742 217785 189712 148277 238010
6765 238010 241222 185352 231126 262930 180935 58254 61456 101246 34573 71041 206766 198098
6753 198098 179746 190851 117561 181411 169553 79988 57520 60419 58388 167126 133213 169933
6741 169933 123815 94208 152933 143832 34027 -57731 -20552 21455 142832 62772 130494
6730 130494 154705 146488 270697 210001 88870 146447 88858 106823 82311 147082 111488
6719 111488 16780 49127 113558 142894 189279 154502 149409 148228 148367 244508 319527 233895
6707 233895 178667 167441 111264 174539 246830 259293 208052 165065 157576 192117 139464 236682
$$ packed form
6789A89537Q4247j30586j6878R9311m3857j42830J2655J5498K2804L8966n7392
6778G1475M7200n15n1715K7896O6769P35P6246q9309L960O5043k8073m1435Q9733
6765B38010L212n5870M5774L1804q1995j22681L202L9790o6673L6468J35725q668
6753A98098j8352J1105p3290O3850j1858q9565k2468K899k031J08738l3913L6720
6741A69933m6118k9607N8725r101j09805r1758L7179M2007J21377q0060O7722
6730A30494K4211q217J24209o0696j21131N7577n7589J7965k4512O4771l5594
6719A11488r4708L2347O4431K9336M6385l4777n093j181J39R6141P5019q5632
6707B33895n5228j1226n6177O3275P2291J2463n1241m2987p489L4541n2653R7218
$$ plain form
6695 236682 127301 167463 201687 171951 243710 273312 274287 242932 71749 117952 142001 130103
6683 130103 162728 160216 115308 151910 107205 -9729 140705 251724 249167 237813 221010
6672 221010 218092 100614 92245 206998 201504 278210 319349 272571 257344 263428 184879 259868
6660 259868 244192 250179 271041 191448 195959 106903 134963 219499 196176 167498 183762 261700
6648 261700 245345 223326 291781 255308 118263 178655 177375 237324 277440 292751 263139 218367
6636 218367 204291 182019 179635 127806 184928 248259 267364 267061 152523 187290 173272 216545
6624 216545 280616 199490 210060 279617 248177 251351 209047 193196 226764 252916 255227 186260
6612 186260 271338 299151 213509 262307 266557 176293 251109 191060 67630 153199 243890 201262
$$ packed form
6695B36682j09381M0162L4224k9736P1759K9602R75l1355j71183M6203K4049j1898
6683A30103L2625k512m4908L6602m4705j16934J50434J11019k557j1354j6803
6672B21010k918j17478q369J14753n494P6706M1139m6778j5227O084p8549P4989
6660B59868j5676N987K0862p9593M511q9056K8060Q4536k3323k8678J6264P7938
6648B61700j6355k2019O8455l6473j37045O0392j280N9949M0116J5311k9612m4772
6636B18367j4076k2272k384n1829N7122O3331J9105l03j14538L4767j4018M3273
6624B16545O4071q1126J0570O9557l1440L174m2304j5851L3568K6152K311o8967
6612A86260Q5078K7813q5642M8798M250r0264P4816o0049j23430Q5569R0691m2628
$$ plain form
6600 201262 193139 221255 204166 123837 36388 57464 173141 254640 101985 91112 234044
6589 234044 281304 237140 279717 309796 314164 239698 154713 82893 91742 138320 183964 212772
6577 212772 150948 189419 138771 246285 264166 266069 273408 240964 222145 198293 208583 214389
6565 214389 222864 194310 210532 192533 213348 232588 171818 141370 210996 321360 270113 239091
6553 239091 332400 245209 192474 212488 223940 288288 279351 297911 238764 286153 237131 297121
6541 297121 277772 216053 284508 291542 184024 195288 303519 257412 220398 241304 160454
6530 160454 175604 183118 265630 339720 339119 432228 466778 385089 234230 200390 159727 196383
6518 196383 240605 295745 347154 382445 310558 284842 265174 286756 316512 419028 384600
$$ packed form
6600B01262q123K8116j7089q0329q7449K1076J15677Q1499j52655j0873J42932
6589B34044M7260m4164M2577L0079M368p4466q4985p1820Q849M6578M5644K8808
6577B12772o1824L8471n0648J07514J7881J903P339l2444j8819k3852J0290N806
6565B14389Q475k8554J6222j7999K0815J9240o0770l0448O9626J10364n1247l1022
6553B39091R3309q7191n2735K0014J1452O4348q937J8560n9147M7389m9022N9990
6541B97121j9349o1719O8455P034j07518J1264J08231m6107l7014K0906q0850
6530A60454J5150P514Q2512P4090o01R3109L4550q1689j50859l3840m0663L6656
6518A96383M4222N5140N1409L5291p1887k5716j9668K1582K9756J02516l4428
$$ plain form
6507 384600 357244 353958 376026 337836 341289 361638 319448 337975 262366 368240 427633 394480
6495 394480 310593 306375 415257 317502 259538 359612 376992 253776 453816 590474 481617
6484 481617 424837 368472 399869 437408 394516 334912 366042 390117 351618 243702 367763
6473 367763 397877 376729 332610 325801 366852 381716 393672 395061 430620 379951 407093 485418
6461 485418 425605 382902 364436 314795 402801 486597 484268 496595 397915 407822 467692 511449
6449 511449 481017 332029 368202 389305 373203 437326 514044 451093 406746 490663 434461
6438 434461 459744 498086 467957 465558 387799 435600 511097 500399 513288 477363 470505 473255
6426 473255 484456 528299 431663 505822 545742 508956 515089 600462 573103 568599 540127 491585
$$ packed form
6507C84600k7356l286K2068l8190L453K0349m2190J8527p5609J05874N9393l3153
6495C94480q3887m218J08882r7755n7964J00074J7380j23216K00040J36658j08857
6484D81617n6780n6365L1397L7539m2892n9604L1130K4075l8499j07916J24061
6473C67763L0114k1148m4119o809M1051J4864J1956J389L5559n0669K7142P8325
6461D85418n9813m2703j8466m9641Q8006Q3796k329J2327r8680R907N9870M3757
6449E11449l0432j48988L6173K1103j6102O4123P6718o2951m4347Q3917n6202
6438D34461K5283L8342l0129k399p7759M7801P5497j0698J2889l5925o858K750
6426D73255J1201M3843r6636P4159L9920l6786O133Q5373k7359m504k8472m8542
$$ plain form
6414 491585 498090 554588 520618 461874 433016 464642 565328 547026 490272 351510 410719
6403 410719 353035 466468 586575 545992 580915 600801 628960 567303 655800 681273 495769
6392 495769 400788 519184 553253 513462 571983 560109 522697 497085 574709 571866 627074 761269
6380 761269 757050 672172 637529 558220 589731 650324 593681 481911 473235 527644 598921 602529
6368 602529 614115 611115 517546 663472 763989 687338 591362 566753 605455 681105 580391
6357 580391 648949 801110 753283 717954 752464 740956 713590 751293 815373 701980 711918
6346 711918 623424 590920 739494 702334 671046 794567 917960 782027 747216 816787 791230
6335 791230 849631 804558 778613 865413 752673 812044 854728 862193 951204 917502 930018 890112
$$ packed form
6414D91585O505N6498l3970n8744k8858L1626J00686j8302n6754j38762N9209
6403D10719n7684J13433J20107m0583L4923J9886K8159o1657Q8497K5473j85504
6392D95769r4981J18396L4069l9791N8521j1874l7412k5612P7624k843N5208J34195
6380G61269m219q4878l4643p9309L1511O0593n6643j11770q676N4409P1277L608
6368F02529J1586l000r3569J45926J00517p6651r5976k4609L8702P5650j00714
6357E80391O8558J52161m7827l5329L4510j1508k7366L7703O4080j13393R938
6346G11918q8494l2504J48574l7160l1288J23521J23393j35933l4811O9571k5557
6335G91230N8401m5073k5945Q6800j12740N9371M2684P465Q9011l3702J2516l9906
$$ plain form
6323 890112 840978 978155 993847 931383 894378 866809 976252 985722 1051384 1089938 1003440
6312 1003440 1018628 983381 923418 959601 952933 954829 1127136 1122507 1104986 1164576 1129965 1152756
6300 1152756 1045093 1062150 1080619 1035519 1157714 1198326 1166467 1164912 1180643 1228611 1290225
6289 1290225 1290580 1353204 1441100 1426055 1408166 1348050 1331508 1393544 1427813 1393053 1334101 1401569
6277 1401569 1370419 1480924 1478107 1484955 1470718 1444838 1533618 1500507 1604236 1726228 1739769
6266 1739769 1701522 1689718 1706411 1752870 1742341 1712202 1740144 1754111 1759690 1806111 1848869 1985213
6254 1985213 1987053 1921706 1920925 2042106 2176189 2147389 2155446 2222169 2284485 2420500 2404729 2320271
6242 2320271 2434937 2441045 2412797 2506659 2497398 2569092 2521134 2592360 2692424 2695006 2791749 2781820
$$ packed form
6323H90112m9134J37177J5692o2464l7005k7569J09443R470O5662L8554q6498
6312A003440J5188l5247n9963L6183o668J896J72307m629j7521N9590l4611K2791
6300A152756j07663J7057J8469m5100J22195M0612l1859j555J5731M7968O1614
6289A290225L55O2624Q7896j5045j7889o0116j6542O2036L4269l4760n8952O7468
6277A401569l1150J10505k817O848j4237k5880Q8780l3111J03729J21992J3541
6266A739769l8247j1804J6693M6459j0529l0139K7942J3967N579M6421M2758J36344
6254A985213J840o5347p81J21181J34083k8800Q057O6723O2316J36015j5771q4458
6242B320271J14666O108k8248R3862r261P1694m7958P1226J00064K582R6743r929
$$ plain form
6230 2781820 2870362 2969188 3006515 3056654 3143162 3130957 3075738 3163641 3240057 3274679 3354440
6219 3354440 3462743 3522825 3446635 3518930 3607147 3648816 3732597 3705460 3788105 3837745 3745899
6208 3745899 3890698 3949726 3984388 4165766 4125827 4075215 4145735 4164655 4226359 4299029 4322869
6197 4322869 4359072 4491883 4520479 4517323 4514176 4476620 4428128 4553459 4608224 4606703 4625897 4642553
6185 4642553 4563208 4585968 4663949 4669462 4716241 4719345 4881272 4935485 4821710 4904313 4914643
6174 4914643 4918514 4902395 5006924 5069610 5149723 5260109 5235889 5277542 5392360 5454507 5433381
6163 5433381 5474157 5588333 5746739 5727224 5792736 5899255 6016837 6096712 6139458 6206482 6213024
6152 6213024 6268484 6500047 6514255 6529987 6677408 6780614 6729501 6748502 6797397 6845492 7016046
$$ packed form
6230B781820Q8542R8826L7327N0139Q6508j2205n5219Q7903P6416L4622P9761
6219C354440J08303O0082p6190P2295Q8217M1669Q3781k7137Q2645M9640r1846
6208C745899J44799N9028L4662J81378l9939n0612P0520J8920O1704P2670K3840
6197D322869L6203J32811K8596l156l147l7556m8492J25331N4765j521J9194J6656
6185D642553p9345K2760P7981N513M6779L104J61927N4213j13775Q2603J0330
6174D914643L871j6119J04529O2686Q0113J10386k4220M1653J14818O2147k1126
6163E433381M0776J14176J58406j9515O5512J06519J17582P9875M2746O7024O542
6152F213024N5460K31563J4208J5732J47421J03206n1113J9001M8895M8095J70554
$$ plain form
6141 7016046 7104514 7058427 7116671 7226341 7316650 7207048 7154498 7287993 7249831 7206157 7287246
6130 7287246 7255407 7185783 7118448 7083972 7050637 6953563 6830538 6695571 6611941 6662509 6553674
6119 6553674 6443378 6324972 6306241 6198345 6072333 5879985 5838218 5767896 5718345 5565301
6109 5565301 5521266 5575382 5447267 5359482 5292698 5194594 5077825 4978201 4993748 4897708 4740425
6098 4740425 4773501 4736480 4691206 4555799 4427788 4384577 4362022 4319494 4294957 4081835 3992191
6087 3992191 4039104 3972324 3892743 3927415 3867561 3950397 3949013 3945263 3765124 3886263 3927841
6076 3927841 3911648 3870243 3864509 3807967 3787426 3668400 3609371 3569198 3585405 3620414 3482023
6065 3482023 3511570 3477623 3467482 3363534 3337321 3252877 3305919 3327261 3437958 3485032 3482125
$$ packed form
6141G016046Q8468m6087N8244J09670R0309j09602n2550J33495l8162m3674Q1089
6130G287246l1839o9624o7335l4476l3335r7074j23025j34967q3630N0568j08835
6119F553674j10296j18406j8731j07896j26012j92348m1767p0322m9551j53044
6109E565301m4035N4116j28115q7785o6784r8104j16769r9624J5547r6040j57283
6098D740425L3076l7021m5274j35407j28011m3211k2555m2528k4537k13122q9644
6087C992191M6913o6780p9581L4672n9854Q2836j384l750j80139J21139M1578
6076C927841j6193m1405n734n6542k0541j19026n9029m0173J6207L5009j38391
6065C482023K9547l3947j0141j03948k6213q4444N3042K1342J10697M7074k907
$$ plain form
6054 3482125 3481103 3472176 3507472 3433487 3438702 3474256 3326796 3355556 3376128 3293388 3338427 3441404
6042 3441404 3422590 3369296 3284912 3214694 3282993 3228066 3321657 3216958 3259895 3277568 3310447
6031 3310447 3278411 3327768 3384152 3334415 3389100 3414410 3419245 3421387 3328557 3408238 3469252 3552905
6019 3552905 3512132 3446166 3412904 3461444 3528010 3648086 3602598 3586124 3645216 3646251 3724120
6008 3724120 3669592 3615654 3658643 3700026 3692593 3807965 3819153 3837264 3795585 3862900 3957580
5997 3957580 3975909 3911504 4079115 4160296 4239329 4293453 4338128 4198512 4297612 4366842 4493787
5986 4493787 4440665 4455292 4426000 4500989 4519136 4623138 4727430 4854525 4957718 4884623 4999404
5975 4999404 5122653 5166225 5130433 5209790 5340083 5393158 5406133 5461935 5486132 5585206 5612195
$$ packed form
6054C482125j022q927L5296p3985N215L5554j47460K8760K0572q2740M5039J02977
6042C441404j8814n3294q4384p0218O8299n4927R3591j04699M2937J7673L2879
6031C310447l2036M9357N6384m9737N4685K5310M835K142r2830P9681O1014Q3653
6019C552905m0773o5966l3262M8540O6566J20076m5488j6474N9092J035P7869
6008C724120n4528n3938M2989M1383p433J15372J1188J8111m1679O7315R4680
5997C957580J8329o4405J67611Q1181P9033N4124M4675j39616R9100O9230J26945
5986D493787n3122J4627k9292P4989J8147J04002J04292J27095J03193p3095J14781
5975D999404J23249M3572l5792P9357J30293N3075J2975N5802K4197R9074K6989
$$ plain form
5964 5612195 5707941 5800845 5885980 5876242 5905621 5978123 6151791 6224086 6153095 6398779 6548364
5953 6548364 6528115 6614609 6685899 6617986 6524428 6647926 6730602 6856927 6892784 6846737 6940724
5942 6940724 6832427 6823074 6798005 6685744 6804099 6918262 6822045 6704466 6761160 6781209 6786054
5931 6786054 6745511 6693942 6637310 6581132 6586890 6521606 6259531 6289587 6291393 6246181 6180576 6071018
5919 6071018 5958161 5973815 5978443 5982801 5922545 5806553 5770241 5777002 5744885 5778957 5668192
5908 5668192 5468780 5410773 5298895 5229862 5243246 5259241 5282126 5198166 5036522 5003654 5037254
5897 5037254 5035499 5007960 4990271 4856509 4964915 4947103 4865055 4715107 4641986 4629955 4575704
5886 4575704 4576539 4513211 4461038 4464688 4519378 4435542 4407809 4341283 4260489 4259243 4220561 4202045
$$ packed form
5964E612195R5746R2904Q5135r738K9379P2502J73668P2295p0991K45684J49585
5953F548364k0249Q6494P1290o7913r3558J23498Q2676J26325L5857m6047R3987
5942F940724j08297r353k5069j12261J18355J14163r6217j17579N6694K0049M845
5931F786054m0543n1569n6632n6178N758o5284k62075L0056J806m5212o5605j09558
5919F071018j12857J5654M628M358o0256j15992l6312O761l2117L4072j10765
5908E668192j99412n8007j11878o9033J3384J5995K2885q3960j61644l2868L3600
5897E037254j755k7539j7689j33762J08406j7812q2048j49948p3121j2031n4251
5886D575704Q35o3328n2173L650N4690q3836k7733o6526q0794j246l8682j8516
$$ plain form
5874 4202045 4188616 4087656 4168470 4194058 4115871 4062760 4036784 3949019 3880006 3937421 3822052
5863 3822052 3825189 3871942 3819915 3727777 3665782 3537473 3493906 3557666 3524688 3538517 3472494
5852 3472494 3391555 3232491 3241064 3250868 3244794 3233991 3173254 3176347 3080328 3005263 2894180 2864077
5840 2864077 2839642 2835105 2936518 2863860 2917018 2913825 2763136 2691751 2602554 2536312 2516536
5829 2516536 2489109 2503606 2570370 2417091 2371159 2235577 2299215 2353355 2409568 2418534 2317137
5818 2317137 2284337 2245066 2239096 2255122 2238032 2227579 2236759 2218144 2222769 2076890 2048695 1979322
5806 1979322 1928165 2021443 1951982 1900992 1988836 2014583 1920016 1949114 2024571 1983030 2003842
5795 2003842 1907150 1847946 1827615 1867470 1833093 1802906 1754256 1678220 1768283 1873651 1776496
$$ packed form
5874D202045j3429j00960Q0814K5588p8187n3111k5976q7765o9013N7415j15369
5863C822052L137M6753n2027r2138o1995j28309m3567O3760l2978J3829o6023
5852C472494q0939j59064Q573R804o074j0803o0737L093r6019p5065j11083l0103
5840B864077k4435m537J01413p2658N3158l193j50689p1385q9197o6242j9776
5829B516536k7427J4497O6764j53279m5932j35582O3638N4140N6213Q966j01397
5818B317137l2800l9271n970J6026j7090j0453R180j8615M625j45879k8195o9373
5806A979322n1157R3278o9461n0990Q7844K5747r4567K9098P5457m1541K0812
5795B003842r6692n9204k0331L9855l4377l0187m8650p6036R0063J05368r7155
$$ plain form
5784 1776496 1704235 1631390 1665233 1701699 1683194 1622957 1625213 1575237 1576471 1698225 1665305 1584816
5772 1584816 1611936 1699295 1626166 1647101 1535257 1535671 1523697 1562183 1607650 1620024 1519486
5761 1519486 1384151 1376536 1373965 1431615 1420772 1423350 1409620 1361724 1286595 1370233 1460289 1479835
5749 1479835 1378516 1306551 1390024 1425958 1465280 1426073 1420432 1447633 1371107 1426576 1439191
5738 1439191 1459367 1435049 1412505 1423507 1387014 1380814 1314536 1350266 1373232 1356122 1248468
5727 1248468 1355848 1401327 1545055 1443619 1274442 1305259 1429326 1411812 1419819 1404942 1480252
5716 1480252 1476673 1427428 1398228 1386518 1387413 1288800 1402581 1420600 1393635 1326078 1400260 1448558
5704 1448558 1492126 1482998 1462768 1412120 1436445 1516281 1667651 1616450 1541942 1550511 1503625 1391509
$$ packed form
5784A776496p2261p2845L3843L6466j8505o0237K256m9976J234J21754l2920q0489
5772A584816K7120Q7359p3129K0935j11844M14j1974L8486M5467J2374j00538
5761A519486j35335p615k571N7650j0843K578j3730m7896p5129Q3638R0056J9546
5749A479835j01319p1965Q3473L5934L9322l9207n641K7201p6526N5469J2615
5738A439191K0176k4318k2544J1002l6493o200o6278L5730K2966j7110j07654
5727A248468J07380M5479J43728j01436j69177L0817J24067j7514Q007j4877P5310
5716A480252l579m9245k9200j1710Q95r8613J13781J8019k6965o7557P4182M8298
5704A448558M3568r128k0230n0648K4325P9836J51370n1201p4508Q569m6886j12116
$$ plain form
5692 1391509 1324146 1418991 1522067 1413793 1416016 1405286 1440468 1390404 1357068 1368704 1364781
5681 1364781 1413388 1367299 1378896 1385037 1365115 1465154 1547004 1489971 1461011 1530017 1511784
5670 1511784 1480634 1454586 1492476 1543269 1538916 1537917 1415879 1447449 1481913 1455541 1481066 1582377
5658 1582377 1582166 1519581 1521819 1499496 1540213 1530718 1470762 1623274 1557944 1491116 1635477 1510889
5646 1510889 1552087 1601294 1558787 1651550 1705008 1646614 1473182 1468471 1612095 1588009 1606711
5635 1606711 1668337 1705263 1760573 1712871 1674231 1646927 1605946 1573252 1747338 1724547 1692416
5624 1692416 1750645 1829396 1856138 1793286 1748688 1767738 1805364 1745563 1791093 1778451 1681901
5613 1681901 1719597 1777630 1808567 1941388 1973653 1923314 1815863 1785246 1809790 1782002 1830052
$$ packed form
5692A391509o7363R4845J03076j08274K223j0730L5182n0064l3336J1636l923
5681A364781M8607m6089J1597O141j9922J00039Q1850n7033k8960O9006j8233
5670A511784l1150k6048L7890N0793m353r99j22038L1570L4464k6372K5525J01311
5658A582377k11o2585K238k2323M0717r495n9956J52512o5330o6828J44361j24588
5646A510889M1198M9207m2507R2763N3458n8394j73432m711J43624k4086J8702
5635A606711O1626L6926N5310m7702l8640k7304m0981l2694J74086k2791l2131
5624A692416N8229P8751K6742o2852m4598J9050L7626n9801M5530j2642r6550
5613A681901L7696N8033L0937J32821L2265n0339j07451l0617K4544k7788M8050
$$ plain form
5602 1830052 1811466 1909468 1930550 1949704 1946228 1898377 2005351 2019865 2041986 2009877 2081892
5591 2081892 2139018 2054260 2080552 2069817 2087567 2101582 2109367 2097294 2242189 2210530 2196313
5580 2196313 2178449 2117757 2184751 2187300 2299896 2204816 2092744 2033399 2120491 2182212 2297181
5569 2297181 2396886 2451755 2459886 2273090 2239101 2247172 2375440 2367288 2391657 2465538 2482035 2519832
5557 2519832 2633297 2652459 2622356 2577078 2501214 2538919 2557398 2557326 2531796 2612090 2616852 2659469
5545 2659469 2777470 2867978 2715628 2810885 2764891 2635537 2758982 2810065 2865008 2865845 2835321
5534 2835321 2817415 2887674 2918043 2983315 3063859 3097754 3096809 3062101 3032473 3130034 3297706 3250092
5522 3250092 3248324 3315188 3321618 3352715 3384726 3393728 3356153 3449947 3405371 3442272 3518467 3516627
$$ packed form
5602A830052j8586R8002K1082J9154l476m7851J06974J4514K2121l2109P2015
5591B081892N7126q4758K6292j0735J7750J4015P785j2073J44895l1659j4217
5580B196313j7864o0692O6994K549J12596r5080j12072n9345Q7092O1721J14969
5569B297181R9705N4869Q131j86796l3989Q071J28268q152K4369P3881J6497L7797
5557B519832J13465J9162l0103m5278p5864L7705J8479p2k5530Q0294M762M2617
5545B659469J18001R0508j52350R5257m5994j29354J23445N1083N4943Q37l0524
5534B835321j7906P0259L0369O5272Q0544L3895r45l4708k9628R7561J67672m7614
5522C250092j768O6864O430L1097L2011R002l7575R3794m4576L6901P6195j840
$$ plain form
5510 3516627 3574524 3624417 3549952 3439239 3567371 3568257 3732914 3806912 3743651 3802414 3884402
5499 3884402 3956039 3977454 3932401 4033723 3993177 3983722 4234413 4337558 4270339 4276439 4310825
5488 4310825 4398133 4522121 4560338 4662074 4720696 4754733 4677783 4767984 4829368 4813626 4911545
5477 4911545 5094246 4996494 5028291 5098954 5216350 5310985 5278046 5334826 5403098 5438378 5517463
5466 5517463 5594947 5620915 5692281 5704174 5791379 5790723 5905152 6028500 6100764 6176823 6300183
5455 6300183 6350454 6335476 6410632 6451727 6553683 6687883 6855663 6936498 6905133 6997041 7103424
5444 7103424 7177667 7143660 7179616 7337570 7486936 7512386 7635421 7764603 7918800 7902159
5434 7902159 7877786 7988104 8159374 8184025 8283626 8477204 8604445 8712495 8775258 8777970 8855122
$$ packed form
5510C516627N7897M9893p4465j10713J28132Q86J64657P3998o3261N8763Q1988
5499C884402P1637K1415m5053J01322m0546r455K50691J03145o7219O100L4386
5488D310825Q7308J23988L8217J01736N8622L4037p6950R0201O1384j5742R7919
5477D911545J82701r7752L1797P0663J17396R4635l2939N6780O8272L5280P9085
5466E517463P7484K5968P1366J1893Q7205o56J14429J23348P2264P6059J23360
5455F300183N0271j4978P5156M1095J01956J34200J67780Q0835l1365R1908J06383
5444G103424P4243l4007L5956J57954J49366K5450J23035J29182J54197j6641
5434G902159k4373J10318J71270K4651R9601J93578J27241J08050O2763K712P7152
$$ plain form
5423 8855122 8934656 9085207 9169667 9328625 9466866 9568297 9675133 9695574 9793249 9840624
5413 9840624 10004243 10209185 10423121 10369963 10448804 10431629 10714979 10871468 10911469 10992375
5403 10992375 11082120 11171288 11267725 11415999 11648971 11779745 11792409 11745721 11836048 11893262 12022026
5392 12022026 12101318 12190959 12275042 12268339 12329142 12469070 12566650 12672896 12696409 12724007 12784713
5381 12784713 12954395 13061340 13163589 13222448 13191105 13241610 13256597 13322573 13303731 13488329
5371 13488329 13557054 13581033 13624703 13670141 13651587 13622262 13732633 13777418 13742680 13772188 13802518
5360 13802518 13851359 13880983 13874000 13877303 14008232 14026655 14083595 14031518 14120745 14125557 14101738 14105600
5348 14105600 14152060 14157748 14301635 14388723 14318664 14409137 14501409 14492169 14405728 14495790 14658553
$$ packed form
5423H855122P9534J50551Q4460J58958J38241J01431J06836K0441R7675M7375
5413I840624J63619K04942K13936n3158P8841j7175K83350J56489M0001Q0906
5403A0992375Q9745Q9168R6437J48274K32972J30774J2664m6688R0327N7214J28764
5392A2022026P9292Q9641Q4083o703O0803J39928R7580J06246K3513K7598O0706
5381A2784713J69682J06945J02249N8859l1343N0505J4987O5976j8842J84598
5371A3488329O8725K3979M3670M5438j8554k9325J10371M4785l4738K9508L0330
5360A3802518M8841K9624o983L303J30929J8423N6940n2077Q9227M812k3819L862
5348A4105600M6460N688J43887Q7088p0059R0473R2272r240q6441R0062J62763
$$ plain form
5337 14658553 14721403 14792927 14766777 14802934 15019466 15047391 15058514 15204002 15418593 15506639 15505138
5326 15505138 15621797 15752882 15995913 16057346 16136637 16378693 16616536 16720663 16776342 16879662
5316 16879662 17078119 17185003 17431908 17628883 17735996 17860431 17981909 18252484 18417539
5307 18417539 18615800 18775570 18998894 19239624 19462297 19749328 20044936 20236847 20409938
5298 20409938 20682246 20970820 21335536 21655956 21962382 22312945 22640045 22946634 23197736
5289 23197736 23427186 23824258 24223100 24546230 24897061 25236743 25588535 25912052 26366991
5280 26366991 26942647 27293013 27713872 28241497 28694162 29155603 29698287 30284477 30678880
5271 30678880 31196449 31687610 32332670 32849598 33339188 33964078 34527397 35157551 35831790
$$ packed form
5337A4658553O2850P1524k6150L6157K16532K7925J1123J45488K14591Q8046j501
5326A5505138J16659J31085K43031O1433P9291K42056K37843J04127N5679J03320
5316A6879662J98457J06884K46905J96975J07113J24435J21478K70575J65055
5307A8417539J98261J59770K23324K40730K22673K87031K95608J91911J73091
5298B0409938K72308K88574L64716L20420L06426L50563L27100L06589K51102
5289B3197736K29450L97072L98842L23130L50831L39682L51792L23517M54939
5280B6366991N75656L50366M20859N27625M52665M61441N42684N86190L94403
5271C0678880N17569M91161O45060N16928M89590O24890N63319O30154O74239
$$ plain form
5262 35831790 36567728 37308302 38093616 38952280 39598971 40302243 41226132 42130515 42972187
5253 42972187 44042484 45080354 46275244 47543281 48806969 50232941 51646967 53271276
5245 53271276 54817708 56531851 58376898 60334544 62550474 64800281 67308389 70029357
5237 70029357 72737247 75697424 79053900 82490251 86250756 90290251 94653523 99507899
5229 99507899 104833820 110496181 116657002 123506991 131088664 139602624 149169382 159686082
5221 159686082 171348122 184372696 198817966 214459314 230884702 247244974 262357694
5214 262357694 274592184 282038707 283726418 279220739 269341642 255674493 239476192 222058898
5206 222058898 204696810 188083385 172579500 158490899 145884046 134693548 124569436
$$ packed form
5262C5831790P35938P40574P85314Q58664O46691P03272R23889R04383Q41672
5253D2972187J070297J037870J194890J268037J263688J425972J414026J624309
5245E3271276J546432J714143J845047J957646K215930K249807K508108K720968
5237G0029357K707890K960177L356476L436351L760505M039495M363272M854376
5229I9507899N325921N662361O160821O849989P581673Q513960R566758J0516700
5221A59686082J1662040J3024574J4445270J5641348J6425388J6360272J5112720
5214B62357694J2234490P446523J687711m505679r879097j3667149j6198301j7417294
5206B22058898j7362088j6613425j5503885j4088601j2606853j1190498j0124112
$$ plain form
5199 124569436 115670005 107780294 100751468 94401234 88621492 83565719 78961417 74817114
5191 74817114 71066120 67555108 64287732 61271832 58563522 55958764 53755586 51587295
5183 51587295 49559055 47703328 45858734 44273383 42826469 41502789 40144578 38924934
5175 38924934 37833470 36743912 35636540 34779951 33854613 33035813 32098873 31214229 30481799
5166 30481799 29612012 28823061 28128877 27384451 26635349 25973116 25413410 24773462 24269029
5157 24269029 23738217 23242645 22686397 22262091 21837966 21427376 21036828 20639614 20315142
5148 20315142 19811661 19497244 19224926 18830824 18571774 18375826 18130567 17818830 17558033
5139 17558033 17267602 17055167 16848423 16620850 16378148 16168583 16001877 15742424 15593744
$$ packed form
5199A24569436q899431p889711p028826o350234n779742n055773m604302m144303
5191G4817114l750994l511012l267376l015900k708310k604758k203178k168291
5183E1587295k028240j855727j844594j585351j446914j323680j358211j219644
5175C8924934j091464j089558j107372q56589r25338q18800r36940q84644p32430
5166C0481799q69787p88951o94184p44426p49102o62233n59706o39948n04433
5157B4269029n30812m95572n56248m24306m24125m10590l90548l97214l24472
5148B0315142n03481l14417k72318l94102k59050j95948k45259l11737k60797
5139A7558033k90431k12435k06744k27573k42702k09565j66706k59453j48680
$$ plain form
5130 15593744 15340080 15105055 14896379 14754441 14499952 14356714 14190819 14015798 13752846
5121 13752846 13676122 13549496 13206835 12994191 12854394 12823723 12593234 12597599 12276298 12039480
5111 12039480 11865755 11719979 11631514 11616812 11438768 11269574 11242831 11168192 11087024 10818900
5101 10818900 10759674 10732563 10581105 10544710 10420337 10402883 10327045 10219041 10097831 10012770
5091 10012770 9987064 9870075 9731318 9596015 9616498 9667216 9593855 9480077 9510559 9368570
5081 9368570 9344396 9285610 9173426 9067481 9154602 9041540 8897864 8919055 8911872 8786877 8829269
5070 8829269 8918477 8794140 8802003 8780564 8688850 8689677 8540899 8660625 8754937 8734404 8763006
5059 8763006 8662320 8636696 8587390 8565896 8546142 8666237 8746132 8814745 8776290 8771955 8786476
$$ packed form
5130A5593744k53664k35025k08676j41938k54489j43238j65895j75021k62952
5121A3752846p6724j26626l42661k12644j39797l0671k30489M365l21301k36818
5111A2039480j73725j45776q8465j4702j78044j69194k6743p4639q1168k68124
5101A0818900n9226k7111j51458l6395j24373j7454p5838j08004j21210q5061
5091A0012770k5706j16989j38757j35303K0483N0718p3361j13778L0482j41989
5081I368570k4174n8786j12184j05945Q7121j13062j43676K1191p183j24995M2392
5070H829269Q9208j24337P863k1439r1714Q27j48778J19726R4312k0533K8602
5059H763006j00686k5624m9306k1494j9754J20095P9895O8613l8455m335J4521
$$ plain form
5048 8786476 8740347 8704425 8799161 8866374 8740526 8750695 8641547 8638148 8628326 8742631 8851642
5037 8851642 8841101 8878427 8847242 8814846 8835796 8877997 8809393 8867643 8868103 8744889 8890477
5026 8890477 8862185 8874647 8895408 8930284 8873921 8900725 8899505 8873121 9000151 8971650 9006156
5015 9006156 9075011 9045463 9123303 9098134 9149520 9153558 9085629 9118007 9120725 9232144 9214830 9221048
5003 9221048 9288193 9285343 9305859 9272783 9165694 9294310 9342313 9399405 9386599 9295549 9323523
4992 9323523 9351232 9435306 9496954 9345751 9337657 9452560 9467363 9427319 9346370 9265079 9217770
4981 9217770 9338446 9365064 9361764 9225889 9176291 9229614 9241785 9265687 9280631 9228488 9212810
4970 9212810 9248459 9108751 9129321 9180735 9199314 9184116 9273482 9313238 9321180 9299914 9365875
$$ packed form
5048H786476m6129l5922R4736O7213j25848J0169j09148l399r822J14305J09011
5037H851642j0541L7326l1185l2396K0950M2201o8604N8250M60j23214J45588
5026H890477k8292J2462K0761L4876n6363K6804j220k6384J27030k8501L4506
5015I006156O8855k9548P7840k5169N1386M038o7929L2378K718J11419j7314O218
5003I221048O7145k850K0516l3076j07089J28616M8003N7092j2806r1050K7974
4992I323523K7709Q4074O1648j51203q094J14903J4803m0044q0949q1291m7309
4981I217770J20676K6618l300j35875m9598N3323J2171K3902J4944n2143j5678
4970I212810L5649j39708K0570N1414J8579j5198Q9366L9756P942k1266O5961
$$ plain form
4959 9365875 9306595 9312945 9349796 9396910 9359025 9128726 9011189 8919552 8906770 8820969 8714795
4948 8714795 8633247 8523245 8487429 8402107 8342295 8257144 8319746 8221553 8204765 8207738 8133277
4937 8133277 8060224 8037987 8074287 7944040 7924604 7816598 7844319 7876683 7870638 7768817 7709055
4926 7709055 7708099 7705551 7850454 7889466 7948807 7979414 7946413 7984075 8012702 7991846 7911666 7901345
4914 7901345 7998228 8052821 8057637 8087865 8124183 8195414 8255435 8336022 8419782 8369207 8397536 8497483
4902 8497483 8462115 8476255 8604803 8651397 8757777 8806093 8932757 8992541 9105248 9318852
4892 9318852 9332477 9426005 9433088 9407151 9538645 9686879 9738530 9751751 9906514 9927554 9882848
4881 9882848 9988585 10056195 9951496 9937185 10047692 10205471 10173040 10228503 10286651 10319667 10378082
$$ packed form
4959I365875n9280O350L6851M7114l7885k30299j17537r1637j2782q5801j06174
4948H714795q1548j10002l5816q5322n9812q5151O2602r8193j6788K973p4461
4937H133277p3053k2237L6300j30247j9436j08006K7721L2364o045j01821n9762
4926G709055r56k548J44903L9012N9341L0607l3001L7662K8627k0856q0180j0321
4914G901345R6883N4593M816L0228L6318P1231O0021Q0587Q3760n0575K8329R9947
4902H497483l5368J4140J28548M6594J06380M8316J26664N9784J12707K13604
4892I318852J3625R3528P083k5937J31494J48234N1651J3221J54763K1040m4706
4881I882848J05737O7610j04699j4311J10507J57779l2431N5463N8148L3016N8415
$$ plain form
4870 10378082 10322088 10304620 10360435 10406879 10477669 10419148 10399847 10374101 10264313 10149412 10095868
4859 10095868 10115280 10072110 10074174 9933187 9941335 9880189 9852680 9820287 9782305 9685783 9576290
4848 9576290 9411886 9461617 9373782 9342281 9305274 9375155 9290774 9125752 9054679 8995692 8859330
4837 8859330 8802444 8758833 8685438 8630986 8541147 8547682 8534137 8497318 8379318 8416688 8479019
4826 8479019 8400107 8383036 8422584 8337287 8287821 8402516 8461734 8478683 8524744 8461302 8445877
4815 8445877 8548641 8558357 8526643 8564284 8583940 8637492 8714631 8712765 8694288 8776815 8909152
4804 8909152 9013407 9038370 9046280 8988371 9102782 9183558 9343740 9454210 9461633 9627468 9738881
4793 9738881 9802622 9895024 9895305 9992916 10114528 10159874 10327698 10556364 10788131 10894707 10896304
$$ packed form
4870A0378082n5994j7468N5815M6444P0790n8521j9301k5746j09788j14901n3544
4859A0095868J9412m3170K064j40987Q148o1146k7509l2393l7982r6522j09493
4848I576290j64404M9731q7835l1501l7007O9881q4381j65022p1073n8987j36362
4837H859330n6886m3611p3395n4452q9839O535j3545l6819j18000L7370O2331
4826H479019p8912j7071L9548q5297m9466J14695N9218J6949M6061o3442j5425
4815H445877J02764R716l1714L7641J9656N3552P7139j866j8477Q2527J32337
4804H909152J04255K4963P910n7909J14411Q0776J60182J10470P423J65835J11413
4793I738881O3741R2402K81R7611J21612M5346J67824K28666K31767J06576J597
$$ plain form
4782 10896304 10996726 11219471 11429601 11469918 11588899 11773513 11934500 12252147 12506187 12689179
4772 12689179 12941336 13199995 13438132 13653891 13946606 14392705 14726551 15019355 15495661
4763 15495661 16013071 16577065 17040725 17617981 18253930 18868117 19574077 20421438 21227239
4754 21227239 22075878 23123385 24085877 25149394 26342137 27619687 29029676 30617591
4746 30617591 32376782 34281272 36231902 38237362 40524119 43074704 45787819 48693302
4738 48693302 51422914 54241330 56851094 59049153 60627492 61302993 61111825 60078465
4730 60078465 58260019 55667430 52873141 49775168 46728424 43660563 40709453 37864503
4722 37864503 35212878 32937591 30816361 28800231 27012650 25357802 23806804 22517004
$$ packed form
4782A0896304J00422K22745K10130M0317J18981J84614J60987L17647K54040J82992
4772A2689179K52157K58659K38137K15759K92715M46099L33846K92804M76306
4763A5495661N17410N63994M63660N77256O35949O14187P05960Q47361Q05801
4754B1227239Q48639J047507R62492J063517J192743J277550J409989J587915
4746C0617591J759191J904490J950630K005460K286757K550585K713115K905483
4738D8693302K729612K818416K609764K198059J578339O75501j91168j033360
4730F0078465j818446k592589k794289l097973l046744l067861k951110k844950
4722C7864503k651625k275287k121230k016130j787581j654848j550998j289800
$$ plain form
4714 22517004 21361998 20250263 19178448 18236138 17377218 16637244 15921456 15145241 14481599
4705 14481599 13841778 13286845 12655305 12291701 11819441 11347467 10982127 10627424 10370428
4696 10370428 10050892 9669773 9426203 9217417 8937191 8746912 8466230 8190269 7947569
4687 7947569 7839782 7591405 7348196 7165137 6967764 6818817 6672155 6540501 6423595 6239301
4677 6239301 6232920 6048309 5853641 5745107 5650262 5579088 5423736 5332622 5217598 5162093 5112216
4666 5112216 5035172 4920378 4857737 4853798 4721657 4655821 4489500 4258451 4184547 4177433 4094858
4655 4094858 4095641 4066727 3915591 3913546 3836966 3798411 3756036 3726171 3701715 3687573 3644469 3515471
4643 3515471 3475772 3448595 3352836 3225280 3259597 3239750 3131642 3015644 3008161 3015245 3006934
$$ packed form
4714B2517004j155006j111735j071815r42310q58920p39974p15788p76215o63642
4705A4481599o39821n54933o31540l63604m72260m71974l65340l54703k56996
4696A0370428l19536l81119k43570k08786k80226j90279k80682k75961k42700
4687G947569j07787k48377k43209j83059j97373j48947j46662j31654j16906j84294
4677F239301o381j84611j94668j08534r4845p1174j55352r1114j15024n5505m9877
4666E112216p7044j14794o2641l939j32141o5836j66321k31049p3904p114q2575
4655D094858P83k8914j51136k045p6580l8555m2375k9865k4456j4142m3104j28998
4643C515471l9699k7177r5759j27556L4317j9847j08108j15998p483P084q311
$$ plain form
4632 3006934 3021004 2971488 2887273 2848456 2797766 2717301 2649814 2527865 2534088 2614532 2613130 2595575
4620 2595575 2540155 2543691 2546130 2483796 2367056 2286935 2315858 2321205 2332439 2366979 2288236 2217370
4608 2217370 2238945 2251819 2240193 2151215 2109999 2058404 2097831 2084276 2046343 2029067 1965408
4597 1965408 2005959 1993762 1932615 1980104 1953592 1868047 1896111 1867810 1940321 1915498 2009709
4586 2009709 1933995 1829058 1865816 1832491 1860868 1830544 1754956 1737869 1776649 1758839 1706531
4575 1706531 1649363 1749643 1806433 1703598 1696888 1722561 1693562 1757060 1676419 1627642 1767859
4564 1767859 1725859 1696073 1689201 1649232 1664648 1738314 1688290 1647303 1681364 1607332 1503256
4553 1503256 1585910 1652241 1670990 1567367 1380644 1287062 1378962 1435059 1460428 1421307 1392711
$$ packed form
4632C006934J4070m9516q4215l8817n0690q0465o7487j21949O223Q0444j402j7555
4620B595575n5420L536K439o2334j16740q0121K8923N347J1234L4540p8743p0866
4608B217370K1575J2874j1626q8978m1216n1595L9427j3555l7933j7276o3659
4597A965408M0551j2197o1147M7489k6512q5545K8064k8301P2511k4823R4211
4586B009709p5714j04937L6758l3325K8377l0324p5588j7087L8780j7810n2308
4575A706531n7168J00280N6790j02835o710K5673k8999O3498q0641m8777J40217
4564A767859m2000k9786o872l9969J5416P3666n0024m0987L4061p4032j04076
4553A503256Q2654O6331J8749j03623j86723r3582R1900N6097K5369l9121k8596
$$ plain form
4542 1392711 1445386 1489499 1375703 1287755 1329776 1344415 1397890 1420159 1489183 1476320 1467684
4531 1467684 1449183 1426929 1307410 1313595 1262081 1264969 1331754 1367164 1272729 1219472 1233613 1278795
4519 1278795 1248943 1301410 1467762 1549818 1497357 1334315 1391160 1394964 1333132 1310132 1271985
4508 1271985 1324217 1405249 1430611 1385027 1423314 1420606 1412600 1396721 1466091 1324167 1296461 1381532
4496 1381532 1461975 1447270 1347662 1398328 1466768 1467516 1518252 1458269 1573475 1606317 1471845
4485 1471845 1460187 1483709 1580200 1573174 1421170 1460644 1514549 1533817 1485328 1448089 1586059
4474 1586059 1661386 1694479 1714463 1678891 1661738 1629001 1644564 1730230 1630149 1593829 1638002
4463 1638002 1747118 1770072 1689560 1752699 1820584 1865054 1842606 1826332 1928800 1963457 2030726
$$ packed form
4542A392711N2675M4113j13796q7948M2021J4639N3475K2269O9024j2863q636
4531A467684j8501k2254j19519O185n1514K888O6785L5410r4435n3257J4141M5182
4519A278795k9852N2467J66352Q2056n2461j63042N6845L804o1832k3000l8147
4508A271985N2232Q1032K5362m5584L8287k708q006j5879O9370j41924k7706Q5071
4496A381532Q0443j4705r9608N0666O8440P48N0736n9983J15206L2842j34472
4485A471845j1658K3522R6491p026j52004L9474N3905J9268m8489l7239J37970
4474A586059P5327L3093J9984l5572j7153l2737J5563Q5666j00081l6320M4173
4463A638002J09116K2954q0512O3139O7885M4470k2448j6274J02468L4657O7269
$$ plain form
4452 2030726 1967201 1985839 1883703 1858740 1977623 2086204 2088254 2015399 2019592 2102919 2148722
4441 2148722 2276879 2268443 2315930 2271041 2344176 2314046 2343390 2377086 2475469 2603876 2553735
4430 2553735 2524723 2587287 2670109 2722967 2763004 2785512 2868773 2895326 2952048 2940668 3042419
4419 3042419 3194978 3285218 3281631 3367352 3464943 3466715 3460935 3564262 3767570 3975087 4000685
4408 4000685 4071829 4214374 4285718 4318161 4508272 4707244 4701022 4771297 4888801 5008521 5213378
4397 5213378 5405806 5618286 5851602 6083181 6359483 6687240 6978470 7291243 7720987 8178277
4387 8178277 8738999 9447119 10152156 10844894 11514056 12361184 13171372 13772894 14333974 15031612
4377 15031612 15883611 16792778 17769402 18626686 19353464 19844513 20226681 20583678 20967948
$$ packed form
4452B030726o3525J8638j02136k4963J18883J08581K050p2855M193Q3327M5803
4441B148722J28157q436M7487m4889P3135l0130K9344L3696R8383J28407n0141
4430B553735k9012O2564Q2822N2858M0037K2508Q3261K6553N6722j1380J01751
4419C042419J52559R0240l587Q5721R7591J772n780J03327K03308K07517K5598
4408D000685P1144J42545P1344L2443J90111J98972o222P0275J17504J19720K04857
4397E213378J92428K12480K33316K31579K76302L27757K91230L12773M29744M57290
4387H178277N60722P08120P05037O92738O69162Q47128Q10188O01522N61080O97638
4377A5031612Q51999R09167R76624Q57284P26778M91049L82168L56997L84270
$$ plain form
4368 20967948 21434887 21956211 22446399 22756994 22778468 22347947 21817761 21285379 20762495 20358271
4358 20358271 20030061 19504245 18859280 18090919 17199986 16141916 15246276 14410962 13634253
4349 13634253 12992624 12302696 11560471 10685850 9986608 9354669 8588108 7882658 7256002
4340 7256002 6782521 6277701 5779857 5470332 5139989 4910307 4652726 4348331 4146693 4065029
4330 4065029 3860027 3761492 3573741 3449994 3362634 3241981 3157702 3115782 2922810 2733772
4320 2733772 2676209 2683873 2591875 2449993 2461520 2418199 2321713 2249385 2218001 2105814 2107573
4309 2107573 2079503 2082951 1961479 1932453 1924177 1817809 1760792 1733465 1694048 1635032 1628673 1598169
4297 1598169 1576003 1519333 1567730 1529976 1507505 1478329 1431420 1404738 1391528 1447678 1478553
$$ packed form
4368B0967948M66939N21324M90188L10595K1474m30521n30186n32382n22884m04224
4358B0358271l28210n25816o44965p68361q90933j058070q95640q35314p76709
4349A3634253o41629o89928p42225q74621o99242o31939p66561p05450o26656
4340G256002m73481n04820m97844l09525l30343k29682k57581l04395k01638q1664
4330D065029k05002r8535j87751j23747q7360j20653q4279m1920j92972j89038
4320B733772n7563P664r1998j41882J1527m3321r6486p2328l1384j12187J759
4309B107573k8070L448j21472k9026q276j06368n7017k7327l9417n9016o359l0504
4297A598169k2166n6670M8397l7754k2471k9176m6909k6682j3210N6150L0875
$$ plain form
4286 1478553 1359208 1331714 1339634 1267649 1336950 1355403 1167331 1109303 1133896 1204305 1170698
4275 1170698 1077184 1036026 1090978 1069841 1128995 1134436 1094700 1048594 988888 1002731 896416
4264 896416 994948 951882 921253 930393 965026 985386 1083441 1001671 841352 801203 813339 885224
4252 885224 830691 752417 777846 804145 741317 617792 673543 735696 860999 733556 696132
4241 696132 687814 721833 670203 748391 767417 595771 526975 681042 717692 753051 718263
4230 718263 702631 669615 598652 662199 652499 615122 506340 560353 678877 708898 627431
4219 627431 571641 586916 588535 476009 496060 518075 513894 533536 549070 513959 512796 525161
4207 525161 382781 355585 547857 453264 312609 468739 555344 514088 487524 372359 414808
$$ packed form
4286A478553j19345k7494P920p1985O9301J8453j88072n8028K4593P0409l3607
4275A170698r3514m1158N4952k1137N9154N441l9736m6106n9706J3843j06315
4264H96416R8532m3066l0629R140L4633K0360R8055q1770j60319m0149J2136P1885
4252H85224n4533p8274K5429K6299o2828j23525N5751O2153J25303j27443l7424
4241F96132q318L4019n1630P8188J9026j71646o8796J54067L6650L5359l4788
4230G18263j5632l3016p0963O3547r700l7377j08782N4013J18524L0021q1467
4219F27431n5790J5275J619j12526K0051K2015m181J9642J5534l5111j163J2365
4207E25161j42380k7196J92272r4593j40655J56130Q6605m1256k6564j15165M2449
$$ plain form
4196 414808 384931 342894 260868 409500 336471 341047 408525 420209 461561 457231 512560 502039
4184 502039 548757 591421 459014 414128 419375 422264 347262 323376 403422 418673 375226 432661
4172 432661 384806 391432 290658 293369 358668 360043 435477 465157 544285 512318 421571 351575
4160 351575 318256 371428 323989 370465 376720 350670 339380 330597 383231 357397 487615 371069
4148 371069 311661 330759 301536 362737 407034 351339 373352 385405 400341 333192 350649 325073
4136 325073 331894 380335 403780 409385 402224 336021 289293 341453 280435 282773 385927 470557
4124 470557 437601 309124 304953 403008 404099 411566 302554 387018 355021 334618 359802 266371
4112 266371 264555 348940 374055 378886 394239 343800 357757 398855 364784 376276 423029 379338
$$ packed form
4196D14808k9877m2037q2026J48632p3029M576O7478J1684M1352m330N5329j0521
4184E02039M6718M2664j32407m4886N247K889p5002k3886Q0046J5251m3447N7435
4172D32661m7855O626j00774K711O5299J375P5434K9680P9128l1967r0747o9996
4160C51575l3319N3172m7439M6476O255k6050j1290q783N2634k5834J30218j16546
4148C71069n9408J9098k9223O1201M4297n5695K2013J2053J4936o7149J7457k5576
4136C25073O821M8441K3445N605p161o6203m6728N2160o1018K338J03154Q4630
4124D70557l2956j28477m171R8055J091P467j09012Q4464l1997k0403K5184r3431
4112B66371j816Q4385K5115M831J5353n0439J3957M1098l4071J1492M6753m3691
$$ plain form
4100 379338 378798 349041 570998 526015 370949 344660 461374 394973 436322 431701 450196 482359
4088 482359 345993 289913 373584 374370 426337 420145 445997 513145 475145 465074 470885 568321
4076 568321 471840 421329 405567 408663 526163 540326 496263 579318 434858 472728 543809
4065 543809 576032 521315 481716 611373 505313 431711 451193 482464 452387 518449 570629
4054 570629 691819 686791 637374 724790 728769 733030 647889 624122 641318 713864 670651 625306
4042 625306 626922 640338 612918 571909 616917 640108 623469 713898 753094 749838 799795 663183
4030 663183 705484 629742 529621 577032 631213 596423 567309 624574 680944 594069 586237 652808
4018 652808 663416 684257 728062 783923 760497 713828 766199 905032 924600 859982 743314
$$ packed form
4100C79338n40k9757K21957m4983j55066k6289J16714o6401M1349m621J8495L2163
4088D82359j36366n6080Q3671P86N1967o192K5852O7148l8000j0071N811R7436
4076E68321r6481n0511j5762L096J17500J4163m4063Q3055j44460L7870P1081
4065E43809L2223n4717l9599J29657j06060p3602J9482L1271l0077O6062N2180
4054E70629J21190n028m9417Q7416L979M261q5141k3767J7196P2546m3213m5345
4042F25306J616J3416k7420m1009M5008K3191j6639R0429L9196l256M9957j36612
4030F63183M2301p5742j00121M7411N4181l4790k9114N7265N6370q6875p832O6571
4018F52808J0608K0841M3805N5861k3426m6669N2371J38833J9568o4618j16668
$$ plain form
4007 743314 788517 942719 960998 847138 983174 1113419 1120599 1141287 1136483 1128161 1171338
3996 1171338 1148447 1223040 1395797 1401581 1437663 1634208 1754932 1964762 2071347 2268170
3986 2268170 2540209 2826605 3304860 3778167 4187103 4576303 4578610 4288443 3886491 3512882
3976 3512882 3181273 2718883 2401467 2171883 2002853 1896338 1900383 1790115 1598280 1454731
3966 1454731 1440859 1378701 1332932 1358433 1249902 1151034 1131588 1303974 1207020 1229683 1175947
3955 1175947 1204729 1244299 1152701 1113549 1123584 1179818 1169687 1158768 1064363 1109515 1172517
3944 1172517 1195847 1267391 1210728 1162820 1311348 1243233 1293351 1276769 1279131 1269494 1149151
3933 1149151 1192054 1135009 1103180 1167516 1191169 1221597 1219636 1114739 1155455 1140706 1148960 1183150
$$ packed form
4007G43314M5203J54202J8279j13860J36036J30245P180K0688m804q322M3177
3996A171338k2891P4593J72757N784L6082J96545J20724K09830J06585J96823
3986B268170K72039K86396M78255M73307M08936L89200K307k90167m01952l73609
3976C512882l31609m62390l17416k29584j69030j06515M045j10268j91835j43549
3966A454731j3872o2158m5769K5501j08531r8868j9446J72386r6954K2663n3736
3955A175947K8782L9570r1598l9152J0035N6234j0131j0919r4405M5152O3002
3944A172517K3330P1544n6663m7908J48528o8115N0118j6582K362r637j20343
3933A149151M2903n7045l1829O4336K3653L0428j961j04897M0716j4749Q254L4190
$$ plain form
3921 1183150 1107744 1081076 1024180 1136710 1099629 1030932 1024630 1060984 1043694 1068981 1026622
3910 1026622 1059900 1110755 1131219 939180 969523 1012985 1027643 1065060 1008423 999662 1082155
3899 1082155 1088285 1022136 1044708 1105985 1292333 1279989 1334123 1245187 1159119 1249388 1285708
3888 1285708 1310171 1379380 1396136 1458687 1495114 1526893 1624378 1680628 1781146 1955354 2027434
3877 2027434 2093445 2048026 2140660 2172455 2106080 2197451 2215150 2153521 2083738 2055944 2118898
3866 2118898 2038314 2043974 1953750 1902124 1886181 1833056 1825151 1629517 1561888 1437427 1420981
3855 1420981 1453849 1431347 1379996 1226523 1193709 1078955 1009761 1044280 916431 860613 885798
3844 885798 895706 921413 913814 878881 804689 826641 904712 792134 789358 820274 719189 783417
$$ packed form
3921A183150p5406k6668n6896J12530l7081o8697o302L6354j7290K5287m2359
3910A026622L3278N0855K0464j92039L0343M3462J4658L7417n6637q761Q2493
3899A082155O130o6149K2572O1277J86348j2344N4134q8936q6068R0269L6320
3888A285708K4463O9209J6756O2551L6427L1779R7485N6250J00518J74208P2080
3877B027434O6011m5419R2634L1795o6375R1371J7699o1629o9783k7794O2954
3866B118898q0584N660r0224n1626j5943n3125p905j95634o7629j24461j6446
3855A420981L2868k2502n1351j53473l2814j14754o9194L4519j27849n5818K5185
3844H85798R908K5707p599l4933p4192K1952P8071j12578k776L0916j01085O4228
$$ plain form
3832 783417 689243 616249 741529 899046 853314 675532 687973 648929 630814 745594 740641
3821 740641 758118 552091 537931 531004 437838 518302 480484 595234 534907 513807 548984
3810 548984 632033 526228 413970 451784 474499 474178 537725 548394 468970 412192 451608 436926
3798 436926 410812 400756 458709 456313 478077 485418 432966 471233 424909 332679 372554 372629 288817
3785 288817 396638 473489 409011 390678 462963 401518 509425 515750 432959 423155 504384 406196
3773 406196 322864 439473 345765 351606 403692 384559 341833 446986 431842 406177 411383 406439
3761 406439 333741 330970 337049 381365 343673 294658 358213 389642 452981 415528 340485 313671
3749 313671 360626 359754 324448 311703 335444 291400 334551 483186 527696 357728 395498 463690
$$ packed form
3832G83417r4174p2994J25280J57517m5732j77782J2441l9044j8115J14780m953
3821G40641J7477k06027j4160o927r3166Q0464l7818J14750o0327k1100L5177
3810E48984Q3049j05805j12258L7814K2715l21O3547J0669p9424n6778L9416j4682
3798D36926k6114j0056N7953k396K1764P341n2452L8267m6324r2230L9875P5q3812
3785B88817J07821P6851o4478j8333P2285o1445J07907O325q2791r804Q1229r8188
3773D06196q3332J16609r3708N841N2086j9133m2726J05153j5144k5665N206m944
3761D06439p2698k771O079M4316l7692m9015O3555L1429O3339l7453p5043k6814
3749C13671M6955q72l5306j2745K3741m4044M3151J48635M4510j69968L7770O8192
$$ plain form
3737 463690 460106 350937 267206 272711 269579 283487 270533 286134 352524 408713 406372 452280
3725 452280 349786 291324 373033 380791 394083 422776 420560 332411 465448 395921 296829 234009
3713 234009 251582 332059 312777 322863 337134 248737 254680 326417 487949 322646 256348
3702 256348 238407 233478 257025 251844 269625 237525 291178 199319 214374 249826 268203 209763
3690 209763 246006 244757 295612 252415 248000 246409 280850 315745 276380 146605 147274 218534
3678 218534 266264 271194 200738 154074 186164 207609 250101 202117 201477 176578 121824 192304
3666 192304 241292 279376 232335 243406 262848 206882 191934 169086 205845 244407 230548 231876
3654 231876 241356 289489 223133 192311 204118 206124 199369 211115 234470 256559 174810 153331
$$ packed form
3737D63690l584j09169q3731N505l132J3908j2954J5601O6390N6189k341M5908
3725D52280j02494n8462Q1709P758J3292K8693k216q8149J33037o9527r9092o2820
3713B34009J7573Q0477j9282J0086J4271q8397N943P1737J61532j65303o6298
3702B56348j7941m929K3547n181J7781l2100N3653r1859J5055L5452J8377n8440
3690B09763L6243j249N0855m3197m415j591L4441L4895l9365j29775O69P1260
3678B18534M7730M930p0456m6664L2090K1445M2492m7984o40k4899n4754P0480
3666A92304M8988L8084m7041J1071J9442n5966j4948k2848L6759L8562j3859J328
3654B31876R480M8133o6356l0822J1807K006o755J1746K3355K2089q1749k1479
$$ plain form
3642 153331 183061 103204 139513 119592 124182 128625 102726 138690 178922 186446 188668 224716
3630 224716 270557 325740 355096 335216 327331 241770 261542 322130 345882 363228 424626 459714
3618 459714 440730 378198 346508 266222 252351 359582 494918 484857 404816 468338 415965
3607 415965 426426 453591 460775 462919 477596 569747 496761 361666 416595 477903 480524 467232
3595 467232 538220 587355 574206 606275 655431 678709 663126 680789 767191 799546 830011 898918
3583 898918 904669 909067 1021701 1048820 1081761 1122989 1217971 1337773 1236926 1369151 1459523
3572 1459523 1453076 1488541 1523470 1512691 1606867 1668787 1765512 1844453 1884886 1973799 1975934 2015950
3560 2015950 2095280 2140158 2149065 2144456 2109622 2066947 2004949 1975383 1814630 1775328 1833034 1891198
$$ packed form
3642A53331K9730p9857L6309j9921M590M443k5899L5964M0232P524K222L6048
3630B24716M5841N5183K9356j9880p885q5561J9772O0588K3752J7346O1398L5088
3618D59714j8984o2532l1690q0286j3871J07231J35336j0061q0041O3522n2373
3607D15965J0461K7165P184K144J4677R2151p2986j35095N4929O1308K621j3292
3595D67232P0988M9135j3149L2069M9156K3278j5583J7663Q6402L2355L0465O8907
3583H98918N751M398J12634K7119L2941M1228R4982J19802j00847J32225R0372
3572A459523o447L5465L4929j0779R4176O1920R6725P8941M0433Q8913K135M0016
3560B015950P9330M4878Q907m609l4834m2675o1998k9566j60753l9302N7706N8164
$$ plain form
3548 1891198 1779721 1668342 1695486 1718514 1647685 1473140 1374565 1311758 1313296 1276182 1139900
3537 1139900 1183965 1067440 1120890 1058290 847234 881818 917541 804224 862706 879936 800479
3526 800479 724501 656547 730716 764343 751738 587626 545282 584804 548782 596042 601952 617489
3514 617489 576832 625931 537365 405443 454684 495916 551893 581330 572244 523608 475265 527785
3502 527785 526312 449852 500792 497393 453688 502389 507978 564959 524453 410275 356144 315563
3490 315563 373015 434176 432847 473850 348852 286995 407006 346713 325550 242617 179501
3479 179501 146062 212013 247844 183768 288772 266433 209799 169814 199917 328043 245707
3468 245707 293217 332809 360707 449729 277295 91722 98958 235667 371194 240480 205426
$$ packed form
3548A891198j11477j11379K7144K3028p0829j74545r8575o2807J538l7114j36282
3537A139900M4065j16525N3450o2600k11056L4584L5723j13317N8482J7230p9457
3526H00479p5978o7954P4169L3627j2605j64112m2344L9522l6022M7260N910J5537
3514F17489m0657M9099q8566j31922M9241M1232N5977K9437r086m8636m8343N2520
3502E27785j473p6460N0940l399m3705M8701N589N6981m0506j14178n4131m0581
3490C15563N7452O1161j329M1003j24998o1857J20011o0293k1163q2933o3116
3479A79501l3439O5951L5831o4076J05004k2339n6634l9985L0103J28126q2336
3468B45707M7510L9592K7898Q9022j72434j85573P236J36709J35527j30714l5054
$$ plain form
3457 205426 185486 174618 226294 244222 139775 174880 90613 64185 106698 213952 186468
3446 186468 295506 290556 232736 191143 227391 231892 101233 140447 171841 153300 123818 169376
3434 169376 381257 389780 324394 330902 310121 197863 105896 115937 125510 287406 199202 162865
3422 162865 152707 150675 156664 148632 126535 220029 242568 233337 177467 166612 162390 131285 76827
3409 76827 96873 37058 78528 128 12886 42996 -15726 61257 79819 86172 152746 233749
3397 233749 171091 103795 116463 86824 122734 170689 50108 105369 144257 162268 208298
3386 208298 72726 75501 11909 39430 152693 70086 85013 -25756 12447 68833 86613
3375 86613 44958 44396 12338 25152 -7295 -28539 94065 16062 -45659 15397 90444 65941
$$ packed form
3457B05426j9940j0868N1676J7928j04447L5105q4267k6428M2513J07254k7484
3446A86468J09038m950n7820m1593L6248M501j30659L9214L1394j8541k9482M5558
3434A69376K11881Q523o5386O508k0781j12258r1967J0041R573J61896q8204l6337
3422A62865j0158k032N989q032k2097R3494K2539r231n5870j0855m222l1105n4458
3409G6827K0046n9815M1470p8400J2758L0110n8722P6983J8562O353O6574Q1003
3397B33749o2658o7296J2668k9639L5910M7955j20581N5261L8888J8011M6030
3386B08298j35572K775o3592K7521J13263q2607J4927j10769L8203N6386J7780
3375H6613m1655n62l2058J2814l2447k1244J22604p8003o1721O1056P5047k4503
$$ plain form
3363 65941 -10975 48368 177835 175739 178742 112305 144718 58333 120840 152994 122726 173249
3351 173249 193559 36915 133019 216964 215536 136055 13356 42092 178568 139726 98433
3340 98433 77905 88106 114261 -12253 -36264 8203 49717 59872 177943 164951 81492
3329 81492 -56311 10346 77779 67683 -12773 27171 -25588 37636 118608 140091 135142 97522
3317 97522 108904 -13991 -14820 53144 67917 82828 120867 77033 -46657 -5098 31447 69649
3305 69649 87926 74916 111545 236106 284916 170494 36183 36373 28541 85464 161321 58073
3293 58073 16274 -5976 89654 112201 66193 -45851 27721 116016 140127 130043 159333 128370
3281 128370 174023 209196 76776 84513 201192 245749 151611 132982 112051 147169 56863
$$ packed form
3363F5941p6916N9343J29467k096L003o6437L2413q6385O2507L2154l0268N0523
3351A73249K0310j56644R6104Q3945j428p9481j22699K8736J36476l8842m1293
3340I8433k0528J0201K6155j26514k4011M4467M1514J0155J18071j2992q3459
3329H1492j37803O6657O7433j0096q0456L9944n2759O3224Q0972K1483m949l7620
3317I7522J1382j22895q29O7964J4773J4911L8039m3834j23690M1559L6545L8202
3305F9649J8277j3010L6629J24561M8810j14422j34311J90p832N6923P5857j03248
3293E8073m1799k2250R5630K2547m6008j12044P3572Q8295K4111j0084K9290l0963
3281A28370M5653L5173j32420P737J16679M4557r4138j8629k0931L5118r0306
$$ plain form
3270 56863 108046 143188 227084 189908 69245 124523 140562 190417 141563 169677 190039 144296
3258 144296 135379 144189 129842 65600 117232 100216 135817 51519 109562 160380 98318 167537
3246 167537 131416 85576 131017 165061 194454 244189 165345 218311 256113 172976 154593 32312
3234 32312 90052 76474 -1729 86859 141982 129558 148058 81029 -7755 38597 45401 88942
3222 88942 157801 107275 136656 250598 264678 151005 166166 259598 280101 228722 228787 200710
3210 200710 164952 162546 179368 135218 87500 161499 175984 110585 192788 187194 161443 133377
3198 133377 100500 170580 246510 286050 239143 176303 138456 162939 170580 140993 76638 96055
3186 96055 144290 163714 1198 150717 203754 195194 120707 123267 133590 158230 122506 272366
$$ packed form
3270E6863N1183L5142Q3896l7176j20663N5278J6039M9855m8854K8114K0362m5743
3258A44296q917Q810j4347o4242N1632j7016L5601q4298N8043N0818o2062O9219
3246A67537l6121m5840M5441L4044K9393M9735p8844N2966L7802q3137j8383j22281
3234C2312N7740j3578p8203Q8588N5123j2424J8500o7029q8784M6352O804M3541
3222H8942O8859n0526K9381J13942J4080j13673J5161R3432K0503n1379O5k8077
3210B00710l5758k406J6822m4150m7718P3999J4485o5399Q2203n594k5751k8066
3198A33377l2877P0080P5930L9540m6907o2840l7847K4483P641k9587o4355J9417
3186I6055M8235J9424j62516J49519N3037q560p4487K560J0323K4640l5724J49860
$$ plain form
3174 272366 191387 49310 82036 198310 204735 33827 98318 98425 64054 130741 95640 107123
3162 107123 116372 131692 130993 119845 84831 96478 83632 130340 130596 129422 95962 45709 27435
3149 27435 61635 158048 114327 90199 48946 68288 -12456 -57620 62251 109144 133668 213649
3137 213649 235881 259399 213447 163461 163217 185846 277106 274797 118537 140164 207526 266392
3125 266392 361964 318308 249547 262644 270423 278814 247070 212142 223736 132467 80969 196197
3113 196197 204142 228108 125173 65612 95571 139954 40190 18810 238660 124900 5073
3102 5073 11509 80235 80761 54355 72930 -62725 -60101 -50482 925 -186 27190 83688 98426
3089 98426 16015 15249 6310 -39463 -69718 -4073 -9785 46380 9274 67838 16273 90858 130544
$$ packed form
3174B72366q0979j42077L2726J16274O425j70908O4491J07l4371O6687l5101J1483
3162A07123R249J5320o99j1148l5014J1647j2846M6708K56j174l3460n0253j8274
3149B7435L4200R6413m3721k4128m1253J9342q0744m5164J19871M6893K4524P9981
3137B13649K2232K3518m5952m9986k44K2629R1260k309j56260K1627O7362N8866
3125B66392R5572m3656o8761J3097P779Q391l1744l4928J1594r1269n1498J15228
3113A96197P945K3966j02935n9561K9959M4383r9764k1380K19850j13760j19827
3102E073O436O8726N26k6406J8575j35655K624R619N1407j111K7376N6498J4738
3089I8426q2411p66q939m5773l0255O5645n712N6165l7106N8564n1565P4585L9686
$$ plain form
3076 130544 147170 97699 67936 60950 69698 -22872 -57556 -101424 -18285 -18180 17867 55169
3064 55169 -50810 -147579 -137994 -21389 -11595 -136064 -68894 -9849 -50208 -13201 -78852 -44016
3052 -44016 -11400 -11260 -117384 -27830 -117290 -83134 -73715 133631 45829 1772 16979 22170
3040 22170 -18354 72014 94486 96803 120121 -9802 27262 8685 10857 29388 -124816 -55642
3028 -55642 17243 25582 37134 14025 -29713 -28984 -54417 -86856 -44709 -46237 -96640 -53893 -101752
3015 -101752 -75974 17807 47721 41228 33447 46370 42943 122391 132311 95555 31409 68088
3003 68088 46738 133929 177597 113040 65636 -29297 -44663 -29516 46197 74016 58958 -97432
2991 -97432 -102818 33728 108734 131055 -29692 -29445 27207 9831 -28036 -41547 -66196 -96250
$$ packed form
3076A30544J6626m9471k9763o986Q748r2570l4684m3868Q3139J05L6047L7302
3064E5169j05979r6769R585J16605R794j24469O7170N9045m0359L7007o5651L4836
3052d4016L2616J40j06124Q9554q9460L4156R419K07346q7802m4057J5207N191
3040B2170m0524R0368K2472K317K3318j29923L7064j8577K172J8531j54204O9174
3028e5642P2885Q339J1552k3109m3738P29k5433l2439M2147j528n0403M2747m7859
3015a01752K5778R3781K9914o493p781J2923l427P9448R920l6756o4146L6679
3003F8088k1350Q7191M3668o4557m7404r4933j5366J5147P5713K7819j5058j56390
2991i7432n386J36546P5006K2321j60747K47N6652j7376l7867j3511k4649l0054
$$ plain form
2979 -96250 -26664 1806 -46585 -13651 40552 28008 35031 42481 35604 -11813 29750 70153
2967 70153 35449 -24402 -34908 -64490 -71728 778 81631 103733 -33803 -95188 -46693 -29228
2955 -29228 -64446 24274 -41129 -71994 -63007 -13111 16738 6540 -8375 -57295 -24244 4679
2943 4679 -44757 11248 20424 -51666 -76739 -87659 -29660 -53001 -134206 -110457 -53864 -72166
2931 -72166 -13288 31742 23794 -112209 -34879 -12174 -77176 -45586 -93316 -143022 -203091 -29266
2919 -29266 22609 55404 46311 55069 44179 -13970 -2517 6726 46878 1238 103019 43246
2907 43246 40604 81673 55322 148001 65720 -41290 79190 26583 -100725 -118303 -28600
2896 -28600 -47639 -153696 -57827 46256 -34650 2762 40469 42577 69476 -22509 -9188 -11681
$$ packed form
2979i6250O9586K8470m8391L2934N4203j2544P023P450o877m7417M1563M0403
2967G0153l4704n9851j0506k9582p238P2506Q0853K2102j37536o1385M8495J7465
2955b9228l5218Q8720o5403l0865Q987M9896K9849j0198j4915m8920L3051K8923
2943D679m9436N6005R176p2090k5073j0920N7999k3341q1205K3749N6593j8302
2931g2166N8878M5030p948j36003P7330K2705o5002L1590m7730m9706o0069J73825
2919b9266N1875L2795r093Q758j0890n8149J1453R243M0152m5640J01781n9773
2907D3246k642M1069k6351R2679q2281j07010J20480n2607j27308j7578Q9703
2896b8600j9039j06057R5869J04083q0906L7412L7707K108K6899r1985J3321k493
$$ plain form
2884 -11681 39651 57733 55234 -45 -58818 16454 53717 58464 63936 47314 75700 -3252
2872 -3252 -14584 -26287 19997 52023 146024 148388 175684 79074 46012 107670 82384 118557
2860 118557 149665 183364 129793 42438 54444 -6983 -61488 42963 139894 70673 -25119
2849 -25119 29841 -7251 48379 47678 76619 122130 100169 164960 100750 80140 133707 28901
2837 28901 -49576 23003 36002 85308 79271 41300 -5948 50376 34036 6287 -17624 75603
2825 75603 235254 150259 -17935 -92753 -25772 67426 157875 99226 100931 31745 -40903 -46906
2813 -46906 -12784 -69819 -113101 -101789 -55808 -52443 -111403 -38208 38245 22036 15473 283
2801 283 77948 82634 48308 -38520 -67108 -48116 -60103 -41983 21913 45219 12239 -31844
$$ packed form
2884a1681N1332J8082k499n5279n8773P5272L7263M747N472j6622K8386p8952
2872c252j1332j1703M6284L2026R4001K364K7296r6610l3062O1658k5286L6173
2860A18557L1108L3699n3571q7355J2006o1427n4505J04451R6931o9221r5792
2849b5119N4960l7092N5630p01K8941M5511k1961O4791o4210k0610N3567j04806
2837B8901p8477P2579J2999M9306o037l7971m7248N6324j6340k7749k3911R3227
2825G5603J59651q4995j68194p4818O6981R3198R0449n8649J705o9186p2648o003
2813d6906L4122n7035m3282J1312M5981L365n8960P3195P6453j6209o563j5190
2801B83P7665M686l4326q6828k8588J8992j1987J8120O3896K3306l2980m4083
$$ plain form
2789 -31844 6582 24182 -45066 7981 26119 116 34435 54078 22134 -20678 -77223 -121496
2777 -121496 -59292 -104051 -65303 -105755 -99650 -16100 22750 -14080 -37237 -84890 -98711 -51524
2765 -51524 -56399 -81187 2103 33192 39755 -51493 -48865 134988 87658 57717 -7811 -53448
2753 -53448 -138560 -101271 -91129 -112545 -132788 -47579 -157715 -105542 -46560 -43998 40680 38900
2741 38900 3302 -53941 -50909 -42206 -18865 -3691 -40251 -119558 -68277 -12891 -14444 -14652 -21060
2728 -21060 -66558 5223 -23129 23591 32145 30782 -55627 -171967 -103142 -50434 -107208 -33574
2716 -33574 -14439 -88892 -47395 -122790 -174640 -173555 -70016 -13102 -79501 10720 47126 75704
2704 75704 -23376 -124994 -68190 -58436 -29393 22897 27294 30384 -55494 -89612 -10202 13293
$$ packed form
2789c1844L8426J7600o9248N3047J8138k6003L4319J9643l1944m2812n6545m4273
2777a21496O2204m4759L8748m0452O105Q3550L8850l6830k3157m7653j3821M7187
2765e1524m875k4788Q3290L1089O563r1248K628J83853m7330k9941o5528m5637
2753e3448q5112L7289J0142k1416k0243Q5209j10136N2173N8982K562Q4678j780
2741C8900l5598n7243L032Q703K3341J5174l6560p9307N1281N5386j553k08o408
2728b1060m5498P1781k8352M6720Q554j363q6409j16340O8825N2708n6774P3634
2716c3574J9135p4453M1497p5395n1850J085J03539N6914o6399R0221L6406K8578
2704G5704r9080j01618N6804R754K9043N2290M397L090q5878l4118P9410K3495
$$ plain form
2692 13293 47503 52024 36417 29270 -7785 -27446 -7159 -49652 7516 -94736 -19018 -18819
2680 -18819 -1388 -35569 -61254 -145043 -92035 -88969 -9600 42513 -31291 -112697 -107242 -53636
2668 -53636 100782 101322 -46125 73646 28515 69715 -11117 -9995 -99250 -55409 -130126 -169735
2656 -169735 -104376 -1014 -17700 -66183 -108337 -147872 -85957 -114383 -97331 -96484 -131784 -125215
2644 -125215 -102286 -156041 -136467 -104692 -14787 -36279 -80171 -20277 -14123 45950 43557 -59686
2632 -59686 -27302 -83328 -102642 -92310 -176031 -75455 -79479 -62580 -59378 -85772 -72952 -45035
2620 -45035 -17505 -34445 -63947 -14343 -15724 -63044 -26319 -120098 -84211 -37977 32602 -62450
2608 -62450 -97409 -53075 4876 12040 33779 59689 -35718 26400 -38255 -56286 129133 24924
$$ packed form
2692A3293L4210M521j5607p147l7055j9661K0287m2493N7168j02252P5718J99
2680a8819J7431l4181k5685q3789N3008L066P9369N2113p3804q1406N455N3606
2668e3636J54418N40j47447J19771m5131M1200q0832J122q9255M3841p4717l9609
2656a69735O5359J03362j6686m8483m2154l9535O1915k8426J7052Q47l5300O569
2644a25215K2929n3755J9574L1775Q9905k1492m3892N9894O154O0073k393j03243
2632e9686L2384n6026j9314J0332q3721J00576m024J6899L202k6394J2820K7917
2620d5035K7530j6940k9502M9604j381m7320L6725r3779L5887M6234P0579r5052
2608f2450l4959M4334N7951P164K1739K5910r5407O2118o4655j8031J85419j04209
$$ plain form
2596 24924 -54556 -138238 -85614 -126933 -159119 -159957 -163098 -80484 -104601 -125220 -123436 -76294 6637
2583 6637 -37080 -92527 -56221 -48285 -53808 -128524 -136344 -128474 -89931 -62370 -120709 -203696 -143857
2570 -143857 -41392 -27969 -128156 -30165 69395 52086 -4707 -55064 -132083 -105783 -124907
2559 -124907 -145401 -108728 -99102 -34162 -38157 -194411 -109002 -100526 -124487 -116640 -121387 -37312
2547 -37312 -60970 -44971 -86065 -47346 61121 26677 2321 -47003 51648 -11264 -8986 -32449
2535 -32449 8236 -16852 30134 12290 -86382 -40852 20575 60625 -52751 -71128 -159171 -39933
2523 -39933 121782 60686 -67275 1578 2056 -44633 -78660 -104453 -112325 -86405 -89382 -101479
2511 -101479 -113991 -136516 -174461 -130429 -112476 -99013 -135343 -154081 -170577 -187029 -33588
$$ packed form
2596B4924p9480q3682N2624m1319l2186q38l141Q2614k4117k0619J784M7142Q2931
2583F637m3717n5447L6306P936n523p4716p820P870L8543K7561n8339q2987N9839
2570a43857J02465J3423j00187R7991R9560j7309n6793n0357p7019K6300j9124
2559a24907k0494L6673R626O4940l995j56254Q5409Q476k3961P847m747Q4075
2547c7312k3658J5999m1094L8719J08467l4444k4356m9324R8651o2912K278k3463
2535c2449M0685k5088M6986j7844r8672M5530O1427M0050j13376j8377q8043J19238
2523c9933J61715o1096j27961O8853M78m6689l4027k5793p872K5920k977j2097
2511a01479j2512k2525l7945M4032J7953J3463l6330j8738j6496j6452J53441
$$ plain form
2500 -33588 -22746 8075 -75588 -74052 -74089 -42405 -5251 -43674 -84826 -61507 -22500 -375 26238
2487 26238 -13236 23838 24560 -43123 -49106 -18404 -4643 4449 -4443 -2956 58721 -64707 -62068
2474 -62068 -12279 4569 -101269 -150974 -68896 -120833 -55976 -87243 -33983 -67889 26800 -35582
2462 -35582 -26123 -111286 -149469 -86211 -6418 4555 -16897 25172 -108064 -69540 -91940 -58146
2450 -58146 20532 62130 14943 -59953 -84672 -105148 -93571 -32510 760 -42843 -32890 -35427
2438 -35427 -34054 -114561 -103419 -19560 -58216 -77030 80456 51242 -9801 -88626 -46249 -41657
2426 -41657 -57826 -66857 -38669 -26814 -9375 -53532 -162468 -197459 -128421 -32380 64230 96056
2414 96056 45660 38806 60359 31327 -39913 -89781 1609 7523 -121890 -127425 -129055 -136619 -14649
$$ packed form
2500c3588J0842L0821q3663J536l7L1684L7154l8423m1152K3319L9007K2125K6613
2487B6238l9474L7074P22o7683n983L0702J3761R092q892J487O1677j23428K639
2474f2068M9789J6848j05838m9705Q2078n1937O4857l1267N3260l3906R4689o2382
2462c5582R459q5163l8183O3258P9793J0973k1452M2069j33236L8524k2400L3794
2450e8146P8678M1598m7187p4896k4719k0476J1577O1061L3270m3603R953k537
2438c5427J373q0507J1142Q3859l8656j8814J57486k9214o1043p8825M2377M592
2426d1657j6169r031K8188J1855J7439m4157j08936l4991O9038R6041R6610L1826
2414I6056n0396o854K1553k9032p1240m9868R1390N914j29413n535j630p564J21970
$$ plain form
2401 -14649 100967 -40162 -65056 30400 23331 -11629 9912 -24164 -3033 28359 61747 56544
2389 56544 -9724 46240 7517 -31902 39850 -22591 -79174 -53264 14121 -28229 10452 -14633
2377 -14633 69664 7856 -130495 -57085 -23076 -93666 -109203 -87283 -120537 -100452 -122349 -210098
2365 -210098 -133918 -108085 -84767 37014 112522 61531 87777 69707 23852 -26299 23910
2354 23910 -47462 61641 58991 89646 53260 -78553 -35955 -82333 -34401 -44918 -23898 -26639
2342 -26639 -34024 -21362 6874 -87410 -81816 -25741 -32880 38894 11636 -40651 -24137 -68124
2330 -68124 17596 43344 9209 -30802 -69504 1651 32856 -89437 14583 -6248 -57125
2319 -57125 3963 -36796 31590 -49382 -6888 18448 -2287 65390 90535 209073 142781 -46361
$$ packed form
2401a4649J15616j41129k4894R5456p069l4960K1541l4076K1131L1392L3388n203
2389E6544o6268N5964l8723l9419P1752o2441n6583K5910O7385m2350L8681k5085
2377a4633Q4297o1808j38351P3410L4009p0590j5537K1920l3254K0085k1897q7749
2365b10098P6180K5833K3318J21781P5508n0991K6246j8070m5855n0151N0209
2354B3910p1372J09103k650L0655l6386j31813M2598m6378M7932j0517K1020k741
2342b6639p385J2662K8236r4284N594N6075p139P1774k7258n2287J6514m3987
2330f8124Q5720K5748l4135m0011l8702P1155L1205j22293J04020k0831n0877
2319e7125O1088m0759O8386q0972M2494K5336k0735O7677K5145J18538o6292j89142
$$ plain form
2307 -46361 -166947 -65035 125141 97610 -25481 -4887 82301 171125 141850 56565 15285
2296 15285 11650 86458 12849 -5942 -48387 -93274 -2592 1458 -74830 -66844 -78079 34269
2284 34269 50736 29717 93441 -15645 -28002 27562 114395 72399 22367 28494 13809 -109652
2272 -109652 -78410 51082 14357 49295 44540 54091 21584 57205 148739 114970 -32581 -98853
2260 -98853 -54006 -64295 7361 41540 70470 13100 69028 7072 -8943 93361 37007 -53738
2248 -53738 7885 42422 92194 93555 74464 160290 46121 -28823 -10116 3155 721 25212
2236 25212 32702 22153 42085 54216 5683 4572 20826 23333 165445 101778 13194 33282
2224 33282 57740 85086 45024 88251 88026 79241 123714 23785 11213 -37381 80887 85228
$$ packed form
2307d6361j20586J01912J90176k7531j23091K0594Q7188Q8824k9275q5285m1280
2296A5285l635P4808p3609j8791m2445m4887R0682M050p6288P986j1235J12348
2284C4269J6467k1019O3724j09086j2357N5564Q6833m1996n0032O127j4685j23461
2272a09652L1242J29492l6725L4938m755R551l2507L5621R1534l3769j47551o6272
2260i8853M4847j0289P1656L4179K8930n7370N5928o1956j6015J02304n6354r0745
2248e3738O1623L4537M9772J361j9091Q5826j14169p4944J8707J3271k434K4491
2236B5212P490j0549J9932J2131m8533j111J6254K507J42112o3667q8584K0088
2224C3282K4458K7346m0062M3227k25q785M4473r9929j2572m8594J18268M341
$$ plain form
2212 85228 -18018 62021 14695 -29555 -26423 53231 60149 33254 -65262 53023 54473 53608
2200 53608 103611 53728 72218 40958 95712 163463 170833 210201 110896 118824 54782 -4643
2188 -4643 -20282 96664 117263 64167 88058 49336 101425 103063 96037 59293 8417 95622
2176 95622 173088 142065 82267 72151 86121 76943 107210 190358 201678 131345 161427 185053
2164 185053 217788 253779 234902 245901 151807 148190 143976 169441 210691 165724 235290 178277
2152 178277 175328 167981 204865 164669 209514 297652 425879 357429 296378 323841 219171 208585
2140 208585 397151 318179 373679 298349 350211 374712 309417 348047 361089 382307 370804
2129 370804 410537 332566 347457 485053 513332 477719 450951 429319 476821 459613 514723
$$ packed form
2212H5228j03246Q0039m7326m4250L132P9654O918k6895r8516J18285J450q65
2200E3608N0003m9883J8490l1260N4754O7751P370L9368r9305P928o4042n9425
2188d643j5639J16946K0599n3096K3891l8722N2089J638p026l6744n0876Q7205
2176I5622P7466l1023n9798j0116J3970r178L0267Q3148J1320p0333L0082K3626
2164A85053L2735L5991j8877J0999r4094l617m214K5465M1250m4967O9566n7013
2152A78277k949p347L6884m0196M4845Q8138J28227o8450o1051K7463j04670j0586
2140B08585J88566p8972N5500p5330N1862K4501o5295L8630J3042K1218j1503
2129C70804L9733p7971J4891J37596K8279l5613k6768k1632M7502j7208N5110
$$ plain form
2118 514723 464524 524831 562068 577397 642552 664348 696157 738007 759611 917718 888048
2107 888048 949348 1067782 1143570 1166200 1220568 1306859 1396503 1387671 1448688 1580801 1719354
2096 1719354 1818493 1873522 2042480 2261811 2573000 2902282 3211797 3736432 4310038 4935739
2086 4935739 5454922 5825028 5759253 5313792 4729984 4160452 3676324 3282020 2875503 2467422
2076 2467422 2175497 1852988 1587081 1501541 1386996 1302823 1228651 1078296 1089095 905813
2066 905813 787574 782324 750891 628172 628912 652926 626761 553489 522335 555639 547014 455381
2054 455381 389970 372185 334324 352680 353207 402813 449217 402046 307690 364538 276148 262381
2042 262381 280460 303285 363227 219594 178885 309945 325600 97699 77557 234403 176692
$$ packed form
2118E14723n0199O0307L7237J5329O5155K1796L1809M1850K1604J58107k9670
2107H88048O1300J18434P5788K2630N4368Q6291Q9644q832O1017J32113J38553
2096A719354R9139N5029J68958K19331L11189L29282L09515N24635N73606O25701
2086D935739N19183L70106o5775m45461n83808n69532m84128l94304m06517m08081
2076B467422k91925l22509k65907q5540j14545q4173p4172j50355J0799j83282
2066I05813j18239n250l1433j22719P40K4014k6165p3272l1154L3304q625r1633
2054D55381o5411j7785l7861J8356N27M9606M6404m7171r4356N6848q8390j3767
2042B62381J8079K2825N9942j43633m0709J31060J5655k27901k0142J56846n7711
$$ plain form
2031 176692 110260 113711 162023 180737 164371 189586 154163 155613 166175 172363 166752 195538
2019 195538 191248 209859 70820 -38008 66649 217928 172863 94046 179681 277264 193671
2008 193671 53061 20852 -9286 -2856 15422 18233 145745 144692 250076 177752 20124
1997 20124 29783 44614 49367 90568 167335 167378 154113 67403 63594 180545 171929 55541 -10875
1984 -10875 -35347 117850 83110 48122 -26034 -106664 24770 51119 91545 78665 40482
1973 40482 -23733 50315 191570 131259 91273 56222 138825 51764 85618 114325 68214 130922
$$ packed form
2031A76692o6432L451M8312J8714j6366K5215l5423J450J0562O188n611K8786
2019A95538m290J8611j39039j08828J04657J51279m5065p8817Q5635R7583q3593
2008A93671j40610l2209l0138O430J8278K811J27512j053J05384p2324j57628
1997B0124R659J4831M753M1201P6767M3j3265q6710l809J16951q616j16388o6416
1984a0875k4472J53197l4740l4988p4156q0630J31434K6349M0426j2880l8183
1973D0482o4215P4048J41255o0311l9986l5051Q2603q7061L3854K8707m6111O2708
$$ [...]
##END NTUPLES=NMR SPECTRUM
##END=
