##TITLE=1H_CA-9170x-1
 DMSO
 8 sc, 
 7.7.2023
##JCAMPDX= 6.0         $$ Bruker NMR JCAMP-DX V2.0
##DATA TYPE= NMR SPECTRUM
##DATA CLASS= NTUPLES
##ORIGIN= UXNMR, Bruker Analytische Messtechnik GmbH
##OWNER= root
$$ XWIN-NMR		Version 3.5
$$ Fri Jul  7 14:10:12 2023 Russian Standard Time (UT+4h)  she@DPX200
##.OBSERVE FREQUENCY= 200.13135
##.OBSERVE NUCLEUS= ^1H
##.ACQUISITION MODE= SIMULTANEOUS
##.ACQUISITION SCHEME= undefined
##.AVERAGES= 8
##.DIGITISER RES= 18
##SPECTROMETER/DATA SYSTEM= spect
##.PULSE SEQUENCE= zg30
##.SOLVENT NAME= DMSO
##.SHIFT REFERENCE= (INTERNAL, DMSO, 0, 15.7568)
##AUDIT TRAIL= $$ (NUMBER, WHEN, WHO, WHERE, WHAT)
$$ ##TITLE= Audit trail, XWIN-NMR		Version 3.5
$$ ##JCAMPDX= 5.01
$$ ##ORIGIN= Bruker BioSpin GmbH
$$ ##OWNER= she
$$ F:/spectra/data/she/nmr/H-F/1/pdata/1/auditp.txt
$$ ##AUDIT TRAIL=  $$ (NUMBER, WHEN, WHO, WHERE, WHAT)
(   1,<2023-07-07 14:09:03.21 +0400>,<she>,<DPX200>,
      <created by zg, POWCHK disabled, PULCHK disabled
       configuration hash MD5:
       00 E9 B6 7A A2 85 ED C7 34 08 36 98 17 FE 4E 26
       data hash MD5: 16K
       B1 1A 84 F4 9B 15 B9 60 49 E2 AE 17 F6 18 6A 6C>)
(   2,<2023-07-07 14:09:05.45 +0400>,<she>,<DPX200>,
      <Start of raw data processing
       efp BC_mod = 2 LB = 0.24 FT_mod = 6 PKNL = 1 PHC0 = -20991.8 PHC1 = 13.25272 SI = 16K 
       data hash MD5: 16K
       E7 D2 88 19 4F 43 AF 9D 71 A2 A6 77 C4 89 FB 6E>)
(   3,<2023-07-07 14:09:21.95 +0400>,<she>,<DPX200>,
      <pk PHC0 = -3.964837 PHC1 = 2.2 
       data hash MD5: 16K
       85 62 09 A3 6A F4 43 59 29 30 D5 03 36 9F 27 16>)
(   4,<2023-07-07 14:09:24.84 +0400>,<she>,<DPX200>,
      <abs ABSG = 5 
       data hash MD5: 16K
       1F 36 0A C0 00 88 EF A3 C2 B4 99 F9 87 8B B4 EC>)
$$ ##END=
$$ 
$$ hash MD5
$$ B8 9D B2 8C 0A 14 92 A3 5E 16 82 97 E3 D8 04 79
##$RELAX= 
##$RELAX= 
##$RELAX= 
##$RELAX= 
##$RELAX= 
##$RELAX= 
$$ Bruker specific parameters
$$ --------------------------
##$DU= <F:/spectra>
##$EXPNO= 1
##$NAME= <H-F>
##$PROCNO= 1
##$TYPE= <nmr>
##$USER= <she>
##$AMP= (0..31)
100 100 100 100 100 100 100 100 100 100 100 100 100 100 100 100 100 100 
100 100 100 100 100 100 100 100 100 100 100 100 100 100 
##$AQSEQ= 0
##$AQ_mod= 1
##$AUNM= <au_zg>
##$AUTOPOS= <>
##$BF1= 200.13
##$BF2= 200.13
##$BF3= 200.13
##$BF4= 200.13
##$BF5= 200.13
##$BF6= 200.13
##$BF7= 200.13
##$BF8= 200.13
##$BYTORDA= 1
##$CFDGTYP= 0
##$CFRGTYP= 5
##$CHEMSTR= <none>
##$CNST= (0..31)
1 1 145 1 1 1 1 1 1 1 1 1 1 1 1 1 1 1 1 1 1 1 1 1 1 1 1 1 1 1 1 1 
##$CPDPRG= <>
##$CPDPRG1= <>
##$CPDPRG2= <>
##$CPDPRG3= <>
##$CPDPRG4= <mlev>
##$CPDPRG5= <mlev>
##$CPDPRG6= <mlev>
##$CPDPRG7= <mlev>
##$CPDPRG8= <mlev>
##$CPDPRGB= <>
##$CPDPRGT= <>
##$D= (0..31)
0 1.2 0 0 0 0 0 0 0 0.06 0 0.03 0 0 0 0 0.0002 0 0 0 0 0 0 0 0 0 0 0 0 
0 0 0 
##$DATE= 1688724542
##$DBL= (0..7)
120 120 120 120 120 120 120 120 
##$DBP= (0..7)
150 150 150 150 150 150 150 150 
##$DBP07= 0
##$DBPNAM0= <>
##$DBPNAM1= <>
##$DBPNAM2= <>
##$DBPNAM3= <>
##$DBPNAM4= <>
##$DBPNAM5= <>
$$ [...]
##$SUBNAM3= <"">
##$SUBNAM4= <"">
##$SUBNAM5= <"">
##$SUBNAM6= <"">
##$SUBNAM7= <"">
##$SUBNAM8= <"">
##$SUBNAM9= <"">
##$SW= 18.05172834244
##$SWIBOX= (0..15)
0 0 2 0 0 0 0 0 0 0 0 0 0 0 0 0 
##$SW_h= 3612.71676300578
##$TD= 16384
##$TD0= 1
##$TE= 0
##$TE2= 300
##$TE3= 300
##$TEG= 300
##$TL= (0..7)
0 120 120 120 120 120 120 120 
##$TP= (0..7)
150 150 150 150 150 150 150 150 
##$TP07= 0
##$TPNAME0= <>
##$TPNAME1= <>
##$TPNAME2= <>
##$TPNAME3= <>
##$TPNAME4= <>
##$TPNAME5= <>
##$TPNAME6= <>
##$TPNAME7= <>
##$TPOAL= (0..7)
0.5 0.5 0.5 0.5 0.5 0.5 0.5 0.5 
##$TPOFFS= (0..7)
0 0 0 0 0 0 0 0 
##$TUNHIN= 0
##$TUNHOUT= 0
##$TUNXOUT= 0
##$USERA1= <user>
##$USERA2= <user>
##$USERA3= <user>
##$USERA4= <user>
##$USERA5= <user>
##$V9= 5
##$VALIST= <valist>
##$VCLIST= <CCCCCCCCCCCCCCC>
##$VD= 0
##$VDLIST= <DDDDDDDDDDDDDDD>
##$VPLIST= <PPPPPPPPPPPPPPP>
##$VTLIST= <TTTTTTTTTTTTTTT>
##$WBST= 1024
##$WBSW= 4
##$XGAIN= (0..3)
0 0 0 0 
##$XL= 0
##$YL= 0
##$YMAX_a= 158607
##$YMIN_a= -174851
##$ZGOPTNS= <>
##$ZL1= 120
##$ZL2= 120
##$ZL3= 120
##$ZL4= 120
##$ABSF1= 15.76342
##$ABSF2= -2.288429
##$ABSG= 5
##$ABSL= 3
##$ALPHA= 0
##$AQORDER= 0
##$ASSFAC= 0
##$ASSFACI= 0
##$ASSFACX= 0
##$ASSWID= 0
##$AUNMP= <proc_1d>
##$AZFE= 0.1
##$AZFW= 0.1
##$BCFW= 0
##$BC_mod= 2
##$BYTORDP= 0
##$COROFFS= 0
##$CY= -3
##$DATMOD= 1
##$DC= 0
##$DFILT= <>
##$DTYPP= 0
##$F1P= 0
##$F2P= 0
##$FCOR= 1
##$FTSIZE= 16384
##$FT_mod= 6
##$GAMMA= 0
##$GB= 0
##$INTBC= 1
##$INTSCL= 3.70164e-10
##$ISEN= 128
##$LB= 0.24
##$LEV0= 0
##$LPBIN= 0
##$MAXI= 10000
##$MC2= 0
##$MEAN= 0
##$ME_mod= 0
##$MI= 1.114404
##$NCOEF= 0
##$NC_proc= -8
##$NLEV= 6
##$NOISF1= 3.799351
##$NOISF2= 2.8
##$NSP= 0
##$NTH_PI= 0
##$NZP= 0
##$OFFSET= 15.75681
##$PC= 1
##$PHC0= -20995.77
##$PHC1= 15.45272
##$PH_mod= 1
##$PKNL= yes
##$PPARMOD= 0
##$PSCAL= 0
##$PSIGN= 0
##$REVERSE= no
##$SF= 200.13000294907
##$SI= 16384
##$SIGF1= 3
##$SIGF2= 2
##$SINO= 5.538805
##$SIOLD= 16384
##$SREGLST= <1H.CDCl3>
##$SSB= 0
##$STSI= 16384
##$STSR= 0
##$SW_p= 3612.71676300578
##$SYMM= 0
##$S_DEV= 0
##$TDeff= 16384
##$TDoff= 0
##$TI= <>
##$TILT= no
##$TM1= 0
##$TM2= 0
##$TOPLEV= 0
##$USERP1= <user>
##$USERP2= <user>
##$USERP3= <user>
##$USERP4= <user>
##$USERP5= <user>
##$WDW= 1
##$XDIM= 16384
##$YMAX_p= 477352395
##$YMIN_p= -2790575
$$ End of Bruker specific parameters
$$ ---------------------------------
##NTUPLES= NMR SPECTRUM
##VAR_NAME=  FREQUENCY,     SPECTRUM/REAL,   SPECTRUM/IMAG
##SYMBOL=    X,             R,               I
##VAR_TYPE=  INDEPENDENT,   DEPENDENT,       DEPENDENT
##VAR_FORM=  AFFN,          ASDF,            ASDF
##VAR_DIM=   16384,         16384,           16384
##UNITS=     HZ,            ARBITRARY UNITS, ARBITRARY UNITS
##FACTOR=    0.220516191357247, 1,           1
##FIRST=     3153.41046945111, 0,            0
##LAST=      -459.306293554675, 0,           0
##MIN=       -459.306293554675, -2790575,    0
##MAX=       3153.41046945111, 477352395,    0
$$ Real data points
##PAGE= N=1
##DATA TABLE= (X++(R..R)), XYDATA
$$ [...]
7576D253K88549k53237M6666L89557p7902n33997K18796l33369k71850j99308
$$ 4253 292802 39565 86231 475788 397886 -136111 82685 -250684 -522534 -721842
7566g21842M90084L09601L0058n17236j00462O72580J75569m30174m04435n1420
$$ -721842 -231758 77843 107901 -409335 -509797 162783 338352 -91822 -496257 -547677
7556e47677O74842K04057n65682K00637j23224J7497M14413l28462k52071J40728
$$ -547677 127165 331222 -234460 -33823 -157047 -139550 274863 -53599 -305670 -164942
7546a64942k3406K92188j22780n58330P8116N18263K71025q1160k84932Q4094
$$ -164942 -188348 103840 -18940 -577270 -499154 19109 290134 208974 -75958 8136
7536H136N4070m6320l61441j68963J37280J80999k70997K01960q1237q6903J0983
$$ 8136 62206 15886 -345555 -514518 -377238 -196239 -467236 -265276 -346513 -433416 -422433
7525d22433K80685n6345k19783P8568K53510K87577j50926m8673j48824m1993
$$ -422433 -141748 -198093 -417876 -339308 -85798 201779 50853 2180 -146644 -188637
7515a88637Q4882k5548N1276j61915L16662L22746k5266m90400J39414M29976
$$ -188637 -103755 -129303 -78027 -239942 76720 399466 374200 -116200 23214 453190
7505D53190j51211l17287J2419K72109l51655j8821k72121j78500l2546M21289
$$ 453190 301979 -15308 -2889 269220 -82435 -101256 -373377 -551877 -584423 -163134
7495a63134J53320Q2181q2753L25692J08320j28487l24459J06775k37456m35464
$$ -163134 -9814 72367 -10386 315306 423626 295139 -29320 77455 -160001 -595465
7485e95465L00811m0672J73695J9721J40367n9521K03140k56779n66335L40093
$$ -595465 -294654 -335326 -161631 -141910 -1543 -61064 142076 -114703 -681038 -340945
7475c40945K56953J46122j77684J80227l49575j53291O51787J34023J310j49160
$$ -340945 -83992 62130 -115554 64673 -284902 -438193 213594 347617 348927 199767
7465A99767m02117J65920L76113r3899j29180k88318J7149P0746J11729p2266
$$ 199767 -202350 -36430 339683 245784 116604 -171714 -154565 -83819 27910 -44356
7455d4356J78487O4283p15443J37501L44788l27704Q3940N41217l12851k91275
$$ -44356 134131 198414 -517029 -379528 -34740 -362444 -278504 262713 -50138 -341413
7445c41413J51879M17732k40040j23986k86757o2000m2063M76371k75172m67593
$$ -341413 -189534 228198 -11842 -135828 -422585 -484585 -526648 -50277 -325449 -793042
7435g93042J33479L50253J32216L38128o3977n61761N27086O9289n2468k14920
$$ -793042 -659563 -309310 -177094 161034 97057 -464704 62382 131671 79203 -135717
7425a35717j82139k42979N79221L65212k25348n34511J39815m5810J72396k3149
$$ -135717 -317856 -560835 18386 383598 158250 -376261 -236446 -282256 -109860 -133009
7415a33009k62550K05133L75409k91362J68680J2993n4083N9242k35038K12017
$$ -133009 -395559 -190426 184983 -106379 62301 75294 21211 80453 -154585 57432
7405E7432p2951j19379J05963j20274K55005K14460l83998m9686j49563j0425
$$ 57432 -15519 -134898 -28935 -149209 105796 320256 -63742 -113428 -262991 -273416
7395b73416J46034j9733K41214K86549l27105n0584m72171J87982J57155R2165
$$ -273416 -127382 -147115 94099 380648 53543 2959 -469212 -281230 -124075 -31910
7385c1910L78817J10705m42818K25918j25293l87148O63830k68471k91007j2035
$$ -31910 346907 457612 14794 240712 115419 -271729 392101 123630 -167377 -179412
7375a79412J40614N7305j86103K11241K20675j86619N019k70319N52295L58794
$$ -179412 -38798 18507 -167596 43645 264320 77701 82720 -187599 364696 723490
7365G23490m84617j3298k79035R4790L22207n89513R728M68557j23776j40880
$$ 723490 238873 225575 -53460 41330 363537 -225976 -216248 252309 128533 -12347
7355a2347l8489K46096M9228l22083N8272K17557N754O6015k18386k39333J86108
$$ -12347 -50836 195260 244488 -77595 -19323 198234 203988 270003 51617 -187716 -1608
7344a608L57741l29746l08159K23091k7602J17961Q2385k35076O5531L01553l6619
$$ -1608 356133 26387 -281772 -58681 -86283 31678 114063 -121013 -55482 246071 209452
7333B09452k47261M77744P4605l06871j06578k42008J83320k4191j04756j80296
$$ 209452 -37809 439935 514540 207669 101091 -140917 42403 18212 -86544 -266840
7323b66840J04000L22775L39031j83293J72178l20463n91228L27498k59362n1032
$$ -266840 -162840 159935 498966 315673 487851 167388 -423840 -96342 -355704 -406736
7313d06736K43338j61442K48654J90930K76750K5513k52053j1237m83614J55072
$$ -406736 -163398 -324840 -76186 114744 391494 417007 164954 153717 -329897 -174825
7303a74825K515j4367R076q9464K66752k09012m20389L2862K75025K10764k5364
$$ -174825 -172310 -186677 -177601 -267065 -313 -209325 -629714 -596852 -321827 -111063 -136427
7292a36427j60041L1279l44879K1430n5844O36038j7953L5689j86901J6517J54941
$$ -136427 -296468 -265189 -610068 -588638 -644482 -8444 -26397 9292 -177609 -161092 -6151
7281f151j33949K59988l38797k157k4462J29620r8760q2260J55657j00229K92848
$$ -6151 -140100 119888 -218909 -221066 -245528 -115908 -214668 -296928 -141271 -241500 51348
7270E1348K54056j82409J6817K07061j52118j52479J42031j67459l6779M864r5658
$$ 51348 305404 122995 139812 346873 194755 42276 184307 16848 -19931 -15067 -110725
7259a10725k93845k28780K60983K0465J30582k62375K37502J34010j8223N1354
$$ -110725 -404570 -633350 -372367 -351902 -221320 -483695 -246193 -112183 -130406 -79052
7249g9052k80316M22891l5072j16810P6134M43102j13466l99601P07l0822m4330
$$ -79052 -359368 63523 28451 -88359 -12225 430877 317411 -82190 -81483 -112305 -156635
7238a56635j03202j30840L50671k54377K22983M82588l14272k45042M17770n5664
$$ -156635 -259837 -390677 -40006 -294383 -71400 411188 96916 -148126 269644 213980
7228B13980r1455k56780l5197k0400K43708K91218o1630L2281l85281m35000J23828
$$ 213980 122525 -134255 -169452 -189852 53856 345074 283444 315725 -69556 -504556 -380728
7217c80728P94513l05465k59527N39896Q2101o28213j21681Q2282j27404M6310
$$ -380728 413785 108320 -151207 388689 470790 -157423 -279104 -196822 -324226 -277916
7207b77916o8295k17019J47274J56592n13593K61357M56189M90433n68851J82108
$$ -277916 -346211 -563230 -415956 -259364 -772957 -511600 -55411 435022 -133829 48279
7197D8279J7907j55285J46078l80425l1672K30840J59539N2560M6128j7896j69040
$$ 48279 66186 -89099 56979 -323446 -355118 -124278 35261 87821 133949 116053 -52987
7186e2987L0663K56896J10745m20401k4365j41609K22829k40118m19825M61813
$$ -52987 -22324 234572 345317 -75084 -99449 -241058 -18229 -258347 -678172 -216359
7176b16359M83533J22322m33574l900m12124L70948J09239J00865K27493J21332
$$ -216359 267174 389496 -44078 -47978 -460102 -89154 20085 120950 348443 469775
7166D69775K39094K8023k64169j39998l49126p183j5790L22032J89868l65463
$$ 469775 708869 736892 472723 332725 -16401 -23584 -39374 282658 472526 107063
7156A07063J40281q760k3606l08503J19839r7598k23426K91336k7473K02560K02779
$$ 107063 247344 238584 214978 -93525 26314 -71284 -294710 -3374 -30847 171713 374492
7145C74492j57545m3679m9543J74986N1217j82946o6815j56744K94983l56395
$$ 374492 216947 173268 123725 298711 349928 166982 100167 -56577 238406 -117989
7135a17989M6599j16990j90003J96140K07908l12783M94370L03059m17727l89483
$$ -117989 -71390 -188380 -378383 -182243 25665 -287118 207252 510311 92584 -296899
7125b96899j6261N68517K33727l50357K4578J0439j49997j51592J27546K71937
$$ -296899 -313160 255357 489084 138727 163305 173744 23747 -127845 -299 271638
7115B71638K59221k13565k71853K5934L22377j73672K18522k27117l29905L53687
$$ 271638 530859 317294 45441 71375 393752 220080 438602 211485 -118420 235267
7105B35267j60492k44835q5208K99888M7400K10221J94205k86327n04059O46253
$$ 235267 74775 -170060 -255268 44620 92020 302241 496446 210119 -293940 352313
7095C52313L9697r6577J6994m14816J6232j84045j33271M5310M55092J8396j08432
$$ 352313 392010 295433 312427 -102389 -86157 -270202 -403473 -358163 96929 115325 6893
7084F893J4286k19415j84381J00069M35550J83467p5471m3434k73539k8572J54318
$$ 6893 21179 -198236 -382617 -282548 153002 336469 260998 217564 -55975 -84547 69771
7073F9771j29900j01072K76322Q6421J32566k79620k60429j16402j52971J38425
$$ 69771 -60129 -161201 115121 201542 334108 54488 -205941 -322343 -475314 -336889
7063c36889J33714K38045k8897q1583R5103L18497k86007L99624l11503j4722
$$ -336889 -203175 34870 5973 -75610 19493 337990 51983 451607 140104 125382
7053A25382j94877j5516M7233l34416O3422M23790l78486r6902K88172l62137
$$ 125382 -69495 -85011 -37778 -372194 -308772 115018 -263468 -360370 -72198 -434335
7043d34335J1238K00044J71173N8223k80180K84515L9443j62571j51392J49677
$$ -434335 -423097 -223053 -51880 6343 -273837 10678 50121 -112450 -263842 -114165
7033a14165L30794r0248l53670K63290m6836l96974L02270J11080q3182K7158
$$ -114165 216629 126381 -227289 36001 -10835 -407809 -105539 5541 -77641 -50483
7023e0483M65704k13058k90973K46062j02873K95527L4181m15861J30979n6804
$$ -50483 415221 202163 -88810 157252 54379 349906 384087 -31774 99205 42401
7013D2401L632k26962M8090q6836K31424R9019N4478L19771R550Q5247k47874
$$ 42401 46033 -180929 -132839 -219675 11749 110768 165246 485017 494567 579814 331940
7002C31940L6764K50062K01351l76280m6835K32057l68572q53915K12971N34274
$$ 331940 368704 618766 820117 443837 397002 629059 260487 -593428 -380457 153817
6992A53817j69024L22468k71902j22439J94329J90398l5928m03037m9072R6483
$$ 153817 -15207 307261 35359 -87080 107249 297647 261719 -141318 -190390 -93907
6982i3907M3039J80467J68627l41355L7761J69787j45644m50590k8575q0925j50400
$$ -93907 -50868 129599 298226 -43129 -5368 164419 18775 -431815 -460390 -541315 -691715
6971f91715Q09402K39870M1035p2806j7461o3551j72976M70832o8304l71362j90943
$$ -691715 117687 357557 398592 325786 308325 244774 71798 542630 474326 102964 -87979
6960h7979J33305q83J02264j5337L60197j1800l68373k30153J05598K19626p6302
$$ -87979 45326 44443 146707 131370 491567 479767 111394 -118759 -13161 206465 130163
6949A30163k26997q0690L07778k51250O698n8424J10371J1852J5401L27664R0072
$$ 130163 -96834 -177524 130254 -120996 -114298 -172722 -62351 -50499 -35098 292566 382638
6938C82638j5452M7359k81908n4331K58264Q4064q7099L35872k36224J99021k41053
$$ 382638 367186 414545 132637 78306 336570 420634 333535 669407 433183 632204 391151
6927C91151j35687p2417j9180K36420l02574j38164K26290o7060k06996N6079
$$ 391151 255464 183047 163867 400287 97713 -40451 185839 118779 -88217 -32138
6917c2138K15583P7639O0011r6262k17653J76497M73322k1072l04023K23264k74443
$$ -32138 183445 261084 321095 224833 7180 183677 656999 635927 331904 555168 280725
6906B80725K0251q2309j84602J97262M8026k10489k27593K22750j06893L11650
$$ 280725 300976 218667 34065 231327 279353 68864 -158729 64021 -42872 268778
6896B68778j16583l21469k06660K91335K13239K19200K0408k83798K33925Q6626
$$ 268778 152195 -169274 -375934 -84599 128640 347840 368248 84450 318375 405001
6886D05001k22610k50581L81436o0864N425q4271j95900N4815Q2980n5866n6420
$$ 405001 182391 -68190 313246 252382 257807 173536 -22364 32451 115431 59565 3145
6875C145Q0292n4545L22516M65604l64791n39365K25734J94432l41113L97772
$$ 3145 83437 28892 351408 817012 452221 -87144 138590 333022 -8091 389681
6865C89681m11326q2431M30674J4632m5913P9956k16614n04086O44543R2120l75362
$$ 389681 -21645 -104076 326598 341230 295317 375273 158659 -345427 299116 391236 15874
6854A5874K43899l3649J61286j56200o4265K10951k097k76084j64222O59820o35779
$$ 15874 259773 226124 387410 231210 166945 377896 375799 99715 -64507 595313 -40466
6843d0466j71455K45574L43343K72898k27105j25502k79510m2888J00452P44666
$$ -40466 -211921 33653 376996 649894 422789 297287 17777 -25111 75341 820007
6833H20007J40887l26566O2485J99248n46910n57639L46064R7626k97358J4174
$$ 820007 960894 634328 696813 896061 349151 -208488 137576 235202 -62156 -47982
6823d7982J78732K13640j18007N3108n362N8067l2163o0810K12897m9486O6333
$$ -47982 130750 344390 226383 279491 274129 332196 300033 239223 452120 402634 468967
6812D68967m81882k66598N73334O9756j70300j42591p1354o1551O7427K45440
$$ 468967 -12915 -279513 293821 363577 193277 50686 -20668 -82219 -14792 230648
6802B30648J12198Q0883J38306m5113j61576j66321M71337K04711j79296R2798
$$ 230648 342846 423729 562035 516922 355346 189025 660362 865073 685777 778575
6792G78575m11265k7328o550J53357j47112j7071j72901L4865m97772J15693N12410
$$ 778575 367310 339982 333432 486789 339677 322606 149705 184570 -313202 -197509 314901
6781C14901K55433M5522k52612k61488J02241K70907n27203P3811K04880L96296
$$ 314901 570334 615856 363244 101756 203997 474904 -52299 21512 226392 622688
6771F22688j6867L50496k13745l23849j20191l898k41546K65730N3445N6508l11432
$$ 622688 605821 956317 742572 418723 298532 294634 53088 318818 372263 428771 117339
6760A17339j79582M62722N4544p1070K04760j2641L83751m50458m95119L34862
$$ 117339 -62243 400479 455023 383953 588713 576072 959823 509365 14246 349108
6750C49108J02055j32939K02238m3146K6646j29386j47941M67731j07734k47102
$$ 349108 451163 318224 520462 477316 503962 374576 226635 694366 586632 339530
6740C39530r3995j40262j1693k91718j36134j39442N91451N41995j63729m3447
$$ 339530 245535 105273 93580 -198138 -334272 -473714 117737 659732 496003 452556
6730D52556K57072q3922k25128J64113j9185J08449q0175O9320m04267l7169J86826
$$ 452556 709628 625706 400578 564691 545506 653955 573780 643100 238833 201664 388490
6719C88490J8692q866N06953q8448l67402j68064K0139k09522j56879M75331J25418
$$ 388490 407182 398316 905269 816821 449419 281355 301494 91972 -64907 410424 535842
6708E35842j72935M13489R3220j8529l87493L15698l97992J7541N2378j32248
$$ 535842 362907 776396 869616 851087 463594 779292 381300 398841 451219 318971
6698C18971r3185R4253j6584Q4032O8537k27067l51829k30777M18343K56290M6137
$$ 318971 225786 320039 303455 387487 456024 228957 -122872 -353649 64694 320984 367121
6687C67121J66312J54339j47818m38075K08013K87465K75949L2330L53087l08750
$$ 367121 533433 687772 539954 101879 309892 597357 873306 905636 1258723 949973
6677I49973n59299m04532l0550N92303O2035Q6626k50449K40095p552k34725M5358
$$ 949973 390674 -13858 -44408 547895 609930 696556 446107 686202 678650 443925 489283
6666D89283j0724k26340K77975R4272j30995j43770M59401J80048k04120l83039
$$ 489283 478559 252219 530194 624466 493471 349701 809102 989150 785030 401991
6656D01991q9830r074o7230J03748N0340j10856n7772N02565o5515k03826Q1388
$$ 401991 312161 303087 235857 339605 389945 279089 221317 723882 658367 454541 535929
6645E35929j69220l6194N37741j27216k77607K34645J8688n8103k86071J47918
$$ 535929 366709 330515 868256 741040 463433 698078 716766 658663 372592 520510
6635E20510K94300j33499l02908k17594J39786j0093K61489o271j78839K99551
$$ 520510 814810 681311 378403 160809 300595 290502 551991 545720 366881 666432
6625F66432K63300p0118j18015N7211L8334r2039J17107J13957l08961k10488
$$ 666432 929732 859614 741599 798810 837144 745105 862212 976169 667208 456720
6615D56720J32207l21559j5013K16057J05644J15214q7064L5988K4877k01081
$$ 456720 588927 267368 252355 468412 574056 689270 602206 638194 663071 461990
6605D61990j83499L25568k13758K16077K04096J95284m65587J88884l58654J63144
$$ 461990 278491 604059 390301 606378 810474 1005758 540171 729055 370401 533545
6595E33545L63443l6486l80720L1774k70599J38191N31195j50254P5224L78090
$$ 533545 896988 860502 479782 511556 240957 379148 910343 760089 835313 1213403
6585A213403j23296p8216j02968k37369k79579j10793M71593l3715N544p2355
$$ 1213403 1090107 1011891 908923 671554 391975 281182 752775 719060 724604 652249
6575F52249N9315J08974L62616k50354m08855j55745M7713R790K62072L58405
$$ 652249 711564 820538 1183154 932800 523945 368200 415913 425703 687775 1046180
6565A046180q225L3399Q6672k09924Q2765k54689J48838n154J72868Q3504N1632
$$ 1046180 1037955 1071354 1158026 948102 1030867 776178 925016 919862 1092730 1176234 1227866
6554A227866l37299n2671Q3909k02628k23229K59778N32112n9707p8239k60050
$$ 1227866 890567 837896 921805 719177 495948 755726 1287838 1228131 1149892 889842
6544H89842l54959J28405J50476j48567j77022K79372L99857O9258O0538j29078
$$ 889842 534883 663288 813764 665197 488175 767547 1167404 1236662 1297200 1168122
6534A168122n34671l061K18297l42256J11980K28688N54931M8289k42892k28412
$$ 1168122 633451 630390 848687 506431 618411 847099 1402030 1450319 1207427 979015
6524I79015N2458J33242J57156j27146L56286J2175l02787O4679r3557m10417
$$ 979015 1031473 1164715 1321871 1194725 1551011 1563186 1260399 1325078 1231521 821104
6514H21104L44732J60445J6822r0543q28110l20346M05278R5010J36985N72833
$$ 821104 1165836 1326281 1343103 1252560 424450 104104 509382 604392 741377 1314210
6504A314210m12814M0537m54628j66372K09380P8321J37078K45718J28215j56246
$$ 1314210 901396 941933 487305 320933 530313 608634 745712 991430 1119645 963399
6494I63399j60230l61663J73100R6904K95337p0440l37226K85361j93626p8631
$$ 963399 803169 441506 614606 711510 1006847 936407 599181 884542 690916 612285
6484F12285K63760k1337l6741o24246O74070L10028j00209j2381O0164o2973l05169
$$ 612285 876045 854708 817967 193721 867791 1177819 1077610 1065229 1125393 1062420 757251
6473G57251J51305q4781J56326l29702K62410j3257M58199k37999K84442K84057
$$ 757251 908556 823775 980101 650399 912809 899552 1357751 1119752 1404194 1688251
6463A688251l44746J69671J9345L5659k05012N1410k71726J47900J83818m0067
$$ 1688251 1343505 1513176 1532521 1568180 1363168 1414578 1142852 1290752 1474570 1434503
6453A434503L6287J12292L10978j6108j50802k02572k78562K764M41473J44289
$$ 1434503 1470790 1583082 1894060 1877952 1727150 1524578 1246016 1248780 1690253 1834542
6443A834542l21525k55808j15179J01345M33059l5350j54120j92338k48214R4424
$$ 1834542 1513017 1257209 1142030 1243375 1676434 1641084 1486964 1294626 1046412 1140836
6433A140836l0886J22775M72120j42086K9064J57739P2909j04496r6671k1861
$$ 1140836 1109950 1232725 1704845 1562759 1591823 1749562 1822471 1717975 1621304 1599443
6423A599443J72957j11019Q0661q8641J26094o6095K6473l56747p736K91212K44725
$$ 1599443 1772400 1661381 1742042 1653401 1779495 1713400 1739873 1383126 1375390 1666602 1911327
6412A911327J96834J24430k41178k89075J93565L83913l96350l99275M58846j93958
$$ 1911327 2108161 2232591 1991413 1702338 1895903 2279816 1883466 1484191 1943037 1749079
6402A749079r8942m0990k5914J29543l2671m97280L85635k3850q8883K61411J48705
$$ 1749079 1650137 1609147 1583233 1712776 1680105 1182825 1568460 1544610 1455727 1717138 1865843
6391A865843L55999k18065m67838O39206K74523n48863j15289L84554q4719J1632
$$ 1865843 2221842 2003777 1535939 2175145 2449668 1900805 1785516 2170070 2085351 2096983
6381B096983K04584J33490N39246l3444o6516p7524k62974j58473l26490j81712
$$ 2096983 2301567 2435057 2974303 2940859 2874343 2796819 2533845 2375372 2048882 1867170
6371A867170K15642Q7496K46823J01472k26620J21321l95396K574K48853J47749
$$ 1867170 2082812 2170308 2417131 2518603 2291983 2413304 2017908 2020482 2269335 2417084
6361B417084l49683L56877l96443J46820M96544j94286m40087P6612Q9795K26497
$$ 2417084 2067401 2424278 2027835 2174655 2671199 2476913 2036826 2113438 2203233 2429730
6351B429730J23052J45761J78738j88378j87514J72196j34533j2803k63563k10422
$$ 2429730 2552782 2698543 2877281 2688903 2501389 2673585 2539052 2526249 2262686 2052264
6341B052264K14353j2995N53137L50659R2882N8167r1895k35572m02657K7986
$$ 2052264 2266617 2253622 2806759 3157418 3250300 3308467 3216572 2981000 2578343 2606329
6331B606329K72968J8781l95324O078R1640M21940k3489p02575K76604K49676
$$ 2606329 2879297 2898078 2502754 2508832 2600472 3022412 2998923 2296348 2572952 2822628
6321B822628l7162J18838k97814L46763j67041j41562J35775J72477O2013j64078
$$ 2822628 2785466 2904304 2606490 2953253 2786212 2644650 2780425 2952902 3014915 2850837
6311B850837L41281l57598j63958Q413k27787j04202L81893j24193K13437J50837
$$ 2850837 3192118 2834520 2670562 2678975 2451188 2346986 2728879 2604686 2818123 2968960
6301B968960L23419J63227k1181l00714j4820n1435m8424J6343M5947J00254P49037
$$ 2968960 3292379 3455606 3434425 3133711 3118891 3067456 3019032 3035375 3081322 3181576 3930613
6290C930613J30320l28349k16345j20325J2006L1766J4108k4429N27664j02733
$$ 3930613 4060933 3732584 3516239 3395914 3407920 3439686 3453794 3429365 3957029 3854296
6280C854296k49402k38194o4681O0468J48734K41438p54285j55820O42745M84675
$$ 3854296 3604894 3366700 3302019 3362487 3511221 3752659 2998374 2842554 3485299 3969974
6270C969974j22858q2919n45493p9220N10361J29046J89406j61745j23778M02902
$$ 3969974 3847116 3764197 3218704 3139484 3649845 3778891 3968297 3806552 3682774 4085676
6260D085676k68446J05879K15112p4404k40432K65363p2228j46658K32387k23865
$$ 4085676 3817230 3923109 4138221 4063817 3823385 4088748 4016520 3869862 4102249 3878384
6250C878384j65157N77479L89951j13366K06413k02460J37401J31287J36890j07351
$$ 3878384 3713227 4290706 4680657 4567291 4773704 4571244 4708645 4839932 4976822 4869471
6240D869471n36510k19827N12023L80797r900l8197j34846j7172M28587K5953
$$ 4869471 4332961 4113134 4625157 5005954 4996054 4957857 4823011 4805839 5234426 5260379
6230E260379j30813j50718o6432L98746J3303n3552k9460J77242J01412J56335
$$ 5260379 5129566 4978848 4912416 5311162 5324465 5270913 5241453 5418695 5520107 5676442
6220E676442j39177J48745L04511k06867N18331j93944k77301J92435J12233O3894
$$ 5676442 5537265 5686010 5990521 5783654 6301985 6108041 5830740 6023175 6135408 6199302
6210F199302J22724k2843k3465M51969q4344l4571P0953k49699K22288K17117
$$ 6199302 6322026 6299183 6275718 6727687 6643343 6608772 6679725 6430026 6652314 6869431
6200F869431K0929M35970K45226k05101J52727L83898M12611j49756n15729J27580
$$ 6869431 6890360 7326330 7571556 7366455 7519182 7903080 8315691 8165935 7650206 7777786
6190G777786P9881k13316L53057K49109j27822J63341Q5386l6241M12015j1683
$$ 7777786 7857667 7644351 7997408 8246517 8118695 8282036 8367422 8331181 8743196 8731513
6180H731513l01643K54148k93578M83820L41452n0385K48295O5117L02096L04924
$$ 8731513 8429870 8684018 8390440 8874260 9215712 9165327 9413622 9478739 9780835 10085759
6170A0085759J00437Q4353L29354j63912j65583L88086K31923M6435R0700K9105
$$ 10085759 10186196 10270549 10599903 10435991 10270408 10658494 10890417 10936852 11027552 11056657
6160A1056657l9155K63893M93216J81426N2465l18733N81995j39216j76400Q46971
$$ 11056657 11017502 11281395 11774611 11956037 12008502 11689769 12271764 12132548 11956148 12803119
6150A2803119M48556J28612L07239j6899J97092Q1580M8906L28042L27513J63419
$$ 12803119 13251675 13380287 13687526 13670627 13867719 13949299 13998205 14326247 14653760 14817179
6140A4817179M63818L68116N3668J99629M79819K06318L1902J22802P04734K61177
$$ 14817179 15280997 15649113 15702781 15902410 16382229 16588547 16620449 16743251 17447985 17709162
6130A7709162J40146K90018M82078J4824N85496Q02402K41056K42023J95672M80695
$$ 17709162 17849308 18139326 18621404 18636228 19221724 20024126 20265182 20507205 20702877 21183572
6120B1183572j2472L09156O35500N07589L44437M31603N61077M13416J07127O41760
$$ 21183572 21171100 21480256 22115756 22623345 22967782 23399385 23960462 24373878 24481005 25122765
6110B5122765P79297M27887j30150M72721P59936M84433N48437J011783M81088
$$ 25122765 25902062 26329949 26199799 26672520 27432456 27916889 28465326 29477109 29958197
6101B9958197N42036O49916Q36793O06547j79900M97646J168776Q85831P38048
$$ 29958197 30500233 31150149 31986942 32593489 32413589 32911235 34080011 34965842 35703890
6092C5703890Q63605L71606P58335R76602Q42413R02429J048102Q60043Q65546
$$ 35703890 36567495 36939101 37697436 38674038 39516451 40418880 41466982 42327025 43192571
6083D3192571P71757J350791J492058P03551Q39864Q75035J439016R80027R67861
$$ 43192571 43964328 45315119 46807177 47510728 48350592 49225627 50664643 51644670 52612531
6074E2612531J319221J016205J360228J242864J064520J530280J385633J221058
$$ 52612531 53931752 54947957 56308185 57551049 58615569 60145849 61531482 62752540
6066F2752540J476272J852468J233223J264979J422583J349046J587910J416910
$$ 62752540 64228812 66081280 67314503 68579482 70002065 71351111 72939021 74355931
6058G4355931J626079J395485J700095J300348J779871J614446J182426J527190
$$ 74355931 75982010 77377495 79077590 80377938 82157809 83772255 84954681 86481871
6050H6481871J023420R58226Q50615J589951J414593N63248J096385P03666M19740
$$ 86481871 87505291 88463517 89314132 90904083 92318676 92881924 93978309 94681975 95101715
6041I5101715P39578L07343K73990K35678J3505k04824o2402K28990m90602r05802
$$ 95101715 95841293 96148636 96422626 96658304 96671809 96466985 96404583 96633573 96142971 95237169
6031I5237169l48370p73026m64094r64001j287414j224764j398102j138993j450935
$$ 95237169 94888799 94115773 93651679 92687678 91400264 90175500 88777398 87638405 86187470
6022H6187470j342256j413399j119216j487755j395925j681042j757402j438356
$$ 86187470 84845214 83431815 82312599 80824844 79428919 77747877 75990475 74552119
6014G4552119j946887j166716j776868j648870j385104j814158j500110j131091
$$ 74552119 72605232 71438516 69661648 68012778 66627674 64813516 63313406 62182315
6006F2182315j419171j371537j437640j264377j637313j734939j199951j099475
$$ 62182315 60763144 59391607 57953967 56689590 55052277 53317338 52117387 51017912
5998E1017912r33430q65955j004000j490160j221619j083376j506515j305600
$$ 51017912 50084482 49218527 48214527 46724367 45502748 44419372 42912857 41607257
5990D1607257r39441o93145p36507j284671q63187n08677o21888j023412j024156
$$ 41607257 40667816 39974671 39238164 37953493 37090306 36581629 35959741 34936329 33912173
5981C3912173o76200r21412n07517n25411p10702o99230n65884o19408o91563
$$ 33912173 33235973 32314561 31807044 31281633 30570931 29871701 29305817 28686409 27994846
5972B7994846m69770k82418q39955n96193m41869o53676l27856m4633l91860o15824
$$ 27994846 27525076 27242658 26402703 25806510 25364641 24710965 24383109 24338476 23946616 23330792
5962B3330792p85141q51833m32616n1109j95935k03000q28275k04003N3316j69970
$$ 23330792 22545651 21693818 21261202 21210093 21014158 20811158 19982883 19778880 19832196 19662226
5952A9662226o00229m75490P3012k74733o80556k80514Q7475k37875k86214n36436
$$ 19662226 19061997 18586507 18659519 18384786 17704230 17423716 17511191 17273316 16987102 16450666
5942A6450666p4171l98374l73362o80048k33938n03979j61837K23019q5344q1939
$$ 16450666 16376495 15978121 15604759 14924711 14690773 14186794 14024957 14247976 14162632 14080693
5932A4080693N9556l73630Q8118k03804p21313m70341O9747j64132R0272l40634
$$ 14080693 14140249 13766619 13854737 13650933 12929620 12459279 12529026 12364894 12455166 12114532
5922A2114532J75713k71216o1699j26157l68734R8662K21533l24981k48294L02973
$$ 12114532 12290245 12019029 11957330 11831173 11462439 11561101 11782634 11457653 11209359 11512332
5912A1512332o3100o45673k20132L13653o91250j00164O2616m57357J07463l22705
$$ 11512332 11449232 10803559 10583427 10897080 10205830 10105666 10168282 9710925 9818388 9495683
5902I495683j929m01659k64883K43159l90605K57300j58051k45993K8030j41853
$$ 9495683 9493754 9092095 8827212 9070371 8679766 8937066 8779015 8533022 8561052 8419199
5892H419199j84077K86283j84792J53930j97890m30480J81392Q6400O0931m08237
$$ 8419199 8235122 8521405 8336613 8490543 8292653 7862173 8043565 8129965 8190896 7782659
5882G782659m88657K82497l7634j58835J18638l22587m40999K15768K16563j94569
$$ 7782659 7294002 7576499 7538865 7380030 7498668 7176081 6735082 6950850 7167413 6972844
5872F972844J43664R8835j83149J2238J67912m66989N6900M8588k06277N1257
$$ 6972844 7116508 7215343 7032194 7044432 7212344 6745355 6802255 6850843 6644566 6695823
5862F695823l29803l3256k60883r3017L50328l10424K01010K71587N8162J12201
$$ 6695823 6366020 6332764 6071881 5978864 6329192 6018768 6219778 6491365 6549527 6661728
5852F661728K1252j64514k01414r7770k06630m53305l82708N24617K50106Q7926
$$ 6661728 6682980 6518466 6317052 6219282 6012652 5559347 5176639 5701256 5951362 6039288
5842F039288J32736k68035k21468k9865l03100O5750l1072L03812P5932j10639
$$ 6039288 6172024 5903989 5682521 5652656 5349556 5415306 5384234 5688046 5763978 5653339
5832E653339j62505o52J04354M6552j10606j00300j01706r8710j85106J74180
$$ 5653339 5490834 5490182 5594536 5641088 5530482 5430182 5328476 5229766 5044660 5218840
5822E218840L2389J5792M28478J34049O5246o64253j91957K24215Q5817L57139
$$ 5218840 5251229 5267021 5695499 5829548 5894794 5230541 5038584 5262799 5348616 5705755
5812E705755k66082l93309K37919j1392l18291m5851k48115L50736j10016J58715
$$ 5705755 5439673 5046364 5284283 5272891 4954600 4908749 4660634 5011370 4901354 5060069
5802E060069J82482K8626k28251l99192L77679j2293j99750k45508n5907k64892
$$ 5060069 5242551 5271177 5042926 4643734 5021413 5009120 4809370 4563862 4507955 4243063
5792D243063J67044J44992p0081J07693j02869J72235j72866O2200q0817J44044
$$ 4243063 4410107 4555099 4485018 4592711 4489842 4662077 4489211 4551411 4470594 4614638
5782D614638K55714K34970k96748K4382J03969L96253n5917j07263j34507k84774
$$ 4614638 4870352 5105322 4808574 4832956 4936925 5333178 5277261 5169998 5035491 4750717
5772D750717r3498J34820K09841p5180p2999l45319K17162l6407j32188p662k37202
$$ 4750717 4657219 4792039 5001880 4926700 4853701 4508382 4725544 4689137 4556949 4549287 4312085
5761D312085k7433L33651N3178J01122l7971K36601R3359j74962p13875l5924
$$ 4312085 4284652 4618303 4671481 4772603 4734632 4971233 5064592 4889630 4175755 4139831
5751D139831K37647P4632K52852J24551l32406k06303J89631K62565K45473l5277
$$ 4139831 4377478 4452110 4704962 4829513 4497107 4290804 4480435 4743000 4988473 4953196
5741D953196j78349j06622J54546j50688q2086M23099n39845l63934L90532P7800
$$ 4953196 4774847 4668225 4822771 4672083 4589997 5013096 4473251 4109317 4499849 4577649
5731D577649O9250M20715j52216n29413J19563J14541k40905L51803j6523M8148
$$ 4577649 4646899 5067614 4915398 4385985 4505548 4620089 4379184 4730987 4714464 4762612
5721D762612L01892j60247l62625k35325L3170m5994J68018J99906L46913J02479
$$ 4762612 5064504 4904257 4541632 4306307 4339477 4293483 4461501 4661407 5008320 5110799
5711E110799p8829L77946l93433K6456k56697L08637N2358o24932r5820Q8811
$$ 5110799 5031970 5409916 5016483 5042939 4786242 5094879 5147237 4522305 4426485 4515296
5701D515296N58534M6425Q0987o4613J9864R1941j20918k98367n74303J68526
$$ 4515296 5073830 5120255 5201242 5136629 5156493 5248434 5127516 4829149 4254846 4423372
5691D423372J53098J42512K53057N3234l93836j05093L60354O5706L03750J43837
$$ 4423372 4576470 4718982 4972039 5025273 4631437 4526344 4886698 4952404 5256154 5399991
5681E399991r9440j20755o1074j36646L09989m04270k07157N37028K49790k80915
$$ 5399991 5300551 5179796 5118722 4982076 5292065 4887795 4680638 5217666 5467456 5186541
5671E186541k2228j08469q8662O83552l35710j17248K33760j16531k99629J14073
$$ 5186541 5164313 5055844 4967182 5650734 5315024 5197776 5431536 5315005 5015376 5129449
5661E129449j8770M81501L2091m35920O0546P5245k14763J59721L81977J91604
$$ 5129449 5110679 5592180 5624271 5188351 5248897 5324142 5109379 5269100 5651077 5842681
5651E842681N69633m47641m99756j36879K2392L56454j69088n75282K98132L19888
$$ 5842681 6412314 5964673 5464917 5328038 5350430 5706884 5537796 4962514 5260646 5580534
5641E580534L14437L12661k13496j74476k0514J6888J95945n1711m40062K41311
$$ 5580534 5894971 6207632 5994136 5819660 5799146 5816034 6011979 5960268 5520206 5761517
5631E761517J38628m46924L27138J13828M0709j24819l43647J18864R531J22650
$$ 5761517 5900145 5453221 5780359 5894187 5934896 5810077 5466430 5585294 5594825 5717475
5621E717475O4617n2225K38527m54088K0616M01438L90856q2837l37439o7621
$$ 5717475 5782092 5729867 5968394 5514306 5534922 5936360 6327216 6244379 5906940 5839319
5611E839319P1773L30018j47879j46746j2601N9284J98202k91372k01857M79687
$$ 5839319 5911092 6241110 6093231 5946485 5933884 5993168 6191370 5899998 5698141 6177828
5601F177828K86600M6647l68120K25181m82702j322J03213j78759N59713J33011
$$ 6177828 6464428 6511075 6142955 6368136 5885434 5884112 5987325 5808566 6368279 6501290
5591F501290M94108r9308j47581N81048J26113n34610l00661J42703L81638l07686
$$ 6501290 6995398 6896090 6748509 7329557 7455670 6921060 6620399 6763102 7144740 6837054
5581F837054R6040l20572j76899L85280O22388l14086j22544J23855k11027j38515
$$ 6837054 6933094 6612522 6435623 6820903 7443291 7129205 7006661 7130516 6919489 6780974
5571F780974k74956N89597L40246j48791Q4941k02066K03700n7508j31183J44626
$$ 6780974 6506018 7095615 7435861 7287070 7372011 7169945 7373645 7316137 7184954 7329580
5561G329580K1764J89905p8446J0923K83772k17211k25662l53414R6978K8957
$$ 7329580 7351344 7541249 7462803 7473726 7757498 7540287 7314625 6961211 7058189 7087146
5551G087146L50085J90853J37293O91015n07560J12989K64255J8852O3186J30112
$$ 7087146 7437231 7628084 7765377 8456392 7948832 8061821 8326076 8344928 8408114 8538226
5541H538226J11199r1241k39250K88712K6377N0174J45206l24430L90418j50320
$$ 8538226 8649425 8558184 8318934 8607646 8634023 8684197 8829403 8504973 8895391 8745071
5531H745071Q8701L70152o3891k24640O7215J16024k98725R1982J40924L90026
$$ 8745071 8833772 9203924 9140033 8915393 8982608 9098632 8799907 8891889 9032813 9422839
5521I422839K70686N1122j46228O9858M10447J10460n21118n4706N40314J33851
$$ 9422839 9693525 9744647 9598419 9668277 10078724 10189184 9668066 9613360 10153674 10287525
5511A0287525J69302J4745K60119P8153k42026J15847N360o7804Q3141L20797
$$ 10287525 10456827 10471572 10731691 10809844 10567818 10683665 10689025 10621221 10704362 11025159
5501A1025159l871k13184M99663q590l76313M70298R0007j74884M41045L46455
$$ 11025159 11021288 10808104 11307767 11299177 10922864 11393162 11483169 11308285 11749330 12095785
5491A2095785N258J96156O6828r8043j81811N39495j43062k07732J9330N51662
$$ 12095785 12101043 12297199 12364027 12265984 12084173 12623668 12480606 12272874 12292204 12843866
5481A2843866L03438n9390j83698K55534j2132J78971L42183J60329N680J28185
$$ 12843866 13147304 13087914 12904216 13159750 13147618 13326589 13668772 13829101 13834781 13962966
5471A3962966L67770J72220N4379J28006j83436K61357J87171O0753K15582l43192
$$ 13962966 14330736 14502956 14557335 14685341 14501905 14763262 14950433 15011186 15226768 14883576
5461A4883576O2875N08139K37014K26569k20336J19331r6127O02190M17163K37533
$$ 14883576 14946451 15454590 15691604 15918173 15697837 15817168 15721041 16323231 16740394 16977927
5451A6977927K75443k69409M65444k1581M2235J49047N02340m0869J91533L08005
$$ 16977927 17253370 16983961 17449405 17427824 17470059 17619106 18121446 18080577 18272110 18580115
5441A8580115M6339J02907L76988M38136J09297L38532j14823L36662L4222L82498
$$ 18580115 18626454 18729361 19106349 19544485 19653782 19992314 19877491 20214153 20248375 20630873
5431B0630873L84155O51981N1667k59254K40707M36121N47780M94405N17725J21195
$$ 20630873 21015028 21667009 21718676 21459422 21700129 22136250 22684030 23178435 23696160 23817355
5421B3817355j11484P6459O22272K39279M80789K93456R6067M6705L45536N71981
$$ 23817355 23705871 23782330 24404602 24643881 25124670 25418126 25514193 25560898 25906434 26478415
5411B6478415O06412K29678M56835J45856P37173k9335L42348J94202N17767P31909
$$ 26478415 27084827 27314505 27771340 27917196 28654369 28625034 28967382 29161584 29679351 30411260
5401C0411260M74701N61207R63050j10835Q3110R74289O43886R30210M39590N86167
$$ 30411260 30885961 31447168 32410218 32299383 32382493 33356782 34000668 34930878 35370468 35956635
5391C5956635L32577L01833P16042O91234O33064N08347P22603N19566M61321
$$ 35956635 36289212 36591045 37307087 37998321 38631385 39139732 39862335 40381901 40843222
5382D0843222P66246J308199Q37942Q04489Q23647N59512J141033J027370R07610
$$ 40843222 41609468 42917667 43755609 44560098 45383745 45943257 47084290 48111660 49019270
5373D9019270J115096O93062J190190O18153P10411J114079J311641J202604J333844
$$ 49019270 50134366 50827428 52017618 52635771 53346182 54460261 55771902 56974506 58308350
5364E8308350J134330J241842J063778J273150J376029J493277J481832J594279
$$ 58308350 59442680 60684522 61748300 63021450 64397479 65890756 67372588 68966867
5356F8966867J441856J201883J955114J588951J916164J804882J232848K006952
$$ 68966867 70408723 71610606 73565720 75154671 77070835 78875717 80108565 82115517
5348H2115517J609863K074257J841339J730057J718166J787151K053005J706863
$$ 82115517 83725380 85799637 87640976 89371033 91089199 92876350 94929355 96636218
5340I6636218K251192J635606J848400J674893J750788J764767K205787J608516
$$ 96636218 98887410 100523016 102371416 104046309 105797097 107561864 109767651 111376167
5332A11376167J340027J391460J605237J783785J409642J522419J836314J460035
$$ 111376167 112716194 114107654 115712891 117496676 118906318 120428737 122265051 123725086
5324A23725086J878531J359690J057343J659874J681865J756484J667970J640361
$$ 123725086 125603617 126963307 128020650 129680524 131362389 133118873 134786843 136427204
5316A36427204J565354J038027J093202Q65225J312485J052941J140999J019505
$$ 136427204 137992558 139030585 140123787 140989012 142301497 143354438 144495437 145514942
5308A45514942O78373L11920J34618M88177P41836J50699m4085k587M3996m51191
$$ 145514942 146193315 146505235 146639853 147128030 147869866 148020565 147976480 147973893 148017889 147566698
5298A47566698m47329k46781j75682l07293P1605j75123q3777j545o48784l19858
$$ 147566698 147119369 146872588 146696906 146389613 146461218 146286095 146202318 146200773 145551989 145232131
5288A45232131j30264O9251N04135P0930n4078n64102L42845l09960K83022j8806
$$ 145232131 145101867 145171118 145675253 145746183 145692105 145128003 145470848 145160888 145443910 145425104
5278A45425104j470K48515l3268L35863J16841j39398K03981L8231N1209K67548
$$ 145425104 145423634 145672149 145638881 145974744 146091585 145952187 146156168 146194399 146245608 146513156
5268A46513156K22911R84678M97429N28941K58726Q02367J085092P45281N65440
$$ 146513156 146736067 147720745 148218174 148747115 149005841 149808208 150893300 151638581 152204021
5259A52204021J161862Q08626J005954J534208J290906J429550J566224J392695
$$ 152204021 153365883 154174509 155180463 156714671 158005577 159435127 161001351 162394046
5251A62394046J606284J524639K123061K022677K422441K206003K249875K365930
$$ 162394046 164000330 165524969 167648030 169670707 172093148 174299151 176549026 178914956
5243A78914956K573709L047956J814902K804701K996356K899964L042646L040241
$$ 178914956 181488665 184536621 186351523 189156224 192152580 195052544 198095190 201135431
5235B01135431L498126K964490L587961L299975L327913L448751L734097L405837
$$ 201135431 204633557 207598047 211186008 214485983 217813896 221262647 224996744 228402581
5227B28402581L830937M107455L884257L766392L983873L822836L840929L557656
$$ 228402581 232233518 236340973 240225230 243991622 247975495 251798331 255639260 259196916
5219B59196916L895191L654293L347117L577081L850878K956755L060778L022503
$$ 259196916 263092107 266746400 270093517 273670598 277521476 280478231 283539009 286561512
5211B86561512K802723K909976K480810J738114J744504K030142J213664J178521
$$ 286561512 289364235 292274211 294755021 296493135 298237639 300267781 301481445 302659966
5203C02659966Q0563K54335M6689j95008m73035j041647j073750k262062j957792
$$ 302659966 302740529 302994864 303041553 302846545 302373510 301331863 300258113 297996051 296038259
5194B96038259k125637k630529l270938l249457l383873l302114m020263m239222
$$ 296038259 293912622 291282093 288011155 284761698 281377825 278075711 274055448 269816226
5186B69816226l417581m379656m431956m584497m386733m752464m562888m451818
$$ 269816226 266398645 262018989 257587033 253002536 248615803 243863339 239300451 234848633
5178B34848633m606176m755512m842633m398348m298728m272119m582694m232070
$$ 234848633 230242457 225486945 220644312 216245964 211947236 207675117 203092423 198860353
5170A98860353m556804m493292m463717m087561l776566l878681l988141l734492
$$ 198860353 194303549 189810257 185346540 181258979 177482413 173603732 169615591 165881099
5162A65881099l435126l418195l321533l898553l279784k902383l401720l204502
$$ 165881099 162445973 159027778 155706245 151807692 148527908 145625525 142223805 139019303
5154A39019303l396263l262275k895712k440982k311277k788978k443396k694343
$$ 139019303 135623040 132360765 129465053 127024071 124712794 121923816 119480420 116786077
5146A16786077k568516k219687k133215k289287k188846k289245k031077k102001
$$ 116786077 114217561 111997874 109864659 107575372 105386526 103097281 101066204 98964203
5138I8964203j897786j858295j922427j725058j727660j630324j808437j254055
$$ 98964203 97066417 95208122 93285695 91560637 89832977 88202653 86394216 85140161
5130H5140161j352410j780191j347092j142136j766806j473343j520996j358514
$$ 85140161 83787751 82007560 80660468 79518332 77751526 76278183 74757187 73398673
5122G3398673j003732j370290j013624j308990o07757q09807j476609j125110
$$ 73398673 72394941 71024651 70011027 68702037 68094280 67284473 65807864 64682754
5114F4682754j314755j205525m14213r69362p00395j192808m88748o65637p24478
$$ 64682754 63367999 62162474 61748261 60778899 60078504 58885696 58396948 57731311 57006833
5105E7006833o69842j363826q08229l79282q45885q12100j003176o50065j91939
$$ 57006833 56336991 54973165 54164936 53785654 52939769 52127669 51124493 50474428 50282489
5096E0282489p65496p36704m75635o23891o27971k78631q02612m39779k54912
$$ 50282489 49516993 48780289 48304654 47680763 47052792 46774161 45971549 45531770 45276858
5087D5276858r90719m74740l15325m10654k04131l21868n63613n14683k48258
$$ 45276858 44286139 43811399 43496074 43085420 42881289 42559421 41995808 41481125 41232867
5078D1232867J37891o12054o54517k84712l28528o64643j81283R2081m64031P8973
$$ 41232867 41370758 40758704 40104187 39819475 39490947 38826304 38645021 38737102 38273071 38352044
5068C8352044q5403m58623m65277j3249k42437J3938J49428j59309k04733k4210
$$ 38352044 38266641 37808018 37342741 37329492 37087055 37100993 37250421 37091112 36886379 36862169
5058C6862169l37736J81429m82353m39269j50921K14523m407l31717k45606Q2503
$$ 36862169 36524433 36705862 36223509 35784240 35633319 35847842 35843435 35511718 35266112 35348615
5048C5348615o45229k46245r7782j99576j16705k27266l4647k47520K61762l37751
$$ 35348615 34703386 34457141 34359359 34159783 34043078 33815812 33781165 33533645 33795407 33457656
5038C3457656R3305l79206Q1865O3631l39455r2292K36318O04912N4605k37522
$$ 33457656 33550961 33171755 33253620 33317251 32977796 32885504 33121822 33726734 33781339 33543817
5028C3543817l79672M12639L66077p0472K57686M08644N4500N2359j3025Q5708
$$ 33543817 33164145 33576784 33942861 33872389 34130075 34538719 34593219 34645578 34632553 34718261
5018C4718261L55219L38138k5530M39092L65614J30227j1234M53746O74732m68831
$$ 34718261 35073480 35411618 35386088 35825180 36190794 36321021 36309787 36763533 37438265 36969434
5008C6969434L59764O53252O34017P40304k81593L7022M58552O24966J41609N37325
$$ 36969434 37329198 37982450 38616467 39356771 39075178 39112200 39570752 40195718 40337327 40874652
4998D0874652Q59935O25568Q05173J045222L62699Q47411Q76884L37929P10333
$$ 40874652 41734587 42360155 43165328 44210550 44573249 45420660 46297544 46635473 47345806
4989D7345806Q42908R93284Q02097J082725Q99206R27352M82610R15033J356938
$$ 47345806 48188714 49181998 49984095 51066820 51966026 52893378 53375988 54291021 55647959
4980E5647959R09215J087759J117708J339458J130654J375110J239056J209919
$$ 55647959 56557174 57644933 58762641 60102099 61232753 62607863 63846919 65056838
4972F5056838J403571J665541J077639J691608J909842J262784J649569J458849
$$ 65056838 66460409 68125950 69203589 70895197 72805039 74067823 75717392 77176241
4964G7176241J419504J633602J501828J253522J770065J538503J147011J316386
$$ 77176241 78595745 80229347 81731175 82984697 84754762 86293265 87440276 88756662
4956H8756662J320888J064799R65573O58764J095432J268777J211488J175716
$$ 88756662 90077550 91142349 92107922 92766686 93862118 95130895 96342383 97518099
4948I7518099J258700J109306J026467J161366J068878R68108R55605R64905J174979
$$ 97518099 98776799 99886105 100912572 102073938 103142816 104110924 105066529 106031434 107206413
4939A07206413J201881R70862Q32547J104252P72811R13940L56603O38092P98074
$$ 107206413 108408294 109379156 110211703 111315955 112088766 113002706 113359309 113997401 114795475
4930A14795475O74268o4227L86766N82758M27143j33030J14796K3115m76660n73722
$$ 114795475 115469743 115405516 115792282 116375040 116802183 116669153 116783949 116807064 116330404 115756682
4920A15756682r87125q66239j508501j775904j691091j731258k098673j757378
$$ 115756682 114769557 113903318 112394817 110618913 108927822 107196564 105097891 103340513
4912A03340513j689630j792382j575524j638665r42407j503670j679268j554486
$$ 103340513 101650883 99858501 98282977 96644312 95701905 94198235 92518967 90964481
4904I0964481j350422j586934j320757j196187j512724j612933j953481k134454
$$ 90964481 89614059 88027125 86706368 85510181 83997457 82384524 80431043 78296589
4896G8296589j475437j732674j693750j453995j625768j386761j952586j202951
$$ 78296589 76821152 75088478 73394728 71940733 70314965 68928204 66975618 65772667
4888F5772667j874476k241982j369822j239604j464806j447889j791199j514762
$$ 65772667 63898191 61656209 60286387 59046783 57581977 56134088 54342889 52828127
4880E2828127j157035p76714j592771j498568j175121m36154r80412r63431j055209
$$ 52828127 51671092 50894378 49301607 47803039 46627918 46191764 45211352 44247921 43192712
4871D3192712r60663q84278p48278m46789p82754j047667j280502k48444j73816
$$ 43192712 42232049 41347771 40599493 40152704 39369950 38322283 37041781 36793337 36619521
4862C6619521p34734n87601p51837o20766m32165k84188m20382l53982k68491
$$ 36619521 35884787 35297186 34545349 33924583 33492418 33208230 32787848 32433866 32165375
4853C2165375o64958n62068j55294n14799j29884n42773l07173m54243j78655
$$ 32165375 31500417 30938349 30783055 30268256 30138372 29595599 29288426 28834183 28655528
4844B8655528N2208K4727k18592m37200l29964m28162l70458j16712M73281l89285
$$ 28655528 28707736 28732463 28513871 28076671 27746707 27318545 26948087 26831375 27304656 26915371
4834B6915371j2610L88370q2609k983j41102J97163k2719k37780K84585J76862
$$ 26915371 26902761 27291131 27208522 27205539 27064437 27261600 27238881 27001101 27285686 27462548
4824B7462548K54589L51440M40072j51654J72420L99764m3519N3686M33670O0070
$$ 27462548 27717137 28068577 28508649 28356995 28529415 28929179 28885660 28939346 29373016 29433086
4814B9433086J78697M71568K28973M13583O81011K46066L87046L19336O83278
$$ 29433086 29611783 30083351 30312324 30725907 31406918 31652984 32040030 32359366 33042644
4805C3042644N77013J56992L17575N67120M92794M84286K28838M24024J077891
$$ 33042644 33619657 33776649 34094224 34661344 35154138 35638424 35867262 36291286 37369177
4796C7369177P93769K64266N43420M46648O45060J077496J068510M80239P42390
$$ 37369177 38162946 38427212 38970632 39417280 40062340 41139836 42208346 42688585 43430975
4787D3430975R18862N59117R59578J180386J364391J386773J488751R78744J414187
$$ 43430975 44349837 44908954 45868532 47048918 48413309 49800082 51288833 52267577 53681764
4778E3681764J738816J487775J383996J710965J591485J868107J743786J780541
$$ 53681764 55420580 56908355 58292351 60003316 61594801 63462908 65206694 66987235
4770F6987235K247551K460007K201633K613116K575866K570606K945322K387224
$$ 66987235 69234786 71694793 73896426 76509542 79085408 81656014 84601336 86988560
4762H6988560L060220K867329K847102L631770L898247L583432M286763M999064
$$ 86988560 90048780 92916109 95763211 99394981 103293228 106876660 111163423 116162487
4754A16162487O075230N933247O689804P603852Q661057R886682J1219495J2184658
$$ 116162487 122237717 128170964 134860768 142464620 151125677 161012359 172231854 184416512
4746A84416512J3510109J5689929J7423476J9067497K1601347K3826587K5253359
$$ 184416512 197926621 213616550 231040026 250107523 271708870 295535457 320788816
4739C20788816K7909784K8985540K9165151K8490917K4033565J5117526K861096
$$ 320788816 348698600 377684140 406849291 435340208 459373773 474491299 477352395
4732D77352395r392237j9755538k6860803l1155514l2374117l2113246l0186224
$$ 477352395 467960158 448204620 421343817 390188303 357814186 325700940 295514716
4725B95514716k7953100k4470698k1090868j8617572j6484555j4643755j2364511
$$ 295514716 267561616 243090918 222000050 203382478 186897923 172254168 159889657
4718A59889657j0943953r452430q940789q090661p152273o374861n469420n278043
$$ 159889657 148945704 139493274 130552485 122461824 115309551 108934690 103465270 98187227
4710I8187227n193708m375392l876948l699513m101389l333515l615057k789687
$$ 98187227 92993519 88618127 84741179 81041666 76940277 73606762 69991705 67202018
4702F7202018k284717k545934k550204k271702j797978j946948k190357j630047
$$ 67202018 64917301 62371367 59821163 57549461 55751483 53804535 51614178 49984131
4694D9984131k032480j820240j032069j348227j396807j500551j326859j348039
$$ 49984131 47951651 46131411 45099342 43751115 42354308 40853757 39526898 38178859
4686C8178859j218100j245109j005910m66524j086871p01411j209493r57870r26626
$$ 38178859 36960759 35715650 34709740 34243216 33156345 32454934 31245441 30287571 29360945
4677B9360945n59205p88437p58882p76440p29363l35704o28389m92796n19142
$$ 29360945 28801740 28013303 27254421 26477981 25748618 25412914 24784525 24291729 23772587
4668B3772587o23409p40763j063305m2209o0938j208070n51546j35288m2348o17520
$$ 23772587 23149178 22408415 21345110 21302901 21241963 20033893 19482347 19347059 19304711 18687191
4658A8687191p7845m43801l42906O1753q5099o51248o76765J05080k66598m64617
$$ 18687191 18609346 18165545 17822639 17884392 17799293 17148045 16471280 16576360 16309762 15845145
4648A5845145j85671n85138l44131L2706j74027k59234N4336k37304m42621k56281
$$ 15845145 15659474 15074336 14730205 14762911 14588884 14329650 14383986 14146682 13704061 13447780
4638A3447780q362J12460K6649p77752m52523J75365n27289l24529n8206R7646
$$ 13447780 13439418 13551878 13578527 12800775 12348252 12523617 11996328 11671799 11613593 11711239
4628A1711239L40725m68168k31814l84214n5862J50179j38098j25866l36426N7610
$$ 11711239 12051964 11583796 11351982 10967768 10911906 11062085 10923987 10798121 10461695 10519305
4618A0519305m0111k01898n11985k30676K29914k53065J24844p27849j17956K44294
$$ 10519305 10479194 10277296 9765311 9534635 9764549 9511484 9636328 8908479 8790523 9034817
4608I034817k6474M2158k27803k27085l54211J05816l4475J93814l69732m8076
$$ 9034817 9008343 9050501 8822698 8595613 8241402 8347218 8312743 8506557 8136825 8088749
4598H088749J54330k84242q0207J8481j1975l71259K92333m6800k27076n7893
$$ 8088749 8243079 7958837 7878630 7897111 7885136 7513877 7806210 7759410 7532334 7474441
4588G474441l68960j04342l12925K08999J56330q6443k07583L5617J33315j48904
$$ 7474441 7105481 7001139 6688214 6897213 7053543 6967100 6759517 6795134 6928449 6779545
4578F779545J49642L46596o57631q59617K96588q8090j78015k29972j13177L24174
$$ 6779545 6929187 7275783 6618152 5758535 6055123 5967033 5789018 5559046 5445869 5770043
4568E770043j36640K70802j35400k90796L34376k38808J038J87850k12786L80447
$$ 5770043 5633403 5904205 5768805 5478009 5812385 5573577 5574615 5762465 5549679 5930126
4558E930126O4840l54618k04764O94657K39248q37845j24272Q3328m89456J42939
$$ 5930126 5994966 5640348 5435584 6130241 6369489 5531644 5407372 5490700 5001244 5144183
4548E144183J39971j54012J92643o7737P6765m6186o8459J36679l29005K07210
$$ 5144183 5284154 5130142 5322785 5255048 5331813 5285627 5217168 5353847 5024842 5232052
4538E232052P1496k51723k69147j97552J7333J25285J60853K78907J02807l09445
$$ 5232052 5303548 5051825 4782678 4585126 4602459 4727744 4888597 5167504 5270311 4960866
4528D960866P4837r2911n52404r211L54956J15589l40780J31687M86717n89057
$$ 4960866 5035703 4942792 4390388 4381177 4736133 4851722 4510942 4642629 5129346 4540289
4518D540289P8432k16963k05278J3854M33386M32940j00991l93043J59276P6849
$$ 4540289 4618721 4401758 4196480 4210334 4643720 5076660 4975669 4582626 4741902 4818751
4508D818751J2508K4222P4821k96419K0355K98329k11804j3594O2234K8315J03876
$$ 4818751 4831259 4855481 4930302 4633883 4654238 4952567 4740763 4727169 4789403 4817718 4921594
4497D921594O957Q6587P8592o89946L42160J63436j53378j6363K03856k09305
$$ 4921594 4928551 5015138 5093730 4403784 4745944 4909380 4756002 4739639 4943495 4734190
4487D734190l58477J95927q2501L14119L44792j34127k33749J14572L90804k6886
$$ 4734190 4375713 4571640 4489139 4803258 5148050 5013923 4780174 4894746 5285550 5258664
4477E258664r1843m64556J05669M71701j40516L047k86775J80943J56237J2662
$$ 5258664 5166821 4702265 4807934 5279635 5139119 5142166 4855391 5036334 5192571 5205233
4467E205233K94013j95734M4855m2950M49025k8296r5986L545J08926K18188p1810
$$ 5205233 5499246 5303512 5348367 5305417 5754442 5726146 5630160 5633705 5742631 5960819 5889009
4456E889009J08178J43848N72616j31764n92843L75401L53194J76731J59597J18714
$$ 5889009 5997187 6141035 6713651 6581887 5989044 6364445 6717639 6894370 7053967 7172681
4446G172681q9302k03320L24712K33835L29113K52387j34364k17270J26932J0521
$$ 7172681 7083379 6880059 7204771 7438606 7767719 8020106 7885742 7668472 7795404 7805925
4436G805925K98111P54538K19558k00940R2435M73692L37756R4738l15946L49305
$$ 7805925 8104036 8858574 9078132 8877192 8969627 9443319 9781075 9875813 9559867 9909172
4426I909172K54438K98538L11036r5995J01438L46168R26479N95008N75394L04608
$$ 9909172 10163610 10462148 10773184 10677189 10778627 11124795 12051274 12646282 13221676 13526284
4416A3526284K79210P7183N55721Q22042L92236L62715N17751N07945N56833O36096
$$ 13526284 13805494 13882677 14438398 15260440 15652676 16015391 16533142 17041087 17597920 18234016
4406A8234016K50867M16386O56645N31431O21498L97870K52783M87794N53411
$$ 18234016 18484883 18901269 19557914 20089345 20710843 21108713 21361496 21849290 22402701
4397B2402701J331101J115789P91727N98420J295413J569980J196289J702291
$$ 22402701 23733802 24849591 25641318 26239738 27535151 29105131 30301420 32003711
4389C2003711J813395K286833K357888L040318L011878L513387L517616L351065
$$ 32003711 33817106 36103939 38461827 41502145 44514023 48027410 51545026 54896091
4381E4896091L740848L211306L345527L189230L431282M062139M049794M799717
$$ 54896091 58636939 61848245 65193772 68383002 71814284 75876423 79926217 84725934
4373H4725934M453294L373671K494670J676422J472496J752857K205494K244762
$$ 84725934 89179228 92552899 95047569 96723991 98196487 99949344 102154838 104399600
4365A04399600K606325N01987j187493j591665k397460k865145k812076k550615
$$ 104399600 107005925 107507912 106320419 104728754 102331294 99466149 96654073 94103458
4357I4103458k227575k719394l450281l799105m646514m949674m352187l515025
$$ 94103458 91875883 89156489 85706208 81907103 77260589 72310915 67958728 64443703
4349F4443703l366888l520861l535612l515452l363653l923630l403664l255244
$$ 64443703 61076815 57555954 54020342 50504890 47141237 43217607 39813943 36558699
4341C6558699l237930k435719k338026k021914j716707j609017j411382j365230
$$ 36558699 33320769 30885050 28547024 26525110 24808403 23199386 21788004 20422774
4333B0422774j143773o41611j015617o41003l95237j118875j137369m26276p66942
$$ 20422774 19279001 18637390 17621773 16980770 16585533 15466658 14329289 13903013 13136071
4324A3136071m53948j3254l63076o46779j97479n89219l83343K9074l62964k84339
$$ 13136071 12682123 12668869 12305793 11659014 11461535 10872316 10488973 10518047 10155083 9870744
4314I870744k57199j92721k35869l53245m33237k99695l2250k9578n82177R0412
$$ 9870744 9613545 9420824 9184955 8831710 8398473 8098778 8066528 8036950 7454773 7545185
4304G545185m25676p33959J86096l38027k01934M0127j6134K26533k55986m40910
$$ 7545185 7119509 6385550 6571646 6233619 6031685 6071812 6055678 6282211 6026225 5585315
4294E585315N7150M8897l49278K34222p17643m26781k33733j4647P4306p6120
$$ 5585315 5642465 5691362 5342084 5576306 4858663 4431882 4198149 4183502 4257808 4181688
4284D181688J12377j81769j27303l34657K16948n5234M35337q3099j03022j44314
$$ 4181688 4294065 4112296 3984993 3650336 3867284 3812050 4247387 4164288 4061266 3916952
4274C916952l27110j96562o5582M47203k97187J60520J25788r2433j01151j10976
$$ 3916952 3589842 3393280 3327698 3774901 3477714 3638234 3764022 3671589 3570438 3459462
4264C459462K18774m07961L47K50995k20067r4072Q4223j14039j56839n3464N28705
$$ 3459462 3678236 3270275 3270622 3521617 3301550 3207478 3291701 3177662 3020823 2967359 3496064
4253C496064j09572m67260j21136L14373l60314n63636j3479L44324m23689P8450
$$ 3496064 3386492 2919232 2798096 3112469 2752155 2188519 2175040 2519364 2095675 2174125
4243B174125J21740k43741j61177L1325K74710j21197k21056j47108J74575M40254
$$ 2174125 2295865 2052124 1890947 1922272 2196982 2075785 1854729 1707621 1882196 2322450
4233B322450J4971k55022k70354N8316j00785K97050K02238m98060p3940M08260
$$ 2322450 2337421 2082399 1812045 1870361 1769576 2066626 2268864 1770804 1696864 2105124
4223B105124J25660k75028M37313k34343j38298k79343L38813k12118J898O3344
$$ 2105124 2230784 1955756 2393069 2158726 2020428 1741085 2079898 1867780 1869678 1933022
4213A933022J21839J1346k00715J34805j71667l25463N7012p3893P8064n8620
$$ 1933022 2054861 2066207 1865492 2000297 1828630 1503167 1560179 1486286 1564350 1505730
4203A505730q1340J15196N52793l55210k89024J14065K31140l31200k7665R4611
$$ 1505730 1424390 1539586 2092379 1737169 1448145 1562210 1793350 1462150 1434485 1529096
4193A529096k99302j30111P7585l00006J53410K74047N497o3823J44336N0092
$$ 1529096 1229794 1099683 1177268 877262 1030672 1304719 1310216 1246393 1390729 1440821
4183A440821J19713l3098k23240K17031j22982k31850p4103J82701j35506Q7167
$$ 1440821 1560534 1527436 1304196 1521227 1398245 1166395 1092292 1274993 1139487 1226654
4173A226654M6236J46055k71412J82319J0600L51119k85047k517o9856L6769j79522
$$ 1226654 1272890 1418945 1147533 1329852 1340452 1691571 1406524 1404007 1334151 1370920 1191398
4162A191398k92677j24731n3329L17490K51049l90867K98475R8561j62657R9835
$$ 1191398 898721 773990 720661 1038151 1289200 898333 1196808 1295369 1132712 1232547
4152A232547j09535J65059q2651K43699m0995j88425L52202P5901o29526L0471
$$ 1232547 1123012 1288071 1205420 1449119 1408124 1219699 1571901 1647802 1018276 1048747
4142A048747L06387k29990j34311r0872L79075P4443n37177N89600j149k69949
$$ 1048747 1355134 1125144 990833 899961 1279036 1353479 816302 1405902 1404753 1134804
4132A134804K19955J43111M44302l94402L59j62136l25175j67640j05396N98139
$$ 1134804 1354759 1497870 1942172 1547770 1548129 1385993 1060818 893178 787782 1385921
4122A385921K28250n1808k4170k31530j32148m07819L9685R7182J858J25116J21669
$$ 1385921 1614171 1562363 1538193 1306663 1174515 766696 806381 903563 905421 1030537 1152206
4111A152206K93570m9227l38501N3409L71095j79948J2414l58650L23560j55053
$$ 1152206 1445776 1396549 1058048 1111457 1482552 1302604 1315018 956368 1279928 1124875
4101A124875o7152L52436k24323J39032M63354M4046k66492J3053k16249J56110
$$ 1124875 1057723 1410159 1185836 1324868 1788222 1832268 1565776 1578829 1362580 1518690
4091A518690l2206r5067K95105j72850k9664j3243J41296K54349p2625l40465
$$ 1518690 1486484 1391417 1686522 1513672 1484008 1470765 1612061 1866410 1793785 1453320
4081A453320o1340j35601K85231Q1478k20687L59967l55633K47403J17414N9932
$$ 1453320 1391980 1256379 1541610 1623088 1402401 1762368 1406735 1654138 1771552 1831484
4071A831484L79826j14261n13401J63652K54295k57086j65030R8221N25937J59452
$$ 1831484 2211310 2097049 1583648 1747300 2001595 1744509 1579479 1677700 2203637 2363089
4061B363089j39590l02005K21096M04160j59139j15710M22625J925k76301L10036
$$ 2363089 2223499 1921494 2142590 2546750 2387611 2271901 2694526 2696451 2420150 2730186
4051B730186l81463L04440k81165J96958J31107j70683M0928M22556L66512l07451
$$ 2730186 2348723 2653163 2371998 2568956 2700063 2529380 2570308 2992864 3359376 3051925
4041C051925M0178o9410j70377m97012N39226J82071n71033j78891K69826K71281
$$ 3051925 3092103 3022693 2852316 2355304 2894530 3076601 2505568 2326677 2596503 2867784
4031B867784p30370j345O12489j85435Q0233J68468j56946k1422j89567K35627
$$ 2867784 2137414 2136069 2748558 2563123 2643356 2811824 2654878 2633456 2443889 2679516
4021B679516M29267l18509J02124l16026Q3092N12050L02938m09807q17896J74598
$$ 2679516 3108783 2790274 2892398 2576372 2659464 3171514 3474452 3064645 2246749 2421347
4011B421347M19677P02256l29708k47166J96800K92132N23276n65368j87041L18478
$$ 2421347 2841024 3543280 3213572 2966406 3163206 3455338 3978614 3413246 3226205 3544683
4001C544683L97760K44043N18450J86049K04882m41248J32339K86415O27918q0307
$$ 3544683 3942443 4186486 4704936 4890985 5095867 4654619 4786958 5073373 5701291 5620984
3991E620984R59165O28855N5603R92937J377920J100239J259814J091872K071650
$$ 5620984 6580149 7209004 7264607 8257544 9635464 10735703 11995517 13087389 15159039
3982A5159039Q21970o74043p23703j140200j052267j688508j418869j406488o20406
$$ 15159039 15981009 15306966 14583263 13443063 12390796 10702288 9283419 7876931 7256525
3973G256525p79970k86093k96857j86752l60482L2334j89843k76724k3291p7200
$$ 7256525 6476555 6190462 5893605 5706853 5346371 5378705 5188862 4912138 4888847 4811647
3963D811647n4945j05090k31101L37063J45020J7521J41488Q8782l39801K21906
$$ 4811647 4756702 4651612 4420511 4757574 4902594 4920115 5061603 5150385 4810584 5032490
3953E032490K12709m0426N2174k78890L4912l5075p891k92001J90902N6361k57817
$$ 5032490 5245199 5204773 5256947 4978057 5012969 4977894 4970003 4678002 4868904 4925265 4667448
3942D667448M58003m821j30403Q491J11662M72708K26910K51148n10257o48999
$$ 4667448 5125451 5120630 4990227 4998718 5110380 5583088 5809998 6061146 5550889 4901890
3932D901890L48465K03248R2297r5697J84303n23821m3991l04986j58978J50875
$$ 4901890 5250355 5453603 5545900 5450203 5634506 5110685 5066694 4761708 4602730 4753605
3922D753605L79073N78354n91241J49886J35353n65923j74570M46864J29690M3784
$$ 4753605 5132678 5711032 5119791 5269677 5405030 4839107 4664537 5111401 5241091 5284875
3912E284875o35598j01871L42571l89988J80969J17121k26316k76863J68970J39264
$$ 5284875 4649277 4547406 4889977 4499989 4680958 4798079 4571763 4294900 4463870 4603134
3902D603134K4741n0220L3506J66963j19529L52161K73136j5727k09138M17628
$$ 4603134 4627875 4577655 4611161 4778124 4658595 5010756 5283892 5268165 5059027 5476655
3892E476655K09435L8389L76404J50893O12360K09354K91815K89786L91253O34126
$$ 5476655 5686090 5724479 6100883 6251776 6864136 7073490 7365305 7655091 8046344 8680470
3882H680470N94692O75757Q47997M27004j77474L18545J90236k27244k11388m8904
$$ 8680470 9275162 9950919 10798916 11225920 11048446 11366991 11557227 11329983 11118595 11069691
3872A1069691m81616j90328j88587m51387K3515j09167j39679k17938m39402j33346
$$ 11069691 10588075 10397747 10209160 9757773 9781288 9672121 9532442 9314504 8875102 8741756
3862H741756m02922o72770l19198m85106L56786n26271p49223k90296m22458l63005
$$ 8741756 8338834 7666064 7346866 6861760 7218546 6692275 5943052 5652756 5230298 4867293
3852D867293j14618k25673l65076m97415M85j48774k33096K60585l2681J2884
$$ 4867293 4752675 4527002 4161926 3664511 3664996 3516222 3283126 3543711 3511030 3523914
3842C523914j85077k20691K25415j44187J44019r8314j44732J31119k64043J44323
$$ 3523914 3338837 3118146 3343561 3199374 3343393 3245079 3100347 3231466 2967423 3111746
3832C111746p7466k0144j57151L2842q9272l391k56636N1695P6126M4015m2651
$$ 3111746 3034280 3014136 2856985 2889827 2800555 2797164 2540528 2592223 2668349 2712364 2669713
3821B669713M13l7465J30515k57192j11197K93979j13547k25087m90178J56206
$$ 2669713 2670126 2632661 2763176 2505984 2394787 2688766 2575219 2350132 1859954 2016160
3811B016160K36281j96155J36832k47923k28771j69505J95776K45691n82730K31372
$$ 2016160 2252441 2056286 2193118 1945195 1716424 1546919 1742695 1988386 1405656 1637028
3801A637028J62835j50713n6344J69306O8826j0661j56904j02201K48403J51349
$$ 1637028 1799863 1649150 1592806 1762112 1830938 1820277 1663373 1561172 1809575 1960924
3791A960924l52153j3454l6762l42577K31964J01234J89798j98299J19539o22935
$$ 1960924 1608771 1595317 1558555 1215978 1447942 1549176 1738974 1540675 1660214 1037279
3781A037279j54933p5430J9796Q8693M54476j65140k43442M61827j14855n69911
$$ 1037279 882346 806916 826712 915405 1369881 1204741 961299 1423126 1308271 738360
3771G38360K50684P5549m45637J10813M39216m12488n2534j50510j09719J0210
$$ 738360 989044 1064593 618956 729769 1168985 756497 703963 553453 443734 453944
3761D53944K7845L89063J06605n2914K64205O5991o62981n4092L53985r4868O3297
$$ 453944 481789 870852 977457 924543 1188748 1254739 591758 537666 891651 796783 860080
3750H60080j46065M8038k74435L53689P46364n66349J51657j86133j66007R449
$$ 860080 714015 762053 487618 841307 1587671 1021322 1172979 986846 820839 830288
3740H30288L3820N17845J84443j82418q6957o9408P2016k52718j35201j9362M34371
$$ 830288 864108 1381953 1566396 1383978 1297021 1227613 1299629 1046911 911710 892348 1326719
3729A326719J95115p06728K40190N51876j02622k26191l14325M09052P6700K03135
$$ 1326719 1521834 815106 1055296 1607172 1504550 1278359 964034 1373086 1449786 1652921
3719A652921j77420j12149n39776K07279R7782L1798r1934k1432K10469J52228
$$ 1652921 1475501 1363352 823576 1030855 1128637 1160435 1068501 1047069 1257538 1409766
3709A409766m55629j15377R5421p3005j03540J11572k7069J70638j20115l7979
$$ 1409766 954137 838760 934181 861176 757636 869208 842139 1012777 892662 854683
3699H54683L5661Q9030N2314o0127O2734M66874k2899m20441j35484R3212n9613
$$ 854683 890344 979374 1031688 971561 1034295 1501169 1478270 1057829 922345 1015557 955944
3688I55944j7765N1400K3883L55310k17596j88769L43713K16617m49584l27765
$$ 955944 938179 989579 1013462 1368772 1151176 962407 1306120 1522737 1073153 745388
3678G45388N3930J30797k33712j8003K10933j38430J12212j85158Q2796N08549
$$ 745388 799318 930115 696403 678400 889333 750903 863115 677957 760753 1269302
3668A269302n55991J26483K45515l31200k82768L53471M4954K3047k47866J29191
$$ 1269302 713311 839794 1085309 754109 471341 824812 869766 892813 644947 774138
3658G74138M6044r2583j25409J25361M0858q8754R8151m27602K25822R6740j19786
$$ 774138 820182 727599 602190 727551 768409 679655 777806 350204 576026 672766 552980
3647E52980L98136L5798l68400O9834M9064J65492K85317N98572l7538o49674
$$ 552980 951116 986914 618514 688348 737412 902904 1188221 1786793 1749255 1099581
3637A099581k31596r5860J46988K21455l6379J78350J95158J29966m5332l79104
$$ 1099581 867985 772125 919113 1140568 1104189 1282539 1477697 1607663 1562331 1183227
3627A183227M2422K87355K06901k32891k58555n9941L7137K58991j13860j67268
$$ 1183227 1225649 1513004 1719905 1487014 1228459 1168518 1205655 1464646 1350786 1183518
3617A183518O53055p2266N4090l21018J20737o2731P15389J6334J1849K5919j99218
$$ 1183518 1836573 1764307 1818397 1497379 1618116 1555385 2270774 2287108 2298957 2324876 2125658
3606B125658n0719m12052K95648J09895k98972K76418O30605L12171k06882M7059
$$ 2125658 2074939 1662887 1958535 2068430 1769458 2045876 2676481 2988652 2781770 2828829
3596B828829l54513L58960J36208K118j33815J02728K26510K50814L22995m385
$$ 2828829 2474316 2833276 2969484 2971602 2837787 2940515 3167025 3417839 3740834 3736449
3586C736449J28288N4124L93728L28101K43601J16617P15752K95568M59868M67883
$$ 3736449 3864737 3918861 4312589 4640690 4884291 5000908 5716660 6012228 6472096 6939979
3576F939979L67925J50299L45739M41838K92814l0210K63303J44672n6453K67165
$$ 6939979 7307904 7458203 7803942 8245780 8538594 8508384 8771687 8916359 8859906 9127071
3566I127071K08145l0810O05945O66673l40748o0320K08774l22646K03875K1486
$$ 9127071 9335216 9304406 9910351 10577024 10236276 10175956 10384730 10062084 10265959 10287445
3556A0287445o15424K14452r7407n99875J91457j25225N8745p1265n98737k66252
$$ 10287445 9672021 9886473 9789066 9189191 9380648 9255423 9314168 9242903 8644166 8377914
3546H377914P7307q24567k5073o16431m86936j49163o56524M3117l17697m32509
$$ 8377914 8455221 7630654 7605581 6989150 6502214 6353051 5696527 5739644 5421947 4989438
3536D989438m01909n5331p9947n74482j04043m22751L10650O38044o47090k23141
$$ 4989438 4587529 4532198 4452251 3877769 3773726 3350975 3661625 4299669 3652579 3429438
3526C429438l6682l35851m52039m663l8345k91227L52746m54247J07139J58889
$$ 3429438 3392756 3056905 2604866 2600203 2561858 2270631 2623377 2169130 2276269 2435158
3516B435158j57769j45670l6172j15280K65430J04655k50953k15584J36275l85141
$$ 2435158 2277389 2131719 2095547 1980267 2245697 2350352 2099399 1883815 2020090 1634949
3506A634949Q7650L5705n70167K49769L43947J50080l49663J73644j96417j15499
$$ 1634949 1722599 1758304 1188137 1437906 1781853 1931933 1582270 1755914 1559497 1443998
3496A443998J47958k48995l61203J68650j27850j93815o003Q5257L8576j57064
$$ 1443998 1591956 1342961 981758 1150408 1022558 828743 822740 907997 946573 789509
3486G89509J06921j77897J03375M44856j58370K77884q3766l64028K65239L46107
$$ 789509 896430 718533 821908 1266764 1108394 1386278 1302512 938484 1203723 1549830
3476A549830l21377k79536K67687m28751J02195l2387l08806m38478K74747j77302
$$ 1549830 1228453 948917 1216604 787853 890048 857661 548855 110377 385124 207822
3466B07822r6591K54805J21488J04724Q7708K54154R065k43252l26393M58991
$$ 207822 111231 366036 487524 592248 679956 934110 943175 699923 373530 832521
3456H32521L71625k32001j78070O3313j88061j28179m29058J35600L50425J05824
$$ 832521 1204146 972145 794075 857388 669327 541148 112090 247690 598115 703939
3446G03939n0026k71460k29829K91049K51776K89427j9718j53051n40119J09078
$$ 703939 653913 382453 152624 443673 695449 984876 965158 812107 271988 381066
3436C81066k02893M06291R0307j76334l3298j27183L44332p8129k49223J63184
$$ 381066 178173 584464 674771 498437 465139 337956 682288 604159 354936 518120
3426E18120l45384K37721n1516k8710J90074j10373J39975j54456l98566L38232
$$ 518120 172736 410457 358941 330231 520305 409932 549907 395451 -3115 335117
3416C35117M93985l46401K16740M6133k31778k0440k09045P3309J71196J98455
$$ 335117 829102 482701 699441 745574 513796 493356 284311 357620 528816 727271
3406G27271k48759p7057m69952K21200M83824k44003l2826l31420O0541L56184
$$ 727271 478512 401455 -68497 152703 636527 392524 359698 28278 88819 445003
3396D45003O8911k7552M1817o0095L49674j57095k04790j2342n8135l78184j59545
$$ 445003 513914 486362 528179 468084 817758 660663 455873 443531 385396 7212 -152333
3385a52333J97162K22237k89891M50963J79417J70462k19841l57051n1000n0382
$$ -152333 44829 267066 -22825 428138 607555 778017 558176 201125 150125 99743
3375I9743J3205l57515L7866L00684j80960J12295J33485K09204m14198j01167
$$ 99743 112948 -244567 -206701 93983 -86977 25318 158803 368007 -46191 -147358
3365a47358L64374o2982J89590k38493j92132J13356k367J35537N2146r3876J71154
$$ -147358 217016 154034 343624 105131 -87001 26355 23988 159525 211671 117795 288949
3354B88949L08107M2865L4531p4713k09362o0152k20328K18769M4042l25466j95429
$$ 288949 597056 639921 674452 599739 390377 330225 109897 328666 372708 47242 -148187
3343a48187K02664K68890J4439j04599J7787k11762j21786J29721K0027J20763
$$ -148187 54477 323367 337806 233207 250994 39232 -82554 47167 67194 187957
3333A87957k02142J58945M6930P7236k88496r7917M39609N24469j41602j89056
$$ 187957 -14185 144760 191690 268926 -19570 -117487 322122 846591 704989 515933
3323E15933k56610o16691J11373M05520m2690k63461L80743r6486R403r560K66294
$$ 515933 259323 -357368 -245995 159525 116835 -146626 234117 137631 147034 137474 403768
3312D03768K47544l6773j77559n27727k3630M58221n254O3861m38387Q1558J40952
$$ 403768 651312 614539 436980 -90747 -114377 343844 338590 402451 -35936 45622 186574
3301A86574j17836K33854L6926n36559m95560N18140L06798K06759M06907J11221
$$ 186574 68738 302592 339518 -197041 -692601 -174461 132337 339096 746003 857224
3291H57224o29542M7408J56093l48868J90130M03176l02370j25029l23279r8962
$$ 857224 227682 275090 431183 82315 272445 675621 373251 248222 -75057 -174019
3281a74019M91652L84312r2476j46298p2394J6611j880J38311K6685k72863k27446
$$ -174019 317633 701945 609469 463171 390777 407388 405508 543819 570504 297641 70195
3270G0195J24119L59260K08233n2670J31318k27781k07832j68378M39004M96733
$$ 70195 194314 553574 761807 709137 840455 612674 404842 236464 675468 1172201
3260A172201k30386j03824m61730K19185l9995j26745K98235J2141m13025K51659
$$ 1172201 941815 837991 376261 595446 555451 428706 726941 739082 326057 577716
3250E77716K82732k66325j39577K17346O1254p1862J16602O8506j83652j59115
$$ 577716 860448 594123 454546 671892 733146 661284 777886 846392 662740 503625
3240E03625K19272m9315k84941q4581j03265L99168j40974L25864L32710o33619
$$ 503625 722897 673582 388641 304060 200795 599963 458989 784853 1117563 483944
3230D83944p28471R1127O59863r7083k246K36070j96435K02407l18880K0450M76703
$$ 483944 -244527 -153400 506463 409380 407134 643204 446769 649176 330296 350746 827449
3219H27449j12463K99866R45K39964L19809l19189J05404q0508j86958J06604
$$ 827449 714986 1014852 1015797 1255761 1575570 1256381 1361785 1281277 1094319 1200923
3209A200923J42896j33430K52K90916k664J40003n49210J62345J14673m00713
$$ 1200923 1343819 1210389 1210641 1501557 1498893 1638896 1089686 1252031 1366704 965991
3199I65991M0739j67261p9046j06741L2429K24808J18136l65376J54198M7980
$$ 965991 1006730 839469 760423 653682 686111 910919 1029055 663679 817877 865857
3189H65857o5971Q1033l43583p5668K39930j97496p3864J60475L6558k7488L9797
$$ 865857 799886 880919 537336 461668 701598 504102 430238 590713 627271 599783 639580
3178F39580J4642J43020N75k96474m379m3206J92122j91410q8821J61890k96629
$$ 639580 654222 797242 797817 501343 496964 453758 645880 454470 365649 527539 230910
3167B30910j49005M66629P4150L5722k89891l07085j55510l4590P9333l3950O42340
$$ 230910 81905 548534 622684 658406 368515 61430 -94080 -128670 -49337 -83287 559053
3156E59053O8513j41056O5476K55019L5483q2307K8702j37959K93744m90l17814
$$ 559053 627566 486510 551986 807005 842488 760181 788883 650924 944668 944178 626364
3145F26364k14007j66291r0845J53993L5701J39344L71657k13834K6000n7354
$$ 626364 412357 246066 155221 309214 344915 484259 855916 642082 668082 610728
3135F10728L40918J29526k30706P86232K9925j48857J15983k75160K10076K59575
$$ 610728 951646 1081172 850466 1636698 1666623 1517766 1633749 1358589 1568665 1828240
3125A828240o4296j0458l03186M21m56436J45106Q4418k2073k21655k76112j91142
$$ 1828240 1763944 1753486 1450300 1450721 994285 1139391 1223809 1201736 980081 703969 512827
3114E12827K40593q5373J2124m55137n9848P29233o3607l02158k10134J008L4765
$$ 512827 753420 668047 680171 225034 165186 894419 830812 528654 318520 319528 354293
3103C54293N569M22155l41128l63442k24407o6482J78346K78321M41354k20423
$$ 354293 359862 782017 440889 77447 -146960 -213442 -35096 243225 684579 464156
3093D64156j72811k08182K48194o5550j19587j95349K22858j27347J51966j55984
$$ 464156 291345 83163 331357 265807 146220 -49129 173729 46382 198348 42364
3083D2364L67311Q6150m9513p57812P7706j2899M04892j9670L1264j78258p7440
$$ 42364 409675 495825 446312 -311500 -233794 -246693 158199 138529 169793 -8465 -85905
3072h5905R518j60539k85051K34611L97429l04840K90521K38161J18852k75814
$$ -85905 -76387 -236926 -521977 -287366 110063 -194777 95744 333905 452757 176943
3062A76943N2877l4664J00231j56156K24880k98490J01339j40574k75291k6480
$$ 176943 229820 195156 295387 139231 364111 65621 166960 26386 -248905 -275385
3052b75385L42574o7426k6868k67215K82566K93299k70345l32566M90770Q2196
$$ -275385 67189 -237 -27105 -294320 -11754 281545 11200 -321366 169404 251600
3042B51600J8158J59729l47387k12157l5880j55902J84048J94324j74764j23374
$$ 251600 269758 429487 82100 -130057 -165937 -321839 -137791 56533 -118231 -241605
3032b41605J80611j48996M09861P5048K52020K55807l07836l53865l38251q2904
$$ -241605 -60994 -209990 199871 274919 526939 782746 474910 121045 -217206 -300110
3022c00110J35651O55661m89202l13559J63902L67185M7059P58K55816p390o1061
$$ -300110 -164459 491202 2000 -311559 -147657 219528 266587 267345 523161 515771 454710
3011D54710N2989n9560m60173j37108K38808j62335J04620J39414P664N2830l9568
$$ 454710 507699 448139 -12034 -149142 89666 -72669 31951 171365 179029 231859 192291
3000A92291n0575J90736j76333j61750j09632J33375k79481L11403r7136K00016
$$ 192291 141716 332452 156119 -5631 -115263 18112 -261369 50034 -47102 152914
2990A52914K45558K2947J94882o57639q1482k12495L39088M46086m17575L388
$$ 152914 398472 421419 616301 -41338 -122820 -335315 3773 449859 32284 35672
2980C5672j91119O8188M80430k40999m95013R6470K88337N50711n11702l99114
$$ 35672 -155447 -87259 393171 152172 -342841 -246371 41966 592677 80975 -318139
2970c18139M13527J85578J56887j4661j52605j65165K5838L79989m8511j00901
$$ -318139 95388 280966 437853 423192 270587 105422 131260 511249 462738 361837
2960C61837j04527j80575j79724J80086M4306r6387K28919L8005l17263l6352
$$ 361837 257310 76735 -102989 77097 121403 25016 253935 291940 -25323 -61675
2950f1675M25853j28755J25742L04080m32506m87995M25840L930L9884r9205j0396
$$ -61675 364178 235423 361165 665245 232739 -255256 170584 174514 214398 115193 104797
2939A04797K1051j18426J45437N0781l65667J17978K83167O7368m3129L25910
$$ 104797 125848 7422 152859 203640 -162027 -44049 239118 306486 263357 589267
2929E89267k5655m08413p6851k73829K91604L63295j16858j29283m78767O13430
$$ 589267 563612 155199 78348 -195481 96123 459418 342560 213277 -265490 347940
2919C47940m5700k48625K66348m182j12773k78619M97885k40351K4978K2892k06846
$$ 347940 302240 53615 319963 315781 203008 -75611 422274 181923 206901 229793 22947
2908B2947N9708l4211j64841j50139P2962K85915j7453j39131K88566J77152j41998
$$ 22947 82655 48444 -116397 -266536 -193574 92341 74888 -64243 224323 401475 259477
2897B59477J1833o924j47727N9653L60790J81689J31136p31088K1599K12584J77850
$$ 259477 271310 264386 116659 176312 537102 718791 849927 118839 140438 353022 530872
2886E30872L77599m79774j19031J03823N0603j245J79582P3210m00965r8764L24315
$$ 530872 908471 428697 309666 413489 464092 462847 642429 715639 314674 215910 540225
2875E40225j04737O9821L32960j54950l83743M6497J69406J86551k49576P9353
$$ 540225 435488 505309 838269 683319 299576 346073 515479 702030 452454 531807
2865E31807k06821j49387M5453K92249n0777j966R2470p4917l11305o4064L19051
$$ 531807 324986 175599 221052 513301 462524 460558 553028 478111 166806 102742 421793
2854D21793J705l74699J64064r5907J76411j75576M87693j29469l76797O0897
$$ 421793 423498 48799 212863 116956 293367 117791 605484 476015 99218 160115
2844A60115J75275L35306j78015j22874o0098K4291J29958R6732J58131p7051
$$ 160115 335390 670696 492681 369807 309709 334000 463958 560690 718821 641770
2834F41770l82063J84217j56994K1280L51510m50116k40245L08192k56886k08112
$$ 641770 259707 443924 286930 308210 659720 209604 -30641 277551 20665 -187447
2824a87447K23870M96692k42103k67631J28985l8306K63909j9643l96563L05164
$$ -187447 36423 533115 291012 23381 152366 114060 377969 358326 -38237 266927
2814B66927k60896K98368L975k09196J85788r5697j53228L03342K92148j07542
$$ 266927 6031 304399 308374 99178 284966 189269 36041 339383 631531 523989
2804E23989q28055N23243k05506K17917J07076m60812K49214m0913k06879j27068
$$ 523989 -304066 219177 13671 231588 338664 -122148 127066 86153 -120726 -247794
2794b47794m8115K75563r8676k02942L1578J20225p059J55030m4915l32951r8043
$$ -247794 -295909 -20346 -119022 -321964 -290386 -170161 -177220 -22190 -67105 -400056 -498099
2783d98099L94305j7481m60692J968N95632K03661m21570j32034L480p7390M52082
$$ -498099 -103794 -121275 -581967 -579999 15633 219294 -202276 -334310 -330830 -408220 43862
2772D3862J40464k5813J33158m15842J52298m64611j92426r2553L14600K68307
$$ 43862 184326 158513 291671 -124171 28127 -436484 -628910 -721463 -406863 -138556
2762a38556R8506J87582j05192k62909k95886J67660j67472K46263L77416J10276
$$ -138556 -40050 147532 42340 -220569 -516455 -348795 -516267 -270004 107412 217688
2752B17688J7358k08608j89698k34803j30118r0167M5787K71114o2694L0721k6454
$$ 217688 235046 26438 -163260 -398063 -528181 -618348 -572561 -301447 -364141 -333420 -359874
2741c59874M6173K74621j53074J81261J42753L7256l53513j42888J79245L8565
$$ -359874 -313701 -39080 -192154 -10893 131860 169116 -184397 -327285 -148040 -109475
2731a09475m30030L18701R1559O4464K2782P250k71338J10819J96535k15624M3775
$$ -109475 -539505 -220804 -129245 -64781 -41999 -34749 -306087 -195268 1267 -214357 -170582
2720a70582j37445l1735j30791M8210m7425N7158L1016j62657k18327O2146L21920
$$ -170582 -308027 -339762 -470553 -422343 -469768 -412610 -381594 -544251 -762578 -700432 -378512
2709c78512q6078J50681k1386j64589j23988r4467J71309M22163K25567q6869
$$ -378512 -464590 -313909 -335295 -499884 -623872 -718339 -547030 -124867 100700 13831
2699A3831n2891L6517k86120M15J1889j82947J04069j0065j32057k2068R2637
$$ 13831 -39060 -2543 -288663 -288248 -276359 -459306 -355237 -365302 -497359 -519427 -426790
2688d26790K10202J22345L13732m0382j81369k8609L4461j23028J42527j49025
$$ -426790 -216588 -94243 219489 179107 -2262 -30871 3590 -119438 23089 -125936
2678a25936k95614k85687L70101l02748k01201J78859L02899L17009N0583r6936
$$ -125936 -421550 -707237 -337136 -639884 -841085 -662226 -359327 -42318 8265 -88671
2668h8671J99305J93215l42378J27117j67677k00755J48583L32424k28786j69102
$$ -88671 110634 303849 -38529 88588 -79089 -279844 -131261 201163 -27623 -196725
2658a96725l27574p3389K59170K95638p3737p469l06506L28797j6063k96868Q0529
$$ -196725 -524299 -597688 -338518 -42880 -116617 -124086 -430592 -101795 -117858 -414726 -334197
2647c34197K97387j7814k4813J83832k45294N8073K82226n1091l49573K75077
$$ -334197 -36810 -54624 -79437 104395 -140899 -82826 199400 148309 -201264 73813
2637G3813K89240o07163k54215J47912k9979K08118k14021k0946K85322j35465
$$ 73813 363053 -244110 -498325 -350413 -380392 -172274 -386295 -407241 -121919 -257384
2627b57384j21061j03637L68809J94661l21754k30540J77273m6497L57871k19078
$$ -257384 -378445 -482082 -113273 81388 -240366 -470906 -293633 -340130 17741 -201337
2617b01337j35834J87337o4947j35821R6075L05514m1950p1120k33435m00248
$$ -201337 -337171 -149834 -214781 -350602 -254527 50987 9037 -62083 -295518 -695766
2607f95766K6603L28993J95245J06961L2201q9376P6776L3163K5302j35671k17909
$$ -695766 -669163 -340170 -144925 -37964 -5763 -95139 -18363 14800 40102 -95569 -313478
2596c13478R0065n6027k08670K33028q1028L5206J5668R6388l0773o1549J83960
$$ -313478 -223413 -279440 -488110 -255082 -336110 -300904 -285236 -188848 -219621 -281170 -97210
2585i7210K49135K61574r5771m10104o15504O00953K86849K2789m80815r4102
$$ -97210 151925 413499 317728 -92376 -707880 -106927 179922 202711 -278104 -372206
2575c72206J96694K72975k7083l15955K70835k07557l58866n2710K12713J31256
$$ -372206 -175512 97463 70380 -245575 25260 -182297 -541163 -593873 -381160 -249904
2565b49904o1814J07884N10633M37498n98724o44484J2731m4094K11936L69383
$$ -249904 -311718 -203834 306799 744297 145573 -498911 -486180 -530274 -318338 51045
2555E1045J87201j20366J17119l20017j91450J48287l8811l1829p991J47116J09659
$$ 51045 238246 117880 234999 -85018 -276468 -128181 -166992 -198821 -206812 -59696 49963
2544D9963j26084l30895N895K52791N4174n5237k96355J74336J72137O3762k50554
$$ 49963 -76121 -407016 -401121 -148330 -94156 -149393 -445748 -271412 -99275 -35513 -286067
2533b86067L2126k74188p6702N23476N1143k352J12277r8459j49623l9845J8218
$$ -286067 -253941 -528129 -604831 -81355 -30212 -32564 79713 -18746 -168369 -208214 -189996
2522a89996J88247k92285l7854K1188J55909M10605l99676Q8596l02338K61356
$$ -189996 -1749 -294034 -331888 -310700 -154791 255814 -143862 -55266 -357604 -96248
2512i6248L20230p79070j34929R6667L46661k09171p630j91737O37373Q7062m38432
$$ -96248 223982 -555088 -690017 -593350 -246689 -455860 -463490 -655227 -17854 69208 -369224
2501c69224j47619J99831j86396J94708J88914k268o1109K04706J57878q4358
$$ -369224 -516843 -317012 -503408 -308700 -119786 -122054 -183163 21543 179421 95063
2491I5063m0350j71553J00467j5092j13775J32333J60906m8834m83592r6599l929
$$ 95063 54713 -116840 -16373 -31465 -145240 -12907 147999 99165 -384427 -481026 -484955
2480d84955K31667n5754j03124r7674N86941J51185O0433N4678m27247n0540J34023
$$ -484955 -253288 -309042 -412166 -509840 77101 228286 288719 343397 -83850 -134390 -367
2469c67q9232l69459K8770l08462M12979K73672k38172K59329L49283r5824l41300
$$ -367 -89599 -459058 -430288 -738750 -325771 -52099 -290271 -30942 318341 222517 -118783
2458a18783m6119K14969j08117j56572J13886j20045j22795M56551J60134j43365
$$ -118783 -164902 50067 -58050 -214622 -100736 -220781 -343576 112975 273109 129744
2448A29744q9189k19589l32274R9935J23938J65594K95422n67332j25044K57507
$$ 129744 40555 -179034 -511308 -411373 -287435 -121841 173581 -393751 -518795 -261288
2438b61288R0043J48867K10561l36334n58337L99145j84152K60091J2880K50586
$$ -261288 -171245 -22378 188183 -148151 -706488 -307343 -491495 -231404 -218524 32062
2428C2062k35264J7389K17480j11787J32974P9071j49265l12203j25043K12675
$$ 32062 -203202 -185813 31667 -80120 52854 131925 -17340 -329543 -454586 -241911
2418b41911P4431l01116K24158J90950k46482N96462Q9607k38197p47282K12752
$$ -241911 -167480 -468596 -244438 -53488 -299970 296492 386099 147902 -599380 -386628
2408c86628L25781r9388m45430L06435K40078k28845M00053J88299m47908k1281
$$ -386628 -60847 -160235 -605665 -299230 -59152 -287997 112056 300355 -147553 -168834
2398a68834L79709l17236L33405K52999k88370k54564j26746M0782j44953j09354
$$ -168834 210875 -106361 227044 480043 191673 -62891 -189637 -148855 -293808 -403162
2388d03162R0642j3845L854R3277M23588r7424p689J86888j96313J09731k3968
$$ -403162 -312520 -326365 -322511 -229234 194354 96930 89241 276129 79816 189547 165579
2377A65579k66877L19431j92215J09652k660j25612o1181j05880m00235j7517
$$ 165579 -101298 218133 25918 135570 132910 7298 -53883 -159763 -559998 -577515
2367e77515K21871R6992j16983j06953J2416J32594j11858j88231m4321J91333
$$ -577515 -355644 -258652 -375635 -482588 -470172 -337578 -449436 -637667 -681988 -490655
2357d90655L80973l4177k39748N17306l6927m00588L43968J71011k30248L254
$$ -490655 -109682 -143859 -383607 133699 96772 -303816 40152 211163 -19085 -15831
2347a5831l41448K57554L99553j14850j77981m43131J1708O8548L78680P4721
$$ -15831 -357279 -99725 299828 184978 6997 -436134 -424426 -355878 22802 97523
2337I7523r1140k27805R0310K06058l47400N1587J120Q8262K3823l47466o2736
$$ 97523 6383 -221422 -131112 74946 -272454 -220867 -219747 -131485 -107662 -455128 -517864
2326e17864m74814L02286Q12032J3858n18258K38164r7080K86345j12490k08825
$$ -517864 -992678 -690392 121640 135498 -382760 -144596 -241676 44669 -67821 -276646
2316b76646n05508j49171M93467J31042O7010Q0480M85619l98534k54420M7390
$$ -276646 -782154 -931325 -437858 -306816 -239806 -159326 326293 -72241 -326661 -279271
2306b79271k85875n9330K65674L9317p8140k41449j65269N58325Q5937J14452
$$ -279271 -565146 -624476 -358802 -319485 -397625 -639074 -804343 -246018 -160081 -45629
2296d5629K20967j21426J16351j2303k53404k10884L50174p0059O0608m61841
$$ -45629 175338 53912 170263 157960 -95444 -306328 43846 -26213 34395 -427446
2286d27446L59137o2897j95208K00633M28377l49343K57085K78981j30098j72715
$$ -427446 -68309 -131206 -326414 -125781 302596 -46747 210338 489319 359221 186506
2276A86506j40282j81220O6386K05893m06400j39204j26807J50768p2089K8559
$$ 186506 46224 -134996 -68610 137283 -269117 -408321 -535128 -384360 -456449 -427890
2266d27890M4655m21881J31516J62916M06547L50606k19849K5669j2625k39749
$$ -427890 -383235 -805116 -673600 -510684 -104137 246469 26620 52289 39664 -200085
2256b00085l25077j38607L81311O313q8888L50788o6460o4728l42724J48491K41192
$$ -200085 -525162 -663769 -282458 -276145 -365033 -14245 -80705 -145433 -488157 -339666 -98474
2245i8474K05046k22162l33896J85841L21015j77928N5223m7733K63091j58861
$$ -98474 106572 -115590 -449486 -263645 57370 -120558 -65335 -113068 150023 -8838
2235h838m0005J29106O9891j84019o64128L45214M17531K4068j78673N0533k9631
$$ -8838 -48843 80263 150154 -33865 -697993 -352779 64752 88820 -89853 -39320 -68951
2224f8951j67322Q5028J27322j01342k64565R464n0020m4057k8277K38056M62747
$$ -68951 -236273 -151245 -23923 -125265 -389830 -380366 -430386 -474443 -502720 -264664 198083
2213A98083J71712m76793l7401j94548j97770J72160J96956M17971Q937K88134
$$ 198083 369795 -106998 -144399 -338947 -536717 -364557 -167601 250370 259307 547441
2203E47441j53262r8189K30552k91824k92859l8914L1551K74628K29585j11946
$$ 547441 394179 295990 526542 234718 -58141 -97055 -65504 209124 438709 326763
2193C26763n4550k30027N536R6271m31312j72731P0434P0007K25279K03961J44111
$$ 326763 272213 42186 47722 143993 -287319 -460050 -389616 -319609 -94330 109631 253742
2182B53742K6091l2156l10297j09652k7069J32283J32204j40674J26820P8139
$$ 253742 279833 247677 -62620 -172272 -199341 -67058 65146 -75528 51292 129431
2172A29431j08792L06921O9678O7887l79456J12821k97994K15258j41935K67688
$$ 129431 20639 327560 397238 465125 85669 198490 -99504 115754 -26181 241507
2162B41507L26628K20825L41089l52601k75316J61261L22746l44718j92663k94796
$$ 241507 568135 788960 1130049 777448 502132 663393 986139 641421 448758 153962
2152A53962K65801j25715J03501L66441L69247J03718j72045j18865k84143k7461
$$ 153962 419763 294048 397549 763990 1133237 1236955 1064910 946045 661902 634441
2142F34441l52732N6906Q9708L2503N58486q5234p8221J6311J93685j14440P4439
$$ 634441 281709 338615 428323 460826 1019312 934078 855857 872168 1065853 951413 1025852
2131A025852O9461J22485k6794J02151R9574J60964P9593L21929K77864j02632
$$ 1025852 1095313 1217798 1191004 1293155 1392729 1553693 1633286 1955215 2233079 2130447
2121B130447R3848K36967L28776N8003P1140j57423R5378K80574o2644J30526
$$ 2130447 2224295 2461262 2790038 2848041 2919181 2761758 2857136 3137710 3075066 3205592
2111C205592J57291j40482K39340M25970P2960k7408K55879N54687N29237O91613
$$ 3205592 3362883 3222401 3461741 3887711 3960671 3933263 4189142 4743829 5273066 5964679
2101E964679L71671J33666Q24519Q81372P99363R74337N11488Q50557J379532
$$ 5964679 6336350 6470016 7294535 8175907 8975270 9949607 10461095 11311652 12691184
2092A2691184K360187K138062K594644L173758L462066J669365j256773k137843
$$ 12691184 15051371 17189433 19784077 22957835 26419901 28089266 26832493 24694650
2084B4694650k698782k855095k234523k241366k213159j917775j470550j267477
$$ 24694650 21995868 19140773 16906250 14664884 12451725 10533950 9063400 7795923
2076G795923q63097q20903m98021R0051k53453m10738k28516k72332j34253q07659
$$ 7795923 6932826 6111923 5613902 5703953 5450500 5039762 4811246 4538914 4404661 3597002
2066C597002m68933J9175l13657j72400J50814r3104l67085K19786k12216l40988
$$ 3597002 3128069 3147244 2833587 2661187 2812001 2718897 2351812 2571598 2359382 2018394
2056B018394Q2158j03512m28215q3384L60242J54700p72922k1621J40847j24582
$$ 2018394 2100552 1997040 1568825 1485441 1845683 2000383 1227461 1205840 1346687 1222105
2046A222105k17473K09827p1190K18711n6411n7855l40246k66768J92353j30861
$$ 1222105 1004632 1214459 1143269 1361980 1305569 1247714 907468 640700 833053 702192
2036G02192J99115j70977q4302J6630l50646l129O3084K88253q7574J67875q9760
$$ 702192 901307 730330 646028 662658 312012 308883 371967 660220 572646 740521 650761
2025F50761j66629J44556M1673K76587R0901k76070l90679n9168k097K11678J08692
$$ 650761 484132 628688 670361 946948 1037849 761779 371100 311932 309835 521513 630205
2014F30205j94118Q3980K91736j38098k18498o4716j63633k25531j19875K14675
$$ 630205 436087 520067 811803 673705 455207 390491 226858 1327 -118548 96127
2004I6127K78516n659n9745m23050m0119J71716M39581q6388r9548J98994o6212
$$ 96127 374643 368984 309239 -113811 -153930 17786 457367 370979 271431 470425 404213
1993D04213m27535j36412N3622M93361k99648K39874j2949j68103k33323k00292
$$ 404213 -23322 -159734 -106112 387249 87601 327475 314526 146423 -86900 -287192
1983b87192M07398J26645k55336K1709J95199r3068J2560o4541N3499l99895j0960
$$ -287192 120206 246851 -8485 13224 208423 115355 127915 63374 116873 -283022 -293982
1972b93982J13753M22929r5612M7603j300K26492k24367n14615K89433K38668
$$ -293982 -180229 242700 147088 194691 193391 419883 195516 -319099 -29666 209002
1962B09002j00747K18456k28267M6111L61036J73403m61357l14228n8740o5902
$$ 209002 108255 326711 98444 144555 505591 678994 217637 -96591 -155331 -221233
1952b21233M44225k54581K2995L72395o01516K6904j58984J86066J60017n687
$$ -221233 222992 -31589 -8594 363801 -237715 -210811 -369795 -183729 -23712 -29399
1942b9399j6134M48540m37039k32229n1069j25694N42425q074k72012J23028o1976
$$ -29399 -45533 403007 -34032 -266261 -317330 -443024 99401 91327 -180685 -57657 -119633
1931a19633P07862K2634o56127L68313k62692J06945J44186N7902m0454j11254
$$ -119633 588229 610863 -45264 323049 60357 167302 311488 369390 328936 217682
1921B17682M7177q8762l5803j7468r4626l12814l4309J18428J28462J96234o91677
$$ 217682 264859 176097 140294 122826 28200 -284614 -318923 -200495 -72033 124201 -567476
1910e67476O36845K23061k28674R6914o3070l72534o4249N0643J16030K52793
$$ -567476 69369 292430 63756 160670 97600 -274934 -339183 -288540 -172510 80283
1900H0283J81435m10355n1305L26627M78712m75279k37086R7667o09518J16247
$$ 80283 261718 -148637 -199942 126685 605397 130118 -106968 -9301 -618819 -502572
1890e02572L37666j61365K39786K31724M2538N0569K16759m88661j7602J14721
$$ -502572 -164906 -326271 -86485 145239 187777 238346 455105 -33556 -51158 63563
1880F3563l14446J96078Q5232L08777o3265k45400j04123k6774J35269J02692
$$ 63563 -250883 -54805 30427 339204 275939 30539 -73584 -100358 34911 137603
1870A37603L3863m60222j20686l9011K6637J84062J23371N3680K61821L9413k9476
$$ 137603 171466 -288756 -409442 -448453 -421816 -237754 -114383 -60703 201118 240531 211055
1859B11055k0254l81989O6352o8695k82561j05926L63278N9244j7730J74008K1519
$$ 211055 190801 -191188 -124836 -193531 -476092 -582018 -218740 -159496 -177226 -3218 18301
1848A8301j2518k64730n2578j56741J43826k83836m7641J12384P11144j24029
$$ 18301 5783 -258947 -311525 -468266 -324440 -608276 -655917 -543533 167611 43582
1838D3582m38161Q57J64821J79950j65759N97306J51170k58926j50046J00974
$$ 43582 -394579 -393722 -228901 -48951 -214710 382596 533766 274840 124794 225768
1828B25768o7032j6160l20927K77252J2799K86575k52965j40664M2168l12001
$$ 225768 158736 142576 -178351 98901 111700 398275 145310 4646 46814 -265187
1818b65187k66798M96086L95185j60977l73672r5644K46595J65410l9612k76642
$$ -265187 -531985 -35899 359286 198309 -175363 -271007 -24412 140998 101386 -175256
1808a75256J99494K96042r0966l40094m2661N70405l6905j05970k35297j057l90414
$$ -175256 24238 320280 229314 -110780 -153441 416964 380059 274089 38792 37735 -352679
1797c52679J49627J76676m5574m2979J1116J9941J52048j87448K91884J63570
$$ -352679 -203052 -26376 -71950 -114929 -103813 -83872 68176 -119272 172612 336182
1787C36182k43840N0620q5250K13018K65043n50096J87554k94595j36455m595
$$ 336182 92342 142962 57712 270730 535773 -14323 173231 -121364 -257819 -262414
1777b62414K7765J01199j96893J47847L0569K5595j37298Q9615j89761O4355N27818
$$ -262414 -234649 -133450 -330343 -182496 -151927 -126332 -263630 -174015 -363776 -299421 228397
$$ [...]
##END NTUPLES=NMR SPECTRUM
##END=
