##TITLE=1H_CA-9170-1
 CDCl3
 8 sc, 
 6.7.2023
##JCAMPDX= 6.0         $$ Bruker NMR JCAMP-DX V2.0
##DATA TYPE= NMR SPECTRUM
##DATA CLASS= NTUPLES
##ORIGIN= UXNMR, Bruker Analytische Messtechnik GmbH
##OWNER= root
$$ XWIN-NMR		Version 3.5
$$ Thu Jul  6 14:15:11 2023 Russian Standard Time (UT+4h)  she@DPX200
##.OBSERVE FREQUENCY= 200.13135
##.OBSERVE NUCLEUS= ^1H
##.ACQUISITION MODE= SIMULTANEOUS
##.ACQUISITION SCHEME= undefined
##.AVERAGES= 8
##.DIGITISER RES= 18
##SPECTROMETER/DATA SYSTEM= spect
##.PULSE SEQUENCE= zg30
##.SOLVENT NAME= CDCl3
##.SHIFT REFERENCE= (INTERNAL, CDCl3, 0, 15.7293)
##AUDIT TRAIL= $$ (NUMBER, WHEN, WHO, WHERE, WHAT)
$$ ##TITLE= Audit trail, XWIN-NMR		Version 3.5
$$ ##JCAMPDX= 5.01
$$ ##ORIGIN= Bruker BioSpin GmbH
$$ ##OWNER= she
$$ F:/spectra/data/she/nmr/H-F/1/pdata/1/auditp.txt
$$ ##AUDIT TRAIL=  $$ (NUMBER, WHEN, WHO, WHERE, WHAT)
(   1,<2023-07-06 14:13:42.56 +0400>,<she>,<DPX200>,
      <created by zg, POWCHK disabled, PULCHK disabled
       configuration hash MD5:
       00 E9 B6 7A A2 85 ED C7 34 08 36 98 17 FE 4E 26
       data hash MD5: 16K
       98 EF AF E4 07 A8 C3 9A 0B 97 CE 48 5B C6 4D AA>)
(   2,<2023-07-06 14:14:11.18 +0400>,<she>,<DPX200>,
      <Start of raw data processing
       efp BC_mod = 2 LB = 0.24 FT_mod = 6 PKNL = 1 PHC0 = -20787.99 PHC1 = 11.65272 SI = 16K 
       data hash MD5: 16K
       90 3C 7A 6D 58 E1 EC CC 7B 8B 23 9A 9B CB B1 E5>)
(   3,<2023-07-06 14:14:29.84 +0400>,<she>,<DPX200>,
      <pk PHC0 = -2.421506 PHC1 = 2.2 
       data hash MD5: 16K
       4B 4C BD 77 DF 2A 15 C4 56 9E 65 8E B4 DD BA BC>)
(   4,<2023-07-06 14:14:32.98 +0400>,<she>,<DPX200>,
      <abs ABSG = 5 
       data hash MD5: 16K
       4D 24 BF 57 40 2E 6A BD 9C 96 3C 94 C8 46 81 4C>)
$$ ##END=
$$ 
$$ hash MD5
$$ B1 70 39 1F 53 AC 87 0C 6B AC 75 77 92 91 B6 B5
##$RELAX= 
##$RELAX= 
##$RELAX= 
##$RELAX= 
##$RELAX= 
##$RELAX= 
$$ Bruker specific parameters
$$ --------------------------
##$DU= <F:/spectra>
##$EXPNO= 1
##$NAME= <H-F>
##$PROCNO= 1
##$TYPE= <nmr>
##$USER= <she>
##$AMP= (0..31)
100 100 100 100 100 100 100 100 100 100 100 100 100 100 100 100 100 100 
100 100 100 100 100 100 100 100 100 100 100 100 100 100 
##$AQSEQ= 0
##$AQ_mod= 1
##$AUNM= <au_zg>
##$AUTOPOS= <>
##$BF1= 200.13
##$BF2= 200.13
##$BF3= 200.13
##$BF4= 200.13
##$BF5= 200.13
##$BF6= 200.13
##$BF7= 200.13
##$BF8= 200.13
##$BYTORDA= 1
##$CFDGTYP= 0
##$CFRGTYP= 5
##$CHEMSTR= <none>
##$CNST= (0..31)
1 1 145 1 1 1 1 1 1 1 1 1 1 1 1 1 1 1 1 1 1 1 1 1 1 1 1 1 1 1 1 1 
##$CPDPRG= <>
##$CPDPRG1= <>
##$CPDPRG2= <>
##$CPDPRG3= <>
##$CPDPRG4= <mlev>
##$CPDPRG5= <mlev>
##$CPDPRG6= <mlev>
##$CPDPRG7= <mlev>
##$CPDPRG8= <mlev>
##$CPDPRGB= <>
##$CPDPRGT= <>
##$D= (0..31)
0 1.2 0 0 0 0 0 0 0 0.06 0 0.03 0 0 0 0 0.0002 0 0 0 0 0 0 0 0 0 0 0 0 
0 0 0 
##$DATE= 1688638422
##$DBL= (0..7)
120 120 120 120 120 120 120 120 
##$DBP= (0..7)
150 150 150 150 150 150 150 150 
##$DBP07= 0
##$DBPNAM0= <>
##$DBPNAM1= <>
##$DBPNAM2= <>
##$DBPNAM3= <>
##$DBPNAM4= <>
$$ [...]
##$SUBNAM3= <"">
##$SUBNAM4= <"">
##$SUBNAM5= <"">
##$SUBNAM6= <"">
##$SUBNAM7= <"">
##$SUBNAM8= <"">
##$SUBNAM9= <"">
##$SW= 18.05172834244
##$SWIBOX= (0..15)
0 0 2 0 0 0 0 0 0 0 0 0 0 0 0 0 
##$SW_h= 3612.71676300578
##$TD= 16384
##$TD0= 1
##$TE= 0
##$TE2= 300
##$TE3= 300
##$TEG= 300
##$TL= (0..7)
0 120 120 120 120 120 120 120 
##$TP= (0..7)
150 150 150 150 150 150 150 150 
##$TP07= 0
##$TPNAME0= <>
##$TPNAME1= <>
##$TPNAME2= <>
##$TPNAME3= <>
##$TPNAME4= <>
##$TPNAME5= <>
##$TPNAME6= <>
##$TPNAME7= <>
##$TPOAL= (0..7)
0.5 0.5 0.5 0.5 0.5 0.5 0.5 0.5 
##$TPOFFS= (0..7)
0 0 0 0 0 0 0 0 
##$TUNHIN= 0
##$TUNHOUT= 0
##$TUNXOUT= 0
##$USERA1= <user>
##$USERA2= <user>
##$USERA3= <user>
##$USERA4= <user>
##$USERA5= <user>
##$V9= 5
##$VALIST= <valist>
##$VCLIST= <CCCCCCCCCCCCCCC>
##$VD= 0
##$VDLIST= <DDDDDDDDDDDDDDD>
##$VPLIST= <PPPPPPPPPPPPPPP>
##$VTLIST= <TTTTTTTTTTTTTTT>
##$WBST= 1024
##$WBSW= 4
##$XGAIN= (0..3)
0 0 0 0 
##$XL= 0
##$YL= 0
##$YMAX_a= 81720
##$YMIN_a= -84730
##$ZGOPTNS= <>
##$ZL1= 120
##$ZL2= 120
##$ZL3= 120
##$ZL4= 120
##$ABSF1= 15.72706
##$ABSF2= -2.324789
##$ABSG= 5
##$ABSL= 3
##$ALPHA= 0
##$AQORDER= 0
##$ASSFAC= 0
##$ASSFACI= 0
##$ASSFACX= 0
##$ASSWID= 0
##$AUNMP= <proc_1d>
##$AZFE= 0.1
##$AZFW= 0.1
##$BCFW= 0
##$BC_mod= 2
##$BYTORDP= 0
##$COROFFS= 0
##$CY= -3
##$DATMOD= 1
##$DC= 0
##$DFILT= <>
##$DTYPP= 0
##$F1P= 0
##$F2P= 0
##$FCOR= 1
##$FTSIZE= 16384
##$FT_mod= 6
##$GAMMA= 0
##$GB= 0
##$INTBC= 1
##$INTSCL= 3.70164e-10
##$ISEN= 128
##$LB= 0.24
##$LEV0= 0
##$LPBIN= 0
##$MAXI= 10000
##$MC2= 0
##$MEAN= 0
##$ME_mod= 0
##$MI= 1.114404
##$NCOEF= 0
##$NC_proc= -8
##$NLEV= 6
##$NOISF1= 3.799351
##$NOISF2= 2.8
##$NSP= 0
##$NTH_PI= 0
##$NZP= 0
##$OFFSET= 15.72926
##$PC= 1
##$PHC0= -20790.41
##$PHC1= 13.85272
##$PH_mod= 1
##$PKNL= yes
##$PPARMOD= 0
##$PSCAL= 0
##$PSIGN= 0
##$REVERSE= no
##$SF= 200.130008462123
##$SI= 16384
##$SIGF1= 3
##$SIGF2= 2
##$SINO= 5.538805
##$SIOLD= 16384
##$SREGLST= <1H.CDCl3>
##$SSB= 0
##$STSI= 16384
##$STSR= 0
##$SW_p= 3612.71676300578
##$SYMM= 0
##$S_DEV= 0
##$TDeff= 16384
##$TDoff= 0
##$TI= <>
##$TILT= no
##$TM1= 0
##$TM2= 0
##$TOPLEV= 0
##$USERP1= <user>
##$USERP2= <user>
##$USERP3= <user>
##$USERP4= <user>
##$USERP5= <user>
##$WDW= 1
##$XDIM= 16384
##$YMAX_p= 271130087
##$YMIN_p= -810912
$$ End of Bruker specific parameters
$$ ---------------------------------
##NTUPLES= NMR SPECTRUM
##VAR_NAME=  FREQUENCY,     SPECTRUM/REAL,   SPECTRUM/IMAG
##SYMBOL=    X,             R,               I
##VAR_TYPE=  INDEPENDENT,   DEPENDENT,       DEPENDENT
##VAR_FORM=  AFFN,          ASDF,            ASDF
##VAR_DIM=   16384,         16384,           16384
##UNITS=     HZ,            ARBITRARY UNITS, ARBITRARY UNITS
##FACTOR=    0.220516191357247, 1,           1
##FIRST=     3147.89702588896, 0,            0
##LAST=      -464.819737116818, 0,           0
##MIN=       -464.819737116818, -810912,     0
##MAX=       3147.89702588896, 271130087,    0
$$ Real data points
##PAGE= N=1
##DATA TABLE= (X++(R..R)), XYDATA
$$ [...]
6925D40146k75772j80940P5879K45358k87692Q3008N7324K34720k02398j75533
6915A4100m7647L0119J8416j68705N439k43156m8780K56878K20859k32485J40627
6904e4335R3169N7914k97267K02762L37970n1391K1906l199Q8617k1348p0248
6893C04550j03384j13888r6920j61643R9211j63228j96518L09712Q1492J48633
6883A08017J7155o6443k29023J19224j37021j85368O7940O2101J94528J51564
6873A02674j10999M4383q7433L45922l4611N8131j08898k74063J94768l05915
6863a76041N822L47655M7192k58730L0071J35822J0334p5311j15447P9346p2106
6852d1393P3852P1614j72251M5221p1150K66388j15227l07820l08J6141K09758
$$ plain form
6925 440146 164374 -16566 59313 304671 16979 99987 157311 392031 189633 14100
6915 14100 -33547 -3428 14988 -153717 -148278 -391434 -440214 -183336 37523 -194962 -54335
6904 -54335 38834 96748 -200519 2243 340213 288822 310728 307529 396146 374798 304550
6893 304550 201166 87278 -9642 -171285 -72074 -235302 -431820 -122108 -40616 108017
6883 108017 125172 58729 -170294 -51070 -188091 -373459 -305519 -243418 -48890 102674
6873 102674 -8325 36058 -51375 294547 259936 318067 209169 -64894 129874 -176041
6863 -176041 -170219 177436 224628 -34102 -4031 131791 142125 66814 -48633 30713 -41393
6852 -41393 32459 104073 -68178 -22957 -94107 172281 57054 -250766 -251074 -234933 -25175
6841b5175J81416J62195j82072M1595M16820j65561n12832j17255J74860J55073
6831A29064j14664k4828j1151J8950l1355k63368K09115N5926J00931k8715J13477
6820A53382j11221j35216K59094k369Q2553l2662l93664p0757P814J59679q913
6809i2280N0920r7223k15481P1529Q4524K28715K36033o2928j41239J01147o1393
6798A02324p1906j08443j00323J92793J42477R5461l06417k19108J14709p251
6788a65684K19817m08176j87439J84447K3906Q8957K02151j84788o8950J55511
6778a40248Q2716m8105J68542O219j05937J25640j67045k39566m860J20493O5773
6767a36378j3924M0475K05906L6145j57763k53015j55309J38736J18058k32239
$$ plain form
6841 -25175 156241 318436 136364 177959 594779 429218 -83614 -200869 -26009 129064
6831 129064 14400 -10428 -21579 -2629 -33984 -297352 -88237 -32311 68620 39905 153382
6820 153382 42161 -93055 166039 163670 246223 213561 -180103 -250860 -243046 -83367 -92280
6809 -92280 -41360 -138583 -354064 -282535 -198011 30704 266737 203809 62570 163717 102324
6798 102324 30418 -78025 -178348 14445 156922 252383 -54034 -273142 -158433 -165684
6788 -165684 54133 -354043 -541482 -357035 -333129 -244172 -42021 -226809 -295759 -140248
6778 -140248 -57532 -105637 62905 69124 -36813 88827 -78218 -317784 -322644 -202151 -136378
6767 -136378 -150302 -109827 96079 132224 -25539 -278554 -433863 -295127 -177069 -409308
6757d09308J86454K87438j81441J7541R4239r4798j07071j0604J60223j70721
6747b28048l6757M8536j98526M1709L37591N1847J58364j53886k77569j48286
6737d05025j47566J27620J05592K96611K02676j06551K32597J82684j92874l88097
6727i2333j04096P2304N3445O9195j65855J82906Q5878k44594o3514J00480L16986
6716B10802o1949j97085r3437j12540J76191J01207r7458o8198k88007J14488
6706c15986j76081J83262K20297n4919j74643k82250R8722L64266q9082j53347
6696c79761K26696k5913R7848l7420k20343M52229Q9442j09270j43260l1282J20432
6685C9398k73659q172l9737P7173K18740K14910k56672P8664L9038j51333R3471
$$ plain form
6757 -409308 -222854 64584 -116857 -99316 -5077 -99875 -206946 -217550 -57327 -228048
6747 -228048 -264805 -216269 -414795 -373086 -35495 16352 174716 20830 -256739 -405025
6737 -405025 -552591 -424971 -319379 -22768 179908 73357 305954 488638 295764 -92333
6727 -92333 -196429 -124125 -70680 -1485 -167340 15566 101444 -143150 -206664 -106184 210802
6716 210802 148853 -48232 -141669 -254209 -78018 23189 -74269 -142467 -430474 -315986
6706 -315986 -492067 -308805 -88508 -143427 -318070 -600320 -501598 -137332 -226414 -379761
6696 -379761 -153065 -178978 -81130 -118550 -338893 113336 202778 93508 -49752 -81034 39398
6685 39398 -234261 -242433 -282170 -204997 13743 228653 -28019 50645 89683 -61650 31821
6674C1821N6936R934O5980l97881M9543j18742J05514K50129l88917n9661J06428
6663b88916P5642N6506P3245R619K38666j04254q2370K3212j97499K35792K9253
6652F8896j0461j66385J76409n0325k03136O4915L25767j38855K9749j88608Q9752
6641b282q9631r644J19565q4310m29811K21205L93634l2548l33297K37004K53599
6630B43484n5152j56248k27133J53747j56303K28715j84977l6573J04352r749
6620i5837J01969J44171j94620M6640l03733o3748K83825J50916k73190L83713
6610A80106K40079l17328j19267J4548K54231l71822j06369J98706l41282J294
6600c67104J03120J34309M248k81996J03661L22755k01181O6042K47611j32971
$$ plain form
6674 31821 88757 98691 164671 -233210 -183667 -302409 -196895 53234 -335683 -395344 -288916
6663 -288916 -213274 -156768 -83523 -73904 164762 60508 -21862 1350 -196149 39643 68896
6652 68896 58435 -107950 68459 18134 -185002 -120087 205680 66825 96574 -92034 -2282
6641 -2282 -91913 -101557 18008 -66302 -496113 -274908 118726 86178 -247119 -10115 243484
6630 243484 188332 32084 -195049 -41302 -197605 31110 -153867 -190440 -86088 -95837
6620 -95837 6132 150303 -44317 2323 -301410 -365158 -81333 69583 -203607 180106
6610 180106 420185 102857 -16410 -1862 252369 -119453 -225822 -27116 -368398 -367104
6600 -367104 -263984 -129675 -125427 -407423 -303762 18993 -182188 -116146 131465 -1506
6590a506j18426J56172M7155k63469K11214q4689n09214K04685M32514j2604q7949
6579b6117j37161j05774r691j19778L26168J16145R5520j26334o1332K1675o324
6568c3003j21896j9590L0288R92L9164p5870j77443J66377r2943q3884M69053
6557A01245j02025J04154P1987o5158j37469l49864K81093m3314J29064K00913
6547A90626o5436j8596j78021o5001k23231o4869L14773J5267J73200j94824M5648
6536g0464J36145k96446J71333K06532Q3591J213j59183j6171J30362k73856m6886
6525a33830L2522R1232N4250J7863Q7903j61702P3938J48673r0958o4085j52069
6514i6263Q7316l34764j38269J57332J01104j6548o600q1062K06880k43803J16077
$$ plain form
6590 -1506 -119932 36240 83395 -180074 31140 -53549 -562763 -358078 74436 61832 -26117
6579 -26117 -163278 -269052 -278743 -398521 -72353 43792 139312 12978 -48354 -26679 -33003
6568 -33003 -154899 -174489 -144201 -143209 -104045 -179915 -357358 -190981 -283924 -367808 101245
6557 101245 -780 103374 175361 110203 -27266 -377130 -96037 -139351 -10287 190626
6547 190626 125190 106594 -71427 -136428 -359659 -424528 -109755 -94488 78712 -116112 -70464
6536 -70464 65681 -230765 -59432 147100 230691 231904 72721 56550 186912 -86944 -133830
6525 -133830 -101308 -10076 44174 62037 149940 -11762 62176 210849 119891 55806 -96263
6514 -96263 -8947 -343711 -481980 -324648 -223544 -240092 -246692 -327754 -120874 -364677 -248600
6503b48600J60808O6039K3819k9066r730l29902k0892R9495J84279j34111K63556
6492B5695J31927l22094M5855K24208k5387o6677k29579J73943P8738j84436K5382
6481a22425N5187j48798J70003K63272q0607K642J89716l33322J63271j03952
6471E4987k17769J51459j05206K33368j41827j82374j9814J60638l1588q2941
6461a81067R8759Q60J62397P1028k43752p0528m2408K00183J55242j64755k97129
6450c11170m7674p0215L07844J45080p0496k137K03999n9588j57941K06346j24065
6439A9983j62071N4935l7339J55218l379m823K71720m4258q3258L1387L949j61357
6427D0707K1718J51375j45173k58042P8784o0576M3708J29199o6226O6491J54076
$$ plain form
6503 -248600 -87792 -21753 2066 -27000 -36730 -366632 -387524 -288029 -103750 -237861 25695
6492 25695 157622 -164472 -118617 105591 80204 13527 -216052 -42109 36629 -147807 -122425
6481 -122425 -67238 -216036 -46033 217239 136632 139274 328990 -4332 158939 54987
6471 54987 -162782 -11323 -116529 116839 -24988 -207362 -227176 -66538 -98126 -181067
6461 -181067 -82308 -81448 80949 151977 -91775 -162303 -204711 -4528 150714 -14041 -311170
6450 -311170 -358844 -429059 -121215 23865 -46631 -48768 155231 95643 -62298 144048 19983
6439 19983 -142088 -87153 -124492 30726 27347 22524 294244 249986 166728 198115 202064 40707
6427 40707 62425 213800 68627 -189415 -110631 -171207 -127499 1700 -64526 1965 156041
6416A56041P8311r0730j18746j98270K16135j22905K5790J22557j78513Q4570
6406b5760M12378j4900r7012J5739l44147J61799k82014j20494L53988J50693
6396B10270P7128q0099j91042J5768L45679k14406J31193R1880m56881j01589
6386a72099J73069L8261n1997L0342j40338L5884M4373J06294J04344k36340K53197
6375A84990J36673n9726j17174j96553J00518l01542j48359P5192L02773P6241
6365E3033p1111j7533j37645l4006J48598K25787J8644l10447K12215n1373q4537
6354d8375J39274K91371l68055j07060J11933n6304k5480l21624K00515J57068
6344b6737J03717l71878j1815P4388J45461N0993j19566K21599o4535l4393k2737
$$ plain form
6416 156041 234352 143622 24876 -173394 42741 -80164 -54374 68183 -110330 -25760
6406 -25760 386618 371718 274706 290445 -53702 108097 -173917 -294411 59577 210270
6396 210270 287398 207299 16257 32025 377704 163298 294491 386371 -70510 -172099
6386 -172099 970 39231 -12766 17576 -122762 -86878 -42505 63789 168133 -68207 184990
6375 184990 321663 261937 144763 -51790 48728 -252814 -401173 -325981 -23208 53033
6365 53033 -18078 -35611 -173256 -207262 -58664 167123 185767 -124680 87535 36162 -48375
6354 -48375 90899 382270 14215 -92845 19088 -37216 -62696 -384320 -183805 -26737
6344 -26737 76980 -294898 -306713 -232325 -86864 -35871 -155437 66162 1627 -32766 -55503
6333e5503L1182J39546J08632l40651K54319n6079o7250k7956j75481L07457n4796
6322F3420M940Q682n411J46911k93231K2297J80691r2595K5112n0388j81227j00615
6310b71414P8167m8855L20819o4391m283J62744k89431J13477P9494p8648k03213
6299b05534J41164j42159p7341K18925L2231q618k3740M3033N6430k4854K9334
6288C8871J99867o5828k60775j41029j5214L2866J276J01391k2030K7230L74418
6277B71043j12994j84135P775J03475p0160p2111j7034K93539J66917J01467q5167
6266D02615l86120l6536j68493o0204L33022r2980K07796j13512j78666J31022
6256C7944j08178j24431j2650j4387K11071K65284O5208j22311k09139L4778N1050
$$ plain form
6333 -55503 -24321 115225 223857 -116794 137525 81446 14196 -13760 -189241 118216 63420
6322 63420 68360 77042 71631 218542 -74689 -52392 128299 35704 60816 10428 -170799 -271414
6310 -271414 -193247 -242102 78717 14326 10043 172787 -116644 -3167 76327 -2321 -205534
6299 -205534 -64370 -206529 -283870 -64945 -32714 -41332 -65072 -22039 34391 9537 38871
6288 38871 238738 172910 -87865 -228894 -244108 -211242 -209966 -108575 -130605 -103375 271043
6277 271043 158049 -26086 -18311 85164 15004 -57107 -74141 219398 386315 487782 402615
6266 402615 16495 -20041 -188534 -248738 84284 -8696 199100 85588 -93078 37944
6256 37944 -70234 -194665 -207315 -221702 -10631 254653 319861 197550 -11589 23189 74239
6245G4239q9173j04801P7868J19031M2764O0777k2523o4770m5055J82767k1576
6234B09548l29897n573K50147j25937k06388j03297K69290q0390l3152J65002
6224I353j18060n3183K31825j66474k57360l7316J89279K11276r3057j15396N408
6213a93705K4169J74210K22768m58389l7938j18803K03139P0262j44481J05714
6203a53054n5688j5134K48273p4623j98687L16025q0587J47343J19970q9468l7853
6192A26517n5827J5513L1939N0051L8052k37514K54814m2089j08444l2485l0294
6181A0233K75050k14105R8534k44875Q2341J92986K4675m2846J14223p0467j72427
6170E3322Q7404j20052q3367K4924m4682J9039j15519K9196K1396j06796R2804
$$ plain form
6245 74239 -14934 -119735 -41867 77164 119928 180705 158182 93412 48357 231124 209548
6234 209548 -120349 -125922 124225 -1712 -208100 -311397 -42107 -122497 -155649 9353
6224 9353 -108707 -161890 69935 -96539 -353899 -391215 -201936 9340 -83717 -199113 -193705
6213 -193705 -169536 4674 227442 -230947 -268885 -387688 -184549 -114287 -258768 -153054
6203 -153054 -208742 -223876 24397 -50226 -248913 67112 -13475 133868 253838 164370 126517
6192 126517 70690 86203 118142 168193 206245 -31269 223545 181456 73012 40527 10233
6181 10233 285283 71178 169712 -75163 7178 200164 224839 181993 296216 225749 53322
6170 53322 140726 20674 -62693 -37769 -82451 -63412 -178931 -149735 -128339 -235135 -142331
6159a42331K40240j21529p3383J1508o9224J10404j23739J22866M7918j7355k9576
6148d4201L0583r723J53499k5143J13844r4977l06831K17980J89565l7743k12486
6137b5633j08080M3823K06214j51067K6550o3219J28895l969J76050n921k34558
6126a0915j02680J10892J97970j10266J16191k2389l57799j60710P0504J47427
6116a21775l933L1145J39469O3182k37492J95717r2911M1490R0607j9748l6618
6105D9133j28762J49666Q4965m1069k30026K74473o7435R0030j76847k7781J14428
6094I0775k0663J85469j28877P8314j82247k79133j0853J5499R416k3234L50105
6083H4571J31409j37448K31659l5714j15817j20594k05326J28563j94373r8829
$$ plain form
6159 -142331 97909 -23620 -97003 -85495 -154719 -44315 -168054 -45188 2730 -14625 -44201
6148 -44201 -13618 -23341 130158 105015 218859 123882 -182949 35031 224596 186853 -25633
6137 -25633 -133713 -89890 116324 -34743 -8193 -71412 57483 53514 229564 223643 -10915
6126 -10915 -113595 -2703 195267 85001 201192 178803 -178996 -339706 -269202 -121775
6116 -121775 -125708 -94563 44906 108088 -129404 66313 -26598 14892 105499 85751 49133
6105 49133 -79629 70037 155002 113933 -116093 158380 90945 180975 4128 -23653 90775
6094 90775 70112 255581 126704 205018 22771 -256362 -267215 -251716 -242300 -265534 84571
6083 84571 215980 78532 310191 274477 158660 38066 -167260 -38697 -233070 -331899
6073c31899M12533J19743j17229n6177j12940M25400j21645j70988Q2794J28294
6063B57886J13287p631l18416J21011K6979r0525J14740j49992J21742l06015
6053a16934m9651J91533j72467j94863J02378N84K56366q0546O1644r0558j09186
6042b01700J53223n5703J8648p4932K1760P7677J69055j8508j8858P8473n3642
6031I5493R9366N7524r5426K8928l91942Q5591K89334K5458M7554k23606j90442
6020a72168J73085P7347M6823L3322L0077k91457K5227J25816Q2459l4098R0770
6009A87203O7368J72916k31998l37556n0084K53619R6819K74619R855k31816R3548
5998C04493k13638p9177p4011L6406K09810o7796j07539L6756k39875Q2906K57434
$$ plain form
6073 -331899 80634 200377 83148 26971 -85969 339431 217786 46798 129592 257886
6063 257886 371173 363542 45126 166137 193116 102591 217331 67339 189081 -116934
6053 -116934 -166585 24948 -147519 -342382 -240004 -239420 16946 -63600 -1956 -92514 -201700
6042 -201700 -48477 -104180 -85532 -160464 -138704 -61027 108028 89520 70662 149135 95493
6031 95493 194859 252383 156957 185885 -206057 -120466 168868 194326 241880 18274 -172168
6020 -172168 917 78264 125087 158409 188486 -102971 -77744 48072 130531 96433 187203
6009 187203 254571 427487 195489 -142067 -192151 61468 158287 432906 442761 210945 304493
5998 304493 90855 11678 -62333 -25927 183883 116087 8548 45304 -194571 -111665 145769
5987A45769K61227J8557j76615j53248l2733j79525J92211K65200N9753N0602
5977D51198q3302o1791o0114K6270J5953n7525o0028o8962K4038k94911n9779
5966b28953K49567M5348j41275K62745K44704P5378j06521O2713l3030k80992
5956A49684R8593N5557J57205K85838j45305L4736k27144j25715j9703k11785
5946E1961J49278N06128Q6088J13178j40891K27857Q2444J30666J12629k41436
5936A077902j75072j93750P8154k234N5364P6720j81914k18770r1619l3845n8625
5925C32311j49594N1473J22427J61120j33938n6483p3794L84821k12421k95492
5915A30430J07264J86332j04152l6350l20530j33636L47277N6935n9185p9063
$$ plain form
5987 145769 406996 425553 248938 95690 62957 -116568 75643 340843 400596 451198
5977 451198 367896 306105 245991 272261 288214 230689 170661 101699 125737 -169174 -228953
5966 -228953 20614 65962 -75313 187432 432136 507514 400993 463706 430676 149684
5956 149684 248277 303834 461039 746877 601572 636308 409164 283449 263746 51961
5946 51961 201239 707367 793455 906633 765742 993599 1076043 1206709 1319338 1077902
5936 1077902 902830 709080 787234 785000 840364 917084 735170 516400 424781 390936 332311
5925 332311 182717 234190 356617 517737 383799 327316 253522 638343 425922 130430
5915 130430 237694 424026 319874 283524 -37006 -170642 176635 233570 174385 95322
5905I5322L49740M4795o3413j18991j11799J74964L9928Q9606j72099j84465J01249
5894B44837k64383J84956q8289r4817K44914L48484l93003M8691J77847K17186
5884F26423q9784l72092K11521j11375n0207j41421J08451q1154J56379j91989
5874F4752j02968J52574J51911m2670K98284O0418l2779k1647j98943k32668Q6271
5863A82535M2849J0803k17778L7524J70933J13451Q8412p6375j23492Q5791P3694
5852C88347j94741j91773P566J67150j93678l2755J26519K37646M5580q2845n6812
5841B20204O2845l9033k5864j07517K20297k3736j26391J4776J10725r6085j43434
5830F6787J45520J04221l5947p3579K85424J37556k6044k73735r0828L518p5499
$$ plain form
5905 95322 445062 489857 426444 307453 195654 370618 410546 500152 328053 143588 244837
5894 244837 -19546 165410 77121 -17696 227218 575702 182699 231390 409237 626423
5884 626423 536639 164547 376068 264693 214486 73065 181516 100362 256741 64752
5874 64752 -38216 114358 266269 223599 521883 582301 549522 527875 328932 96264 182535
5863 182535 225384 236187 18409 55933 226866 340317 428729 352354 228862 314653 388347
5852 388347 193606 1833 9399 176549 -17129 -49884 76635 314281 359861 277016 220204
5841 220204 283049 244016 218152 110635 330932 307196 180805 195581 306306 210221 66787
5830 66787 212307 316528 280581 207002 492426 629982 603938 330203 239375 242893 167394
5819A67394K73193r4738k34808r121J25694L24382m5879m80063N580m6533O9554
5808E4655J01797J62450j63240K78417J29651k17372k17924j23715L69719M8015
5798D22453m1932l2746R4786Q2804k86477M3936K77460q9092j81569R0060m8810
5787C30873q5J1304m0808j92106m9702M96005j39767K5173N2741k20704o1123
5776B11801L58920j03638O7720j39483k08579j01817J67482j33630N8263K08455
5766C85494J97640k11939j53780J45172k03761J73144J6986K39131M028j15890
5756D76225j67244J3938j50849j03367N3757O0281J58852M3658j49775Q8461N3185
5745C77122j33255J63255Q8642j4739k13255J2988J12865J74028j9935j11937
$$ plain form
5819 167394 440587 345849 111041 101920 227614 551996 506117 26054 31634 -14899 54655
5808 54655 156452 318902 155662 434079 563730 346358 128434 4719 374438 422453
5798 422453 380521 347775 442561 525365 238888 282824 560284 471192 289623 379683 330873
5787 330873 330788 342092 301284 109178 59476 555481 415714 440887 493628 272924 211801
5776 211801 570721 467083 534803 395320 186741 84924 252406 118776 177039 385494
5766 385494 583134 371195 217415 362587 158826 331970 348956 588087 592115 476225
5756 476225 308981 322919 172070 68703 122460 182741 341593 385251 235476 323937 377122
5745 377122 243867 407122 495764 481025 267770 280758 393623 567651 547716 435779
5735D35779m16n1837N7931L8884P9097j16897Q9125K2982j88965R0368K8243M1292
5723E25586K41330j88786k4373l3842K05181J41528O2531k11618k85813K68312
5713G00036p3487l427j20066O9862O6410K07084o830j17474J71701J3479j1286
5702H96002j58639M52724J509O0229N9936l28132m7573J16185j0488Q7605j8700
5691A110658k21271l20351R5068R8251p7414L1632R0687r8268K5118j75988r3489
5680D64633L07987q3138j04473j8467J34671j21728K25522K7152L6343j63573
5670G04929k06000O8450P7049j00308K14832j96649j23754J03403j33967J51675
5660E59660n3384M09293j42336j61409q0606J18159J29487M0688n0594l03342
$$ plain form
5735 435779 435363 383526 441457 480341 559438 442541 531666 554648 365683 456051 484294 525586
5723 525586 766916 578130 553757 519915 725096 866624 929155 717537 431724 700036
5713 700036 626549 623122 503056 572918 639328 846412 839582 722108 893809 907288 896002
5702 896002 737363 1190087 1191596 1251825 1311761 983629 936056 1052241 1041753 1129358 1110658
5691 1110658 889387 569036 664104 762355 684941 716573 807260 708992 734110 558122 464633
5680 464633 772620 689482 585009 566542 701213 579485 805007 832159 868502 704929
5670 704929 498929 567379 644428 544120 758952 562303 438549 541952 407985 559660
5660 559660 506276 915569 773233 611824 531218 649377 778864 819552 768958 465616
5650D65616J84750N9872k2889j63122J50639m2365k80533K44807Q7987N4085K92565
5639A031412r7191j77046K95505J00042k8541P6622m02026j1692p3018l0091O6150
5628G50126r5387J40587J04q3684j08949O4211l53200L11781O1092p5490J48888
5617G60079Q7997K17806j32808J12877R203K34230l34330q2524M5431k4335L8505
5606I32131k54785j37553L42760o2989J28881J25981L5058J62870j54940p5975
5596A041439q6440p5661j9688K21564m6635l15943K81842q1478l89013K92733
5586H22720J71587M0438J21348M5172k39279K82039q8198m515J5811n8304l2739
5575A076080j45221Q6853j1035J92057j21744K1245o4653O2825p8021K10245j24284
$$ plain form
5650 465616 650366 710238 687349 524227 674866 632501 351968 596775 684762 738847 1031412
5639 1031412 934221 757175 1052680 1152722 1124181 1200803 798777 787085 714067 683976 750126
5628 750126 654739 795326 795430 711746 602797 667008 313808 625589 686681 611191 760079
5617 760079 848076 1065882 933074 1045951 1055154 1289384 955054 872530 917961 893626 932131
5606 932131 677346 539793 882553 819564 948445 1074426 1109484 1272354 1117414 1041439
5596 1041439 954999 879338 859650 1081214 1034579 718636 1000478 919000 529987 822720
5586 822720 994307 1034745 1156093 1201265 961986 1244025 1155827 1151312 1167123 1108819 1076080
5575 1076080 930859 1017712 1006677 1198734 1076990 1098235 1033582 1096407 1018386 1228631 1104347
5564A104347J64251N1780l11541Q614K92363J5421j89309Q8058j125L0468j01655
5553A151672J64439k9419R3604L0839J20345M394j39302L4681L33720l27954k75548
5542A161471K03990J04090K19986R750j1500L9177k26155K03376j45049K19182
5532A778318J40738j04512j39109P4015k4963M4473q5694J54399R5837M5894j9803
5521A959593K79667j50807p2307j76887p7445J92248J54573K4154K7306J79528
5511B339623q3725K84430N4597l108J18620J99742k72035N4648n025j41966k2782
5500B523019K76631J28590m3122l0927L32613q3283P8633P3363J55603J51156
5490C562276O6306J98867K08388l09102J46467J14126K76811k4947k0485J2472
$$ plain form
5564 1104347 1268598 1320378 1008837 1017451 1309814 1325235 1135926 1223984 1222859 1253327 1151672
5553 1151672 1316111 1286692 1380296 1411135 1531480 1535874 1396572 1431253 1764973 1437019 1161471
5542 1161471 1365461 1469551 1689537 1699287 1687787 1726964 1500809 1704185 1559136 1778318
5532 1778318 1919056 1814544 1675435 1749450 1724487 1768960 1683266 1837665 1933502 1979396 1959593
5521 1959593 2239260 2088453 2016146 1839259 1761814 1954062 2108635 2132789 2160095 2339623
5511 2339623 2255898 2540328 2594925 2591817 2710437 2910179 2638144 2692792 2687767 2545801 2523019
5500 2523019 2799650 2928240 2885118 2854191 3186804 3103521 3182154 3255517 3411120 3562276
5490 3562276 3628582 3827449 4035837 3726735 3873202 3987328 4264139 4239192 4218707 4231179
5480D231179J94962P0636n0944Q6725P409J19470P5407K05018l6117Q7781K73328
5469E264854J02777J31665R0343K64238r0991L08642J83347j08548L05753K71929
5459F724009L44341j35310K01987j32819j47104K84294L55171J35508K62686J82857
5449H075620L34009K67712K06439K68170J82271J46107K38434L13454L13782L48641
5439A0694639K46944J64404P52573M05057L12637P52965L57593L63475M32316
5430A4482603M42271O71403O25165P17923O39174O40511P83702P32199O32528
5421B0367479P41567R99208J177826J144131J196739J248089J242840J430970
5413B9548849J914062J779528K108169K155568K545931K734007L026617L602173
$$ plain form
5480 4231179 4426141 4496777 4445833 4532558 4539967 4659437 4734844 4939862 4903745 4991526 5264854
5469 5264854 5367631 5499296 5589639 5853877 5762886 6071528 6254875 6146327 6452080 6724009
5459 6724009 7068350 6933040 7135027 7002208 6855104 7139398 7494569 7630077 7892763 8075620
5449 8075620 8409629 8677341 8883780 9151950 9334221 9480328 9718762 10032216 10345998 10694639
5439 10694639 10941583 11105987 11858560 12263617 12576254 13329219 13686812 14050287 14482603
5430 14482603 14924874 15596277 16221442 16939365 17578539 18219050 19002752 19734951 20367479
5421 20367479 21109046 22108254 23286080 24430211 25626950 26875039 28117879 29548849
5413 29548849 31462911 33242439 35350608 37506176 40052107 42786114 45812731 49414904
5405D9414904L757864M244958M436075M612789M930131N050356M384731M312545
5397H5144353L944991L651352L017398J904705R75360j03222j625794l183279
5389I3725864m071001m933878n144323n475638n928305n552595n263758n037192
5381E2319174m627489m288020l551530l478035l001242k235338k452509j836498
5373B6848513j764752j705246j431630j412892j064671j184884j110528o21806
5365A6552104o62519j047908p61870l35882n74617p73664n73197n34185m96601
5356A0791661l23059l66176k25281k35932l03391k35334j70695m62006l41492
5347H128295N6806m84709q6744k44353m94087j74245k6313k62682l38764O0687
$$ plain form
5405 49414904 53172768 57417726 61853801 66466590 71396721 76447077 80831808 85144353
5397 85144353 89089344 92740696 95758094 97662799 98638159 98534937 96909143 93725864
5389 93725864 89654863 84720985 79576662 74101024 68172719 62620124 57356366 52319174
5381 52319174 47691685 43403665 39852135 36374100 33372858 31137520 28685011 26848513
5373 26848513 25083761 23378515 21946885 20533993 19469322 18284438 17173910 16552104
5365 16552104 15889585 14841677 14079807 13743925 13169308 12395644 11822447 11288262 10791661
5356 10791661 10468602 10102426 9877145 9641213 9337822 9102488 8931793 8469787 8128295
5347 8128295 8185101 7700392 7613648 7369295 6875208 6700963 6674650 6411968 6073204 6133891
5337F133891k09458K20839j62471n14596k44250l17842l48287L59333L7465k28763
5327D725861l24623k66947k24605O182j26688m5856o8753j40441l43669p3538
5317C116923j6396o3793R280m1718L0304k01384O4560k90012J47916J59581l16853
5306B598408L3430n1224J64216k64375l41543L24913j16727q8741j74462O9394
5296B153289j37171J0072j00781o3757K62860o2331J7120K67258N5383k53408
5286B148534j94676j48209M7903J11973j84739O0764l995k04342K0447m2164m5254
5275A566242L92938k51443r5822r9222J7290K80040q6412K9520l9521j13074j36937
5264A463599J79613N0397n6925l4597J71382k40655k66318J69223K81581l3657
$$ plain form
5337 6133891 5924433 6145272 5982801 5468205 5223955 4906113 4557826 4917159 4954624 4725861
5327 4725861 4401238 4134291 3909686 3915868 3789180 3743324 3674571 3534130 3190461 3116923
5317 3116923 3100527 3036734 3046014 3004296 3034600 2833216 2897776 2607764 2755680 2915261 2598408
5306 2598408 2631838 2580614 2744830 2480455 2138912 2463825 2347098 2258357 2083895 2153289
5296 2153289 2016118 2026190 1925409 1861652 2124512 2062181 2079301 2346559 2401942 2148534
5286 2148534 1953858 1805649 1853552 1965525 1780786 1841550 1837555 1633213 1653660 1611496 1566242
5275 1566242 1959180 1707737 1611915 1512693 1529983 1810023 1723611 1753131 1713610 1600536 1463599
5264 1463599 1643212 1693609 1636684 1602087 1773469 1532814 1266496 1435719 1717300 1683643
5254A683643k47828j0469j80214J97408k34910j2054L66376P6581k55315P3663
5244A456881r7062j93784O295M1178J0160l8779J64708p7660O5748j40156j28418
5233A069111J74741L79060o3978k73453m1774R277j24321O0420k31830k48401
5223G08852J95968L32528q4069j62926L2809J9727Q389l71863N3354R4025J71501
5212I98295J51077o5346k0747R5234l8947n4054J7646p5112j48507J91111j55872
5201H94778J20227K48492k20415r7731m4883K07679K00902q2331j52314Q9623
5191A164027m8963O9338p6892J36290L0223p4820m8363k48503M6860N7270j61355
5180H45112J79113L16700J67609M593J42319J66888L57279P0429j68307j95674
$$ plain form
5254 1683643 1435815 1425346 1245132 1442540 1207630 1195576 1561952 1638533 1383218 1456881
5244 1456881 1359819 1166035 1172330 1213508 1223668 1184889 1349597 1271937 1337685 1197529 1069111
5233 1069111 1243852 1622912 1558934 1285481 1243707 1252984 1128663 1189083 957253 708852
5223 708852 904820 1237348 1153279 990353 1023162 1042889 1051278 679415 732769 826794 998295
5212 998295 1149372 1084026 1063279 1158513 1119566 1065512 1083158 1008046 859539 1050650 894778
5201 894778 1015005 1263497 1043082 945351 900468 1108147 1309049 1226718 1074404 1164027
5191 1164027 1115064 1184402 1107510 1243800 1274023 1199203 1150840 902337 949197 1006467 845112
5180 845112 1024225 1340925 1508534 1513127 1655446 1822334 2179613 2250042 2081735 1886061
5170A886061l00739k43100K28265k33840l79752K85487M8160j73973J2712q8616
5160A040665j42709j59279K43836J59797L9890L8866k33447j58354o3559j86917
5150E78789K18841J79415R8220k97709N6843k24161J69870M6829j85870J42421
5140G83488r9131J9252o5393J15331n4671K44796q5949l1896l7535N3859j8365
5129H23786R5960J47793k18581j73213K40950j29168l5337R5059M7476l3973J38020
5118I98772m0545N8600J72467j53020k00032J46586q9141O8855R2891J00988J3161
5107A169582O7703m3343q6136J37206j89589n4217J17874K3239m3421L56659j61080
5096A294477l26691k09330K45754K05771O6329o3945J3790K65462j36273l2965
$$ plain form
5170 1886061 1585322 1342222 1570487 1336647 956895 1242382 1290542 1116569 1129281 1040665
5160 1040665 897956 738677 982513 1142310 1182200 1221066 987619 829265 765706 578789
5150 578789 797630 977045 1075265 777556 834399 610238 780108 826937 641067 783488
5140 783488 684357 703609 638216 753547 698876 943672 857723 825827 788292 842151 823786
5129 823786 919746 1067539 848958 675745 916695 787527 752190 847249 894725 860752 998772
5118 998772 958227 1016827 1189294 1036274 836242 982828 893687 962542 1055433 1156421 1169582
5107 1169582 1237285 1193942 1107806 1245012 1055423 1001206 1119080 1142319 1098898 1455557 1294477
5096 1294477 967786 758456 1004210 1209981 1276310 1212365 1226155 1491617 1355344 1322379
5086A322379O0822r7744r9722J75958P6394k93606j61310K32617j77948p8836
5076I59004o6329j49113o9877J50245J94500L5184j44031P387P0783O2506j21963
5065I28296L8635K15331j3380J97863m3096n09550j35116J15849M8386J14108
5055I57326J60914Q0243L4317j22962k40477Q6522P3052l05653J30960K3317j18887
5044G58672J60437j05637k22776k12870J50868l2251J14559L51267K9734J71618
5034A163621l50786j38151N5867m3243l1279J29191K73721k22893j90216o4502
5024E81330N7489J59550L39957Q544K3223J62907q3648k07963l80730j17688L35395
5013H78366M8583P7689K49770k6897p8598j38083l42782K20663K49584k6347J09683
$$ plain form
5086 1322379 1383201 1285457 1185735 1361693 1438087 1144481 983171 1215788 1037840 959004
5076 959004 892675 743562 673685 823930 1018430 1053614 909583 916970 987753 1050259 928296
5065 928296 966931 1182262 1168882 1366745 1323649 814099 678983 794832 843218 957326
5055 957326 1118240 1198483 1232800 1109838 869361 955883 1028935 723282 854242 877559 758672
5044 758672 919109 813472 590696 377826 528694 496443 611002 962269 992003 1163621
5034 1163621 812835 674684 730551 687308 656029 785220 1058941 836048 645832 581330
5024 581330 638819 798369 1138326 1146870 1170093 1333000 1249352 1041389 660659 542971 878366
5013 878366 926949 1004638 1254408 1227511 1148913 1010830 668048 888711 1138295 1111948 1221631
5002A221631J45934l69795J27543K64928k08569l01843p5703R8117J56571M077
4992A062891j15013n814J59776L1747M3425j42390p5376j5894L79450n003j01430
4981A216369m9379L05869M4653l41655j15003J09145N2608j13037K86814O5281
4971A461665M8705p0018j67689o8724K49916j38550l7027N0162N353O1943N9983
4960A455719K71075J36325k03894j22588K58314Q4092l8630j15192k19194p8779
4950A427248L68591N9956j86124N6395L02375j53539j64475O5375n2273L02471
4940B026000j21774J12824q6548L8440N1580j82680k6315J32684J21958j0638
4930B055531j05851Q168K56611k18660q037j56912P3415L06555j45930L2932k81553
$$ plain form
5002 1221631 1367565 997770 1125313 1390241 1181672 879829 804126 902243 1058814 1062891
4992 1062891 947878 942064 1101840 1133587 1177012 1034622 959246 943352 1322802 1317799 1216369
4981 1216369 1166990 1472859 1517512 1175857 1060854 1169999 1222607 1109570 1396384 1461665
4971 1461665 1510370 1440352 1272663 1203939 1453855 1315305 1278278 1328440 1333793 1395736 1455719
4960 1455719 1726794 1863119 1659225 1536637 1794951 1879043 1840413 1725221 1506027 1427248
4950 1427248 1795839 1855795 1669671 1726066 2028441 1874902 1710427 1775802 1723529 2026000
4940 2026000 1904226 2017050 1930502 1968942 2020522 1837842 1811527 1944211 2066169 2055531
4930 2055531 1949680 1957848 2214459 1995799 1987762 1830850 1904265 2210820 2064890 2097822 1816269
4919A816269j32975m2225r1512J88568L76538l11675P5312J68050n6816j13181
4909A876353j3198p9119M8j96438m6460K17918k9965L1890Q6924L8601N4685k41230
4897A700009M1800K9487N062O0451j8307J96632Q2715L6893J1179K8326o2750
4886B111497J20306m04369j62540K09642K18731M4160j16679k35476k9525m1866
4876A713881j23164n9632J49090J9336K5254K79771k43684K36350L01084j12184
4866B186102k75492L5871J15602l45771Q3319J78518J6386K21163J41962j49949
4856B207711l3130L7336Q5126P832p2461P0152K33888J19622o7642K93151j53004
4845B728581j5168P043k65110J58747K53739j93063j10835j61578J90621R9402
$$ plain form
4919 1816269 1683294 1641069 1549557 1738125 2114663 1802988 1878300 2046350 1989534 1876353
4909 1876353 1863155 1784036 1784084 1587646 1541186 1759104 1729139 1761029 1847953 1886554 1941239 1700009
4897 1700009 1741809 1771296 1776358 1836809 1818502 2015134 2097849 2134742 2145921 2174247 2111497
4886 2111497 2231803 1827434 1664894 1874536 2093267 2137427 2020748 1785272 1755747 1713881
4876 1713881 1590717 1531085 1680175 1699511 1724765 2004536 1760852 1997202 2298286 2186102
4866 2186102 1910610 1946481 2062083 1716312 1799631 1978149 1994535 2215698 2357660 2207711
4856 2207711 2174581 2211917 2297043 2304875 2232414 2302566 2536454 2656076 2588434 2881585 2728581
4845 2728581 2713413 2720456 2455346 2614093 2867832 2674769 2563934 2402356 2592977 2692379
4835B692379J92145M93723q0787j004J31418j06966J29792M56260P4455L49964
4825D331379j69672K6431j54516k88696l16183j12351n2176k29524K01350j9296
4815C216746k18672l3219K06904L13945P8161n3030n0096q9325j13509J68793
4805C426698N9498L0893o1052J15714J34922l784Q2445K18329K87554j65025J41109
4794D267301M49092L30886L0394k6865K81797j83469k39620K8566m64078j64273
4784D309731J40616N5056o6817L549k07417j17507J89288J7729j09806L7675L18047
4773D570144K09984P288j28603J111O570R8805K40649O1797j64792L71151k9296
4762E244808j81927j2650J4660L98964R7798O8273j05388J3908K56102k3165J01714
$$ plain form
4835 2692379 2884524 3378247 3297460 3296456 3427874 3320908 3450700 3906960 3981415 4331379
4825 4331379 4161707 4188138 4033622 3744926 3428743 3316392 3264216 3034692 3236042 3216746
4815 3216746 2998074 2964855 3171759 3485704 3563865 3510835 3460739 3371414 3257905 3426698
4805 3426698 3486196 3517089 3456037 3571751 3706673 3702889 3785334 4003663 4291217 4126192 4267301
4794 4267301 4716393 5047279 5077673 5050808 5332605 5149136 4909516 4938082 4474004 4309731
4784 4309731 4450347 4505403 4438586 4442135 4234718 4117211 4306499 4324228 4214422 4252097 4570144
4773 4570144 4780128 4787416 4658813 4659924 4666494 4765299 5005948 5067745 4902953 5274104 5244808
4762 5244808 5062881 5050231 5064891 5463855 5561653 5629926 5524538 5538446 5794548 5771383 5873097
4751E873097J99079J0725J88203m4175J73028J06939J57682L72127K77205J57671
4741G471581n332J12230J33612K87920L77623N72278j03353M21910O73324K80770
4731A0222563K69669K3836J86668L43391K30529J63227L82323N3072l23933K0279
4721A1571624p5604k82912Q2173J92164L48413N9416K05357K3312R9892L18482
4711A2542317M22298K69955L06364L02824M90191M38505J92477N12709O76820
4702A6154460J47720L56292K01631J06295K39145J98383P26997L03591N26325
4693A8960839O98476N10217P70323L54661M55415O33404M80852O01095M25293
4684B3890575P01911N10682P06802Q44784Q09375J078752J121956O56058J125859
$$ plain form
4751 5873097 6072176 6082901 6271104 6226929 6399957 6506896 6664578 7036705 7313910 7471581
4741 7471581 7466249 7578479 7712091 8000011 8377634 8949912 8846559 9268469 9941793 10222563
4731 10222563 10492232 10516068 10702736 11046127 11276656 11439883 11822206 11875278 11551345 11571624
4721 11571624 11496020 11213108 11295281 11487445 11835858 11895274 12100631 12123943 12223835 12542317
4711 12542317 12964615 13234570 13540934 13843758 14333949 14772454 14964931 15477640 16154460
4702 16154460 16302180 16658472 16860103 16966398 17205543 17403926 18130923 18434514 18960839
4693 18960839 19659315 20169532 20939855 21294516 21749931 22383335 22864187 23465282 23890575
4684 23890575 24592486 25103168 25809970 26654754 27464129 28542881 29664837 30320895 31446754
4675C1446754J392994J073097O87065J204675J115765J123453J377700J039950
4667D0461453J647806J560843J510032J391782J691428K136556K629529K711991
4659E5741420K807920K756962L435035M063106M265036M748060N166521N600958
4651H8585018O094830O136829N793904N310502N010367M762744M731557N044366
4643A31470117N414495N768274N526753N128199M301816K517954J149697m06089
4635A60871216k270118l642786m914119o089402o471121o907083o975974o783340
4627A16817273o479120n933938o196766n691993m861188m854739m584410m222357
4619G3992762m226039l812107l667951l299806l363660k968325k931696k937876
$$ plain form
4675 31446754 32839748 33912845 34599910 35804585 36920350 38043803 39421503 40461453
4667 40461453 42109259 43670102 45180134 46571916 48263344 50399900 53029429 55741420
4659 55741420 58549340 61306302 64741337 68804443 73069479 77817539 82984060 88585018
4651 88585018 94679848 100816677 106610581 111921083 116931450 121694194 126425751 131470117
4643 131470117 136884612 142652886 148179639 153307838 157609654 160127608 161277305 160871216
4635 160871216 158601098 154958312 150044193 143954791 137483670 130576587 123600613 116817273
4627 116817273 110338153 104404215 98207449 92515456 87654268 82799529 78215119 73992762
4619 73992762 69766723 65954616 62286665 58986859 55623199 52654874 49723178 46785302
4611D6785302k321573k158493k252474k094101j752374j593757j459426j337387
4603C1815717j152838j011316j226289r90251q87772j104547o60538p12670o43891
4594B3425605o21404o72147n05744o99632m87377m28226n76618m70566n43607
4585A8420284m51346o53627n55279l40970l81733m09139m94029k87667p76787
4576A4069707l76711l32883k90171l49221l52748l53959l42128l40829k86131
4567A1044926o9381k65939m67487m45058Q9536n21240j51429K5914k46295k15455
4557H778092j63491q4169k2031m9326m0912j55636j45710j37097L6816J99625
4547H216161k80696k80258n0641K32900p9169k52418J11334q3044K25015L94508
$$ plain form
4611 46785302 44463729 42305236 40052762 37958661 36206287 34612530 33153104 31815717
4603 31815717 30662879 29651563 28425274 27435023 26547251 25442704 24782166 24069496 23425605
4594 23425605 22804201 22132054 21626310 20926678 20439301 20011075 19434457 18963891 18420284
4585 18420284 17968938 17315311 16760032 16419062 16037329 15628190 15134161 14846494 14069707
4576 14069707 13692996 13360113 13069942 12720721 12367973 12014014 11671886 11331057 11044926
4567 11044926 10975545 10709606 10242119 9797061 9886597 9365357 9213928 9239842 8993547 8778092
4557 8778092 8614601 8530432 8508401 8459075 8418163 8262527 8116817 7979720 8016536 8216161
4547 8216161 7935465 7655207 7604566 7837466 7758297 7505879 7617213 7534169 7759184 8153692
4537H153692m8720k38488o8120J91272l935j31311J42539N596J9337j52961q4919
4526G783982M98009J65513J77523j83978J53077L40526l1584N6206K48300J31447
4516I339021N5455J14899O0628j336K70416K21765K08569j60888K54978L39404
4506A0702911J88958K1027N461K41930J16790J98634m593J44411K47293J33293
4496A1996115J31347N6515J38805J94230P0688L39295L63584M97510K49794L04203
4486A4342086J22067L37929L68272M27464K05624j20912L25073P87108L95609
4477A7190320L72605N48375M17216N12014O26111P89327P22570M19238R17125
4468B2514901P83481Q39742R51177Q67374J099595Q43685R95574J195291J135739
$$ plain form
4537 8153692 8104972 7866484 7798364 7989636 7985701 7854390 7996929 8002525 8021862 7868901 7783982
4526 7783982 8281991 8447504 8625027 8441049 8594126 8934652 8903068 8959274 9207574 9339021
4516 9339021 9394476 9509375 9570003 9568667 9839083 10060848 10269417 10108529 10363507 10702911
4506 10702911 10891869 10912896 10918357 11160287 11277077 11475711 11471118 11615529 11862822 11996115
4496 11996115 12127462 12183977 12322782 12517012 12587700 12926995 13290579 13788089 14037883 14342086
4486 14342086 14464153 14802082 15170354 15597818 15803442 15682530 16007603 16794711 17190320
4477 17190320 17562925 18111300 18528516 19040530 19666641 20455968 21178538 21597776 22514901
4468 22514901 23298382 24138124 25089301 25956675 27056270 27899955 28895529 30090820 31226559
4459C1226559J049787J335687J549813J555921J564312J843895J884637K188677
4451D4199288K411059K556418K893276K887956L601732M355317M793075N020482
4443G2718603N375105O279413P138831Q536657J0116884J2076459J3930629J6059822
4435A52232403J7318848J7214171J3784749O781246k293122j1600684j7707854
4428A75729757j9784787j8992257j6893921j4416458j2328329j0257277q323525
4421G4733203p099835o242481n122071m470010l597977l375034k991299k488740
4413C9345756k357707k294185k021811j694273j743881j336931j096826j314577
4405B5485565j178455j097423j072782p62799r33561r22006p60602q64493l23954
$$ plain form
4459 31226559 32276346 33612033 35161846 36717767 38282079 40125974 42010611 44199288
4451 44199288 46610347 49166765 52060041 54947997 58549729 62905046 67698121 72718603
4443 72718603 78093708 84373121 91511952 100048609 110165493 122241952 136172581 152232403
4435 152232403 169551251 186765422 200550171 207331417 205038295 193437611 175729757
4428 175729757 155944970 136952713 120058792 105642334 93314005 83056728 74733203
4421 74733203 67633368 61390887 56268816 51798806 48200829 44825795 41834496 39345756
4413 39345756 36988049 34693864 32672053 30977780 29233899 27896968 26800142 25485565
4405 25485565 24307110 23209687 22136905 21374106 20440545 19518539 18757937 17893444 17569490
4396A7569490q29684o96993k30550n91135m50006k38643n37107m03109n51502
4387A3040761j31322k90442n03867k52303m86764m32339k78251j62958k81042
4378A0221473n3523P2333m00864l35417j26101p3821k34337m98857k29507l92239
4368G949140l87284k32547M29028o7856j15467m69364k23738N6301O6948j79825
4358F825336l06728N1933j58828P2884r5129j09763P2407j89913m3072q6679o0618
4347E971830j97990n7669K22667m5395k19075j37724j14252j66058J20836o6374
4337E310796J33723k00870l1694j80072l32837L8692o9705j34411Q8561n6339
4327D565844R0300k59324M7899K9375k57660L97288j04178j57854j05054K01783
$$ plain form
4396 17569490 16739806 16042813 15812263 15221128 14771122 14532479 13995372 13592263 13040761
4387 13040761 12909439 12618997 12115130 11862827 11376063 10943724 10665473 10502515 10221473
4378 10221473 10167950 10240283 9839419 9504002 9377901 9304080 9069743 8570886 8341379 7949140
4368 7949140 7561856 7329309 7758337 7690481 7575014 7105650 6881912 6938213 7005161 6825336
4358 6825336 6518608 6570541 6411713 6484597 6389468 6279705 6352112 6162199 6119127 6032448 5971830
4347 5971830 5773840 5716171 5938838 5893443 5674368 5536644 5422392 5256334 5377170 5310796
4337 5310796 5444519 5243649 5211955 5031883 4699046 4737738 4668033 4533622 4622183 4565844
4327 4565844 4656144 4396820 4444719 4474094 4216434 4613722 4509544 4351690 4246636 4448419
4317D448419p827P7747N1512j4120j68909P4847j25173J01228j30445J5466L7700
4306D360445k26345j27416M2135n71K39850l5691k1041J70955K6468J0475o3582
4295D375682K91246L9958j68957J118J55086P3624J52931l1597L513L8811n4618
4284D876797k61696k52348M3267k26262j29388q4431n3880n8585m1343J8742j94630
4273C636243j91882p5755K49845k03842k5780L9302Q9466J48710j48256j1040
4263C507011K82384m2207Q3538K32266j72312n8570k47165p1307K37818J77510
4253C928966M66176J20899N095j04777j84376j59303j10089J86432J46366K710
4243D298099R9766J23364k81882j80323P7844l5214K28914j50724n1459j0947
$$ plain form
4317 4448419 4440592 4518339 4569851 4555731 4386822 4461669 4336496 4437724 4307279 4322745 4360445
4306 4360445 4134100 4006684 4048819 4048248 4288098 4252407 4231366 4402321 4428789 4439264 4375682
4295 4375682 4666928 4706886 4537929 4539047 4694133 4767757 4920688 4889091 4892604 4931415 4876797
4284 4876797 4615101 4362753 4406020 4179758 4050370 3965939 3912059 3853474 3812131 3830873 3636243
4273 3636243 3444361 3368606 3618451 3414609 3388829 3428131 3517597 3666307 3518051 3507011
4263 3507011 3789395 3747188 3830726 4062992 3890680 3832110 3584945 3513638 3751456 3928966
4253 3928966 4395142 4516041 4521136 4416359 4231983 4072680 3962591 4149023 4295389 4298099
4243 4298099 4397865 4521229 4239347 4059024 4136868 4101654 4330568 4179844 4128385 4117438
4233D117438n2797j28396k83182M48554k74818k00148Q749k33904j54257r0992
4223C156247M87548j17310k8715J82681m5212o1051N5278k9018J34520j53905
4213C581063L4900J26333K29479j24002l1187m38103m1706K18974Q9856K08692
4203C854299R9848m32214K2136m2476k69692K10514J87471J41192J16310j08173
4193C779215J58604p1519L2414n7561r6127J5579r4090K20910k42448l6211J27214
4182C735980K96545N9167n9591k01153L21951J50247K26551k55155K24888Q5485
4172D584915j59282J47902M4222Q2394k8030J4126K03070K8478J21602o7564O6606
4161E038439J23888J09271K60422J35755j14553l9755M7164J72272K46352K7278
$$ plain form
4233 4117438 4064641 3936245 3653063 4101617 3826799 3626651 3635400 3401496 3247239 3156247
4223 3156247 3643795 3526485 3497770 3680451 3635239 3574188 3629466 3600448 3734968 3581063
4213 3581063 3615963 3742296 3971775 3847773 3816586 3378483 3336777 3555751 3645607 3854299
4203 3854299 3954147 3521933 3544069 3501593 3231901 3442415 3629886 3771078 3887388 3779215
4193 3779215 3937819 3866300 3898714 3841153 3745026 3760605 3666515 3887425 3644977 3608766 3735980
4182 3735980 4032525 4091692 4032101 3830948 4152899 4303146 4529697 4274542 4499430 4584915
4172 4584915 4425633 4573535 4617757 4700151 4672121 4686247 4889317 4917795 5039397 4971833 5038439
4161 5038439 5162327 5271598 5532020 5667775 5553222 5513467 5560631 5732903 5979255 6006533
4151F006533J59155J04112K51647j06607M7828K04929J44150J37796L81945J40014
4141G471502Q1894O5526J66518J04206M65005Q0306l15704L08493J39857J62727
4131H730330K2995L43392Q3177R3776Q2114J40682k8922M92891Q054K7306j04309
4120I891486j04219J99434L23293j0809J64950J41308k14805K35511K59306N50426
4110A1435881O63114J09608j5857L00311J35332K42328J40899L83597K23569K65489
4100A3884271N28954K10181P76273J92775M65942P47324J67268M66675R97860
4091A8437523M80642M37040M13492O84706R39710P44968N37531P48575R49694
4082B4373881J119136J075181J006172J164611J341835J622453J324405J487486
$$ plain form
4151 6006533 6165688 6269800 6521447 6414840 6462668 6667597 6811747 6949543 7331488 7471502
4141 7471502 7553396 7618922 7785440 7889646 8354651 8434957 8119253 8427746 8567603 8730330
4131 8730330 8753325 9096717 9179894 9273670 9355784 9496466 9467544 9960435 9968489 9995795 9891486
4120 9891486 9787267 9986701 10309994 10299185 10464135 10605443 10390638 10626149 10885455 11435881
4110 11435881 12098995 12208603 12192746 12493057 12628389 12870717 13011616 13395213 13618782 13884271
4100 13884271 14413225 14623406 15399679 15592454 16058396 16805720 16972988 17439663 18437523
4091 18437523 18918165 19355205 19768697 20453403 21393113 22138081 22675612 23424187 24373881
4082 24373881 25493017 26568198 27574370 28738981 30080816 31703269 33027674 34515160
4074C4515160J441063J521854J792705J811103J460658J711932J602425J836593
4066D7693493J761065K009700K013992K126574K190398K216632J958794K181903
4058F4152551K176881K151717K166481J677840J393114J721258J364204J196062
4050G8000108J494234J390516J369042J446493J517911J344136Q76027J121970
4042H8560437J083087L18015k2752J77186p59773m63181l53269k48241n29846
4033H7761663q80761n39490l99518r87802r06225p79063j158063j564554j653896
4024G8892291j498265j600165j594140j652271j641820j559322j435444j488681
4016F6422183j441340j444157j180625j159566j518753j223648j148917j411789
$$ plain form
4074 34515160 35956223 37478077 39270782 41081885 42542543 44254475 45856900 47693493
4066 47693493 49454558 51464258 53478250 55604824 57795222 60011854 61970648 64152551
4058 64152551 66329432 68481149 70647630 72325470 73718584 75439842 76804046 78000108
4050 78000108 79494342 80884858 82253900 83700393 85218304 86562440 87438467 88560437
4042 88560437 89643524 89961539 89938787 90115973 89356200 88893019 88539750 88291509 87761663
4033 87761663 86880902 86341412 85941894 84954092 84047867 83268804 82110741 80546187 78892291
4024 78892291 77394026 75793861 74199721 72547450 70905630 69346308 67910864 66422183
4016 66422183 64980843 63536686 62356061 61196495 59677742 58454094 57305177 55893388
4008E5893388j182293q40988r31011q93461n44427p03010j18595l28616l08735
3999E0042252J4917l01901M08653N74880L90877K14138M16592N42146N84833J000779
3989E3888166P06589R44752J085865J130320J461069J968479J963724K086441
3981F5235405K198762K568254L032628L606055L852035M277157M746042N438947
3973I4955285O254604O895714Q221826R440575J0930058J2972563J4429908J7333527
3965A81434060J8966493J9336776J8219251J5345556J0705888N843402J278661
3958B71130087l091002n096965o602626o485765n546763m394428l095488j972378
3950B34844672j406227j710510k180134l951287o610918r604899j1981873j4621574
$$ plain form
4008 55893388 54711095 53870107 52939096 52045635 51501208 50798198 50679603 50350987 50042252
3999 50042252 50057169 49755268 50163921 50738801 51129678 51343816 51760408 52302554 52887387 53888166
3989 53888166 54594755 55539507 56625372 57755692 59216761 61185240 63148964 65235405
3981 65235405 67434167 70002421 73035049 76641104 80493139 84770296 89516338 94955285
3973 94955285 101209889 108105603 116327429 125768004 136698062 149670625 164100533 181434060
3965 181434060 200400553 219737329 237956580 253302136 264008024 269851426 271130087
3958 271130087 268039085 262942120 256339494 249853729 244306966 239912538 236817050 234844672
3950 234844672 233438445 231727935 229547801 225596514 218985596 209380697 197398824 182777250
3942A82777250j5585451j5601881j5091873j3566227j1842465j0061929q962166
3935I2065258p747990o676783n951374n542165m722165l867633l560735l138803
3927E0857610k928273k629277k100711j930729j744858j348156j345911j732988
3919C5096707j184966q90470j193502j054589q52890r11738r08652q22417o93361
3910B6584122o06747n25144n28934o75334q98499k92851o9609m99359n13654l65247
3900B1608744o79176o63349l46067l48394m66300q39772l47392j58779l13049
3891A7446466n81698k33748k28136n15652m97729m81670J56024k96233l74719
3882A4392905j63499P1196l02236j91614o9792m05679k45680j21145o8935p3019
$$ plain form
3942 182777250 167191799 151589918 136498045 122931818 111089353 101027424 92065258
3935 92065258 84317268 77640485 71689111 66146946 61424781 57557148 53996413 50857610
3927 50857610 47929337 45300060 43199349 41268620 39523762 38175606 36829695 35096707
3919 35096707 33911741 33021271 31827769 30773180 29920290 29008552 28099900 27277483 26584122
3910 26584122 25977375 25452231 24923297 24247963 23349464 23056613 22987004 22487645 21973991 21608744
3900 21608744 20929568 20266219 19920152 19571758 19105458 18265686 17918294 17759515 17446466
3891 17446466 16864768 16631020 16402884 15887232 15389503 14907833 15063857 14767624 14392905
3882 14392905 14229406 14300602 13998366 13806752 13736960 13331281 13085601 12964456 12895521 12822502
3872A2822502r9917l63877o8957J20379P9278k13336q5492j0915k7286Q959k70269
3861A1891069K11866L7959R2249J1236l23817J4323Q0456j09097j56610K23588
3851A1973222j48401k92219k62826J01996P8369K41985Q0907N6787j19117j77001
3841A1533702j638J4234K7017j235j28553O8318R4891q1055P3503j44063K30723
3830A1685844k39586j3851J60017j70581k00147P0216l01221Q3071j40828q7273
3820A0845661J38017J00863k04112j92619K87774k67334k49248J21948p7688j05017
3810A0398245l2812j39330L41210l53797j13518J38835j57869j1931J8K3654P7585
3799A0170290j597J0821j15570j43867J80647j52205k54634o1470O2751N8399
$$ plain form
3872 12822502 12722585 12358708 12289751 12410130 12489408 12276072 12190580 12179665 12152379 12161338 11891069
3861 11891069 12102935 12140894 12233143 12244379 11920562 11934885 12015341 11906244 11749634 11973222
3851 11973222 11824821 11532602 11269776 11371772 11450141 11692126 11773033 11829820 11710703 11533702
3841 11533702 11532064 11546298 11573315 11572080 11443527 11511845 11606736 11525681 11599184 11455121 11685844
3830 11685844 11446258 11432407 11592424 11421843 11221696 11291912 10990691 11073762 10932934 10845661
3820 10845661 10983678 11084541 10880429 10687810 10975584 10708250 10459002 10580950 10503262 10398245
3810 10398245 10365433 10226103 10567313 10213516 10099998 10238833 10080964 10069033 10069051 10092705 10170290
3799 10170290 10168693 10179514 10063944 9920077 10100724 9948519 9693885 9632415 9695166 9753565
3789I753565j3566m8755Q9632k34889m4857K6545J75208l0627j83172J47047Q6943
3778I723074l26921j32721L13005L21096j76203k0051j98651J52944K36994k61954
3768I630612K01329K6078k26607K60273j41959r1984K62401J45423n000R5322
3758A0155888K69356J72369K29145O4020J27982L4461J16619J37445J31857L52062
3748A1791204K18745J60136J07650l8350J96307L75953j27240j33266K14846L98441
3738A3164426J47010L11277L12313L55552P2390l58N27966N0272M29728J07910
3728A5478486L72397O7107K1193L97632O44249n5552J55907M22700N05764K87410
3718A8297293J09022J03810M07659L12792L63384N08628M58586M79001M60149
$$ plain form
3789 9753565 9739999 9691244 9780876 9545987 9501130 9527675 9702883 9672256 9489084 9636131 9723074
3778 9723074 9396153 9263432 9576437 9897533 9721330 9701279 9502628 9655572 9892566 9630612
3768 9630612 9831941 9858019 9631412 9891685 9749726 9657742 9920143 10065566 10060566 10155888
3758 10155888 10425244 10597613 10826758 10890778 11018760 11053221 11169840 11307285 11439142 11791204
3748 11791204 12009949 12170085 12277735 12239385 12435692 12811645 12684405 12551139 12765985 13164426
3738 13164426 13311436 13622713 13935026 14290578 14362968 14362610 14890576 14940848 15370576 15478486
3728 15478486 15850883 15917990 15939183 16336815 16981064 16925512 17081419 17504119 18009883 18297293
3718 18297293 18406315 18510125 18917784 19230576 19593960 20102588 20561174 21040175 21500324
3709B1500324M42134K82700L23660M09638L35853O52120M38545O43245P17411
3700B5745630P82798P55841R50777R35255Q32142P95267P61871J231269J034626
3691C3825476J260191R15155J129698J393565J455441J363750J720866J708329
3683D4772471K092175K299987K500687K809345K858261L253210L591170L922735
3675F8100041M357529M823330N363271O409436P376718Q281641R597511J0880333
3667A25189810J1581829J1576023J0373570P951702N171585K637963J060331Q54109
3659A76396922J768138L413136N470016P298039Q545279R407696R658802Q124928
3651B30082956N492863J965575k066547n950312q769026j0825306j1185640j0532553
$$ plain form
3709 21500324 21942458 22225158 22548818 22958456 23294309 23946429 24384974 25028219 25745630
3700 25745630 26528428 27284269 28235046 29170301 30002443 30797710 31559581 32790850 33825476
3691 33825476 35085667 36000822 37130520 38524085 39979526 41343276 43064142 44772471
3683 44772471 46864646 49164633 51665320 54474665 57332926 60586136 64177306 68100041
3675 68100041 72457570 77280900 82644171 89053607 96430325 104711966 114309477 125189810
3667 125189810 136771639 148347662 158721232 166672934 171844519 174482482 175542813 176396922
3659 176396922 178165060 181578196 187048212 194346251 202891530 212299226 221958028 230082956
3651 230082956 235575819 237541394 235474847 229524535 220755509 209930203 198744563 188212010
3643A88212010r677701q257201o319434m712087l430241k635860k971983m023047
3635A46184456n403453p178320r018148j0384470j0581913r799228q471581p356453
3627G7990890o280722n163533m176649l734993l291717k592760k093928k242874
3619D8413714j828857j639135j892232j817862j677329j465283j740678j336821
3611C5015517j669934j357786j083841j239714j095988p92118q53170r55073j057152
3602B4910741r78618q58822j080375j093719o68838q91050j004781r68204o99405
3593A6666929n45930o98938o80543m76926m65319o94254n91757n37815l4951j76987
3583A1763509n81161m07866m07786m14916k29466m84885l78162j56428k07705
$$ plain form
3643 188212010 178534309 170277108 163957674 159245587 155815346 153179486 150207503 146184456
3635 146184456 140781003 133602683 124584535 114200065 103618152 93818924 85347343 77990890
3627 77990890 71710168 66546635 62369986 58634993 55343276 52750516 50656588 48413714
3619 48413714 46584857 44945722 43053490 41235628 39558299 38093016 36352338 35015517
3611 35015517 33345583 31987797 30903956 29664242 28568254 27776136 26922966 25967893 24910741
3602 24910741 23932123 23073301 21992926 20899207 20230369 19339319 18334538 17366334 16666929
3593 16666929 16120999 15422061 14741518 14264592 13799273 13105019 12513262 11975447 11940496 11763509
3583 11763509 11182348 10774482 10366696 9951780 9722314 9237429 8859267 8702839 8495134
3574H495134k60849k48189k36693m46887m33071N3624Q002k13906j77085j26273
3564F413807k62169j55148k8549k8670j26353l49764M7279N3117m00557R3400
3554E256393k36955N92J04002n6520j15080J2691j46161k74387j55485j40272
3544D248818l43413J70857o0283k6322n9516L4840J33485k52057M0149j32895
3534C753663J56514J23208J2579j63713k03001K8685p6451j62848j83275k6583
3524C258778m9438j24298K9083k79778J4335R9585K1460j83421J51608q7945J74796
3513C024765j24795j52752o7211J61111j6407j68823K34730j73173j49985K41289
3503B808749l06591j42282J4483n9230N3283q4002L642o0966J6900k06673l7454
$$ plain form
3574 8495134 8234285 7986096 7749403 7302516 6869445 6923069 6931071 6717165 6540080 6413807
3564 6413807 6151638 5996490 5967941 5939271 5812918 5463154 5510433 5563550 5162993 5256393
3554 5256393 5019438 5020030 5124032 5067512 4952432 4965123 4818962 4544575 4389090 4248818
3544 4248818 3905405 4076262 4015979 3989657 3930141 3964981 4098466 3846409 3886558 3753663
3534 3753663 3910177 4033385 4045964 3882251 3679250 3707935 3631484 3468636 3285361 3258778
3524 3258778 3209340 3085042 3114125 2834347 2848682 2948267 2969727 2786306 2937914 2849969 3024765
3513 3024765 2899970 2747218 2680007 2841118 2824711 2655888 2890618 2717445 2567460 2808749
3503 2808749 2502158 2359876 2374359 2315129 2368412 2284410 2288052 2227086 2243986 2037313 1999859
3492A999859K30337k28533j01266J06401k7370j93590O7283l81189K3233J44823
3482A639988m8935n2289J18061K5987k54768n3695j26717O2213o4015j40267J15609
3471A221172K14052n3131m2702J63047J21328k24196J97160l38791j22202Q2535
3461A218272o9510R5816k21004m1386J80587j59660J71307j48650m5559M0715
3451A020928J1799j0373j41330J19562M5363j58425k10447P980k117J64450J56164
3440A003554j0819J0283J3023j65906r1088j7095L6684J40999j0532j36404O1292
3429H33991l5231p0033r162O6060K9035L98541r1332l83232k14795n2642K59570
3418G30770N1876j1253J48148j87176P057M5775j80351K1577l4153L06168K4017
$$ plain form
3492 1999859 2230196 2001663 1900397 2006798 1979428 1785838 1853121 1471932 1495165 1639988
3482 1639988 1591053 1538764 1656825 1682812 1428044 1374349 1247632 1309845 1245830 1105563 1221172
3471 1221172 1435224 1382093 1339391 1502438 1623766 1399570 1596730 1257939 1135737 1218272
3461 1218272 1148762 1244578 1023574 982188 1162775 1003115 1174422 1025772 980213 1020928
3451 1020928 1032727 1022354 881024 1000586 1045949 887524 677077 685057 682940 847390 1003554
3440 1003554 992735 1003018 1016041 850135 759047 741952 778636 919635 909103 772699 833991
3429 833991 798760 728727 719565 785625 814660 1213201 1121869 738637 523842 471200 730770
3418 730770 782646 771393 919541 732365 739422 785197 604846 626423 592270 898438 922455
3407I22455j31071k4824j19159p3307Q2976j08114l671O146K46272J627r6589
3396G02741k67224q2027r5531L45703K25011q6350k7512L9331j796k27840K06580
3385G31086N11097r7233k24715q2847j44398J63985Q5512J58289J50124P2225
3375A323125p1834k45443n2425P0413J48675R7292R8431K56589M4463M2081k84489
3364A426878j22743K33266n1160o1901O3249J75535l7624k78174J24366l2512
3354A439180k10344j50160m1090O1996n5663l00498J92685J42157m04247r1331
3344E82685L99134J17960n1099j62520k07551j5182J64604j00358J33642m3726
3334H17589j50812J19769q2144j4173k33570P0441O9807J4102j93626p350J13807
$$ plain form
3407 922455 791384 766560 647401 574094 657070 548956 545285 551431 797703 799330 702741
3396 702741 435517 353490 257959 603662 828673 742323 714811 754142 752346 524506 731086
3385 731086 1242183 1144950 920235 837388 692990 856975 942487 1100776 1250900 1323125
3375 1323125 1251291 1005848 953423 1023836 1172511 1269803 1368234 1624823 1669286 1711367 1426878
3364 1426878 1304135 1537401 1486241 1424340 1487589 1663124 1625500 1347326 1471692 1439180
3354 1439180 1228836 1078676 1037586 1099582 1043919 743421 936106 1078263 674016 582685
3344 582685 981819 1099779 1048680 886160 678609 663427 828031 727673 861315 817589
3334 817589 666777 786546 704402 690229 456659 527100 596907 611009 417383 410033 523840
3323E23840j60187L1129N4957M8845J76470k0484l16328l3884O2270O0185q1873
3312C44940q9317k37091j06595N63244J58841l28415m0317m9824k15953L0141
3302B9654L49409r9473j41942j34925N18372k33011k8076M9587o3306J99041k22007
3291B23323N2068J87699j06303j70990P7939J38397J11525n2941l0515j83849
3281B46353K81717J20710k5687l4158n3860r1562j09899l9165j44600l2751K78836
3270C95934J32315j2649m3503J40102l23579J49007Q0134L4376J74673k1143p3879
3259F31788l2643k47756n6544K6891M68482k00490l1324J89600J36517J08358
3249I92879J19144J7458l29921P0622K05095n2077m10381J8183K9277J59911k91207
$$ plain form
3323 523840 363653 394782 449739 498584 675054 654570 338242 304358 366628 426813 344940
3312 344940 255623 18532 -88063 475181 634022 305607 265290 215466 -487 29654
3302 29654 379063 279590 137648 2723 521095 288084 260008 309595 246289 445330 223323
3291 223323 275391 463090 356787 185797 263736 402133 513658 460717 430202 246353
3281 246353 528070 648780 623093 588935 535075 443513 333614 294449 149849 117098 395934
3270 395934 528249 515600 472097 612199 288620 437627 517761 552137 726810 705667 631788
3259 631788 599145 351389 294845 321736 790218 589728 558404 748004 884521 992879
3249 992879 1112023 1129481 799560 870182 1075277 1023200 612819 631002 660279 820190 528983
3238E28983j24679j6448o6627P7096p2567l361P7151r0152p7260j53121O3550
3227A42565r6027j24381J06501m9007Q5165J55601l93019J91613K10511L57004
3217E86526J7970m3566m46546k14269J46550n1294p2176J97872R9689k45773J53546
3206A28529J54119j81563J12902r0632K2803R5360m9574q4860j56812J86696P4766
3195B11734r8845M2877K11078j90086k92361P1542J06792o9243j46507J83296
3185C0277J36590k17398J55618k06642k8047J30770n8538J65306J3101k91808
3175a70771j8526J01859K24352j69023m2269m0124J43068K7675o2778o8671J65479
3164I0271P4872j22304j82033J6247J28140J72137j68139r8651J97411J69813
$$ plain form
3238 528983 404304 387856 321229 398325 325758 322397 399548 309396 232136 79015 142565
3227 142565 46538 -77843 28658 -20349 64816 220417 -172602 19011 229522 586526
3217 586526 604496 560930 114384 -99885 46665 -4629 -76805 121067 220756 -25017 128529
3206 128529 282648 101085 213987 123355 146158 241518 191944 107084 -49728 136968 211734
3195 211734 112889 155766 366844 176758 -115603 -44061 62731 -6512 -153019 30277
3185 30277 166867 -50531 105087 -101555 -129602 1168 -57370 107936 121037 -170771
3175 -170771 -189297 -87438 136914 -32109 -74378 -114502 28566 56241 -6537 -75208 90271
3164 90271 165143 42839 -139194 -122947 5193 177330 9191 -89460 107951 277764
3154B77764r3642q7475k73514n8321J97557j46896K8998N4949l8917K04868K07395
3143B72766k87740R5792J24032o8676j24037k69636J36806J09039m948r4783K90270
3132A78885L16715m6022k40268k53641P939J18598j76917j03221l6674J94782
3122c9824K50021k11716m6442j36523J02935J12242L313j19462K38737M5410k57430
3111e8739O3102J32697n5052J88144n3130j43799k80971N0962O463j68725J33129
3100a85919Q6190Q3771J58996j69890K2334J05608M3884J9550R3344m73144L5352
3089a79924J47302j44387j91288K38288p6729m0826J66562Q6656j8464j61053
3079a73863K46463j27318n4598O4806J93523l67230r3447J68403L4825M2297P9162
$$ plain form
3154 277764 184122 96647 -176867 -235188 -37631 -184527 -155529 -100580 -139497 65371 272766
3143 272766 -14974 80818 204850 136174 12137 -257499 -120693 -11654 -16602 -111385 178885
3132 178885 495600 449578 209310 -44331 -36392 82206 -94711 -197932 -234606 -39824
3122 -39824 210197 -1519 -47961 -184484 -81549 30693 34006 -85456 153281 198691 -58739
3111 -58739 4363 137060 82008 270152 217022 73223 -207748 -156786 -150323 -319048 -185919
3100 -185919 -99729 -15958 143038 -26852 -4518 101090 144974 164524 257868 -215276 -179924
3089 -179924 -32622 -177009 -368297 -130009 -206738 -247564 -81002 5654 -12810 -173863
3079 -173863 72600 -54718 -109316 -44510 149013 -218217 -311664 -143261 -108436 -66139 13023
3068A3023j77941k8896q4088J713K91389k11487l08134L7020L01746K04792j44165
3057a05028J17198o1705J24256K79157n1547j76583j23578J0839J55745N2705
3047B21459j75920k95001J89619K4621N6920K2095P1400M602q1290k51199J71944
3036d0750K78784r3786k67908J9386m61404K43934M48592p0674q9029m1533L11735
3025B37347J571N3907m28224o6769l1399K22876l8553j75105N3540K56862O6912
3014A52965j06719O657J3781q6354p2218p3856j7832J71720j72759m7225K04144
3003b7696J07133k76702j31825J33973L25969J10974M9566J55063l89083K06901
2993B64273k25116Q6527J15625k24169j33006m9413m589J54459Q1034j00734J72302
$$ plain form
3068 13023 -164918 -193814 -277902 -276189 15200 -196287 -504421 -467401 -165655 39137 -105028
3057 -105028 12170 -49535 74721 353878 302331 125748 2170 13009 168754 221459
3047 221459 45539 -249462 -59843 -35222 21698 43793 115193 119795 38505 -212694 -40750
3036 -40750 238034 144248 -123660 -104274 -565678 -321744 126848 56174 -32855 -74388 237347
3025 237347 238918 292825 -135399 -202168 -233567 -10691 -49244 -224349 -170809 86053 152965
3014 152965 46246 52903 66684 -19670 -91888 -165744 -183576 -11856 -184615 -231840 -27696
3003 -27696 79437 -197265 -329090 -195117 130852 241826 291392 446455 57372 264273
2993 264273 39157 125684 241309 17140 -115866 -165279 -169868 -15409 65625 -35109 137193
2982A37193J8898P188J02963L4119L6739j45165k49151m5465P3645j17864J66768
2971A9868L73179j55642j06179N601k5671Q0683K6386J9975l85298j69281N9631
2960b56748J64240J6666j6475J71928p2536n6159p2337Q9870q7630l7156n8745
2949b15082J3120J99463J13062q1536j53926K75543r6895k13099J6403J14485
2939b8462L14041j17867m9952j17115K01986j66357P6323p8407P9528r5576j25075
2928a06933J44706J64136k50879m4756n1756k34290q7784J55969K69096J454L858
2917c7179P7269M4793p5085J88744q8407K6518k2531r2739j37343j3161R6701
2906c2420p411J27757m8379j59995J51729j24401j04372N0324P11m8102J20746
$$ plain form
2982 137193 156091 163279 266242 300361 337100 191935 -57216 -102681 -29036 -146900 19868
2971 19868 393047 237405 131226 136827 111156 191839 218225 238200 -147098 -316379 -256748
2960 -256748 -92508 -75842 -92317 79611 7075 -49084 -121421 -31551 -119181 -156337 -215082
2949 -215082 -201962 -2499 110563 29027 -124899 150644 53749 -159350 -142947 -28462
2939 -28462 285579 167712 117760 645 202631 36274 112597 34190 113718 18142 -106933
2928 -106933 37773 201909 -48970 -93726 -145482 -379772 -467556 -311587 -42491 -41037 -37179
2917 -37179 40090 84883 9798 198542 110135 136653 114122 21383 -115960 -129121 -32420
2906 -32420 -39831 87926 39547 -120448 31281 -93120 -197492 -147168 -146457 -194559 -73813
2895g3813N5537J00039K05460L1538k51430j00147j81437K15543K6840k3086O8338
2884G3382k34192J2247J40986q3107K0912O0143j34285K82660p6732j62839J61481
2873F0656j55255N2756R320o6596J38058r6868j17220L4955J03977J35102j34390
2862c5505J15431J31208k31023L5154K17968j48215J5870m9665j3546K68243k54615
2851E1305k48468J32832p6456J80878J12820J32803J02202n53899r5202K84062
2841B2877n5672p0179j13972K4240K34199K27113j4063q9247n6249r3346N2750
2830F8451j75062o1992j57232J51693j8216J85561J16423j13341N1533O4075j56436
2819d4543k30932Q2281Q6776J35865j18632k37523J15502P8782R7885r9136L0816
$$ plain form
2895 -73813 -18276 81763 287223 318761 67331 -32816 -214253 1290 28130 5044 73382
2884 73382 -160810 -148563 -7577 -90684 -69772 -9629 -143914 138746 62014 -100825 60656
2873 60656 -94599 -41843 -32523 -99119 38939 -57929 -175149 -140194 -36217 98885 -35505
2862 -35505 79926 211134 -19889 15265 233233 85018 100888 51223 37677 305920 51305
2851 51305 -197163 -64331 -140787 40091 152911 285714 387916 -165983 -261185 22877
2841 22877 -32795 -102974 -216946 -192706 41493 268606 254543 165296 109047 15701 68451
2830 68451 -106611 -168603 -325835 -174142 -192358 -6797 109626 -3715 47818 111893 -44543
2819 -44543 -275475 -193194 -106418 29447 -89185 -326708 -211206 -132424 -34539 -133675 -102859
2808a02859L38250j73943m23941Q8862K40253l5912k48987k30399J62432L01613
2798h4631R6595N2029L10646P1007k96376j49128j40935o0210o0298M3119m09
2787b18591K01002J3107J77816k72106K2587K28375l25984N6051O7160J17517
2777F6934m0146j72527K46970k49943j89833L42891j47000J93850k09738K20517
2767F1975r2650j57722J8170j2814J2030p5444J19693o8900K5599J06773J96743
2756A33453k50l21604J40563Q6201j27267J2750q9581q6189L66837j04851r1335
2745h1273J04705j13840r2185N4131R7578p8044K55452k46091r9024K00005k84572
2734b83158l30741L09308O6047K44103Q0684j62470J44352k38239J97826m38851
$$ plain form
2808 -102859 235391 61448 -362493 -273631 -33378 -69290 -318277 -548676 -386244 -84631
2798 -84631 11964 63993 374639 445646 149270 142 -140793 -201003 -261301 -218182 -218591
2787 -218591 -17589 -4482 173334 -98772 -76185 152190 -173794 -117743 -50583 66934
2777 66934 26788 -145739 101231 -148712 -338545 4346 -142654 51196 -158542 61975
2767 61975 -30675 -188397 -170227 -183041 -171011 -246455 -126762 -195662 -170063 -63290 133453
2756 133453 133203 -188401 -47838 38363 -88904 -76154 -165735 -251924 114913 10062 -81273
2745 -81273 23432 -90408 -182593 -128462 -30884 -108928 146524 -99567 -198591 1414 -283158
2734 -283158 -613899 -304591 -238544 5559 86243 -76227 68125 -170114 27712 -411139
2724d11139K93948J16404m64459J06736J79222L87043r6488k53845j38563K23011
2714e8130J32984k21144j65892o7984O8337L9687K8332J12487j35932l8913K73201
2703c2967L4088k7182K71118j51916M6764l9877j63580J05724j22111j34630P0345
2692a44224p4169J14417J00465n1598J66389J3423k42546j99675k4956M0813J42972
2681a58689K28388j04672k77722q6617K83014j44214j7544K34059M3127n7780
2671e8650n9850J64216J64059k31993K00159j36214j36541Q3018Q7043r9894l9888
2660f4535J41561q873P4241j19468j52037J58451K86397q8374j91039j14747J8624
2649e9799m34424J93036L81539J61493k07852j61441j02326O596J42558q7194
$$ plain form
2724 -411139 -117191 -787 -465246 -358510 -179288 207755 111267 -142578 -281141 -58130
2714 -58130 74854 -146290 -312182 -380166 -311829 -272142 -243810 -131323 -267255 -306168 -32967
2703 -32967 1121 -26061 245057 93141 139905 100028 -63552 42172 -79939 -214569 -144224
2692 -144224 -218393 -103976 -3511 -55109 111280 124703 -117843 -317518 -342474 -301661 -158689
2681 -158689 69699 -34973 -312695 -399312 -116298 -260512 -278056 -43997 -870 -58650
2671 -58650 -118500 45716 209775 -22218 177941 41727 -94814 -11796 75247 -24647 -64535
2660 -64535 77026 68153 142394 22926 -129111 29340 315737 227363 36324 -78423 -59799
2649 -59799 -494223 -301187 80352 241845 33993 -127448 -229774 -223178 -80620 -167814
2639a67814O1932J33699j76862l3180j30290J53842p3379j98807K67454J54413
2629h992j17769L46371j32192j41470p6727K4716J4334K65199j09401j72662L58938
2618B50345j28127l20150j83207K39694N3418J41758j36542m5554k18928J34078
2608b13215J14151L2075P4403j4063L8168J6100P7997M9309q3968j33436j46479
2597a88958m2939M766J11328J90864r6735k0089j70944P9770N2515k2539J10078
2586G117l6679K42257j31599j09457J4272R7477l7954J34773O2967j89907r7297
2575d4030N4675j23002j09186J1518J36128j5907k12197J3613K72396L84392l9393
2564C29007m10456R2856n8026P2108k83867r238m8398k24329J09690N2303K07474
$$ plain form
2639 -167814 -105882 27817 -149045 -182225 -312515 -158673 -232052 -430859 -163405 -8992
2629 -8992 -126761 219610 87418 -54052 -130779 -106063 -91729 173470 64069 -108593 250345
2618 250345 122218 -197932 -381139 -141445 -88027 53731 -82811 -128365 -347293 -213215
2608 -213215 -99064 -66989 7414 -6649 31519 47619 125616 174925 90957 -42479 -188958
2597 -188958 -231897 -227131 -115803 75061 -21674 -41763 -212707 -132937 -80422 -102961 7117
2586 7117 -29562 212695 81096 -28361 -14089 83388 45434 180207 243174 53267 -44030
2575 -44030 10645 -112357 -221543 -210025 -73897 -89804 -302001 -288388 -15992 368400 329007
2564 329007 -81449 11407 -46619 25489 -258378 -267616 -316014 -540343 -430653 -378350 -170876
2553a70876j30475Q9359J35547k7909R8536J06824j52443R2895O8538J33067j54350
2542H8713k69949P8213k13080q1881K41700K8838q0390R34L6070R4247J0788n5253
2530a21050J6953q64j24291K83350m7728L3413J59626k84899J07684j22037j7768
2519a17611n9822K03945j50532k31798J64536L12191R482k8041j24424O3743Q4229
2508A25898j46316j63625K06210m6076j75665P1695R9242n2388j85145k911J8221
2497b50860K45039J70929m51901k67640J04920J58980K19796R5825m8583j74196
2487a97691j30753L53389k85889K7322K35559l89172j93721K05280K15731k3674
2477a83619j00710r043J09945M4682J77798r7063l2654k09532j98653M0391L12024
$$ plain form
2553 -170876 -301351 -211992 -76445 -104354 -5818 101006 -51437 41458 109996 243063 88713
2542 88713 -181236 -103023 -316103 -397984 -156284 -127446 -207836 -206902 -170832 -76585 -65797 -121050
2530 -121050 -104097 -104961 -229252 54098 6370 39783 199409 -85490 22194 -99843 -117611
2519 -117611 -177433 26512 -124020 -355818 -191282 120909 130391 102350 -22074 41669 125898
2508 125898 -20418 -184043 22167 -23909 -199574 -127879 -28637 -81025 -266170 -269081 -250860
2497 -250860 -5821 165108 -286793 -554433 -449513 -290533 -70737 25088 -23495 -197691
2487 -197691 -328444 24945 -260944 -233622 1937 -387235 -580956 -375676 -159945 -183619
2477 -183619 -284329 -293372 -183427 -138745 39053 -58010 -90664 -300196 -498849 -458458 -146434
2466a46434j69082J03102L92144K960Q1272j64920j9690k0799j43683K77811q0637
2455A12044n3585J72775r428k14123O4836j796M6993j34632n4492K75289j60987
2444D2894j55752J0923j12751n44J92677P3762J26289j55953n9699L11915P3350
2433C47111p5441q0125J13425j51831k8006m6192N40l4009O2928k39867j5677
2422a47144J37695K01121j37941J5485K9111l03467K13719K33634J12476j16246
2412B38443k9538j825K5050N123j47875k3239j52547J99966J65353j67638P8667
2401A89940N5826K148k80259J98527j23255r7793J83749j7519k19890Q0822R1594
2390F3890l19551J07519k8483q5571Q4490j70625j7853J74421L73856K9041j7673
$$ plain form
2466 -146434 -315516 -212414 179730 182690 263962 99042 79352 58553 -85130 192681 112044
2455 112044 58459 231234 221806 7683 72519 70723 117716 -16916 -71408 203881 42894
2444 42894 -112858 -101935 -214686 -215230 -22553 51209 177498 21545 -38154 273761 347111
2433 347111 271670 191545 304970 153139 125133 78941 79481 45472 108400 -131467 -147144
2422 -147144 -9449 191672 53731 69216 98327 -205140 8579 242213 354689 238443
2412 238443 208905 207080 232130 237253 89378 66139 -86408 113558 278911 111273 189940
2401 189940 245766 247914 -32345 166182 42927 -54866 128883 111364 -108526 -27704 63890
2390 63890 -255661 -148142 -176625 -262196 -177706 -348331 -366184 -191763 182093 211134 193461
2379A93461j2974m3737J00453J31590L4511K38475j33361k19537k41662q8613
2369d1394K50837N8165k29168j06878R9327o8658N9226k1494P5778k1326j36265
2358h1850J34847L4308j58172o9601P939K47835J04562m5959k93198J4409K30876
2347A25996P9891m0768J37208n7791L0942M0214j87446R6935q7396P3450J6676
2336B27911Q6181j17750j53312L5912M3092j2063J00290K32406j32931j54446
2326A55290O0066R0286l018l18311k27329K9983n9275J06467K5188R8953q4903
2315a26603L10921J66655j3742J1523k69256J77544M6894j26878J81138J74463
2305E32659j41121N6818k43888J42466J37060K7552K0671j7352j59715J31193
$$ plain form
2379 193461 180487 136750 237203 368793 403304 641779 508418 288881 47219 -41394
2369 -41394 209443 267608 38440 -68438 30889 -37769 21457 -37 75741 54415 -81850
2358 -81850 52997 87305 -70867 -140468 -132529 115306 219868 173909 -119289 -104880 125996
2347 125996 205887 165119 302327 244536 275478 315692 128246 225181 137785 211235 227911
2336 227911 314092 196342 43030 78942 122034 109971 210261 442667 309736 155290
2326 155290 215356 305642 302624 -15687 -243016 -213033 -272308 -165841 -140653 -41700 -126603
2315 -126603 184318 350973 337231 348754 79498 257042 303936 177058 358196 532659
2305 532659 391538 448356 204468 346934 483994 511546 532217 514865 355150 486343
2295D86343J36953m36343m9829J1688m2171J9528J52458k00270J99619r0667k4349
2284A62960K56576j95671J13169K52578j26826j97542j39840J62382J00954k59917
2274A28823j00245K11650Q9717J13021k8794j16783k4062j4737o5190n1785J04383
2263B45998J05607P1988O2307R0895l35619l26186K20669M41195J18692j66802
2253E28744Q810P8076j60234J6074o137r9246J81139j04211j11460N8436j17442
2242B72549K73621Q1078q4836k6626J56666j05305j1880j19630j01397k23282
2232A10958M71347J39993Q7188q7720j9472j98278K45365L6369k30887J37757
2222F92620q6320K36118r5021J73321n489j32535O6079M40381l27611k6863j95127
$$ plain form
2295 486343 623296 186953 137124 148812 106641 126169 278627 78357 277976 187309 162960
2284 162960 419536 223865 337034 589612 462786 265244 125404 287786 388740 128823
2274 128823 28578 240228 329945 442966 414172 297389 273327 258590 193400 141615 245998
2263 245998 351605 423593 485900 576795 241176 -85010 135659 576854 695546 528744
2253 528744 537554 615630 455396 471470 465333 366087 547226 443015 331555 389991 272549
2242 272549 546170 627248 542412 515786 672452 567147 555267 435637 334240 110958
2232 110958 582305 722298 809486 721766 702294 504016 749381 785750 554863 692620
2222 692620 606300 842418 747397 920718 915229 782694 848773 1289154 961543 934680 739553
2211G39553K8924j00140J12230K50907j38245m4295L03426L62515j38234k13366
2201A163275K34221K5541J30622n0114j29422J78740P4456N844L09715n2392J851
2190A892337l12512k538J36318J4558J97359J17046k01793j97083K93138L17456
2180B254286L36160k14382q8332j14971J56180m194L44798J72820p7795j63337
2170B601233Q00K88890k6389J82356J37681k31006k9499K3476N0979K10639J73571
2159C382731L88763R3719k06314J41580r7816P3572J66895L21275Q8839K64615
2149D617859M16541K90K16787J33591J84237L53292L26648N69729M01003L48993
2139G568970J13323K61694K34411L53003K62163K63643N27105M51129N95263L95229
$$ plain form
2211 739553 768477 668337 780567 1031474 893229 848934 1152360 1514875 1376641 1163275
2201 1163275 1397496 1423037 1553659 1503545 1374123 1552863 1627319 1633163 1942878 1890486 1892337
2190 1892337 1579825 1577287 1713605 1728163 1925522 2042568 1840775 1643692 1936830 2254286
2180 2254286 2590446 2376064 2287732 2172761 2328941 2324747 2669545 2842365 2764570 2601233
2170 2601233 2602033 2890923 2864534 3046890 3184571 2953565 2924066 2947542 2998521 3209160 3382731
2159 3382731 3771494 3865213 3658899 3800479 3702663 3776235 3943130 4264405 4353244 4617859
2149 4617859 5034400 5034690 5251477 5385068 5569305 5922597 6249245 6818974 7219977 7568970
2139 7568970 7682293 7943987 8178398 8531401 8793564 9057207 9584312 10035441 10630704 11025933
2129A1025933N43861N70826Q12591J135471J353427J436908J274198J230858Q37553
2120B0221626R12797J269251J607302J947157K805095L516678M508727O506037
2112D3294670R139145J2211491J5624380J4948310R871606m052408j8725628j8830385
2104F3481181j3655338r031848o845346n643009m199648l087765k516805j544717
2096A6956705j434772q74822m88350m95141r12137j184491j090505r81771r29044
2087H565672m70485m07507k70038n64422m58018l51262m72993k55202m35099j77713
2077D702933j07670n7545k22339j00430l20830n7320Q1779l96608o3431L2705
2067C491244j12845o7493J39948l60159j10155m9055J03544j43454k06442P5052
$$ plain form
2129 11025933 11569794 12140620 12953211 14088682 15442109 16879017 18153215 19384073 20221626
2120 20221626 21134423 22403674 24010976 25958133 28763228 32279906 36788633 43294670
2112 43294670 52433815 64645306 80269686 95217996 105089602 101037194 82311566 63481181
2104 63481181 49825843 40793995 33948649 28305640 24105992 21018227 18501422 16956705
2096 16956705 15521933 14647111 14158761 13663620 12751483 11566992 10476487 9494716 8565672
2087 8565672 8095187 7687680 7417642 6853220 6395202 6043940 5570947 5315745 4880646 4702933
2077 4702933 4595263 4537718 4315379 4214949 3894119 3836799 3918578 3521970 3458539 3491244
2067 3491244 3378399 3310906 3450854 3090695 2980540 2931485 3035029 2891575 2685133 2760185
2057B760185n74464K53338j04020j25043K27940l2770m48607J98082j6323k43606
2047A894712p6510R1798n8818j88156l64760J61913o2636j3891j63292K7461j71080
2036A076741Q2396M8629j14766k90694j28440J98755j05973K505K4805K91523
2026A085481l37472k91884N9696K48884M2282k4586N4170J65079j72621k4620
2016H04409r3400j47729M5172K7341K25948l35397K44700R7215m34136K26888
2006F61011N5475l78689J24272K66565j28869j80372p9192Q597J66293J07051
1996F22142k61670o479k62493J36689m5284M2698J15283p3040o2355J08803m8538
1985B65756K7339J18660K11029j87855J10054J60608k77038l70738J02837K85137
$$ plain form
2057 2760185 2185721 2439059 2335039 2209996 2437936 2405166 1956559 2154641 2138318 1894712
2047 1894712 1818202 1910000 1851182 1663026 1298266 1460179 1397543 1383652 1220360 1247821 1076741
2036 1076741 1159137 1207766 1093000 802306 673866 872621 766648 769153 793958 1085481
2026 1085481 748009 456125 515821 764705 806987 782401 836571 1001650 829029 804409
2016 804409 711009 563280 608452 635793 861741 526344 771044 868259 434123 661011
2006 661011 716486 337797 462069 728634 599765 419393 340201 348798 515091 622142
1996 622142 360472 353993 91500 228189 182905 225603 340886 267846 205491 314294 265756
1985 265756 293095 411755 622784 434929 544983 705591 428553 57815 160652 445789
1975D45789k26598K15089j25583L10038J20802q8112j42094j74224k46111J38946
1965B27942k2501p302j02645l8326J86333O0735n1315k9775J85206r9184J9544
1954C28712O3077R46j67566J62212R1851R4496j10370r7182P0984k42540Q4424
1943B79044J98758p0379n1350k26876M9350K36529R6199k97406j291k3543j25289
1932F3746j6454J53058J16267P3823J59053j59104J9741L1142k33289k35983P6096
1921D8096O2599o6071o2293N4015M77647j96070j60370J51945p5131K9434l1652
1910B32149k98297n9696j45931o2350L05253L17437J20932j30152m21892Q1069
1900f1478J90789j67724R6543P8673K59053k65231j30974k5864K11828J15645
$$ plain form
1975 445789 219191 434280 308697 618735 739537 651425 509331 335107 88996 227942
1965 227942 205441 198139 95494 57168 243501 304236 252921 223146 408352 309168 328712
1954 328712 391789 392735 225169 387381 479232 573728 463358 366176 437160 194620 279044
1943 279044 477802 407423 356073 129197 178547 415076 511275 213869 212578 189035 63746
1932 63746 47292 200350 316617 390440 549493 390389 410130 441272 207983 -28000 48096
1921 48096 110695 44624 -17669 36346 513993 317923 157553 309498 234367 263801 232149
1910 232149 -66148 -125844 -271775 -334125 -28872 288565 409497 279345 -142547 -61478
1900 -61478 129311 -38413 58130 136803 395856 130625 -349 -26213 185615 301260
1890C01260q9174j57954k3846J80581j18708J41004j21779m7527n1204O4830J50872
1879B28355J44336k68494J60039K22238j35374j44616k4468J513j93045J63642
1869A54126j84184l2380J60954Q6218J61961n5756j68111k07016k49151L7761
1859b95578J40739J64904k72858R2321Q8619K30842k31037K41202J71672j03707
1849B27119k165j19489O0451r8902J81038J64845q2737J78538j20030j63787J99599
1838D24480m8953k944M1858M2375M0M0423k52922j5325j72832l0768Q5157M5900
1826A56489R3180n7396K08539j68172P5728J1925p0399k06721j18859J40415K3644
1815H8373j44062L001K42474r8969K07557o2929p2337R2899k75941j93107K49160
$$ plain form
1890 301260 212086 54132 30286 210867 92159 233163 111384 63857 12653 77483 228355
1879 228355 372691 104197 264236 486474 351100 206484 182016 183529 -9516 154126
1869 154126 -30058 -62438 98516 184734 346695 290939 122828 -84188 -333339 -295578
1859 -295578 -154839 10065 -262793 -170472 -81853 148989 -82048 159154 330826 227119
1849 227119 224954 105465 165916 67014 248052 412897 330160 508698 388668 224881 424480
1838 424480 375527 372583 414441 456816 456856 497279 244357 229032 56200 25432 110589 156489
1826 156489 249669 192273 400812 232640 308368 320293 249894 43173 -75686 64729 88373
1815 88373 -55689 -52688 189786 90817 298374 235445 163108 256007 -19934 -213041 36119
1804C6119j6486J33740j12583m18634L09960J01416M1676P1320K9508j45380k23045
1793a92389M2032j28004J89153J28229k07656J59626k09610q2590J19334K99875
1783A18000P6600N7989j96000k37103J9993m3260M68991k28629J32415K65172
1773D34168j00602k84747j43573J09323n1400M3048J23752l4185j93513n2604
1763a50333o4761Q5242o2949K3848K47789Q4775n9627m8976Q4038k11336j09595
1752a81885K2274j8458M7159J37172J28471j0793p8346j0741j09642K12632j9690
1741A18153j91331J42413k22924J45932O769j46679K96667O9244m3136o2098P0969
1730A83979j01494K5858j09495O2882M6211j06233O0123r7804O9594L8128L8628
$$ plain form
1804 36119 19633 153373 40790 -377844 -67884 33532 75208 146528 176036 30656 -192389
1793 -192389 -150357 -278361 -89208 39021 -168635 -9009 -218619 -301209 -181875 118000
1783 118000 194600 252589 56589 -180514 -160521 -203781 265210 36581 168996 434168
1773 434168 333566 48819 -94754 14569 -36831 6217 129969 95784 -97729 -150333
1763 -150333 -215094 -129852 -192801 -168953 78836 163611 103984 55008 139046 -72290 -181885
1752 -181885 -159611 -178069 -130910 6262 134733 123940 45594 34853 -74789 137843 118153
1741 118153 -73178 69235 -153689 -7757 -988 -147667 149000 218244 175108 113010 183979
1730 183979 82485 108343 -1152 61730 107941 1708 61831 -35973 33621 71749 110377
1719A10377r8878j67007P3401J34332j92759L5912R1672m787K91908k71971j10030
1708a07830m9153L1505L48432k78097q8813L4213k13728J34591Q5221j35798J96576
1697d2881j7798J0482k8671k086J29148J52211o7659j08987K38140J45699l28210
1686G9388k59048K0576J42842q4373O4841J37467J72503k5558l57701J08604j34341
1675a34800L9538j61153j54533L95370K25368N1156k74692p709R3729l6594J7088
1664E2768l09695J9785K094j23197K62275K68010p3723q1752j38789k02447M27909
1653A03238K10391l87779O5448N7206j06790q1617p8264j33671L8584J15507Q7670
1642a10077k04622K37910K80773k84015r0890J95779J169J86104j77041k190k2137
$$ plain form
1719 110377 11499 -155508 -82107 52225 -140534 -104622 -12950 -17737 274171 2200 -107830
1708 -107830 -156983 -125478 222954 -55143 -143956 -109743 -323471 -188880 -103659 -239457 -42881
1697 -42881 -60679 -50197 -78868 -80954 48194 200405 132746 23759 261899 407598 79388
1686 79388 -179660 -159084 -16242 -100615 -35774 101693 274196 248638 -109063 -459 -134800
1675 -134800 -95262 -256415 -410948 -15578 209790 260946 -13746 -21455 72274 35680 52768
1664 52768 -256927 -237142 -235048 -358245 -95970 172040 98317 16565 -122224 -324671 103238
1653 103238 313629 -74150 -8702 48504 -58286 -139903 -218167 -351838 -313254 -197747 -110077
1642 -110077 -314699 -76789 203984 -80031 -170921 24858 26027 212131 35090 32900 10763
1631A0763k57249K1372k7964L9978K71436k5334j3136k19327k41752L98309j71518
1620b14422k12167K00442M9366K31205J35702Q7614l7455L6291k69870k21387
1610b14681m6522k80005L73334J93466K3363Q3406j20325Q3347j13109k4310J94637
1599A52601M9513j89146j57746K37828N6849k35932m10731N72598L3805j2641
1589I6998j41314O6718l5811r5980j15404K40200K72668J42400n8040k12322q6548
1578G3565k07304j38178L20516m574j48793j8626q8496O16K02103L822M4918J47348
1566A86917m0094J7385o4000l976o331P3975k05041m14929K13803K43167o9126
1555f8250r8912O55424k26038l65799J08018k69142J51497J18485j98477N6529
$$ plain form
1631 10763 -246486 -225114 -253078 -213100 58336 33002 19866 -199461 -441213 -42904 -214422
1620 -214422 -426589 -226147 -176781 54424 190126 277740 240285 276576 6706 -214681
1610 -214681 -261203 -541208 -167874 25592 48955 132361 12036 95383 -17726 -42036 152601
1599 152601 202114 12968 -144778 93050 149899 -86033 -496764 75834 109639 96998
1589 96998 -44316 22402 -13409 -109389 -224793 15407 288075 430475 372435 160113 73565
1578 73565 -133739 -271917 48599 44025 -104768 -123394 -211890 -211274 -9171 -5349 39569 186917
1566 186917 146823 164208 100208 96232 89901 163876 -41165 -456094 -242291 876 -68250
1555 -68250 -167162 488262 262224 -103575 4443 -264699 -113202 5283 -193194 -136665
1545a36665J33849j30501J06727o2087P9686j27682R4096J67567M0523P0073j48120
1534H7466p6568p300K54741J19605l39303Q0809k16725J05172k05572j1117j16210
1523c25002N7680K05494J71563L52419l56915j83946P3280l1731p3546P8477R9328
1512F7101j04982k89382K06571L21149k93755Q6155J56769j17314k62875K44261
1502A3698p9349O330J82780K16174l9583j06744o8602k14392j07002M1378k6344
1491a81656k58923J09175K57287j2323p529K28221K71192j72273j15281l09692
1481a91802P0415L0686k55916K90067K69837n0216M5194q7466l9897O337q6681
1470E58q5481q5376j49228K81210K18010j24916N7657k17895p2547M18633J67742
$$ plain form
1545 -136665 -2816 -133317 -26590 -88677 -8991 -136673 -42577 124990 165513 235586 87466
1534 87466 10898 3598 258339 377944 38641 119450 -97275 7897 -197675 -208792 -325002
1523 -325002 -267322 -61828 109735 462154 105239 -78707 -5427 -37158 -110704 -32227 67101
1512 67101 -37881 -327263 -120692 200457 -93298 -7143 149626 32312 -230563 13698
1502 13698 -65651 -59321 123459 339633 300050 193306 124704 -89688 -196690 -155312 -181656
1491 -181656 -440579 -331404 -74117 -86440 -93969 134252 405444 233171 117890 -191802
1481 -191802 -121387 -90701 -346617 -56550 213287 163071 208265 120799 80902 87239 558
1470 558 -84923 -170299 -319527 -38317 179693 54777 112434 -105461 -178008 240625 408367
1459D08367j71057j02075p8077J1627J67104j4174j91239O2604j48390J4597J7345
1448b3368j48335K77009K02711j73691P7813j16277j67534L3502o1151J73282
1438G3961q6072J52066O0123j52997p8303j67785O6669j25112M542J61233M8483
1427d3192k5738j99200M6357m7741J3475K56227J76028q8193k77102K79064k74601
1416a84616P8799K45240O862j76415r4683J31418O929k21067K7182J24849K28849
1405A73347l66491K47149o6144j36374J44789k74316K37226Q2360m2064R035J43236
1394A51753m6854j43456J59993J24413P1142o5650l51773k30006j00146l80328
1384h10912K72426K24552J19874k155J16244P0272q2970L03277j28039q43k2473
$$ plain form
1459 408367 237310 135235 57158 68785 235889 221715 30476 93080 -55310 -40713 -23368
1448 -23368 -171703 105306 308017 134326 212139 95862 -71672 -38170 -99321 73961
1438 73961 -12111 139955 200078 47081 -31222 -199007 -132338 -257450 -252908 -91675 -43192
1427 -43192 -68930 -268130 -221773 -269514 -256039 188 176216 88023 -189079 89985 -184616
1416 -184616 -105817 139423 146285 -30130 -124813 6605 13534 -207533 -180351 -55502 173347
1405 173347 -193144 54005 -12139 -148513 -3724 -278040 -40814 41546 -518 8517 151753
1394 151753 104899 -38557 121436 245849 316991 251341 -100432 -330438 -430584 -810912
1384 -810912 -538486 -313934 -194060 -196215 -79971 -9699 -92669 210608 82569 81726 59253
1373E9253j01232k0329k6877J86402J4120M4840K06209q4388j98707N83j51281
1362g1407J1769O5188j20378j50164P993K93191Q1810o2920j35369k76434K72586
1351h4135L84980j33472j92305J82188j70553k83928k3495L43634M3513n1067
1341A5360j30408P2599j288M3971O006j8039K9507J61579j22021k68321R506o5803
1329b67352K79784r450k4175j0538k9934r2629J27095Q7870j39412L129J007j55940
1317b30545q3981K8689L04273j64042K5259n09206K03756N56664r0524k14801
1307a74458J0919o5075R6063M14P9030k7851r1522P7639k579n6788L9805k06923
1295c21326J89077K29005J49981j39010k42723J66735j80016O0275N0105R4534
$$ plain form
1373 59253 -41979 -62308 -89185 97217 111337 156177 362386 277998 79291 79874 -71407
1362 -71407 -59638 5550 -114828 -264992 -256999 36192 118002 55082 -80287 -356721 -84135
1351 -84135 300845 167373 -24932 157256 -13297 -297225 -320720 22914 66427 15360
1341 15360 -115048 -42449 -43737 234 6240 -11799 17708 179287 57266 -211055 -201549 -267352
1329 -267352 12432 2982 -21193 -31731 -61665 -154294 -27199 60671 -78741 -75612 -74605 -230545
1317 -230545 -314526 -285837 18436 -145606 -120347 -629553 -425797 130867 40343 -174458
1307 -174458 -163539 -228614 -132551 -132137 -53107 -80958 -172480 -94841 -97420 -154208 -114403 -321326
1295 -321326 -132249 96756 246737 107727 -134996 31739 -148277 -88002 -37897 56637
1285E6637L332k1160m0607j25663K54086k28345N1074l9109N4282O1947L34969
1274C61443k06042j19923k1568K19093p9254k46760j58122J99551J71490j55295
1264c5387o2753P302l25243M34150J63697j67585n4941Q8488K38988k24295j70226
1253a07805r1814J42304k12N8383m6896K45265n7491p64k63659m447J66722J67750
1241B07336K27616l57074j11438J7167j24295K69927j16368k63n2334K09409k04262
1230c4579J49610j1885J86140r9121j57002r3944j92604q2243K77493m4336J532
1219a00939k45173J46808n087L17826J09155j30120k0531p5070O1567N9799J27289
1208B45524k13369J43347N4687k76314K50957k68143m16321L22802J04368j1688
$$ plain form
1285 56637 59969 38809 -1798 -127461 126625 -101720 -50646 -89755 -35473 26474 361443
1274 361443 155401 35478 13910 233003 153749 -93011 -251133 -51582 119908 -35387
1264 -35387 -98140 -90838 -416081 18069 181766 14181 -40760 47728 286716 62421 -107805
1253 -107805 -199619 -57315 -57527 856 -46040 199225 141734 140970 -122689 -127136 39586 207336
1241 207336 434952 77878 -33560 -16393 -140688 129239 12871 12608 -39726 169683 -34579
1230 -34579 115031 103146 289286 190165 33163 -60781 -253385 -335628 -58135 -102471 -100939
1219 -100939 -346112 -199304 -204391 113435 222590 92470 71939 -3131 58436 118235 245524
1208 245524 32155 175502 230189 -46125 204832 -63311 -479632 -156830 -52462 -64150
1198f4150K90462m359J09191N5874j79717J1742j36134J12708j51961j09975q4346
1187a50665o6788M72738L432j38883m2951j57271j87953r8923N8725L48205J1314
1176E0980l8849J12663J95199l16107j09136K15212j67944P1236j14320J23214
1166B2148j80498j30823J25851J19464K51484J95333k30535N855j48067j23506
1156i3294j33972K79050k8043m9334K08217n0133J63362M304k66841k5877J3654
1145B1093q3874j85354R2274k56422J99214L2937O1031J1850R0023J86204l8169
1134A30807k94967m1005J385K05493o196j4920L19514j69654l51364l367K20818
1123c456q947k14449k82697M46130J82312J02769P506j29863M8780K20712j90537
$$ plain form
1198 -64150 226312 221953 331144 387018 207301 219043 82909 195617 43656 -66319 -150665
1187 -150665 -217453 255285 258717 119834 76883 -80388 -268341 -367264 -308539 39666 50980
1176 50980 12131 124794 319993 3886 -105250 109962 -57982 13254 -101066 22148
1166 22148 -158350 -289173 -163322 -43858 207626 402959 172424 178279 30212 -93294
1156 -93294 -227266 51784 23741 -25593 182624 132491 295853 300157 33316 7439 21093
1145 21093 -62781 -248135 -155861 -412283 -213069 -180132 -119101 -107251 -17228 168976 130807
1134 130807 -164160 -205165 -203780 1713 -4483 -19403 300111 130457 -220907 -224274 -3456
1123 -3456 -12403 -226852 -509549 -63419 118893 221662 229168 99305 148085 368797 178260
1112A78260q6206Q0095N2432q1670M4101j77805l51924n6618J83488K79344L43319
1101D06816j27051l29615q9026n0931J67386j05934L45077o6924j94431j5365
1091e9998k28515P3616r8813L28014J2953j6445P1181j57184k3086J52327K1061
1080G5111J57192J06294o6481J59595k87434M8110J8750k08882j7929L1916j03766
1069h7524K79526k03171N0589n4295j81833J88553J19489k43603k31412O5145
1059b98536K55862J87648k4056k8273j60965K4492J89779K39792m1111k25696
1049A18936j2481m1405j04100k24505m2063K36063J26578j07763k24496K00368
1039g4868K96149k69820k55092R6024R6650j02654p1784J68653R8997J33038p7052
$$ plain form
1112 178260 92054 172149 224581 142911 187012 9207 -342717 -399335 -215847 63497 406816
1101 406816 279765 -49850 -138876 -189807 -22421 -128355 216722 149798 -44633 -59998
1091 -59998 -288513 -214897 -313710 14304 27257 10812 81993 -75191 -98277 54050 75111
1080 75111 232303 338597 272116 431711 144277 192387 211137 2255 -15674 16242 -87524
1069 -87524 192002 -11169 39420 -14875 -196708 -8155 111334 -132269 -363681 -298536
1059 -298536 -42674 144974 120918 92645 -68320 -43828 145951 385743 344632 118936
1049 118936 106455 65050 -39050 -263555 -305618 -69555 57023 -50740 -275236 -74868
1039 -74868 221281 -48539 -303631 -207607 -110957 -213611 -285395 -116742 -17745 115293 38241
1028C8241J210J09530J0921k58431m5065L3563J01008N1064j12415j39089N6663
1017a52800m9950J23192Q1415j44413n3360l2263m929K1701M6843k81636M5928
1006d00272M57362J85524K232k60800l1393K8659j74385J04658K11571k41009
996a17853k6879K60112k0979j01272K59336r9642j27017j06572K341p9482N0482
985a07425J48057j86571p6779j8632n0102Q6683N8661n6384N4075n8642m1514
974b48573K57101j27888j78703P9233J39232O3219M1276J26709K30517k01509
964A80614k04781j60180l6897Q3242j58614K11877j91292j39924K52791J94828
954C1664M3432o5160k08732K49776J3989J97674l2650j47747k05505K6006M0669
$$ plain form
1028 38241 39451 148981 159902 -98529 -143594 -110031 -9023 42041 -70374 -209463 -152800
1017 -152800 -202750 -79558 1857 -142556 -195916 -228179 -233108 -211407 -164564 -446200 -400272
1006 -400272 57090 242614 244846 -15954 -47347 -18688 -193073 -88415 123156 -117853
996 -117853 -144732 115380 94401 -6871 252465 152823 25806 -80766 -78425 -157907 -107425
985 -107425 40632 -145939 -222718 -241350 -291452 -204769 -146108 -202492 -148417 -207059 -248573
974 -248573 8528 -119360 -298063 -218830 -79598 -16379 24897 151606 382123 180614
964 180614 -24167 -184347 -221244 -138002 -296616 -84739 -276031 -415955 -163164 31664
954 31664 75096 9936 -198796 50980 64969 262643 229993 82246 -123259 -97253 -56584
943e6584q0959J38590j04860O4918O7503K31799k2001L2883P0772m70665K0784
932a07820K25989k92897Q3383J90008M908j38802J68084p6386j83008K43238j93384
921g6687N4852M5326O531K5539n77j51992n7133n1259J6720K66229l3963k7984
909A5602Q2234r75j9100M1224m59327o8649K39534j92918L3849J26396R9209p7434
897a80355P9574J57198k17500j7137K71348P7922l95793r3200L92616K6966j56566
886e4927J34936k14042L8048N3421p0593R5665Q9076K00406O7790j4085J66575
$$ plain form
943 -56584 -137543 1047 -103813 -38895 28608 260407 238406 271289 342061 -128604 -107820
932 -107820 118169 -174728 -91345 98663 103571 -35231 132853 56467 -126541 116697 -76687
921 -76687 -21835 23491 30022 55561 54984 -97008 -154141 -205400 -188680 77549 43586 15602
909 15602 97836 96861 77761 118985 -340342 -408991 -169457 -362375 -328526 -202130 -102921 -180355
897 -180355 -100781 56417 -161083 -178220 93128 171050 -224743 -317943 74673 101639 -54927
886 -54927 80009 -134033 -95985 -42564 -113157 -17492 71584 271990 339780 325695 492270
$$ [...]
##END NTUPLES=NMR SPECTRUM
##END=
