##TITLE=1H_CA-9169xY
 DMSO
 8 sc, 
 7.7.2023
##JCAMPDX= 6.0         $$ Bruker NMR JCAMP-DX V2.0
##DATA TYPE= NMR SPECTRUM
##DATA CLASS= NTUPLES
##ORIGIN= UXNMR, Bruker Analytische Messtechnik GmbH
##OWNER= root
$$ XWIN-NMR		Version 3.5
$$ Fri Jul  7 16:32:41 2023 Russian Standard Time (UT+4h)  she@DPX200
##.OBSERVE FREQUENCY= 200.13135
##.OBSERVE NUCLEUS= ^1H
##.ACQUISITION MODE= SIMULTANEOUS
##.ACQUISITION SCHEME= undefined
##.AVERAGES= 8
##.DIGITISER RES= 18
##SPECTROMETER/DATA SYSTEM= spect
##.PULSE SEQUENCE= zg30
##.SOLVENT NAME= DMSO
##.SHIFT REFERENCE= (INTERNAL, DMSO, 0, 15.7766)
##AUDIT TRAIL= $$ (NUMBER, WHEN, WHO, WHERE, WHAT)
$$ ##TITLE= Audit trail, XWIN-NMR		Version 3.5
$$ ##JCAMPDX= 5.01
$$ ##ORIGIN= Bruker BioSpin GmbH
$$ ##OWNER= she
$$ F:/spectra/data/she/nmr/H-F/1/pdata/1/auditp.txt
$$ ##AUDIT TRAIL=  $$ (NUMBER, WHEN, WHO, WHERE, WHAT)
(   1,<2023-07-07 16:30:56.90 +0400>,<she>,<DPX200>,
      <created by zg, POWCHK disabled, PULCHK disabled
       configuration hash MD5:
       00 E9 B6 7A A2 85 ED C7 34 08 36 98 17 FE 4E 26
       data hash MD5: 16K
       C9 EE 75 EE BE 43 55 71 08 43 F4 6F 48 9C 03 8A>)
(   2,<2023-07-07 16:31:18.06 +0400>,<she>,<DPX200>,
      <Start of raw data processing
       efp BC_mod = 2 LB = 0.24 FT_mod = 6 PKNL = 1 PHC0 = -20991.82 PHC1 = 12.65272 SI = 16K 
       data hash MD5: 16K
       6A 96 86 59 F9 EC C6 F5 01 A8 87 1A 8D C1 6E A9>)
(   3,<2023-07-07 16:31:41.60 +0400>,<she>,<DPX200>,
      <pk PHC0 = 1.134153 PHC1 = -4.6 
       data hash MD5: 16K
       EF EF AC E3 BF 17 CB 94 F4 C2 C8 92 5D 1C 8A C0>)
(   4,<2023-07-07 16:31:45.12 +0400>,<she>,<DPX200>,
      <abs ABSG = 5 
       data hash MD5: 16K
       67 89 FB 2E BE 61 F8 8C E6 9D 40 36 71 88 9B C2>)
$$ ##END=
$$ 
$$ hash MD5
$$ ED A4 E4 A4 CF 58 BB 64 BA 6D 36 D6 16 57 0D 66
##$RELAX= 
##$RELAX= 
##$RELAX= 
##$RELAX= 
##$RELAX= 
##$RELAX= 
$$ Bruker specific parameters
$$ --------------------------
##$DU= <F:/spectra>
##$EXPNO= 1
##$NAME= <H-F>
##$PROCNO= 1
##$TYPE= <nmr>
##$USER= <she>
##$AMP= (0..31)
100 100 100 100 100 100 100 100 100 100 100 100 100 100 100 100 100 100 
100 100 100 100 100 100 100 100 100 100 100 100 100 100 
##$AQSEQ= 0
##$AQ_mod= 1
##$AUNM= <au_zg>
##$AUTOPOS= <>
##$BF1= 200.13
##$BF2= 200.13
##$BF3= 200.13
##$BF4= 200.13
##$BF5= 200.13
##$BF6= 200.13
##$BF7= 200.13
##$BF8= 200.13
##$BYTORDA= 1
##$CFDGTYP= 0
##$CFRGTYP= 5
##$CHEMSTR= <none>
##$CNST= (0..31)
1 1 145 1 1 1 1 1 1 1 1 1 1 1 1 1 1 1 1 1 1 1 1 1 1 1 1 1 1 1 1 1 
##$CPDPRG= <>
##$CPDPRG1= <>
##$CPDPRG2= <>
##$CPDPRG3= <>
##$CPDPRG4= <mlev>
##$CPDPRG5= <mlev>
##$CPDPRG6= <mlev>
##$CPDPRG7= <mlev>
##$CPDPRG8= <mlev>
##$CPDPRGB= <>
##$CPDPRGT= <>
##$D= (0..31)
0 1.2 0 0 0 0 0 0 0 0.06 0 0.03 0 0 0 0 0.0002 0 0 0 0 0 0 0 0 0 0 0 0 
0 0 0 
##$DATE= 1688733056
##$DBL= (0..7)
120 120 120 120 120 120 120 120 
##$DBP= (0..7)
150 150 150 150 150 150 150 150 
##$DBP07= 0
##$DBPNAM0= <>
##$DBPNAM1= <>
##$DBPNAM2= <>
##$DBPNAM3= <>
##$DBPNAM4= <>
##$DBPNAM5= <>
$$ [...]
##$SUBNAM3= <"">
##$SUBNAM4= <"">
##$SUBNAM5= <"">
##$SUBNAM6= <"">
##$SUBNAM7= <"">
##$SUBNAM8= <"">
##$SUBNAM9= <"">
##$SW= 18.05172834244
##$SWIBOX= (0..15)
0 0 2 0 0 0 0 0 0 0 0 0 0 0 0 0 
##$SW_h= 3612.71676300578
##$TD= 16384
##$TD0= 1
##$TE= 0
##$TE2= 300
##$TE3= 300
##$TEG= 300
##$TL= (0..7)
0 120 120 120 120 120 120 120 
##$TP= (0..7)
150 150 150 150 150 150 150 150 
##$TP07= 0
##$TPNAME0= <>
##$TPNAME1= <>
##$TPNAME2= <>
##$TPNAME3= <>
##$TPNAME4= <>
##$TPNAME5= <>
##$TPNAME6= <>
##$TPNAME7= <>
##$TPOAL= (0..7)
0.5 0.5 0.5 0.5 0.5 0.5 0.5 0.5 
##$TPOFFS= (0..7)
0 0 0 0 0 0 0 0 
##$TUNHIN= 0
##$TUNHOUT= 0
##$TUNXOUT= 0
##$USERA1= <user>
##$USERA2= <user>
##$USERA3= <user>
##$USERA4= <user>
##$USERA5= <user>
##$V9= 5
##$VALIST= <valist>
##$VCLIST= <CCCCCCCCCCCCCCC>
##$VD= 0
##$VDLIST= <DDDDDDDDDDDDDDD>
##$VPLIST= <PPPPPPPPPPPPPPP>
##$VTLIST= <TTTTTTTTTTTTTTT>
##$WBST= 1024
##$WBSW= 4
##$XGAIN= (0..3)
0 0 0 0 
##$XL= 0
##$YL= 0
##$YMAX_a= 184264
##$YMIN_a= -151623
##$ZGOPTNS= <>
##$ZL1= 120
##$ZL2= 120
##$ZL3= 120
##$ZL4= 120
##$ABSF1= 15.75129
##$ABSF2= -2.300559
##$ABSG= 5
##$ABSL= 3
##$ALPHA= 0
##$AQORDER= 0
##$ASSFAC= 0
##$ASSFACI= 0
##$ASSFACX= 0
##$ASSWID= 0
##$AUNMP= <proc_1d>
##$AZFE= 0.1
##$AZFW= 0.1
##$BCFW= 0
##$BC_mod= 2
##$BYTORDP= 0
##$COROFFS= 0
##$CY= -3
##$DATMOD= 1
##$DC= 0
##$DFILT= <>
##$DTYPP= 0
##$F1P= 0
##$F2P= 0
##$FCOR= 1
##$FTSIZE= 16384
##$FT_mod= 6
##$GAMMA= 0
##$GB= 0
##$INTBC= 1
##$INTSCL= 3.70164e-10
##$ISEN= 128
##$LB= 0.24
##$LEV0= 0
##$LPBIN= 0
##$MAXI= 10000
##$MC2= 0
##$MEAN= 0
##$ME_mod= 0
##$MI= 1.114404
##$NCOEF= 0
##$NC_proc= -8
##$NLEV= 6
##$NOISF1= 3.799351
##$NOISF2= 2.8
##$NSP= 0
##$NTH_PI= 0
##$NZP= 0
##$OFFSET= 15.77664
##$PC= 1
##$PHC0= -20990.69
##$PHC1= 8.052721
##$PH_mod= 1
##$PKNL= yes
##$PPARMOD= 0
##$PSCAL= 0
##$PSIGN= 0
##$REVERSE= no
##$SF= 200.129998979422
##$SI= 16384
##$SIGF1= 3
##$SIGF2= 2
##$SINO= 5.538805
##$SIOLD= 16384
##$SREGLST= <1H.CDCl3>
##$SSB= 0
##$STSI= 16384
##$STSR= 0
##$SW_p= 3612.71676300578
##$SYMM= 0
##$S_DEV= 0
##$TDeff= 16384
##$TDoff= 0
##$TI= <>
##$TILT= no
##$TM1= 0
##$TM2= 0
##$TOPLEV= 0
##$USERP1= <user>
##$USERP2= <user>
##$USERP3= <user>
##$USERP4= <user>
##$USERP5= <user>
##$WDW= 1
##$XDIM= 16384
##$YMAX_p= 449514752
##$YMIN_p= -6925700
$$ End of Bruker specific parameters
$$ ---------------------------------
##NTUPLES= NMR SPECTRUM
##VAR_NAME=  FREQUENCY,     SPECTRUM/REAL,   SPECTRUM/IMAG
##SYMBOL=    X,             R,               I
##VAR_TYPE=  INDEPENDENT,   DEPENDENT,       DEPENDENT
##VAR_FORM=  AFFN,          ASDF,            ASDF
##VAR_DIM=   16384,         16384,           16384
##UNITS=     HZ,            ARBITRARY UNITS, ARBITRARY UNITS
##FACTOR=    0.220516191357247, 1,           1
##FIRST=     3157.37893476159, 0,            0
##LAST=      -455.337828244187, 0,           0
##MIN=       -455.337828244187, -6925700,    0
##MAX=       3157.37893476159, 449514752,    0
$$ Real data points
##PAGE= N=1
##DATA TABLE= (X++(R..R)), XYDATA
$$ [...]
13790B01333j17331j6458j31069J8534P2195k56965J2665K25804P3893j78321
13780i5720J77386j14795l6621O7736l97092k39752K73751J05448l12950K07265
13770c65344L0903K54861K02733n46741L33722K91735L18401L3398m54189p2744
13760B6735J43278K5483m20233r7011L67860j71755J17719K47544R4724m08001
13750g3657K59371n4121l95836M06923K0368j1481j73722m00095P5473n2150n24641
13739i23568N78612L08574K24363j42603P8646j16629j87134R8201K48469p0050
13729I6881j93305l99395K5394P4682K99688m5343N6394n4053M13892J41153k24893
13718A91095L5240K7028l03190o5024n9930j522k18308j31762N76324J19918l90119
$$ plain form
13790 201333 84002 67544 -63525 -44991 27204 -229761 -217096 8708 82601 -95720
13780 -95720 81666 -33129 -69750 -2014 -399106 -638858 -365107 -259659 -572609 -365344
13770 -365344 -334441 -79580 123153 -423588 -89866 201869 520270 553668 99479 26735
13760 26735 170013 195496 -224737 -321748 46112 -125643 -7924 239620 334344 -73657
13750 -73657 185714 131593 -264243 142680 163048 151567 -22155 -422250 -346777 -398927 -923568
13739 -923568 -344956 -36382 187981 45378 124024 7395 -179739 -81538 166931 96881
13729 96881 -96424 -495819 -470425 -395743 -96055 -141398 -85004 -139057 274835 415988 191095
13718 191095 226335 253363 -49827 -114851 -174781 -176303 -394611 -526373 49951 169869 -220250
13707b20250k67660O06103m677J72646L8594k79583r4196k14709j0063O0724J69017
13696d4054Q6768k33635n3015l4959N50087J35818m53824n2553q6602J50043j34688
13685a70614j04225P6098J0271K81508j90795j0714k29637M12449L78481l16293
13675A36529k90484j31701l94825K24632p0119L01655P4842o428K34569M72628
13665E51298J56030k82449n18851o9797J24578j92112K55505K03590M8272j53320
13655A22744J33176Q6082l34594j45609K03881J95319m70430j55844j75455K92299
13645b48431M42590R754j56769j84659j0113J35975N930K4208r0959r9719K78143
13634A05950K93169o1565j59406L9450k08985p1529j02308R5042j47143n2124
$$ plain form
13707 -220250 -487910 118193 113516 286162 324756 45173 -49023 -263732 -273795 -213071 -44054
13696 -44054 42714 -190921 -243936 -278895 271192 407010 -46814 -99367 -185969 -35926 -170614
13685 -170614 -274839 -198741 -188470 93038 -97757 -108471 -338108 74341 452822 136529
13675 136529 -153955 -285656 -680481 -455849 -525968 -224313 -149471 -155899 78670 551298
13665 551298 707328 424879 -93972 -163769 -39191 -231303 24202 227792 276064 122744
13655 122744 255920 342002 7408 -138201 65680 260999 -209431 -365275 -540730 -248431
13645 -248431 194159 203913 47144 -137515 -147628 -11653 -5723 18485 -72474 -172193 105950
13634 105950 399119 337554 178148 217598 8613 -62916 -165224 -70182 -217325 -269449
13624b69449j59571N47904K38116P7452k5906p5388L4570k67176j69965k41323
13614c10736m2692M87611m81301J26476J59830O3542k4055k05649n433L05026
13604G2619m6146l35168q3938K1560L4641k43165M0665J87280K83553k44124j69735
13593d81958j86452M69746M34362P1928k61785L65728m85068m38273N01972n8179
13583f7979N7424m25666J77174L07233Q7024m8947j92449K18623j73140j15197
13573a75900J04415K56503J2465o8946J50825p49648J22587o372R4767L88802
13563A29498j04573P640k28264l26729M76454n20133J91143K23267J84185J14244
13553A46732k90067M23113j82298k31638O2841k43797Q6026J42171P480k90005
$$ plain form
13624 -269449 -429020 118884 357000 434452 408546 333158 367728 100552 -69413 -310736
13614 -310736 -353428 134183 -347118 -220642 -60812 2730 -21325 -226974 -232407 72619
13604 72619 26473 -308695 -392633 -371073 -336432 -579597 -538932 -351652 -68099 -312223 -481958
13593 -481958 -668410 -198664 235698 307626 45841 411569 -73499 -511772 -9800 -67979
13583 -67979 -10555 -436221 -259047 48186 135210 86263 -106186 112437 -60703 -175900
13573 -175900 -71485 185018 197483 128537 279362 -470286 -347699 -354071 -259304 129498
13563 129498 24925 32565 -195699 -522428 -45974 -566107 -374964 -151697 32488 146732
13553 146732 -143335 279778 97480 -134158 -71317 -315114 -229088 -86917 -79437 -369442
13543c69442K3444K5946j51530J35961m10890J75675L7396J02342Q5449J96137
13533a49512Q6434l7613N9077J00510K6654K50869Q3878k04778m42260O57799
13523D31058M63814o92801j52395r3523l34822j60786N02815N24091k28752J93946
13513D52645j2529P4628l51162k67214J5549R1970j58309M8071K95549j67429
13503B1769j27658j67581j21621K35106j08555j61373L19492N41626k16174p74796
13493e59765L97761L5419l4449L94978j70725k23666l32976K27188K3239j74477
13483d17473j99933M83769J99551P9594Q2655N4839n01892P1927j44956l1397
13473c23316N9742L77249J78496k35645K58980l85057K94532O2108n18753j75252
$$ plain form
13543 -369442 -345998 -320052 -471582 -335621 -746511 -570836 -533440 -431098 -345649 -149512
13533 -149512 -63078 -100691 -41614 58896 85550 336419 420297 215519 -226741 431058
13523 431058 894872 202071 49676 -43847 -378669 -539455 -36640 487451 258699 452645
13513 452645 440116 514744 163582 -103632 -88083 3887 -154422 -106351 189198 21769
13503 21769 -105889 -273470 -395091 -159985 -268540 -429913 -110421 431205 215031 -559765
13493 -559765 -162004 -126585 -161034 233944 63219 -160447 -493423 -266235 -242996 -417473
13483 -417473 -617406 -133637 65914 145508 228163 283002 -218890 -146963 -291919 -323316
13473 -323316 -263574 113675 292171 56526 315506 -69551 224981 287089 -231664 -406916
13463d06916K35126p7284J37326p5069O339J83704l26255l72400L88963l2382
13453c38848O4939K98241J63445j77564q704o00901M86942k47064k61955Q1566
13443e39903M52814N86321K51629j74618m42789l70851O8097K12509l83482r1776
13433d32049O43904J05923j83774M30482l32723m36234l07475J27365m3512N18075
13423H9982L34171k51777k69122j63530K72561k30054J77973q7421p7733K36181
13413C1231J16464j18177j84458J75377O7573l91289l05285K22434r2284L47479
13403a30935p0528J48807M7353k47802J17155r283j56664k4032K85853O8916m33894
13392d05054K83720k03633J01434j88468k87036P99084J48526K58703l1623j78712
$$ plain form
13463 -406916 -171790 -249074 -111748 -186817 -180478 3226 -323029 -695429 -306466 -338848
13453 -338848 -273909 24332 187777 10213 1509 -599392 -112450 -359514 -621469 -539903
13443 -539903 -87089 499232 750861 576243 133454 -237397 -169300 43209 -340273 -432049
13433 -432049 211855 317778 134004 564486 231763 -204471 -511946 -384581 -428093 89982
13423 89982 424153 172376 -96746 -260276 12285 -217769 -39796 -127217 -204950 31231
13413 31231 147695 29518 -154940 20437 88010 -303279 -608564 -386130 -478414 -130935
13403 -130935 -201463 -52656 -5303 -253105 -135950 -145233 -301897 -325929 -40076 28840 -405054
13392 -405054 -121334 -324967 -223533 -412001 -699037 100047 248573 507276 475653 296941
13382B96941k71748p7048o3686L98913m25618q7472j54290o8299K15201p2625
13372c09731L49878o7917J43905n3966K71112k28911j60259l94779J03059K39612
13362a07997m90901n7431J41734L25014j60418r2470J61757J51476P145K89619
13352A67528J59909m20878k40887m7104J47725N06335j07625m17321L70583j60427
13342d2162L19776j12657o65894L16277L34369R298j37156r5733l8771J55360
13332D2707L9875J06062m1262k27878j65986r3548M13084j99586J00299J19435
13322I3202j00691Q4956k36036k66534l6941Q0301p4303R6742K74681q4897P7257
13311i2263k01910Q6063j12561K37225K59513m07065r0983K37765J27443K28238
$$ plain form
13382 296941 25193 -51855 -115541 283372 -142246 -229718 -384008 -452307 -237106 -309731
13372 -309731 40147 -27770 116135 62169 333281 104370 -55889 -450668 -347609 -107997
13362 -107997 -598898 -656329 -514595 -189581 -349999 -442469 -280712 -129236 -122091 167528
13352 167528 327437 -93441 -334328 -381432 -233707 272628 165003 -252318 118265 -42162
13342 -42162 277614 164957 -500937 -184660 149709 159007 21851 -73882 -112653 42707
13332 42707 82582 188644 147382 -80496 -246482 -340030 73054 -126532 -26233 93202
13322 93202 -7489 77467 -158569 -425103 -462044 -381743 -456046 -359304 -84623 -169520 -92263
13311 -92263 -294173 -208110 -320671 -83446 176067 -230998 -321981 -84216 43227 271465
13301B71465L0079l71314n9657k8359j59028r0317J57275M15250J16908k00194
13291H2108l6793l54232k7734J81329l38675L0734m2620J16872M21191k85886
13281b53706J19761k24462n2024L24726N09175p3513k82045j01398K32790k42044
13271d2740q6948L52526p712J80330p1010j84813J81578N533k70166M6343M6573
13260A49494j86788K1735o99903K17119K13258k0954R7374J54907J22841r9859
13250c0776K86090J84360J8351q3068l84682o11559L45129j5620J49849n3916
13240a95842l00590K46278M56040l20721l06464O1244L68640J63456n00633J17610
13230b10982K46963k21814L5731J94699R3392j43223l71583K06472k80313j42561
$$ plain form
13301 271465 301544 -69770 -129427 -157786 -316814 -407131 -249856 165394 282302 82108
13291 82108 45315 -308917 -336651 -155322 -493997 -463263 -505883 -389011 32180 -253706
13281 -253706 -133945 -358407 -410431 -85705 423470 349957 67912 -33486 199304 -42740
13271 -42740 -129688 222838 215126 395456 324446 139633 321211 326744 56578 102921 149494
13260 149494 -37294 -15559 -715462 -498343 -285085 -306039 -208665 -53758 69083 -30776
13250 -30776 255314 439674 458025 374957 -9725 -621284 -276155 -291775 -141926 -195842
13240 -195842 -496432 -250154 205886 -114835 -421299 -360055 8585 172041 -328592 -210982
13230 -210982 35981 -185833 -150102 44597 137989 -5234 -376817 -170345 -450658 -593219
13220e93219J34763J86122K7058j97555K96819L43200n26526m17125L21578L82890
13210d1995J2480k14436M0023M0561K21345r4082L96657l32345n64893j87583
13200g24268L64494M73521J70543r6994k25700P6625k40890m07201M6585M09402
13190a53883J20624J9825o5380n806m351n4663L3074j94857K91793j38443L89633
13179B37566N0678o43245l5829K55416k4077k19335N76892o4511J9445l20205
13169a67205q6244K75908n4286J82819q7288o9932O7906k8090J21046R0219k60288
13158a5435j50863m38451j10271M51532J2308K17761l00359J10565j94702K06020
13148b11895K35436m11847M4881j62963L97K42514M2164j83610k08159K61865
$$ plain form
13220 -593219 -458456 -272334 -245276 -442831 -146012 197188 -329338 -746463 -424885 -41995
13210 -41995 -29515 -243951 -203928 -163367 57978 -36104 360553 28208 -536685 -724268
13200 -724268 -359774 113747 284290 187296 -38404 38221 -202669 -609870 -563285 -153883
13190 -153883 -33259 -13434 -78814 -84620 -88971 -143634 -110560 -305417 -13624 -152067 237566
13179 237566 288244 -355001 -390830 -135414 -159491 -378826 198066 133555 153000 -167205
13169 -167205 -253449 22459 -31827 150992 63704 -6228 61678 33588 154634 244853 -15435
13158 -15435 -166298 -604749 -715020 -263488 -251180 -33419 -333778 -223213 -417915 -211895
13148 -211895 23541 -388306 -343425 -506388 -505991 -263477 -221313 -404923 -613082 -351217
13138c51217L08593K81435k23292M0331J42641o94659J98224L61263K6046Q6675
13128A76040k44623j95458J47208l9349j0532l00626J39408q131k68011M8420
13118e55654J25763J6895m3912N01368J93910R3576j77042K29383m30412m22698
13108d68823M87042K5796j20187J10431K11901j33503r7119K17278J45886o1463
13098C17239l38928k68037L36916M24478K78848m02549j73745m044N6760N4265
13088B81203j95726O4088j71180J31405j99272m58266J02229j79523N92083L24603
13078B91644k11494q0737k00746J84675J56745q1853O1919j12965k1619k9586
13068d4017l9269p7468J50059l7519j20521J62293J10824j25099k12354J41247
$$ plain form
13138 -351217 -42624 238811 15519 55850 198491 -496168 -297944 63319 89365 176040
13128 176040 -68583 -264041 -116833 -156182 -166714 -467340 -327932 -336063 -604074 -555654
13118 -555654 -429891 -412996 -456908 44460 238370 331946 154904 384287 -46125 -468823
13108 -468823 18219 44015 -76172 34259 246160 112657 15538 232816 378702 317239
13098 317239 -21689 -289726 47190 471668 750516 347967 174222 170178 226938 281203
13088 281203 85477 149565 -21615 109790 -89482 -547748 -445519 -625042 -32959 291644
13078 291644 80150 -587 -201333 -16658 140087 58234 120153 7188 -14431 -44017
13068 -44017 -83286 -160754 -10695 -48214 -168735 -6442 104382 -20717 -233071 -91824
13058i1824k24948j72126L7717L26549J66617j12988J4192K617K06380k93046
13048a40860J86602N02692j21902j26601k96943k53074l08534K22382j6926J13873
13038b39291K50121k40757L67017j09465p9698m6372o078j72876K12525l55240
13028d20114K43583J95173m80947Q0207R1740L22734j34085k85677J50004M89535
13018B52153K33698j92725n9726N0713m2807L7108l02887J77821q1678n450m74386
13007d08166l5808R9545N31708j27756o52302j12602K79656M26945J05559N3654
12997A60433n72882M9582L51020J57086k6176j01377j16095n4447j5662L48182
12987A79664P3227p0265n0355k28276J8465M5233j99815m9700J52488O8490J80146
$$ plain form
13058 -91824 -316772 -488898 -451181 -124632 41985 -71003 -56811 -54194 152186 -140860
13048 -140860 45742 548434 426532 299931 2988 -250086 -558620 -336238 -353164 -239291
13038 -239291 10830 -229927 137090 27625 -52073 -98445 -104523 -277399 -64874 -420114
13028 -420114 -176531 18642 -462305 -382098 -290358 32376 -101709 -387386 -237382 252153
13018 252153 485851 293126 233400 284113 241306 278414 -24473 153348 71670 66220 -408166
13007 -408166 -443974 -344429 187279 59523 -592779 -705381 -425725 1220 106779 160433
12997 160433 -412449 -362867 -11847 145239 119063 17686 -98409 -152856 -168518 179664
12987 179664 252891 182626 132271 -96005 -77540 -32307 -232122 -281822 -129334 -60844 119302
12976A19302o8446J8597j73702K52200J18930l18494o9516m5080K43675J69309
12966B46775n58810k97043L18239L53013k9317J07722K9470j13572K45479k98115
12956C841o5546m0129J89408j70776j88899N16675j79997M50571K0696o36747
12946a00903l0849M35016j65164j71947n0809L2223J1539l30563k70788N4781
12936e87464k52827J05510Q91216R3276k86398K30492L111l29092k70016J02486
12926b99706K47723K9296N7755j54566J99689M5700j05502O8336P1987J90124
12916C50836M64151j16308r55239j2414J6460L7563K68261k1826J60099n722j23550
12905F2311p6655K02858k25313k02582k74411K7287L00683J66162N456K68050
$$ plain form
12976 119302 50856 69453 -104249 147951 266881 -51613 -121129 -166209 77466 246775
12966 246775 -312035 -609078 -290839 62174 32857 140579 170049 56477 301956 3841
12956 3841 -61705 -101834 87574 -83202 -272101 244574 64577 515148 535844 -100903
12946 -100903 -131752 303264 138100 -33847 -84656 -52433 -40894 -371457 -642245 -587464
12936 -587464 -840291 -734781 156435 249711 -36687 193805 196916 -132176 -402192 -299706
12926 -299706 -51983 -22687 35068 -119498 80191 125891 20389 88725 160712 350836
12916 350836 814987 698679 -256560 -268974 -252514 -214951 53310 31484 191583 185861 62311
12905 62311 -14344 188514 -36799 -239381 -513792 -486505 -185822 -19660 -14204 253846
12895B53846k56487J4462K4480m05119q9858J43544M9419m0767M06023L06488
12885D06031k3294j8195m21215J63319J08052q3930k78798j08933P3763K00774
12875A7574j41217J93128j4078n26534K75863J55004j70406N3347k4586J93378
12865A1473k02155p9549J42474M32233J23424k57110K66882l84768l621k7733
12855B1550l16915m2027M42889k79457n70016K59999N5291K16353K88219j48688
12845g2802K30749k09010k47419N92702o31269k90145K97812M33461j50286j63705
12835b09912K89398l04619K2726O3832J97264m9697m34192k25116O31022J60724
12825A41430l5150J5154n19935K1745K80795J13726P6357l49679J10589P1970
$$ plain form
12895 253846 -2641 11821 36301 -368818 -458676 -315132 -265713 -306480 99543 406031
12885 406031 382737 364542 -56673 106646 214698 130768 -148030 -256963 -183200 17574
12875 17574 -123643 69485 55407 -471127 -195264 -40260 -210666 -157319 -181905 11473
12865 11473 -190682 -270231 -127757 304476 427900 170790 437672 52904 49283 21550
12855 21550 -295365 -337392 105497 -173960 -743976 -483977 -428686 -212333 75886 -72802
12845 -72802 157947 -51063 -298482 294220 -337049 -627194 -329382 104079 -46207 -209912
12835 -209912 79486 -225133 -202407 -138575 58689 8992 -425200 -650316 -19294 141430
12825 141430 106280 121434 -398501 -376756 -95961 17765 94122 -255557 -144968 -72998
12815g2998k69851j69767K91603K26738m4517p7011M05138l01072o0916j91353
12805b64006J22675K09443N3215p1595Q960l06433j50680n1176O9946M13274J45677
12794A79300n33268j04503l43195J70050K43151j34858L52442J11095n2195M1709
12784g0272k38004q4103L58419J31045K08891J51183K01791n41832L68984k43391
12774B42711J46981k7770m94905M39757P6828m81078l12555J08387J18525K53138
12764G0019J82641j30667k6397p6792m4623J15010n9173j9180J63681J4770l7020
12753A52269l0907j65954P7808n43269m2162P0291L25549J06243j23930K21131
12743D7069J51648l99365j04266J30729J06660R9611j86388K01396j88662l70034
$$ plain form
12815 -72998 -342849 -512616 -221013 5725 -38792 -115803 289335 -11737 -72653 -264006
12805 -264006 -141331 68112 121327 49732 58692 -247741 -398421 -449597 -379651 33623 179300
12794 179300 -353968 -458471 -801666 -631616 -388465 -523323 -170881 -59786 -111981 -70272
12784 -70272 -308276 -392379 -33960 97085 305976 457159 658950 117118 486102 242711
12774 242711 389692 361922 -132983 306774 383602 -97476 -410031 -301644 -183119 70019
12764 70019 252660 121993 95596 18804 -25819 89191 30018 10838 174519 189289 152269
12753 152269 121362 -44592 33216 -510053 -552215 -481924 -156375 -50132 -174062 47069
12743 47069 198717 -200648 -304914 -174185 -67525 32086 -154302 47094 -141568 -511602
12733e11602l8300N33257l15135J01489L7132L29314l46970J92890L7998K18012
12723B38085K21189j46440n5997k2714n70268n1127N01700p530j00356o8396K0949
12712d0905Q084k75284L9912J84695K93686J96868o2039k3908m29787j74775M47454
12701A64001j881n52682n3554M41729j34587J26364J69986l87989K42468K3045
12691C6900K16074J86005r7537m33378J51676n3493k75942K33149K77407j85048
12681E5813n53439N6117O79997j50551j47480l8652J92906l53173L40466k56384
12671a74380n11464J13329J2629K06352K22004J20794K33196K61504j23311m09221
12661d8568K9505O0116p6825Q9370m15515K59121J76925P3046k84441n3419K58928
$$ plain form
12733 -511602 -549902 -16645 -331780 -230291 -193159 136155 -210815 -17925 20073 238085
12723 238085 459274 312834 256837 234123 -336145 -387272 114428 106898 6542 -61854 -40905
12712 -40905 -32821 -308105 -268193 -83498 210188 407056 345017 321109 -108678 -283453 164001
12701 164001 162120 -390562 -444116 -2387 -136974 -10610 159376 -228613 13855 36900
12691 36900 252974 438979 341442 -91936 59740 6247 -269695 -36546 240861 55813
12681 55813 -497626 -441509 238488 87937 -59543 -98195 94711 -258462 82004 -174380
12671 -174380 -685844 -572515 -559886 -353534 -131530 -10736 222460 483964 360653 -48568
12661 -48568 -19063 41053 -35772 53598 -361917 -102796 74129 147175 -137266 -190685 68243
12650F8243k53164L41243K36077q7331j90467m6153k89942O4100j38524l54158
12640f50076L02634K5825J61395L74893j49981J38074Q8751K8524L33392j86722
12630D66709o06812N7302K10910o3026o41954M97533M82183l23870K50068l40426
12620a1383m25464k05835J58273M17180M1019j28677M31238r6243m0066j5146
12610A24896R4471k22463P8743k05218J7686J80537k1958m3093l02446L09176
12600A0331J21678m3242L50120l07227l36676J79813K54748J1263J38023j58053
12590B20778L6289L10697j6980l21815m49452J68059j67110j70031O28362J86759
12580D25556m95725j12723K52647L75816k59604j01306J2691o07375j10190M44579
$$ plain form
12650 68243 -184921 156322 392399 305068 114601 68448 -221494 -157394 -295918 -650076
12640 -650076 -347442 -321617 -160222 214671 64690 202764 291515 320039 653431 466709
12630 466709 -140103 -82801 128109 65083 -576871 -79338 402845 78975 329043 -11383
12620 -11383 -436847 -642682 -484409 -67229 -26210 -154887 276351 180108 140042 124896
12610 124896 219367 -3096 75647 -129571 -111885 68652 46694 3601 -298845 10331
12600 10331 132009 88767 438887 131660 -205016 -25203 229545 240808 378831 220778
12590 220778 257067 567764 550784 228969 -220483 -52424 -219534 -389565 238797 425556
12580 425556 -70169 -182892 69755 445571 185967 84661 97352 -510023 -620213 -175634
12570a75634L92497N0491n66358O0795K89857r3648J49922j93916L08186k10365
12560A1827o9811J39129k30508K19037J47162k33490j95294J82772J82830K71605
12550D25259l84936j27795J84585j08317R237P809p1142J37452k56236K76133
12540I2049j80788J75370L31124l14722J76363O0377k24979l36035j18052K00260
12530a39033M22406j48954l9740K82490p38320k82194j1284L57348K9221j03180
12520c71240K96820J33737K7845O1894M15344J11157Q0813l60947k94797k68772
12510a68146q806J76275r4592k05932j14560k02819N4353K48508J90306l98174
12500e23587L86828M43812J20036M7443k20353K05529m18053M4469j46945k73643
$$ plain form
12570 -175634 216863 267354 -299004 -238209 51648 -42000 107922 -85994 222192 11827
12560 11827 -57984 81145 -149363 69674 216836 -16654 -211948 -29176 153654 425259
12550 425259 40323 -87472 97113 -11204 -1967 5842 -65300 72152 -184084 92049
12540 92049 -88739 86631 417755 103033 279396 339773 114794 -221241 -339293 -139033
12530 -139033 283373 134419 94679 377169 -361151 -643345 -654629 -297281 -268060 -371240
12520 -371240 -74420 59317 87162 149056 564400 675557 756370 395423 100626 -168146
12510 -168146 -176952 -677 -95269 -301201 -415761 -618580 -564227 -315719 -125413 -523587
12500 -523587 -136759 307053 427089 474532 254179 459708 41655 86124 -60821 -334464
12490c34464N90446K63431j48391j03083l53663j84428k13438K10856L60369j4935
12480G2700l9216j38128J10521K54675r4092J67640O7810j65225R3452q1564K4875
12469B73448l62859p0175N67601j01056j08408R1079l37921j6229j17802M3620
12459a38702L93115o8918r4602J72843m36057J11382L51993j29676l30703L17766
12449A48441j34655L53721m6231j0629k48989j58339K75705J57248k46053R0055
12439A80274J4867q1460q2981o7691o415k42434L30744m18832L27853k15733J48029
12428a13779m4696Q9920K08521J26063m98083J85338j18380J38639Q771o421L37807
12417C13700Q8049l63714l82946K40898J18790Q1605k3980J50739j82147n507
$$ plain form
12490 -334464 255982 519413 371022 267939 -85724 -270152 -483590 -272734 87635 72700
12480 72700 33484 -104644 5877 260552 166460 334100 401910 236685 330137 248573 273448
12469 273448 -89411 -159586 408015 306959 198551 289630 -48291 -64520 -182322 -138702
12459 -138702 254413 185495 90893 263736 -172321 -60939 291054 161378 -169325 148441
12449 148441 13786 367507 321276 310647 61658 -96681 179024 336272 90219 180274
12439 180274 195141 113681 30700 -36991 -43406 -285840 44904 -373928 -46075 -261808 -113779
12428 -113779 -158475 -68555 139966 266029 -232054 -46716 -165096 -26457 -17686 -24107 313700
12417 313700 401749 38035 -344911 -104013 14777 96382 72402 223141 40994 35487
12407C5487L29995k06971l05455J49834O0341M57851k79025J83224k30778P5455
12397B69958K32149K3514J65627j77895J39535l62703k95607r3587K07222L93746
12387E01959k2170l5121m41613j37174K64193j26989p2724M02111K74221k49073
12377C57620r5398J66686m7571J09237m8371m63871j69176j7375r9740K82458
12367b5501j24776k82167J19442N34919q0694k38123L40652r8468j05320J16971
12357A56935J440r5988M52588l28385m03567K19404K88067M20698j9712m24586
12347B66894L15715q00k98682k4132L43621j62531K9213k08007k80387N00849
12337D81753k70244j1081J15488j27584j3076k91725j4598K39342L31636N2932
$$ plain form
12407 35487 365482 158511 -146944 2890 63231 521082 242057 425281 194503 269958
12397 269958 502107 525621 691248 513353 652888 290185 -5422 -99009 108213 501959
12387 501959 479789 444668 3055 -134119 130074 3085 -69639 332472 606693 357620
12377 357620 262222 428908 381337 490574 442203 -21668 -190844 -208219 -307959 -25501
12367 -25501 -150277 -432444 -313002 221917 141223 -96900 243752 145284 39964 156935
12357 156935 158375 62387 514975 186590 -216977 2427 290494 711192 691480 266894
12347 266894 582609 581809 283127 258995 602616 440085 469298 261291 -19096 481753
12337 481753 211509 200428 315916 188332 175256 -116469 -131067 108275 439911 492843
12327D92843j9786o6106K75769o66570R367K44698k165J41782J46689k62300n62052
12316b67831N23839J49143J0212j81871J55205j12380o2772J7541M77338k43022
12306D65402N4677n7812j86102K0112j57488J0106k8126K64714L06424J4552O2445
12295G68904l63745m63731k7591K56744J88162k86910j71784K33225K13972j30644
12285B16602J70446k00089j65389R8979j7883J31645j6248j71632N37708j44405
12275D39734o43121K64500J68015L43637j84248J52274j47303k33691O73160K88389
12265A121346k97007k01589l82141n0024n6657M1752R5190k39389m91288L35863
12255a23944j05329L01783K50632n19992K70149J02649K07948J58225L6447k86959
$$ plain form
12327 492843 473057 406951 682720 16150 25517 270215 268050 409832 556521 294221 -267831
12316 -267831 256008 405151 415363 233492 388697 276317 213545 231086 708424 465402
12306 465402 520079 462267 276165 296277 138789 148895 120769 385483 691907 706459 768904
12295 768904 405159 -58572 -86163 170581 358743 71833 -99951 133274 347246 216602
12285 216602 387048 186959 21570 120549 102666 234311 218063 46431 584139 439734
12275 439734 -203387 61113 229128 572765 388517 540791 393488 159797 832957 1121346
12265 1121346 824339 622750 240609 190585 133928 175680 270870 31481 -459807 -123944
12255 -123944 -229273 72510 323142 -196850 73299 175948 383896 542121 578568 291609
12245B91609P7322l94393L60398q8244n44719J29642N43687Q6783m39102K23107
12235B46090J36814J83652p1066r1991l03470K2655L18948J28002K52524N9615
12225H81773L7149O3484k01020m67195R3326n2337L92800M57061n14160l41870
12215C49011r4109L4816K83605J10566R1521m00942J04889l970j95198N76219
12205H56408L85968k87485k42418k99881m5280j20059K18972k79284K05551k35541
12195A56951J24742M30141L9816K66119k29295j81167k69773J96177j22848j02414
12185C08449M04730k67353m3804K6082J01815L0324n12223K30870K06959n9036
12175D26813q5786n1954K48001J58816k1484K47143r9527q2296j37776M09960
$$ plain form
12245 291609 368931 -25462 334936 246692 -298027 -168385 375302 462085 22983 246090
12235 246090 382904 566556 495490 403499 100029 122684 441632 569634 822158 881773
12225 881773 918922 982406 781386 314191 407517 355180 747980 1205041 690881 349011
12215 349011 254902 289718 573323 683889 775410 374468 479357 475387 280189 856408
12205 856408 1242376 954891 712473 412592 367312 247253 466225 186941 392492 156951
12195 156951 281693 711834 751650 1017769 788474 607307 337534 533711 410863 308449
12185 308449 713179 445826 402022 428104 529919 560243 48020 278890 485849 426813
12175 426813 341027 289073 537074 695890 674406 921549 822022 739726 601950 1011910
12165A011910K89005j22020l52461j04972N22951k38837Q8696J19989k08424N6938
12155A062775k30241o2166K80602M58721m44305J57300K8391p179k18812J38444
12145A163530k86731q6774K3427K16869M1782R3407o407m93990L65892p890j02841
12134I20274M34133k22741J03282J63984J2538k0916l60731M36466M80899J40027
12124B087215m19224m7830k19159j58934J57826M1298j76636K38973J24287M3900
12114A671716N0367j88804k71899K56511M6709Q634Q7256R9746m21743L08180
12104A646673L32698L80537j91723j37594L76969j62415j39477N4432M23255P6247
12094B659602j06539j15118K88176J43407Q3674N9639q7056k36961j46083j4123
$$ plain form
12165 1011910 1300915 1178895 826434 721462 1244413 1005576 1094272 1214261 1005837 1062775
12155 1062775 832534 770368 1050970 1509691 1065386 1222686 1251077 1243898 1025086 1163530
12145 1163530 876799 790025 813452 1030321 1072103 1165510 1159103 665113 1031005 1023115 920274
12134 920274 1354407 1131666 1234948 1398932 1411470 1390554 1029823 1466289 1947188 2087215
12124 2087215 1667991 1620161 1401002 1242068 1399894 1441192 1264556 1503529 1627816 1671716
12114 1671716 1722083 1533279 1261380 1517891 1564600 1573234 1660490 1760236 1338493 1646673
12104 1646673 1979371 2359908 2168185 2030591 2407560 2245145 2105668 2160100 2583355 2659602
12094 2659602 2553063 2437945 2726121 2869528 2953202 3012841 2925785 2688824 2542741 2528618
12084B528618l8058L26312M10328O3456M14274j49895L1837K43102K87868j49832
12074C968010N6497j33181r2609L37383m07227L96297M53933K29036j53925l86492
12064D267722Q8352K87752M23023L61886J79203q0709j75251l2667M44084R4940
12054E858335K6899q5218K08110r2404j87138O18304J3159N1074k4685L4137K13019
12043F633592J9520L02916N62962J1430l36064J20611M12205k35434M8260L73937
12033G913935J76707K2701l2787M20560L1745M70779l94446j4251J95543j04872
12023H685614K98872j13197k33970j91221K68905k31310j20572O660n6097k54898
12013H058786L75017L60501j9009k02056P0348J76515k75251k70000N67922K83734
$$ plain form
12084 2528618 2490560 2816872 3227200 3290656 3704930 3555035 3586872 3829974 4117842 3968010
12074 3968010 4024507 3891326 3798717 4136100 3728873 4125170 4579103 4808139 4654214 4267722
12064 4267722 4356074 4643826 5066849 5428735 5607938 5527229 5351978 5319311 5763395 5858335
12054 5858335 5885234 5800016 6008126 5915722 5728584 6346888 6360047 6411121 6386436 6420573 6633592
12043 6633592 6653112 6956028 7518990 7530420 7194356 7314967 7727172 7491738 7539998 7913935
12033 7913935 8090642 8113343 8080556 8501116 8532861 9003640 8609194 8594943 8790486 8685614
12023 8685614 8984486 8871289 8637319 8446098 8715003 8483693 8363121 8369781 8313684 8058786
12013 8058786 8433803 8794304 8775295 8573239 8643587 8820102 8544851 8274851 8842773 9126507
12003I126507l67004j26722l34151K02678l6020p3026J4683K74433j84883J35748
11993H632243J42154n83292p4016J77255m23420j47742R9847k55255j82740J15681
11983G500715J52460m79098l89250p5994K0810k2278k81812l10620k45377K25446
11973F095002J38325j28432j99533j44509r4704m20439J77363J62849k0075K34292
11963E800139j87689m31064J33290j2682m22463l89264J52440n0387j91931m59448
11953C940941K46689l30388k8639k5262m13774K06418J58329j65779q3029J52370
11943C657876l15812k2275J43917j6218J67378l09914j26569o021Q7865j51274
11933C108953j17864J3424R8656k61639K31942p522j95373J62965K0484k7013
$$ plain form
12003 9126507 8759503 8632781 8298630 8501308 8465288 8392262 8406945 8681378 8496495 8632243
11993 8632243 8774397 8191105 8117089 8294344 7870924 7723182 7823029 7567774 7385034 7500715
11983 7500715 7653175 7174077 6784827 6708833 6729643 6707365 6425553 6114933 5869556 6095002
11973 6095002 6233327 6104895 5905362 5760853 5666149 5245710 5423073 5585922 5565847 5800139
11963 5800139 5612450 5181386 5314676 5301994 4879531 4490267 4642707 4592320 4400389 3940941
11953 3940941 4187630 3857242 3828603 3803341 3389567 3595985 3754314 3588535 3505506 3657876
11943 3657876 3342064 3319789 3463706 3447488 3614866 3304952 3178383 3172362 3260227 3108953
11933 3108953 2991089 3004513 3103169 2841530 3073472 3065950 2870577 3033542 3054026 3027013
11923C027013J46537l36428k88707Q0374k31594Q3836n36813j05602J97588J6681
11913B052885m99999L96310M88280k54608k95595k8034k8869M08949N293N1316
11903B295928l60401M93189M0086n46824J16155K53961j22078j57566m4361J43320
11893B111409J35777J20280P7477q2804j4108l48541m52962M25001J23355k90035
11883A804849k0456k3853K98792Q2935p502j09587J58608J24307K84362M0417
11873B632872q405r9484M7173k11985l72542P6790l8729O24272p0570n3353r2629
11862B433410M8714m3021j45002k45467K54625o2635L46097K0148q1519j28272
11852B397078J55885M77981j47092J67074k64733r4028J75699O9932j00022L74955
$$ plain form
11923 3027013 3173550 2837122 2548415 2628789 2397195 2481031 1944218 1838616 2036204 2052885
11913 2052885 1552886 1949196 2437476 2182868 1887273 1859239 1830370 2239319 2244612 2295928
11903 2295928 1935527 2428716 2468802 1921978 2038133 2292094 2170016 2012450 1968089 2111409
11893 2111409 2247186 2367466 2444943 2362139 2348031 1999490 1546528 1971529 2094884 1804849
11883 1804849 1784393 1760540 2059332 2142267 2134765 2025178 2183786 2308093 2592455 2632872
11873 2632872 2624467 2524983 2572156 2360171 1987629 2064419 2025690 2649962 2579392 2526039 2433410
11862 2433410 2482124 2439103 2294101 2048634 2303259 2240624 2586721 2606869 2525350 2397078
11852 2397078 2552963 3030944 2883852 3050926 2786193 2692165 2867864 2937796 2837774 3212729
11842C212729j29350p0268k15715L90238N19105o5222k91227K126k6446L04399
11832C630369Q1835J76692Q1139N037K19811k59826r9260L8405M3364L84250J74217
11821D476033K09975J56480j31023k05797J16652K88085j15441L88789M17719
11812E601472k65907J02765N22955J68910o7837J96496L3876Q4193m63049M09808
11802F323682r8046J6642K62975K61046m0721r3063J18613N9709K20595k9673
11792G001759j21916M36281J76715J98391q2556m5466L62144j05050Q974M7235
11782G876511n9096r6520J64091J59408m3650j79923o2728K17064L23131j1779
11772H286509j83017l82210N3585N1380M38294k60293j56647L45251R9995j95480
$$ plain form
11842 3212729 3083379 3013111 2797396 3187634 3706739 3641517 3350290 3352416 3325970 3630369
11832 3630369 3712204 3888896 3970035 3975072 4194883 3935057 3835797 3874202 3917566 4301816 4476033
11821 4476033 4686008 4842488 4711465 4505668 4622320 4910405 4794964 5183753 5601472
11812 5601472 5335565 5438330 5961285 6130195 6062358 6258854 6292730 6376923 5913874 6323682
11802 6323682 6225636 6242278 6505253 6766299 6725578 6632515 6751128 6810837 7031432 7001759
11792 7001759 6879843 7316124 7492839 7691230 7608674 7563208 7925352 7820302 7829276 7876511
11782 7876511 7817415 7720895 7884986 8044394 8000744 7820821 7758093 7975157 8298288 8286509
11772 8286509 8103492 7721282 7774867 7826247 8264541 8004248 7847601 8192852 8292847 8097367
11762H097367j53568m0547K02158L32183j12051J22083j70271l2365K19714n6381
11752H408322o0841j55383o3308q8536J09090j15904j75849Q4448k92164o99559
11742F950316j2750O0884M21024p4733l17571J85119k80386j13158k40217m826
11732F573702l80466N1703M70999K7389l63141k61901j87081p483j89476j19091
11722E615154k66793r1540M73039l07867m57322k63139L98547l8271L28312m48474
11712D941646k93129j86344L26822J13490k23129k06217m19044Q8426j30844O6913
11702D078590L51380M11534M7558q49474n75144j36095r4156L67363L56109r9957
11692C857708q033R7346m29643k91890k21715K56293N4382n36236K88019l7762
$$ plain form
11762 8097367 7943799 7903252 8105410 8437593 8325542 8447625 8277354 8244989 8464703 8408322
11752 8408322 8347481 8192098 8128790 8040254 8149344 8033440 7857591 7942039 7649875 6950316
11742 6950316 6937566 6998450 7419474 7344741 7027170 7212289 6931903 6818745 6578528 6573702
11732 6573702 6193236 6244939 6715938 6743327 6380186 6118285 5931204 5923721 5734245 5615154
11722 5615154 5348361 5256821 5729860 5421993 4964671 4701532 5100079 5061808 5390120 4941646
11712 4941646 4648517 4462173 4788995 4902485 4679356 4473139 4054095 4142521 4011677 4078590
11702 4078590 4429970 4841504 4889062 4039588 3464444 3328349 3234193 3601556 3957665 3857708
11692 3857708 3849675 3947021 3517378 3225488 3003773 3260066 3314448 2778212 3066231 3028469
11682C028469m12894N47118K96899j71166q8184M79262k14283j33209k78718M846
11672C058140L9284k12497j05452j17049K82007l00446J83910j72967L70900l04779
11662B721051k69106L60669j9000n13743K06375O0501j08031K90076n90832p6885
11652B061075J11170M7454k32613O48568M39093l10629k35813K69943k1929l79082
11642B397237J76524L61043K683j28842k57425j26550J52220r6561j10011O9698
11632B440016l95320K55942j73821J49856J5422M55069L5705j93204J41273j74333
11622B556605K06428j74582o1703J26233M94493j77962r7025k26689j58965M7016
11612B533849q0567J89447k13338j59537L87180P7863Q9570n49695K17271j38868
$$ plain form
11682 3028469 2615575 3162693 3459592 3288426 3200242 3679504 3465221 3332012 3053294 3058140
11672 3058140 3097424 2884927 2779475 2662426 2944433 2643987 2827897 2654930 3025830 2721051
11662 2721051 2451945 2812614 2793614 2279871 2486246 2546747 2438716 2728792 2137960 2061075
11652 2061075 2172245 2219699 1987086 2635654 3074747 2764118 2528305 2798248 2776319 2397237
11642 2397237 2573761 2934804 2937487 2808645 2551220 2424670 2576890 2480329 2370318 2440016
11632 2440016 2044696 2300638 2126817 2276673 2292095 2747164 2782869 2589665 2730938 2556605
11622 2556605 2763033 2588451 2526748 2652981 3147474 2969512 2872487 2645798 2486833 2533849
11612 2533849 2453282 2642729 2429391 2269854 2657034 2734897 2824467 2274772 2492043 2353175
11602B353175j22077N65747j88448m19261j19045K63026r8087K46253j29204j06130
11592B245949p3201k03084J03481L96860K53044Q086j03790J85144j27518k16597
11582B468374k4351L98553o338l94322j43273L04117K73245j2150l14662L96289
11572B945482j59137k07069k7495l4036P30730m58477K5751L1814J5415J1561
11562B874539J20919K8162j78028o2024l8846j03763l63160N88068O02569m49861
11552C018575n21506L44907N0302k68678L69988j9925K09641k01821L0263L88779
11542C400525m15705J66652k22631J89207M45245j74476J4339n3086j93258j41919
11532C014893l07922k33423M07297O60143J17586m40048j43611j06364K68845
$$ plain form
11602 2353175 2231098 2796845 2608397 2189136 2070091 2333117 2235030 2481283 2352079 2245949
11592 2245949 2172748 1969664 2073145 2470005 2723049 2731135 2627345 2812489 2684971 2468374
11582 2468374 2444023 2842576 2836238 2441916 2298643 2602760 2876005 2863855 2549193 2945482
11572 2945482 2786345 2579276 2551781 2517745 3248475 2789998 2815749 2847563 2862978 2874539
11562 2874539 2995458 3023620 2845592 2783568 2744722 2640959 2277799 2865867 3468436 3018575
11552 3018575 2497069 2841976 2892278 2623600 2993588 2973663 3183304 2981483 3011746 3400525
11542 3400525 2984820 3151472 2928841 3118048 3563293 3388817 3403156 3350070 3156812 3014893
11532 3014893 2706971 2473548 2880845 3540988 3658574 3218526 3074915 2968551 3237396
11523C237396n33693O8928K51191J94085k16091k81796K72269O48657n6824m26206
11513C157916J88401m95768K20234L5612K51378l57531k17557L64069L32351J83369
11503C662474l98877l46969m728K43208K51760q5020o7055J3561K32677J78613
11493C679644m116l07198l65689m1183j8087K54045M01095k42554q4938J27545
11483C398564R0050K86647M3592k79166K8364K15223l8976j80726M3295J68207
11473C775074l17111r3081r3837L00629L3181r6808j54332k94096J08835J8750
11463C187204K57783K24756k51313M19923P5059m9971l14112L25564l6861J28778
11453C966810j23883O068J33956l77458l62454K60762L51164R9185k74508j65127
$$ plain form
11523 3237396 2703703 2772631 3023822 3217907 3001816 2720020 2992289 3640946 3584122 3157916
11513 3157916 3346317 2850549 3070783 3106395 3357773 3000242 2782685 3146754 3479105 3662474
11503 3662474 3263597 2916628 2911900 3155108 3406868 3321848 3254793 3268354 3501031 3679644
11493 3679644 3675528 3368330 3002641 2961458 2943371 3197416 3598511 3355957 3271019 3398564
11483 3398564 3488614 3775261 3818853 3539687 3568051 3783274 3744298 3563572 3606867 3775074
11473 3775074 3457963 3364882 3271045 3571674 3604855 3508047 3353715 3059619 3168454 3187204
11463 3187204 3444987 3669743 3418430 3838353 3913412 3863441 3549329 3874893 3838032 3966810
11453 3966810 3842927 3848995 3982951 3605493 3243039 3503801 3854965 3954150 3679642 3514515
11443C514515K43342K37271J29080J00740K17164k19795k30284K36045Q4642N2888
11433D365608j17760m7218P3088p4527O0406p2616L43269L3997k10885l00790
11423D052572N1364L76309l41690J39658K25287K91866o4720o88800l79012K41616
11413C904450N01713o3625M01420k48572L4984m66983N7714L37353M24560l9528
11403D843486J30768j02398M87898O5877P0127n32333M9170N4713L4131L60147
11393E461586o0153k85372l1462J46458n685l0802L50567J27809Q8644k84077
11383E477513J09003M23298k37748l12190m69598J15313J24316p9803J02250K23555
11373E475909k59069K87258k30457j56044k5346O18921J91894j79321k51578J17214
$$ plain form
11443 3514515 3757857 3995128 4124208 4224948 4442112 4222317 3992033 4228078 4312720 4365608
11433 4365608 4247848 4200630 4273718 4199191 4259597 4186981 4530250 4564247 4353362 4052572
11423 4052572 4103936 4480245 4138555 4278213 4503500 4795366 4730646 4041846 3662834 3904450
11413 3904450 4406163 4342538 4743958 4495386 4530370 4063387 4121101 4458454 4883014 4843486
11403 4843486 4974254 4871856 5359754 5425631 5495758 4963425 5012595 5067308 5101439 5461586
11393 5461586 5401433 5116061 5084599 5231057 5225372 5194570 5545137 5672946 5761590 5477513
11383 5477513 5586516 6009814 5772066 5459876 4990278 5105591 5229907 5150104 5252354 5475909
11373 5475909 5216840 5504098 5273641 5117597 5092251 5711172 5903066 5723745 5472167 5589381
11363E589381l67167j7580M06606J41520j83013M24341j49564J93437p3159k8346
11353E936456o3715p9226j08031k9776O86187j23592N5999o8477K47442j4562
11343F438705r3080j87180J51102P3918l85357K69469P6687n6773r2718K58959
11333F453732k6005r7228K4401J91736M07700l15054J74553O49247k32661n4154
11323G176267j96390k31934K36316K91145J07269j17093J36223l26847k16689
11314F858267L50817M890K59349k7506J06605p7913k25569J09145J8754K06907
11304G583746K57957K65873l32676J87944L38974Q1423j73535k24741m4242J01879
11294H042602p7828K34146L67844m07750k48873M9679k57484M90201m4578M68809
$$ plain form
11363 5589381 5222214 5204634 5611240 5752760 5569747 5994088 5844524 6037961 5964802 5936456
11353 5936456 5872741 5793515 5685484 5655708 6341895 6218303 6274302 6205825 6453267 6438705
11343 6438705 6345625 6158445 6309547 6383465 5998108 6267577 6344264 6287491 6194773 6453732
11333 6453732 6427727 6330499 6354900 6546636 6954336 6639282 6813835 7463082 7230421 7176267
11323 7176267 6979877 6747943 6984259 7275404 7382673 7265580 7401803 7074956 6858267
11314 6858267 7209084 7213974 7473323 7445817 7552422 7474509 7248940 7358085 7376839 7583746
11304 7583746 7841703 8107576 7774900 7962844 8301818 8383241 8209706 7984965 7940723 8042602
11294 8042602 7964774 8198920 8566764 8159014 7910141 7959820 7702336 8192537 8147959 8616768
11284H616768O2411p7159K76429M36150l07006l10178n10518M18944N97651J60768
11274I364260J61563k68721J79156k5177L68048k12911M212k32851r6168L81815
11264I623226J71820J12849K3429j6839j15645p8960J03075P5688M02556j78118
11254A0123081J39544n3611j4455K60909r9593J76504k41817R6389L66213k20789
11244A0532375L26328K45777k5503J65791j51241J46116O7733l4063M36808K27986
11234A1938107J26065j7595k35984J03054K66779R4605N8781j91218k38890j5991
11224A1887713K47743L07378J3883K64716J73850N1629J15206J47160M02560L02669
11214A3914507j46538j26495O4480m08894J63009M3010K38167M55380K24762q0890
$$ plain form
11284 8616768 8679179 8602020 8878449 9314599 9007593 8697415 8186897 8605841 9203492 9364260
11274 9364260 9525823 9257102 9436258 9411081 9779129 9566218 9570430 9337579 9241411 9623226
11264 9623226 9795046 9907895 9931324 9914485 9798840 9719880 9822955 9898643 10301199 10123081
11254 10123081 10262625 10209014 10194559 10455468 10355875 10532379 10290562 10386951 10753164 10532375
11244 10532375 10858703 11104480 11078977 11244768 11093527 11239643 11307376 11273313 11710121 11938107
11234 11938107 12064172 12046577 11810593 11913647 12180426 12275031 12333812 12142594 11903704 11887713
11224 11887713 12135456 12442834 12456717 12721433 12895283 12946912 13062118 13209278 13611838 13914507
11214 13914507 13767969 13641474 13705954 13297060 13460069 13503079 13741246 14196626 14421388 14340498
11204A4340498l72841O2875L87327O7209j66213J0374M76955J13502K2336J73934
11194A5115956J30112J94950L21534L851L55746J53259j13354j03017J97080J96326
11184A6452443L7756m9292J78086J53716k06279J12814M86943K26029q0867P3925
11174A7385274J1068M44390L06728j01719k55607L20251Q39974r8954J91244P9241
11164A9121890J13184J27255P4582L04271K32456j09334k03527N49181K8593O13081
11154B0851632j397m06236L71467O24332m5560n5070P20091M02253k09937K37422
11144B2488997L50437j94767K04382N02519j30568K54327J03936P786O9495M79325
11134B4135869n554J30614N23074J95947J92493N99633K31324M65641j98206J93457
$$ plain form
11204 14340498 13967657 14030532 14417859 14485068 14318855 14329229 14806184 14919686 14942022 15115956
11194 15115956 15246068 15441018 15762552 15766403 16122149 16275408 16162054 16059037 16256117 16452443
11184 16452443 16490199 16440907 16618993 16772709 16566430 16679244 17166187 17392216 17311349 17385274
11174 17385274 17396342 17840732 18147460 18045741 17790134 18110385 18950359 18851405 19042649 19121890
11164 19121890 19235074 19362329 19436911 19741182 19973638 19864304 19660777 20209958 20238551 20851632
11154 20851632 20850235 20443999 20815466 21439798 21394238 21339168 22059259 22461512 22251575 22488997
11144 22488997 22839434 22644667 22849049 23351568 23221000 23475327 23579263 23587049 23656544 24135869
11134 24135869 24130315 24260929 24784003 24979950 25172443 25772076 26003400 26469041 26270835 26464292
11124B6464292J6692M40446M21504r0065q8861M26735M36052M95901K70240j94548
11114B8598388J15752j4883O31163O65456L7935R4364J73645L36415K46132K8377
11104C0912744L73067J83749L23281P49781R1811L54356M54573J55660M50108
11095C4049130O7352L59529M30513L70766L56143N50870M3591O2408M28057N56350
11085C7274709M76260O56121R4146M49351N91681N3393J09088O02342N00242N03140
11075D1310473L33678L76957R0138M38210K74627J82457N95385P38577J93104
11066D4533606O28049O71511L52626N15981O26583N35873K49664P94491M64866
11057D9373250N34042K12031J43755Q80514J010966P24244K09600N98407L74265
$$ plain form
11124 26464292 26480984 26921430 27342934 27252869 27164008 27590743 28026795 28522696 28792936 28598388
11114 28598388 28714140 28699257 29330420 29995876 30033811 30128175 30301820 30638235 30884367 30912744
11104 30912744 31285811 31469560 31792841 32542622 32634433 32988789 33443362 33599022 34049130
11095 34049130 34116482 34476011 34906524 35277290 35633433 36184303 36227894 36290302 36718359 37274709
11085 37274709 37750969 38407090 38501236 38950587 39542268 39595661 39704749 40307091 40807333 41310473
11075 41310473 41644151 42021108 42111246 42549456 42824083 43006540 43601925 44340502 44533606
11066 44533606 45161655 45833166 46185792 46701773 47328356 47864229 48113893 48908384 49373250
11057 49373250 49907292 50119323 50263078 51143592 52154558 52878802 53088402 53686809 54061074
11048E4061074L87820Q45259J365585K55245L73377P66117Q97721O72015M48478
11039F0072691J041329K93162J303615R90667L27544N91104P11893O35812P31254
11030F6699071Q81594P43360J231139J045269O29380L94957J174030J365001Q97072
11021G5060873R47977O28393J100569R16573N79941J384035J050513J356408J098211
11012H4123493J110040J408046R92969J249791J005441R02055J376960J669847
11004I3838642J285806J039942J302196J096247J176915J390165J427417J692828
10996A04250158J542029J357159J742193J966357J264468J224159J721724J800508
10988A16868755J727734J669331J496077K083587K153294J282068J876227K494603
$$ plain form
11048 54061074 54448894 55294153 56659738 56914983 57288360 58054477 58952198 59624213 60072691
11039 60072691 61114020 61407182 62710797 63701464 64029008 64620112 65332005 65967817 66699071
11030 66699071 67580665 68324025 69555164 70600433 71229813 71624770 72798800 74163801 75060873
11021 75060873 76008850 76637243 77737812 78654385 79234326 80618361 81668874 83025282 84123493
11012 84123493 85233533 86641579 87634548 88884339 89889780 90791835 92168795 93838642
11004 93838642 95124448 96164390 97466586 98562833 99739748 101129913 102557330 104250158
10996 104250158 105792187 107149346 108891539 110857896 112122364 113346523 115068247 116868755
10988 116868755 118596489 120265820 121761897 123845484 125998778 127280846 129157073 131651676
10980A31651676J938770J673816K266010J983566J892278K157797J941925K543660
10972A48049498K576875K077940K516368K166210K238666K673729K387643K587049
10964A67273978K578539K603283K607215K895113K773385K917353K928665L388126
10956A89965657L158381K845025L265953L153001K763119L827231L320612L367032
10948B15666011L591401L627732L678360L184258L628523L709544L556414L856205
10940B44498448M036412L851734M393366M150826L783715M359096L833045M784610
10932B77691252M024512M180394M431211M368407M794734M689660M770910M516249
10924C13467329M814687M879480M548722M748366M664848M602859M924973M320362
$$ plain form
10980 131651676 133590446 135264262 137530272 139513838 141406116 143563913 145505838 148049498
10972 148049498 150626373 152704313 155220681 157386891 159625557 162299286 164686929 167273978
10964 167273978 169852517 172455800 175063015 177958128 180731513 183648866 186577531 189965657
10956 189965657 193124038 195969063 199235016 202388017 205151136 208978367 212298979 215666011
10948 215666011 219257412 222885144 226563504 229747762 233376285 237085829 240642243 244498448
10940 244498448 248534860 252386594 256779960 260930786 264714501 269073597 272906642 277691252
10932 277691252 281715764 285896158 290327369 294695776 299490510 304180170 308951080 313467329
10924 313467329 318282016 323161496 327710218 332458584 337123432 341726291 346651264 350971626
10916C50971626N015735M702308M439744M448610M702557M892938M754292M320830
10908C88248640L951209M407649M534288M166828L911364L870815L751445L294301
10900D20136539L563335L519702L024763K658302K349668K653228K173147K200772
10892D42279456J750534J448323J400251J036350Q88589M35822K75427j80390
10884D49334362N5861r70518j242534j011089j426012j640459j507255k150717
10876D39441639k378411k532271k787736k924046l204211l697590l522907m110675
10868D14283792l709962l850753l710650m611083m700380m012540m471510m738759
10860C80478155n191580n081581n054706m625529m934951m954913m873179m666944
$$ plain form
10916 350971626 355987361 360689669 365129413 369578023 374280580 379173518 383927810 388248640
10908 388248640 392199849 396607498 401141786 405308614 409219978 413090793 416842238 420136539
10900 420136539 423699874 427219576 430244339 432902641 435252309 437905537 440078684 442279456
10892 442279456 444029990 445478313 446878564 447914914 448803503 449239325 449514752 449334362
10884 449334362 449390223 448419705 447177171 446166082 444740070 443099611 441592356 439441639
10876 439441639 437063228 434530957 431743221 428819175 425614964 421917374 418394467 414283792
10868 414283792 410573830 406723077 403012427 398401344 393700964 389688424 385216914 380478155
10860 380478155 375286575 370204994 365150288 360524759 355589808 350634895 345761716 341094772
10852C41094772n109544n014344n348259n179557m813349n112945m970635n060918
10844C00485221m696204m632991m771785m409550m424257m050849m650111m386608
10836B64462866m400653m264196m112115m852869m412643l690896m244899m092938
10828B30391657l187584l975373m093624l054442l268710l899720l491143l024659
10820B02396402l621009l334302l538729l046458k862603l025499l308506k812695
10812A76846601k655546l638311k451803k385752k512625k753512k795281k588241
10804A55065530k536517j971667k190753k226920k361498k092571k035866k435740
10796A37213998j763491k131698k335893j834899k109644j934445j732511j629794
$$ plain form
10852 341094772 335985228 330970884 325622625 320443068 315629719 310516774 305546139 300485221
10844 300485221 295789017 291156026 286384241 281974691 277550434 273499585 268849474 264462866
10836 264462866 260062213 255798017 251685902 246833033 242420390 238729494 234484595 230391657
10828 230391657 227204073 223228700 219135076 216080634 212811924 208912204 205421061 202396402
10820 202396402 198775393 195441091 191902362 188855904 185993301 182967802 179659296 176846601
10812 176846601 174191055 170552744 168100941 165715189 163202564 160449052 157653771 155065530
10804 155065530 152529013 150557346 148366593 146139673 143778175 141685604 139649738 137213998
10796 137213998 135450507 133318809 130982916 129148017 127038373 125103928 123371417 121741623
10788A21741623k071143j681646j822681j846426j844959j285922j189629j283837
10780A08715380j730859k064776j331741j627207j244230j305427j276181j412331
10772I6722628j560659j242636o62800j436433j169950j606169j246772j260710
10764H6536499j195211q55925j086864r87051p34760j272667j150549p09122r45123
10755G7599227q36769j008800j777669m53521o45854q48724j065275q87166r63935
10746F9111514q70339q42753r16959m22869j134139q57037l78685m49037q01246
10737F2438450p17974r27213n99246m52837n90280j097831p51487l68934o70104
10728E6262544j58678j38637p48216q85638j203461o84513o22937o61583o62725
$$ plain form
10788 121741623 119670480 117988834 116166153 114319727 112474768 111188846 109999217 108715380
10780 108715380 106984521 104919745 103588004 101960797 100716567 99411140 98134959 96722628
10772 96722628 95161969 93919333 93256533 91820100 90650150 89043981 87797209 86536499
10764 86536499 85341288 84485363 83398499 82411448 81676688 80404021 79253472 78544350 77599227
10755 77599227 76762458 75753658 73975989 73522468 72876614 72027890 70962615 70075449 69111514
10746 69111514 68241175 67398422 66481463 66058594 64924455 64067418 63688733 63239696 62438450
10737 62438450 61720476 60793263 60194017 59741180 59150900 58053069 57301582 56932648 56262544
10728 56262544 56103866 55965229 55217013 54331375 53127914 52443401 51820464 51158881 50496156
10719E0496156n09869l37620o49172m40903p15239o90371l63578m03496k00121
10710D6185787n80529m07888n19410n44195j04017k48008r26027p4859q11925
10701D1968929m13821k15095m55961k60063k93497n64218p06238l28680l56465
10692C8374891l39734m38890k0864o45937l55397j83188l83646k03474n34975
10683C5268786o0529l15100n46229q25513L24938l10231l26869l31083j57566
10674C2720604k48193l40248l90291m22128R3619j32178m41262n44342n70558
10665B9725023K60471m36091l33858k1507m73767m23868l23013N6327k78211j31905
10655B7619601L295m71030J03975J05585o64174k82022k34712L54843m51574n65926
$$ plain form
10719 50496156 49986287 49648667 48999495 48558592 47843353 47152982 46789404 46385908 46185787
10710 46185787 45605258 45197370 44677960 44133765 44029748 43781740 42855713 42780854 41968929
10701 41968929 41555108 41340013 40884052 40623989 40330492 39766274 39060036 38731356 38374891
10692 38374891 38035157 37596267 37575403 36929466 36574069 36390881 36007235 35803761 35268786
10683 35268786 35208257 34893157 34346928 33521415 33846353 33536122 33209253 32878170 32720604
10674 32720604 32472411 32132163 31741872 31319744 31413363 31281185 30839923 30295581 29725023
10665 29725023 29985494 29549403 29215545 29194038 28720271 28296403 27973390 28029717 27751506 27619601
10655 27619601 27622896 27151866 27255841 27361426 26697252 26415230 26180518 26535361 26083787 25517861
10645B5517861k69316k98380R317J60619n17248k26841l75571l58068Q492j1332
10635B3639533j55667k72673L9162j10301m91901J84226k42043m08276j87500
10626B1994560k8741q6600J76397j41664p0752k21806j19027m05666j95300o9602
10616B0831799n76819j36113M9983J80221k00932k98199l1818l62533p2070K0609
10606A9404128l20389j60952l22123k4751K9211k85830J20639K79492l54870l24675
10596A8039880k86231n12829L76533k54841p3730k02956j52062k35186j76806
10587A6521772N6437J96384K04103n8865k00915k22737k39633j34937l75575K81459
10577A6027493J02344o77528n67291N4570R7456m9999l34048j91804J54736K43306
$$ plain form
10645 25517861 25248545 24950165 24959482 25120101 24602853 24376012 24000441 23642373 23650865 23639533
10635 23639533 23483866 23211193 23250355 23140054 22648153 22832379 22590336 22182060 21994560
10626 21994560 21965819 21879219 22055616 21913952 21843200 21621394 21502367 21096701 20901401 20831799
10616 20831799 20254980 20118867 20168850 20349071 20148139 19849940 19818122 19455589 19383519 19404128
10606 19404128 19083739 18922787 18600664 18575913 18605124 18319294 18439933 18719425 18364555 18039880
10596 18039880 17753649 17240820 17617353 17362512 17288782 17085826 16933764 16698578 16521772
10587 16521772 16578209 16774593 16978696 16919831 16718916 16496179 16256546 16121609 15746034 16027493
10577 16027493 16129837 15452309 14885018 14939588 15037044 14987045 14652997 14461193 14615929 14859235
10567A4859235J2300N2991j13842k47294n7691k97119r4656o7733K9571l07587
10557A3768175K62707K14579m81805m68449K56426j47825K79431p5729j32631
10548A3474879l8785L878k12079j90222O9550o6950m41646K34632k97777k77853
10538A2257627P9133K58491k96613l66727P5866P7857k20614j45471L7899k45467
10528A1511981o1833J56710J81132J431l16167R4041J97392l0213p60586j96340
10518A0777548L87260k4651l66513P3917M7850j26080j98008j36328K88251m81002
10508A0242244n9721J87741J16831k27443K10953q0906J63451j33538l37329J96578
10498A0278861K9659r8922m98055N126L73496M64417l81566m67344r5957k01558
$$ plain form
10567 14859235 14871535 14924526 14810684 14563390 14505699 14208580 14113924 14046191 14075762 13768175
10557 13768175 14030882 14245461 13763656 13295207 13551633 13403808 13683239 13607510 13474879
10548 13474879 13436094 13439972 13227893 13037671 13107221 13040271 12598625 12833257 12535480 12257627
10538 12257627 12336760 12595251 12298638 11931911 12007777 12085634 11865020 11719549 11757448 11511981
10528 11511981 11450148 11606858 11787990 11789421 11473254 11567295 11764687 11734474 10973888 10777548
10518 10777548 11164808 11140157 10773644 10847561 10895411 10769331 10571323 10434995 10723246 10242244
10508 10242244 10182523 10370264 10487095 10259652 10470605 10389699 10553150 10419612 10082283 10278861
10498 10278861 10308520 10209598 9711543 9716669 10090165 10554582 10173016 9705672 9609715 9408157
10488I408157L46089J93875m92788J98679M43982R7291o83165J05144J81887l14405
10478I484746p1994L9225L49633n24315L1489n4904n65403l56806m0398L26236
10468H617509L51311l54033K24359N2479j62178J88984J08596P7457o26875R7911
10458H575520l70075k57868P17825l13482m5494L4856L77051K44283k04267k16970
10448H541379j87557q158n5620p2396K65875K62160j46165n0483M47904j06280
10438H890659j93383j97486N0974M53722o83441m16844O06605k56687L8725p9877
10428H212967J11352k3210m95826M4148k23893L71400j14031j55365N90731k07862
10418H110411K5245k88671j70017l17723j84568J88786m7685N69989K00598m3689
$$ plain form
10488 9408157 9754246 9948121 9455333 9654012 10097994 10195285 9512120 9617264 9799151 9484746
10478 9484746 9412752 9451977 9801610 9277295 9308784 9253880 8688477 8331671 8291273 8617509
10468 8617509 8968820 8614787 8839146 8891625 8729447 8918431 9027027 9104484 8477609 8575520
10458 8575520 8205445 7947577 8665402 8351920 8306426 8341282 8718333 8962616 8758349 8541379
10448 8541379 8353822 8345664 8290044 8217648 8483523 8745683 8599518 8549035 8996939 8890659
10438 8890659 8697276 8499790 8550764 9004486 8321045 7904201 8510806 8254119 8292844 8212967
10428 8212967 8324319 8301109 7805283 7849431 7625538 7996938 7882907 7727542 8318273 8110411
10418 8110411 8135656 7846985 7676968 7359245 7174677 7363463 7315778 7885767 8086365 8042676
10408H042676o24994L0238j54929L02866j48753j45059O2862j0868o3957L88413
10398G678495K5751j91235O1065k35074M5286M3892R6607m09841L87049J07499
10388G609494j81441O271m05843Q4986K38806K86857Q0023L785M4936j24318K29743
10377G873299Q5989j94864L4504q5732K89116O0673m83750J41060R3381L9195
10367G852871o8705K54846k34050K34370j3220j43295k0809J51982J19768J93077
10357H326835l98508k62217L99167N3509J4939K02775J64067k31136j8903K57897
10347H508425N9522N90338l3092k0318j19704j2262L00732J05847J9029J14643
10337I513160K17612J58282N19208K06639L09882m87057N86839l892j11031j25770
$$ plain form
10408 8042676 7417682 7447920 7292991 7595857 7447104 7302045 7364907 7354039 7290082 7678495
10398 7678495 7704246 7513011 7574076 7339002 7384288 7428180 7524787 7114946 7501995 7609494
10388 7609494 7428053 7434324 7028481 7113467 7352273 7639130 7719153 7722938 7767874 7643556 7873299
10377 7873299 7959288 7764424 7798928 7713196 8002312 8062985 7579235 7720295 7813676 7852871
10367 7852871 7784166 8039012 7804962 8039332 8026112 7882817 7862008 8013990 8133758 8326835
10357 8326835 7928327 7666110 8065277 8118786 8133725 8336500 8500567 8269431 8250528 8508425
10347 8508425 8567947 9158285 9125193 9104875 8985171 8972909 9273641 9379488 9398517 9513160
10337 9513160 9730772 9889054 10408262 10614901 10924783 10437726 11024565 11020673 10909642 10783872
10327A0783872J66471l9069L98575L7441l29138L34256M3699M09656M17340p5378
10317A2147725l015q5748N33771L47628J1675Q9976j37134j97106J77801L1496
10307A2917069j71913N05983p1601J89795M86296j52432K223K2984K45379K21091
10297A4194874l9532j15530j32807O21808J40692k23039j31813j76872L47644
10288A4485425L50212J00349Q2618j10116K34459j57865J26225N25494L98705
10279A6035506N27883k27623o00098L37236j09885J84092J66699R7474N75813
10270A6987097K55593m16380j60558l20305J84349k10103o3494M61829j60024
10261A6558004L1627K01717k2335j55452m61949l14540J81615J68017J48347o8298
$$ plain form
10327 10783872 10950343 10911274 11309849 11347290 11018152 11352408 11396107 11805763 12223103 12147725
10317 12147725 12144710 12058962 12592733 12940361 12952036 13042012 12904878 12707772 12885573 12917069
10307 12917069 12745156 13251139 13179538 13369333 13855629 13703197 13705420 13728404 13973783 14194874
10297 14194874 14155342 14039812 13907005 14528813 14669505 14446466 14314653 14137781 14485425
10288 14485425 14835637 14935986 15018604 14908488 15142947 14985082 15111307 15636801 16035506
10279 16035506 16563389 16335766 15735668 16072904 15963019 16147111 16313810 16411284 16987097
10270 16987097 17242690 16826310 16665752 16345447 16529796 16319693 16256199 16718028 16558004
10261 16558004 16589631 16791348 16769013 16613561 16151612 15837072 16018687 16186704 16335051 16266753
10251A6266753p387k22031J01945j45263l13171k4697n90713k45839n2105J74425
10241A4941917O76r7588M02273k10710k86606n6118k11333j83607L26557l90796
10231A4234665O4587m23402j15511j04399p5041J94021n32872J94804l04747m00733
10221A2731372j88479j41032j31276J00377K13074j53294j75364j45195m0774
10212A2069409m27714M3165j99230l96874o9339j88635m62579K05233k71133o7050
10202A0235253r3713j20826k65013l47366j28292j49780K17745p94407J969j45992
10192H409578p2820N11341j43520m82749k82348n03589P2081l45515l09305J3690
10182F866844J97500n3188n80551j99599k48086K97038J07752q12849Q2889L19486
$$ plain form
10251 16266753 16259366 16037335 16139280 15994017 15680846 15656149 15065436 14819597 14767492 14941917
10241 14941917 14942593 14845005 15247278 15036568 14749962 14693844 14482511 14298904 14625461 14234665
10231 14234665 14299252 13875850 13760339 13655940 13580899 13774920 13242048 13436852 13132105 12731372
10221 12731372 12542893 12401861 12270585 12370962 12584036 12430742 12255378 12110183 12069409
10212 12069409 11641695 11684860 11485630 11088756 11019417 10830782 10368203 10573436 10302303 10235253
10202 10235253 10141540 10020714 9755701 9408335 9280043 9130263 9348008 8553601 8555570 8409578
10192 8409578 8336758 8848099 8704579 8221830 7939482 7435893 7507974 7162459 6853154 6866844
10182 6866844 7064344 7011156 6430605 6231006 5982920 6279958 6387710 5574861 5657750 5977236
10172E977236j20290n31650K7534j3132q1428J8720j55314J82880N0015N442O9414
10161E429427j02151n56113K5518j42189J37544Q234L7840k59268q8587o3684
10151D426571O8197q5586N40735j20923m22650J65216n4638j23822j22135j23271
10141D147694q0724l14596J64303K56503j21522J53045k42913J20293j07312r7024
10131C877747J58436k53481M36815k4001j76722K86403j1899l86806k55181J19096
10121C770407j09412J0792n10952M34532L80129n8733k90604J16299m19q5337
10111C656702K53453K94121j53930j79519k58895N61759R000n71199J51566L58906
10101D121964O2703m41029j19926J62001k5426K82075m10425L89360L38848l49274
$$ plain form
10172 5977236 5856946 5325296 5352830 5339698 5258270 5276990 5121676 5304556 5354571 5360013 5429427
10161 5429427 5327276 4771163 4796681 4654492 4792036 4800270 4838110 4578842 4490255 4426571
10151 4426571 4494768 4409182 4949917 4828994 4406344 4571560 4516922 4393100 4270965 4147694
10141 4147694 4066970 3752374 3916677 4173180 4051658 4204703 3961790 4082083 3974771 3877747
10131 3877747 4036183 3782702 4219517 4195516 4018794 4305197 4293298 3906492 3651311 3770407
10121 3770407 3660995 3671787 3160835 3595367 3975496 3916763 3626159 3742458 3742039 3656702
10111 3656702 3910155 4204276 4050346 3870827 3611932 4173691 4182691 3611492 3763058 4121964
10101 4121964 4184667 3743638 3623712 3785713 3760287 4042362 3631937 4021297 4360145 4010871
10091D010871j9911m00327J36137J06705p1639k88770N32270K42317k15848k01068
10081C830737K3973k6657J81101k05126j70032K70837K87189M10132k90186m97389
10071C814579L61552J5067Q0645M26152l35009J62390J99490j7695J12560j98125
10061D621606M2731K48517k40521q9583J74860M29521L57857N9633J03631j85600
10051E522652k40033o6713k40777O39021L54857j23737P024K76731n67723N7211
10041E618513L18267k10576K90845J15113L04367r5318K95658J58267J84894J05055
10031G085085N821M15095J80261j81851P3190j25033m93932N00771N23097K03950
10021H186454j41576j16915J46631K74107r738j2743J89967l06247p7925j37843
$$ plain form
10091 4010871 3990960 3590633 3726770 3833475 3761836 3473066 4005336 4247653 4031805 3830737
10081 3830737 3854710 3828053 4009154 3804028 3633996 3904833 4192022 4602154 4311968 3814579
10071 3814579 4176131 4191198 4271843 4697995 4362986 4525376 4724866 4707171 4819731 4621606
10061 4621606 4664337 4912854 4672333 4582750 4757610 5187131 5544988 5604621 5708252 5522652
10051 5522652 5282619 5215906 4975129 5614150 5969007 5845270 5852294 6129025 5561302 5618513
10041 5618513 5936780 5726204 6017049 6132162 6436529 6341211 6636869 6795136 6980030 7085085
10031 7085085 7090906 7506001 7686262 7504411 7577601 7452568 6958636 7459407 7982504 8186454
10021 8186454 8044878 7927963 8074594 8348701 8338963 8326220 8516187 8209940 8132015 7994172
10011G994172k53251L41320M98995k50161N5500J49827j18075j56872L99988M4468
10001H705911q2539q1204L51298J10346J29134k99668K97138L36165J41916L32739
9991I941236r4593J50304j24515J01476M08426j40928O6491J83688M5357J82421
9981A0719363J89335J39952l5963J36078J2794Q0315L85547j56604L8848j36036
9971A1373629m7074K03127j96256M18971K18893R8183j79608L51580l64183J20198
9961A1997460K57920j11278j6479n21563k73105J85237L50655m28732L21981l0704
9951A1731392n44714J48993J47337Q0110Q3844j68467P0563q4104L32014o5838
9941A1731130j10899K9723J00623K24918J34832k79010n10973M7759J66520O398
$$ plain form
10011 7994172 7740921 8082241 8581236 8331075 8386575 8536402 8418327 8261455 8661443 8705911
10001 8705911 8623372 8542168 8893466 9003812 9132946 8833278 9130416 9466581 9608497 9941236
9991 9941236 9846643 9996947 9872432 9973908 10382334 10241406 10307897 10491585 10536942 10719363
9981 10719363 10908698 11048650 11012687 11148765 11161559 11241874 11627421 11470817 11509665 11373629
9971 11373629 11326555 11529682 11333426 11752397 11971290 12069473 11889865 12241445 11877262 11997460
9961 11997460 12255380 12144102 12127623 11606060 11332955 11518192 11868847 11440115 11762096 11731392
9951 11731392 11186678 11335671 11483008 11563118 11646962 11478495 11549058 11464954 11796968 11731130
9941 11731130 11620231 11649954 11750577 11975495 12110327 11831317 11320344 11368103 11534623 11541021
9931A1541021r1881J22206o2244K74036k00766m94397L58293J30337m90345K82953
9921A1369213k43969K12270K81490j24601m83567J23243K16084k92676O7748L53497
9911A1478732n30154J36536M721j83583j09943l61168k07966j69000M7869l0443
9901A0075601j22291k96398l8550m3724m86497k31203L25267p9313J01803o29053
9891H575642J87531J52460p7967k36699k69720J43505m09461j04409k34966n96174
9881G129742j56025K16880J90265P6437k6204m58191j66725M2843l33248L1146
9871F546920l83516j75431M97398l7810j47697q3263N77361J07628m72327j46964
9861F282299l22674K73434p8396k18251k48508R4289m4324r0124K565J64369m55070
$$ plain form
9931 11541021 11449140 11571346 11509102 11783138 11582372 11087975 11446268 11576605 11086260 11369213
9921 11369213 11125244 11337514 11619004 11494403 11010836 11134079 11350163 11057487 11125235 11478732
9911 11478732 10948578 11085114 11089835 10906252 10796309 10435141 10227175 10058175 10106044 10075601
9901 10075601 9953310 9656912 9618362 9574638 9088141 8856938 9182205 9102892 9204695 8575642
9891 8575642 8763173 8915633 8837666 8600967 8331247 8474752 8065291 7960882 7725916 7129742
9881 7129742 6973717 7190597 7380862 7457299 7431095 6972904 6806179 6849022 6515774 6546920
9871 6546920 6163404 5987973 6485371 6447561 6299864 6216601 6793962 6901590 6429263 6282299
9861 6282299 5959625 6233059 6154663 5936412 5687904 5782193 5737869 5647745 5650310 5814679 5359609
9850E359609k70537j24185k06599J19427K8324j0880j05934r6228j58939q3907
9840D450151k37151n5524j39205K00006k60544J0036J75395m25526l01578q565
9830C407495l64866k9504M01146p8212L7471k00206J47811K78152m4372m64171
9820C090744j24840J85571k12864k51018j35762L81426k85890k66330J89598J0772
9810B581407j6294l67825o7041k3160k32663k22727L24317K39339K61906J94413
9800B671672j87300o48248j67777N71252k70027N7624p4720k17376L09835j10573
9790A934362k27544N19243K33705N317n14089m15778J46638N03601m49111k46898
9780A489446j37237k2685K46915k75350k37000J62068K57814j59857K60962K29619
$$ plain form
9850 5359609 5089072 4964887 4758288 4877715 4906039 4895159 4789225 4692997 4534058 4450151
9840 4450151 4213000 4157476 4018271 4218277 3957733 3967769 4143164 3717638 3416060 3407495
9830 3407495 3042629 3013125 3414271 3336059 3373530 3173324 3321135 3599287 3554915 3090744
9820 3090744 2965904 3151475 2938611 2687593 2551831 2933257 2647367 2381037 2570635 2581407
9810 2581407 2565113 2197288 2130247 2107087 1874424 1651697 1976014 2215353 2477259 2671672
9800 2671672 2484372 1836124 1668347 2239599 1969572 2027196 1952476 1735100 2044935 1934362
9790 1934362 1706818 2226061 2459766 2465083 1950994 1535216 1681854 2185455 1736344 1489446
9780 1489446 1352209 1329524 1576439 1301089 1064089 1226157 1483971 1324114 1585076 1814695
9770A814695k3972l52955O3695J99669k61929k49367L13463N18372J48548k04031
9760A966188n19138J14435K75822J88295l79067m29171M67705K45001q4367M7170
9750A892873m68561m17562j20805O49189l81232O9495L51885L0623l24569l80427
9740I00909K46240n7821J40228P4936j83024k07127O788m8905p3376J01316K74622
9729A174786J20995R532k52324j52118N9270N1422J73672R1036l04626J99328
9719A170973j27098j76272L42981L00550o19162k43952M05918N5593J85189l413
9709A291307j89531N0886K49063O8664p79j04460M3060m90467j78292K11503j20445
9698H30509J68899k32590K91330J389l39893J97339r3288l0217M05496j19945
$$ plain form
9770 1814695 1790723 1437768 1501463 1701132 1439203 1189836 1503299 2021671 2170219 1966188
9760 1966188 1447050 1561485 1837307 2025602 1646535 1217364 1685069 1930070 1845703 1892873
9750 1892873 1424312 1006750 885945 1535134 1153902 1223397 1575282 1605905 1281336 900909
9740 900909 1147149 1089328 1229556 1304492 1121468 914341 921129 872224 798848 900164 1174786
9729 1174786 1295781 1305313 1052989 900871 960141 1011563 1185235 1276271 971645 1170973
9719 1170973 1043875 867603 1210584 1511134 891972 648020 1053938 1109531 1294720 1291307
9709 1291307 1101776 1152662 1401725 1470389 1469610 1365150 1408210 917743 739451 950954 830509
9698 830509 999408 766818 1058148 1059537 719644 916983 823695 793478 1198974 1079029
9688A079029j43851l7803j90286J67260j89844k44768J00997K17575J26955k00693
9678F84571j03712K75930J47743q1527m20069k3723L14868N6903o8939k43142
9668E38903P2959k57932N20649l8576K24597Q9991J1062l86536K10323j28616
9658H56824L60548P9053m47165J45998j3410j3094p3361p1851P6368j72127P9331
9647H07114J25132L26627M1311l27394j22860j8702k849R7402M3144Q4078k38427
9636H14576k70486L95722l44640r4834J88077N3860L5492k18365J00809J64811
9626H25022j70082L58692R2596L59603n28929l12284p3305K79968N968j07815
9616G29434J50084K72320n15060L3712M15096k63363m73760J74503J5499K0895
$$ plain form
9688 1079029 935178 897375 707089 874349 684505 439737 540734 758309 885264 684571
9678 684571 580859 856789 1004532 923005 502936 479213 794081 850984 782045 538903
9668 538903 611862 353930 874579 836003 1060600 1150591 1161653 775117 985440 856824
9658 856824 1217372 1296425 849260 995258 981848 968754 895393 823542 899910 727783 807114
9647 807114 932246 1258873 1300184 972790 849930 831228 828379 925781 968925 1053003 814576
9636 814576 544090 939812 595172 500338 688415 742275 777767 559402 660211 825022
9626 825022 654940 1013632 1106228 1465831 936902 624618 551313 831281 837249 729434
9616 729434 879518 1151838 636778 670490 1085586 822223 348463 522966 538465 559360
9606E59360L08296q5888j62587j61111Q0652J63261J50937P8581j71766P4068
9596H33803r6781J45914j45240k05536N22504o3929N14346j13238q15170J63286
9586G39959k45050M63459j06690l7964j60318j34610N5764k35398m91658L4884
9576a17622P37588J11417j86504n07j69702m3933j6140J51478P18123k10554l47002
9565F26642k22164K80990J16300j86330j72779J46905J52510j90545k23398p766
9555C20365j5835k66574J72944J30589L22554J96001l09994M43081k41408J2603
9545G64326J91949j94623p9110L81150j78535m38870j85952K04420L37362j19751
9535F82366l09948L77336N65671o37780n20943J95474J64015J08584j14147l1646
$$ plain form
9606 559360 867656 781768 619181 458070 538722 701983 852920 931501 759735 833803
9596 833803 737022 882936 737696 532160 1054664 990735 1505081 1391843 576673 739959
9586 739959 494909 958368 851678 813714 653396 518786 574550 339152 -152506 -117622
9576 -117622 619966 731383 544879 544372 374670 330737 314597 466075 1184198 973644 626642
9565 626642 404478 685468 801768 615438 442659 589564 742074 551529 328131 320365
9555 320365 304530 37956 210900 341489 664043 860044 550050 993131 751723 764326
9545 764326 956275 761652 682542 1063692 885157 446287 260335 464755 802117 682366
9535 682366 372418 749754 1315425 677645 156702 352176 516191 624775 510628 478982
9525D78982J58230n204o3073K30586P7258l86759J1903L63234l94896J53894K74967
9514H99122l27482L30375q7211n84911k77859M78542J81838l50062j57303j19575
9504a4526J03558K48943k04649K84063K02122K6033q0354j27578K60055J51830
9494H49497L4370j8810J95181l54562k70650M27870o3377O4068J49320R7877k18277
9483H92507r1838q5792J52857l17761r1776m7348l00969M21392J72983l5293o42902
9472B6060J49210J36708J37229l04619p3098p2212M60253L12360l12169n5400
9462D04322k53485r4920K39051r9343k39224M28532K94801j83683j61375K57476
9452E92152k4874n19137p5776P8473K23439J37633r5002r8788l81908K91020l5346
$$ plain form
9525 478982 637212 632008 568935 799521 876779 490020 501923 865157 470261 624155 899122
9514 899122 571640 902015 814804 229893 -47966 430576 612414 262352 105049 -14526
9504 -14526 89032 337975 133326 417389 619511 645544 565190 437612 697667 849497
9494 849497 883867 865057 1060238 705676 435026 862896 799519 863587 1012907 1110784 892507
9483 892507 800669 714877 867734 549973 458197 410849 109880 531272 704255 668962 26060
9472 26060 175270 311978 449207 144588 71490 -722 459531 771891 459722 404322
9462 404322 150837 55917 294968 195625 -43599 384933 679734 496051 334676 592152
9452 592152 567278 48141 -27635 50838 274277 411910 316908 218120 -163788 127232 91886
9441I1886K03904p5541K57753L22936k58096k97256j4538L64873K12936l24871
9431D83986j58342N02549K03576n1010n36460j98338K22337L31817o0154n92916
9421A47045j60714K65518j70070M5038j3574J67565J68167J86964j45524K60098
9411G50513j17477L0020L5819m02206J26147J28786J52511k43393k65771J90279
9401C85228N5749k81282N50838J93903j03188j3767j47641n36423K66410Q0058
9391D49885j29057N40928r9298K2064p8311j31233r5097m3742l94269J8413O54955
9380G15238k77567J04999L56092l37267l4201l14460j39315j21245M29745L42165
9370G24184l27006K61836k34083O1741J54927J27749l66756l44360l9961O32832
$$ plain form
9441 91886 295790 220249 478002 800938 542842 245586 231048 595921 808857 483986
9431 483986 325644 828193 1031769 980759 444299 245961 468298 800115 739961 147045
9421 147045 -13669 251849 81779 126817 113243 280808 448975 635939 490415 750513
9411 750513 633036 663056 698875 296669 422816 551602 704113 460720 194949 385228
9401 385228 440977 159695 710533 904436 801248 787481 639840 103417 369827 449885
9391 449885 320828 861756 762458 784522 706211 574978 479881 436139 41870 60283 715238
9380 715238 437671 542670 898762 561495 527294 212834 73519 -47726 382019 724184
9370 724184 397178 659014 424931 486672 641599 769348 402592 58232 18271 651103
9360F51103J36136k80429R0705k03274l74297K03774K69560K47799j64032o2377
9350E14668r4597l8193J99443Q5336j00318k32067J978P8200K37323j00732k65009
9339B86032p0702K08038Q614p0294k03779m9062J02758K15105j80257J93445k27249
9328B12649L92881K8371m1815L3156r8401m32069r8606J91469k76149M8821j03069
9317a42762J73425M44719l5183Q836J22159J9966J65864Q2127K10392l70753Q0044
9306G58834J89349P51j54020n6992l11211j03482n82070L6537M06402Q7372o4233
9295B07237R4166p5767l42336m3697J95758J04995K62867K2952j62198r909J79053
9284D33121L32042j68163M6572j26492o3466K17220J4796n9144l49802M3912J09222
$$ plain form
9360 651103 787239 506810 597515 394241 19944 223718 493278 741077 577045 514668
9350 514668 420071 381878 581321 666657 566339 334272 336250 414450 651773 551041 286032
9339 286032 215330 423368 431982 361688 157909 108847 211605 426710 246453 439898 212649
9328 212649 605530 633901 592086 625242 526841 94772 -3834 187635 -88514 -39693 -142762
9317 -142762 30663 475382 440199 449035 571194 591160 757024 839151 1049543 678790 758834
9306 758834 948183 948934 794914 737922 426711 323229 -258841 -222304 184098 271470 207237
9295 207237 301403 225636 -116700 -160397 35361 140356 403223 426175 263977 254068 433121
9284 433121 765163 597000 643572 517080 453614 670834 685630 626486 276684 320596 429818
9273D29818j30089q6784J65878j60462Q8469j9573k26117L52489N6303P9042l19646
9262B29328L07184j38340q1201M5606R3671J72260q6786j04989k45144J65861
9252C57450L7298r7579j50580K18398J63484k39276J5741m02880L46754O07683
9242H56493p7802m56743O6507M90352n27741j22234L01204J17363l85977l73718
9232a12296N71191j44668L35653L24887Q2804j55874M0207L9776n37046J14220
9222E58854k4733K5578k97665l32129K94986J72399K1276P8230k70321O25406
9212H51881J54550m29967K6680k64509J22072K09722N4922r1272n8262J22101
9202F97918p353j75235l209K95381L8325l33299K64580j43532m3918R5177l75771
$$ plain form
9273 429818 299729 212945 378823 218361 306830 287257 61140 413629 469932 548974 229328
9262 229328 536512 398172 316971 362577 456248 628508 541722 436733 191589 357450
9252 357450 394748 297169 146589 364987 528471 289195 304936 -97944 248810 856493
9242 856493 778691 321948 388455 878807 351066 228832 530036 647399 261422 -112296
9232 -112296 458895 314227 649880 974767 1057571 901697 941904 981680 444634 558854
9222 558854 534121 559699 262034 -70095 224891 397290 418566 496796 226475 851881
9212 851881 1006431 576464 603144 338635 460707 670429 725351 634079 575817 697918
9202 697918 690565 515330 512121 807502 845827 512528 777108 633576 589658 684835 309064
9191C09064J71404K99972K1191k80157J27439N1863k25521k31124n00077L50231
9181I4285L64609J98218k48783k60182J22538J68363J55337K4727P5820N157m9076
9170F51013n18258K68010j21006j73756K53466j3476k467j03360L28117j65394
9160D02889l57367J64406L25309k18920P963l35417L6129j27381J06790N21471
9150E25872K85863k14245p4904N51953j20807l50938k32114l9992j12589K37886
9140D55985L00115J09106n08096l67037M35440J8377k61708j79121O5282J36017
9130B04360J9773M41658k62398l71876m1786O64558N5804r1804j82401J11099
9120E46987j36493k56242M22385K48231j15802K4087K0290k23183q567q2002j37493
$$ plain form
9191 309064 480468 780440 801631 521474 648913 700776 475255 244131 -255946 94285
9181 94285 458894 657112 408329 148147 270685 439048 594385 619112 694932 700089 651013
9170 651013 132755 400765 279759 106003 359469 345993 343526 240166 568283 402889
9160 402889 45522 209928 535237 316317 324280 -11137 24992 -102389 4401 525872
9150 525872 811735 597490 522586 1074539 953732 602794 370680 330688 218099 455985
9140 455985 756100 865206 357110 -9927 425513 443890 182182 3061 68343 204360
9130 204360 224133 665791 403393 31517 -10269 654289 710093 618289 435888 546987
9120 546987 410494 154252 576637 824868 709066 733153 753443 530260 521693 439691 302198
9109C02198M33059N49446l90677J6435k19887o13677J68689L20506J96944m55893
9099C07143M94077j1936K14681k79857K84621k94582l36891J10476L16691L08295
9089A112718n08646l1672k70771L77539j19254J06832o0828L36693n91495J43228
9079D94344N38129L4927j18051j79979l63013K03300L0440K8545K67782p6296
9069H60128k99532j74758m096J600M22928n9279M04771k60834l93060l76358O58855
9058G80365M44874l45384j25413M0204k61756n8597M16373j12707M0652j07716
9048G10895j47558j14794O2492K43104R7930l06659k66168l15284L45991M34269
9038G44218J70990j49209p9658J24078j34993l65689j23151l538N79405K77088
$$ plain form
9109 302198 735257 1284703 894026 910461 690574 76897 245586 566092 763036 307143
9099 307143 801220 789284 1003965 724108 1008729 714147 377256 487732 804423 1112718
9089 1112718 604072 572400 301629 679168 559914 666746 605918 942611 351116 494344
9079 494344 1032473 1067400 949349 769370 406357 609657 640097 668642 936424 860128
9069 860128 560596 385838 381742 383342 806270 746991 1151762 890928 497868 121510 780365
9058 780365 1225239 879855 754442 794646 532890 474293 890666 777959 818611 710895
9048 710895 563337 448543 511035 754139 852069 545410 279242 -36042 309949 744218
9038 744218 915208 765999 686341 810419 675426 309737 186586 183048 762453 1039541
9028A039541J44939l64157J64593L04219n75347L12133L93107m49222k0341K86570
9018A236035m76172J30769L96075N9336j85540j59814K72295k41620K4555K46176
9008A302095k60342L04255J02992j95926k07050Q9272L02273q190l39134K32307
8998A322552n6444P0459j36536J93127O7510J29766K28310o36784J08709J75876
8988A466545N5325k83412o9568J12300r0348L45911R1140n00480J33554K37285
8978A498252J56406J80300k66690k67600J35920P5168j04776n829j90020j48988
8968A062143J36629K11178j9340k8524o8867Q5580j4390j41486K73327L49402
8958A845652j48794J31811j15665j72607J84858J9513m2248J19184Q1426M5426
$$ plain form
9028 1039541 1184480 820323 984916 1289135 713788 1025921 1419028 969806 949465 1236035
9018 1236035 759863 890632 1286707 1346043 1160503 1000689 1272984 1031364 1055919 1302095
9008 1302095 1041753 1346008 1449000 1253074 1046024 1135296 1437569 1429379 1090245 1322552
8998 1322552 1266108 1336567 1200031 1393158 1460668 1590434 1818744 1181960 1290669 1466545
8988 1466545 1521870 1238458 1168890 1281190 1190842 1536753 1627893 1127413 1260967 1498252
8978 1498252 1654658 1834958 1568268 1300668 1436588 1511756 1406980 1401151 1211131 1062143
8968 1062143 1198772 1409950 1390610 1362086 1293219 1378799 1364409 1222923 1496250 1845652
8958 1845652 1696858 1828669 1713004 1540397 1725255 1744768 1702520 1821704 1903130 1948556
8948A948556K30215J58009K93336M7242P1562K602l86918k89969N02520J79849
8938B757004k40274o5834M25565r0402r603l38296l64997M74528j27809L26947
8928B746829L81363K81147J13782m26372j26567M08484L47026l43275P5835O71095
8918D129347Q12l09025M67270N72320m21629j19666J43000L12073K44106l2441
8908D986167N91947q7599L76350L51534j47375J23365L42120L77791j5340K76397
8898G175357M56778K72460J77784K31053O76620J75818N10828N57848N5077P38245
8888A1027868O39860R15337P88509Q58776J308650J066734J230827J227732J585775
8879B0650068J406740P52909O51305Q30640N52576K51418l00841k41453J21759
$$ plain form
8948 1948556 2178771 2336780 2630116 2677358 2748920 2751522 2364604 2074635 2577155 2757004
8938 2757004 2516730 2450896 2876461 2786059 2776456 2438160 2073163 2547691 2419882 2746829
8928 2746829 3128192 3409339 3523121 3096749 2970182 3378666 3725692 3382417 3458252 4129347
8918 4129347 4130159 3821134 4288404 4860724 4439095 4319429 4462429 4774502 5018608 4986167
8908 4986167 5578114 5490515 5866865 6218399 6071024 6194389 6536509 6914300 6898960 7175357
8898 7175357 7632135 7904595 8082379 8313432 8990052 9165870 9676698 10234546 10289623 11027868
8888 11027868 11667728 12583065 13371574 14230350 15539000 16605734 17836561 19064293 20650068
8879 20650068 22056808 22809717 23461022 24291662 24844238 25095656 24794815 24553362 24675121
8870B4675121j75732q64301j164698j906138j387324L0138o41700j104287q94559
8861A6566520n51187p49000l31968m6992L72419k74971K7948K9887j97956J86950
8851A5031650P18214O60227M00816N14187J157563Q82353J139348J243841R72513
8842B2720712J532726R84216N59400O66067N58511Q32053J91373l20004l39469
8833B7385585m77573p30263j579522j650114j973969k039942j080298j223061
8825A6630843j245060j116695j152192j351289k61327j032070q94106j08539l19301
8816I150264p32284m10746o16404m89858K22424k12257n60244l31529L0488k71124
8806E778730j11641l98594J60753j96586o58411l6660k67009m40565J24166m9527
$$ plain form
8870 24675121 24499389 23635088 22470390 20564252 19176928 19207066 18565366 17461079 16566520
8861 16566520 16015333 15266333 14934365 14887373 15259792 14984821 15012769 15042656 14844700 15031650
8851 15031650 15749864 16410091 16810907 17325094 18482657 19365010 20504358 21748199 22720712
8842 22720712 24253438 25237654 25797054 26463121 27021632 27853685 28045058 27725054 27385585
8833 27385585 26908012 26177749 24598227 22948113 20974144 18934202 17853904 16630843
8825 16630843 15385783 14269088 13116896 11765607 11504280 10472210 9578104 9469565 9150264
8816 9150264 8417980 8007234 7390830 6900972 7123396 6911139 6350895 6019366 6049854 5778730
8806 5778730 5667089 5268495 5429248 5232662 4574251 4537591 4270582 3830017 3954183 3904656
8796C904656O29198n35888o03125j35708N4960p3985k60058J83872j8123R5753
8786C241552j13619o3518L34168k85127j17413k98807m12136J46022j17807k69662
8776B043653J38160J50386J13992J3580l8960j58247K93482j6338m0875k00891
8766B297942q0371J5409J9973M7992j66431M57316l09403l27565M43831l60162
8756B038531j9112N21622J47001j54378k56387j50429j89723J16354r1220J74286
8746B136545K2555p6099L03725L12486J77885o57248k47896m7646J74226R9084
8736B197617K58821k12228j29138K29752j76658p9062J8958K51874L3814k95622
8726B098128L33783M10410l36195l32402j74634k4665L15982q6191K59258M30764
$$ plain form
8796 3904656 4533854 3997966 3394841 3259133 3314093 3240108 2980050 3163922 3145799 3241552
8786 3241552 3127933 3064415 3398583 3113456 2996043 2697236 2285100 2431122 2313315 2043653
8776 2043653 2181813 2332199 2446191 2459771 2420811 2262564 2556046 2539708 2498833 2297942
8766 2297942 2217571 2232980 2252953 2300945 2134514 2591830 2282427 1954862 2398693 2038531
8756 2038531 2019419 2541041 2688042 2533664 2277277 2126848 1937125 2053479 1962259 2136545
8746 2136545 2159100 2083001 2386726 2699212 2877097 2219849 1971953 1924307 2098533 2197617
8736 2197617 2456438 2244210 2115072 2344824 2168166 2089104 2108062 2359936 2393750 2098128
8726 2098128 2431911 2842321 2506126 2173724 1999090 1974425 2290407 2204216 2463474 2894238
8716B894238L53464M02783m43133j49274M35991j53543k23282L62945q990j85307
8706C285892M24640M06058k22136m82283j73265L7437N3977O36570M62130j85139
8696D243881O610K33479p7657k40254J08194K07688K1944K20358M4776J15080
8686D884099J68061p2168N04779j4435j65111O63591J60499j43140K60543M32314
8676F679032M6663L60572K59746K60163P1381M86241L40838l4088L48525M62595
8666I281668O86797K44343O02527O89599K432M56057N2042L48126P94505Q78251
8656A4036347R44174P31266P72194N72034R05588J324001J693175K138260J866086
8647B4983125K284404J929362K306501K270534K490656K227877K159179K125134
$$ plain form
8716 2894238 3247702 3650485 3207352 3058078 3494069 3340526 3117244 3480189 3471199 3285892
8706 3285892 3710532 4116590 3894454 3412171 3238906 3276343 3330320 3966890 4429020 4243881
8696 4243881 4250491 4483970 4406313 4166059 4274253 4481941 4503885 4724243 4769019 4884099
8686 4884099 5052160 4979992 5484771 5470336 5305225 5968816 6129315 5986175 6246718 6679032
8676 6679032 6725695 7086267 7346013 7606176 7677557 8163798 8504636 8470548 8819073 9281668
8666 9281668 9968465 10212808 10815335 11504934 11507366 11963423 12015465 12363591 13158096 14036347
8656 14036347 14980521 15711787 16483981 17056015 17961603 19285604 20978779 23117039 24983125
8647 24983125 27267529 29196891 31503392 33773926 36264582 38492459 40651638 42776772
8639D2776772J736740J321322O41770K95831k43584m30344j178959j846730j393229
8630D1679589k381331k285585k523639k460784k375914k186901k370343k205336
8622B2889756j288221j941217j833351j301160r52966q81861r96025p64342j135989
8613A1794624q58828n57345n50928n16026q27706m89250l99155j18074k68823
8604G208489k19960k11905j84751m77122M97681o13451l70527l5866m27345k66135
8594D899108l42137K04771K57174j54092n39832r8845j55885j16430l8239j8379
8584C897214J71096l3670j73816m53310j7095J33368j19737n57755J84389j69154
8574B861530n41293K12353K23103K07312k55534J0137m59807k27911J55591k46589
$$ plain form
8639 42776772 44513512 45834834 46476604 46772435 46528851 46098507 44919548 43072818 41679589
8630 41679589 39298258 37012673 34489034 32028250 29652336 27465435 25095092 22889756
8622 22889756 21601535 19660318 17826967 16525807 15572841 14690980 13694955 12930613 11794624
8613 11794624 10935796 10378451 9827523 9311497 8483791 7994541 7595386 7477312 7208489
8604 7208489 6988529 6776624 6591873 6114751 6612432 5998981 5628454 5592588 5165243 4899108
8594 4899108 4556971 4761742 5018916 4864824 4324992 4226147 4070262 3953832 3915593 3897214
8584 3897214 4068310 4034640 3860824 3407514 3390419 3523787 3404050 2846295 3030684 2861530
8574 2861530 2320237 2532590 2755693 2963005 2707471 2717608 2257801 2029890 2185481 1938892
8564A938892M74623J58058n19600M2768j27130k13393K03048K57257J66193J32456
8554B513172j27348j87477L06462l42980o4010M50541j04096n17938K75405K19856
8544B421587j30506m29566N5156N12401j16713j56255Q8205m65467K92333j33871
8534A937304R1428L09861L24699m1105j52434l30276R6347K5803K56899K24993
8524B743519K88735k47835j34342k0551j08725K45965l3231K75268j09321q8328
8514B811154L0592J09251j39256K87207K48775J48081K40671K01582k27269j48328
8504C562460k21177N2344L32424R0919K5242J96023k4903j06321K96077O79884
8494D882972j10784M78090j14913M1061R2217K60754j4966O1741M07353L62307
$$ plain form
8564 1938892 2413515 2571573 2051973 2094741 1967611 1754218 1957266 2214523 2380716 2513172
8554 2513172 2385824 2198347 2504809 2161829 2097819 2548360 2444264 1926326 2201731 2421587
8544 2421587 2291081 1861515 1916671 2429072 2312359 2156104 2244309 1778842 2071175 1937304
8534 1937304 2028732 2338593 2663292 2622187 2469753 2139477 2235824 2261627 2518526 2743519
8524 2743519 3032254 2784419 2650077 2629526 2520801 2766766 2733535 3008803 2899482 2811154
8514 2811154 2841746 2950997 2811741 3098948 3347723 3495804 3736475 3938057 3710788 3562460
8504 3562460 3341283 3393627 3726051 3816970 3842212 4038235 4013332 3907011 4203088 4882972
8494 4882972 4772188 5250278 5135365 5176426 5268643 5529397 5514431 5576172 5983525 6345832
8484F345832j19724J08222K56936N87849J63058N43481K11811n9428K89683O04208
8474H931928N26632J36407L74308N00263Q11145O06966L71100Q41569J307098
8465A4407416O73487J193251R53968J525466J205053J312148J526904J416033
8457B4213726R46954J066884J166185L14957R2417N4016j21456m13914l08816
8448B7010953n89586j375458j064363j017927r89374j051321j048762j345041
8440A8529121q35848n24556n20778k67580m29204m36222n33004k17650l04597
8431A4459682K99483P1240m6666M82137P38423M27004R41003R43639N95095R06215
8421A9817255P61465N87104J183454O53402N54807j85769l9604m23537k64596
$$ plain form
8484 6345832 6226108 6334330 6591266 7179115 7342173 7885654 8097465 8038037 8327720 8931928
8474 8931928 9458560 9594967 9969275 10469538 11280683 11887649 12258749 13100318 14407416
8465 14407416 15080903 16274154 17228122 18753588 19958641 21270789 22797693 24213726
8457 24213726 25160680 26227564 27393749 27708706 27801123 27855139 27733683 27319769 27010953
8448 27010953 26421367 25045909 23981546 22963619 21974245 20922924 19874162 18529121
8440 18529121 17693273 17168717 16647939 16380359 15951155 15514933 14981929 14764279 14459682
8431 14459682 14759165 14830405 14783739 15265876 16004299 16431303 17372306 18315945 18911040 19817255
8421 19817255 20578720 21165824 22349278 23002680 23557487 23371718 23332114 22908577 22643981
8412B2643981j72311j079198p19286r15104j286823j013302j414688j046917r98453
8403A3997899j084360j021356q31436j062112r50943m44765o52770n90492n33708
8394F825957o8003m1816l22018o25802j60609k7384m96208l71078m8053j68118
8384D496868p76394j41214K50255q1316o1894p23229o1345n0849M96258j04091
8374C243049m20679o0734K99774j51677p8502l24565K21227l62787m57744Q9317
8364A996679j15357J35314O22011l07824l93019J17919j71996j57698m1735M8576
8354A732870J29601j94977k15231O9237p533m26576L59540J15819k51705k44962
8344A066083J77185k8915k00632J76405P6435n4378N4343K74170l36778n0855
$$ plain form
8412 22643981 22471670 21392472 20673186 19758082 18471259 17457957 16043269 14996352 13997899
8403 13997899 12913539 11892183 11060747 9998635 9047692 8602927 7950157 7359665 6825957
8394 6825957 6757954 6716138 6394120 5768318 5607709 5580325 5084117 4713039 4664986 4496868
8384 4496868 3720474 3579260 3829515 3748199 3686305 2963076 2901731 2850882 3347140 3243049
8374 3243049 2822370 2761636 3061410 2909733 2831231 2506666 2727893 2365106 1907362 1996679
8364 1996679 1881322 2016636 2638647 2330823 1937804 2055723 1883727 1726029 1684294 1732870
8354 1732870 1862471 1667494 1452263 1521500 1513967 1087391 1446931 1562750 1311045 1066083
8344 1066083 1243268 1214353 1013721 1190126 1266561 1212183 1266526 1540696 1203918 1153063
8334A153063j18919L51972j72142j84658m42463Q8322J74356J4582q8808K43963
8324A019268k11682l85414r5608O2622m3494O7472N83929k46124k87412k0392
8314D43165k2218j20602k42999L15032j27303k4347J30907J49176M93676Q5465
8304A079952k23326J13044k66985O22k30543k31960L38233J16539p7942k8425
8294E89209N61409m96695M0834K52119n37762J74542j01317K25647K44475m41408
8284E11053J07655R3302j75133J13947M0549k31736m4412L47452k7490o2364R7861
8273G70684k12174l20852j34277j66840K23964K43058k27573m21733L07180M48192
8263E09629j92119j13528J08722L9978K19016M00059n95539k83107K28860O1860
$$ plain form
8334 1153063 1034144 1386116 1213974 1029316 586853 675175 849531 864113 775305 1019268
8324 1019268 807586 422172 326564 389186 345692 413164 997093 750969 463557 443165
8314 443165 420947 300345 57346 372378 245075 220728 351635 500811 994487 1079952
8304 1079952 856626 969670 702685 703307 472764 240804 579037 695576 617634 589209
8294 589209 1150618 653923 694757 946876 409114 583656 482339 707986 952461 511053
8284 511053 618708 712010 536877 650824 691373 459637 415225 762677 735187 672823 770684
8273 770684 558510 237658 103381 -63459 160505 403563 175990 -245743 61437 509629
8263 509629 317510 203982 312704 352682 571698 971757 376218 93111 321971 383831
8253C83831o70404J13298N34565J40878j10809j63048N4682l87962p47K03482
8243I7766O2925k31264L03470M95359l90821l54935k94033N75871j95636l07241
8233b38539M8516k08868n4227J70197j51984K57647K90647p7167P4602q4210K83829
8222C10443m03057l09550J15889M1541q4559J23467J30677j15163o1133k77333
8212e28778K98910J04802j71692k97593Q4936O00583j24650k2439L00275j51890
8202I2464K74138j51086J16757n52606j12967J52200K97361k65930M14827j663247
8192a398089n527611L537801K629919O09479N2653l09870L03698j08529M78858
8183B68309q2245n808l32768j72129J89260J98850k24940N9279k29701k85401
$$ plain form
8253 383831 -286573 -173275 361290 502168 391359 228311 282993 -104969 -105716 97766
8243 97766 160691 -70573 232897 728256 337435 -17500 -311533 264338 68702 -238539
8233 -238539 -190023 -398891 -453118 -282921 -434905 -177258 113389 36222 110824 26614 310443
8222 310443 -92614 -402164 -286275 -244734 -329293 -205826 -75149 -190312 -251445 -528778
8212 -528778 -229868 -125066 -296758 -594351 -509415 91168 -33482 -55921 244354 92464
8202 92464 366602 215516 332273 -220333 -333300 -181100 116261 -149669 265158 -1398089
8192 -1398089 -6925700 -3387899 -757980 -148501 -95848 -405718 -102020 -210549 268309
8183 268309 186064 180256 -152512 -324641 -135381 63469 -161471 -102192 -331893 -617294
8173f17294K99261L33855k18906R2680L3514p270p2565K55044k54119J39170k17849
8162b34479K4831J02259J27840n5454K96027P4779p9353n23449O7831J16137l9576
8151a22607L7890p6156J44362k17592k71348j69371L49263K69211j3791j7837
8141h7976K14724k2873n75809N6994M08343J67091J2230k03085l3567j01830k7388
8130a93146k05679J45567j78220k21941J16095K22068L31794J73707j51191J39554
8120A78608J6470m49453k8879M09706j38459j08081K47620P8744K26097l3808
8110C98565k86012m59487j19894M93289L65375l32156j27342J40654m02924J87698
8100a42234K00526M86766q84757K92559K97781M4482J33142o00879J87578p1757
$$ plain form
8173 -617294 -318033 15822 -203084 -110404 -76890 -84160 -156725 98319 -155800 -16630 -234479
8162 -234479 -209648 -107389 20451 -35003 261024 335803 256450 -266999 -199168 -83031 -122607
8151 -122607 -84717 -160873 -16511 -234103 -505451 -674822 -325559 -56348 -70139 -87976
8141 -87976 126748 103875 -471934 -414940 -6597 160494 172724 -30361 -63928 -165758 -193146
8130 -193146 -398825 -253258 -431478 -653419 -537324 -315256 16538 190245 39054 178608
8120 178608 195078 -254375 -283254 126452 -12007 -120088 127532 206276 432373 398565
8110 398565 112553 -346934 -466828 26461 391836 59680 -67662 72992 -329932 -142234
8100 -142234 58292 545058 -339699 -47140 250641 295123 428265 -172614 14964 -56793
8090e6793o6078J90925k67168m11276O33975K61926l84208J02332N6316n10879
8080d50928M01259J96337l19991K2126K53681q9035l15011J5790M65428m9320
8070A30336K53808o0450p8353k55839K68260m5100l14502K34055n3834j9772J46530
8059B05139j16760k62841Q8793J00015j11199K63452n3989J72081j08688n5632
8049A20371j14923k1717j31764l8631M59526j41505J14074J71289m15004j72013
8039a70297o4625n01861L62627O0260k14509K65245o5102K67126Q6562j20446
8029i5020P0251o525j35668J22961k786Q4666N440M21788k00763j42776J76222
8018B97790l94187K8693j8811n64516m8943L53077J56115K32255m35699k5260
$$ plain form
8090 -56793 -122871 68054 -199114 -610390 23585 285511 -98697 3635 59951 -450928
8080 -450928 -49669 146668 -173323 -151197 102484 13449 -301562 -285772 179656 130336
8070 130336 384144 323694 245341 -10498 257762 212662 -101840 132215 78381 58609 205139
8059 205139 88379 -174462 -85669 14346 -96853 166599 112610 284691 176003 120371
8049 120371 5448 -16269 -148033 -186664 272862 131357 245431 416720 1716 -170297
8039 -170297 -234922 -736783 -374156 -313896 -528405 -263160 -328262 -61136 25426 -95020
8029 -95020 -24769 -31294 -166962 -44001 -46787 37879 43319 465107 264344 121568 297790
8018 297790 -96397 -67704 -86515 -651031 -699974 -346897 -190782 41473 -394226 -419486
8008d19486o1183K14831J62711k3075k20484m02140K53925P4315m538O25543J84644
$$ plain form
8008 -419486 -480669 -265838 -103127 -126202 -346686 -748826 -494901 -420586 -425124 200419 385063
$$ [...]
##END NTUPLES=NMR SPECTRUM
##END=
