##TITLE=1H_CA-9169x
 DMSO
 8 sc, 
 7.7.2023
##JCAMPDX= 6.0         $$ Bruker NMR JCAMP-DX V2.0
##DATA TYPE= NMR SPECTRUM
##DATA CLASS= NTUPLES
##ORIGIN= UXNMR, Bruker Analytische Messtechnik GmbH
##OWNER= root
$$ XWIN-NMR		Version 3.5
$$ Fri Jul  7 14:17:04 2023 Russian Standard Time (UT+4h)  she@DPX200
##.OBSERVE FREQUENCY= 200.13135
##.OBSERVE NUCLEUS= ^1H
##.ACQUISITION MODE= SIMULTANEOUS
##.ACQUISITION SCHEME= undefined
##.AVERAGES= 8
##.DIGITISER RES= 18
##SPECTROMETER/DATA SYSTEM= spect
##.PULSE SEQUENCE= zg30
##.SOLVENT NAME= DMSO
##.SHIFT REFERENCE= (INTERNAL, DMSO, 0, 15.7513)
##AUDIT TRAIL= $$ (NUMBER, WHEN, WHO, WHERE, WHAT)
$$ ##TITLE= Audit trail, XWIN-NMR		Version 3.5
$$ ##JCAMPDX= 5.01
$$ ##ORIGIN= Bruker BioSpin GmbH
$$ ##OWNER= she
$$ F:/spectra/data/she/nmr/H-F/1/pdata/1/auditp.txt
$$ ##AUDIT TRAIL=  $$ (NUMBER, WHEN, WHO, WHERE, WHAT)
(   1,<2023-07-07 14:15:55.10 +0400>,<she>,<DPX200>,
      <created by zg, POWCHK disabled, PULCHK disabled
       configuration hash MD5:
       00 E9 B6 7A A2 85 ED C7 34 08 36 98 17 FE 4E 26
       data hash MD5: 16K
       2E 56 EA 81 C6 3D 4A 2E AC EE 72 52 CF 4F 6A 06>)
(   2,<2023-07-07 14:15:57.45 +0400>,<she>,<DPX200>,
      <Start of raw data processing
       efp BC_mod = 2 LB = 0.24 FT_mod = 6 PKNL = 1 PHC0 = -20995.77 PHC1 = 15.45272 SI = 16K 
       data hash MD5: 16K
       8E 41 2C 64 FC 0F 08 06 59 87 30 ED 2B B4 0F 7C>)
(   3,<2023-07-07 14:16:13.85 +0400>,<she>,<DPX200>,
      <pk PHC0 = 9.093022 PHC1 = -13.6 
       data hash MD5: 16K
       4B 2B 17 81 81 49 E9 B1 9E 3B D5 9A F0 41 A4 38>)
(   4,<2023-07-07 14:16:17.17 +0400>,<she>,<DPX200>,
      <abs ABSG = 5 
       data hash MD5: 16K
       F2 D7 56 E9 01 D9 1A C4 F5 22 AB 61 46 F7 05 F1>)
$$ ##END=
$$ 
$$ hash MD5
$$ FE 09 97 25 4C B1 A5 1C 44 7E D5 DD 9C D9 71 D0
##$RELAX= 
##$RELAX= 
##$RELAX= 
##$RELAX= 
##$RELAX= 
##$RELAX= 
$$ Bruker specific parameters
$$ --------------------------
##$DU= <F:/spectra>
##$EXPNO= 1
##$NAME= <H-F>
##$PROCNO= 1
##$TYPE= <nmr>
##$USER= <she>
##$AMP= (0..31)
100 100 100 100 100 100 100 100 100 100 100 100 100 100 100 100 100 100 
100 100 100 100 100 100 100 100 100 100 100 100 100 100 
##$AQSEQ= 0
##$AQ_mod= 1
##$AUNM= <au_zg>
##$AUTOPOS= <>
##$BF1= 200.13
##$BF2= 200.13
##$BF3= 200.13
##$BF4= 200.13
##$BF5= 200.13
##$BF6= 200.13
##$BF7= 200.13
##$BF8= 200.13
##$BYTORDA= 1
##$CFDGTYP= 0
##$CFRGTYP= 5
##$CHEMSTR= <none>
##$CNST= (0..31)
1 1 145 1 1 1 1 1 1 1 1 1 1 1 1 1 1 1 1 1 1 1 1 1 1 1 1 1 1 1 1 1 
##$CPDPRG= <>
##$CPDPRG1= <>
##$CPDPRG2= <>
##$CPDPRG3= <>
##$CPDPRG4= <mlev>
##$CPDPRG5= <mlev>
##$CPDPRG6= <mlev>
##$CPDPRG7= <mlev>
##$CPDPRG8= <mlev>
##$CPDPRGB= <>
##$CPDPRGT= <>
##$D= (0..31)
0 1.2 0 0 0 0 0 0 0 0.06 0 0.03 0 0 0 0 0.0002 0 0 0 0 0 0 0 0 0 0 0 0 
0 0 0 
##$DATE= 1688724954
##$DBL= (0..7)
120 120 120 120 120 120 120 120 
##$DBP= (0..7)
150 150 150 150 150 150 150 150 
##$DBP07= 0
##$DBPNAM0= <>
##$DBPNAM1= <>
##$DBPNAM2= <>
##$DBPNAM3= <>
##$DBPNAM4= <>
##$DBPNAM5= <>
$$ [...]
##$SUBNAM3= <"">
##$SUBNAM4= <"">
##$SUBNAM5= <"">
##$SUBNAM6= <"">
##$SUBNAM7= <"">
##$SUBNAM8= <"">
##$SUBNAM9= <"">
##$SW= 18.05172834244
##$SWIBOX= (0..15)
0 0 2 0 0 0 0 0 0 0 0 0 0 0 0 0 
##$SW_h= 3612.71676300578
##$TD= 16384
##$TD0= 1
##$TE= 0
##$TE2= 300
##$TE3= 300
##$TEG= 300
##$TL= (0..7)
0 120 120 120 120 120 120 120 
##$TP= (0..7)
150 150 150 150 150 150 150 150 
##$TP07= 0
##$TPNAME0= <>
##$TPNAME1= <>
##$TPNAME2= <>
##$TPNAME3= <>
##$TPNAME4= <>
##$TPNAME5= <>
##$TPNAME6= <>
##$TPNAME7= <>
##$TPOAL= (0..7)
0.5 0.5 0.5 0.5 0.5 0.5 0.5 0.5 
##$TPOFFS= (0..7)
0 0 0 0 0 0 0 0 
##$TUNHIN= 0
##$TUNHOUT= 0
##$TUNXOUT= 0
##$USERA1= <user>
##$USERA2= <user>
##$USERA3= <user>
##$USERA4= <user>
##$USERA5= <user>
##$V9= 5
##$VALIST= <valist>
##$VCLIST= <CCCCCCCCCCCCCCC>
##$VD= 0
##$VDLIST= <DDDDDDDDDDDDDDD>
##$VPLIST= <PPPPPPPPPPPPPPP>
##$VTLIST= <TTTTTTTTTTTTTTT>
##$WBST= 1024
##$WBSW= 4
##$XGAIN= (0..3)
0 0 0 0 
##$XL= 0
##$YL= 0
##$YMAX_a= 175022
##$YMIN_a= -224010
##$ZGOPTNS= <>
##$ZL1= 120
##$ZL2= 120
##$ZL3= 120
##$ZL4= 120
##$ABSF1= 15.7568
##$ABSF2= -2.29505
##$ABSG= 5
##$ABSL= 3
##$ALPHA= 0
##$AQORDER= 0
##$ASSFAC= 0
##$ASSFACI= 0
##$ASSFACX= 0
##$ASSWID= 0
##$AUNMP= <proc_1d>
##$AZFE= 0.1
##$AZFW= 0.1
##$BCFW= 0
##$BC_mod= 2
##$BYTORDP= 0
##$COROFFS= 0
##$CY= -3
##$DATMOD= 1
##$DC= 0
##$DFILT= <>
##$DTYPP= 0
##$F1P= 0
##$F2P= 0
##$FCOR= 1
##$FTSIZE= 16384
##$FT_mod= 6
##$GAMMA= 0
##$GB= 0
##$INTBC= 1
##$INTSCL= 3.70164e-10
##$ISEN= 128
##$LB= 0.24
##$LEV0= 0
##$LPBIN= 0
##$MAXI= 10000
##$MC2= 0
##$MEAN= 0
##$ME_mod= 0
##$MI= 1.114404
##$NCOEF= 0
##$NC_proc= -9
##$NLEV= 6
##$NOISF1= 3.799351
##$NOISF2= 2.8
##$NSP= 0
##$NTH_PI= 0
##$NZP= 0
##$OFFSET= 15.7513
##$PC= 1
##$PHC0= -20986.68
##$PHC1= 1.852719
##$PH_mod= 1
##$PKNL= yes
##$PPARMOD= 0
##$PSCAL= 0
##$PSIGN= 0
##$REVERSE= no
##$SF= 200.130004050382
##$SI= 16384
##$SIGF1= 3
##$SIGF2= 2
##$SINO= 5.538805
##$SIOLD= 16384
##$SREGLST= <1H.CDCl3>
##$SSB= 0
##$STSI= 16384
##$STSR= 0
##$SW_p= 3612.71676300578
##$SYMM= 0
##$S_DEV= 0
##$TDeff= 16384
##$TDoff= 0
##$TI= <>
##$TILT= no
##$TM1= 0
##$TM2= 0
##$TOPLEV= 0
##$USERP1= <user>
##$USERP2= <user>
##$USERP3= <user>
##$USERP4= <user>
##$USERP5= <user>
##$WDW= 1
##$XDIM= 16384
##$YMAX_p= 506434132
##$YMIN_p= -2409095
$$ End of Bruker specific parameters
$$ ---------------------------------
##NTUPLES= NMR SPECTRUM
##VAR_NAME=  FREQUENCY,     SPECTRUM/REAL,   SPECTRUM/IMAG
##SYMBOL=    X,             R,               I
##VAR_TYPE=  INDEPENDENT,   DEPENDENT,       DEPENDENT
##VAR_FORM=  AFFN,          ASDF,            ASDF
##VAR_DIM=   16384,         16384,           16384
##UNITS=     HZ,            ARBITRARY UNITS, ARBITRARY UNITS
##FACTOR=    0.220516191357247, 1,           1
##FIRST=     3152.30770439899, 0,            0
##LAST=      -460.409058606794, 0,           0
##MIN=       -460.409058606794, -2409095,    0
##MAX=       3152.30770439899, 506434132,    0
$$ Real data points
##PAGE= N=1
##DATA TABLE= (X++(R..R)), XYDATA
$$ [...]
$$ plain form
8241 165622 -310903 51092 437455 -71834 443803 763979 -256260 -151828 -212246 428043
8231 428043 194516 -239484 -648365 96003 209013 -347332 -1117628 -1053080 -300793 147601
8221 147601 242566 137499 329080 -99480 -342602 -350182 -547640 -782717 -577402 -272951
8211 -272951 -255471 -275660 278920 453063 550504 -280689 -446621 -904326 -476312 390971
8201 390971 503102 548610 -486617 -767276 316762 1403238 405306 11829 -279004
8192 -279004 -787126 -798556 -593000 522464 984805 836438 741959 837118 108089 517531
8182 517531 -3521 -506981 -150043 -110773 199452 123687 469816 276841 -142868 -898639
8172 -898639 -328787 -647864 -96283 -93153 -256750 18287 878446 283485 71766 33205
$$ packed form
8241A65622m76525L61995L86363n09289N15637L20176j020239J04432o0418O40289
8231D28043k33527m34000m08881P44368J13010n56345p70296O4548P52287M48394
8221A47601R4965j05067J91581m28560k43122p580j97458k35077K05315L04451
8211b72951J7480k0189N54580J74143R7441q31193j65932m57705M28014Q67283
8201C90971J12131M5508j035227k80659J084038J086476r97932l93477k90833
8192b79004n08122j1430K05556J115464M62341j48367r4479R5159p29029M09442
8182E17531n21052n03460L56938L9270L10225p5765L46129j92975m19709p55771
8172h98639N69852l19077N51581L130j63597K75037Q60159n94961k11719l8561
$$ plain form
8162 33205 -658335 -582202 -1257966 -1080230 -133443 610665 576948 378315 533698 716706
8152 716706 272539 893310 560429 118427 252203 171146 -67923 -616951 -1044186 -727330
8142 -727330 -1098843 -596789 -341981 21303 20119 85471 -138583 -525041 -491588 42660
8132 42660 478653 375711 728460 590446 -173979 -188883 -477551 226298 1192066 857269
8122 857269 955209 -41439 31448 55871 -67286 343282 515421 440247 458737 824847 910736
8111 910736 927537 714467 138261 5379 -67426 -651716 -458329 79779 114192 -209777
8101 -209777 -24051 -225234 -568361 14246 222227 571835 344016 615197 119466 -662094
8091 -662094 -773503 -525029 87321 -306721 -248046 387519 84935 -266256 -377111 -698457
$$ packed form
8162C3205o91540P6133o75764J77736R46787P44108l3717j98633J55383J83008
8152G16706m44167O20771l32881m42002J33776q1057k39069n49028m27235L16856
8142g27330l71513N02054K54808L63284j184O5352k24054l86458L3453N34248
8132D2660M35993j02942L52749j38014p64425j4904k88668P03849R65768l34797
8122H57269R7940r96648P2887K4423j23157M10568J72139p5174J8490L66110Q5889
8111I10736J6801k13070n76206j32882p2805n84290J93387N38108L4413l23969
8101b09777J85726k01183l43127N82607K07981L49608k27819K71181m95731p81560
8091f62094j11409K48474O12350l94042N8675O35565l02584l51191j10855l21346
$$ plain form
8081 -698457 -511749 -555974 -94097 -14519 270714 166130 -561666 -57884 -83984 -365836
8071 -365836 -22794 371842 1001152 797576 647788 656629 1073956 446243 -48601 347730
8061 347730 -35623 27347 -225917 -366200 73413 354939 140176 -273703 -88857 -571666
8051 -571666 -1242611 -733476 -216725 -63591 -319860 -289760 211260 488169 -324745 19125
8041 19125 100916 121691 247856 425103 1571063 1103583 247208 333645 51336 308744
8031 308744 -705813 14244 234787 894240 1322922 -19167 564411 119550 -470645
8022 -470645 -193638 698595 -96866 31646 135120 -457724 -489500 -434835 761008 637005
8012 637005 761426 560644 725539 154057 -230504 -16442 206905 368801 520019 104227
$$ packed form
8081f98457J86708m4225M61877P9578K85233j04584p27796N03782k6100k81852
8071c65836L43042L94636O29310k03576j49788Q841M17327o27713m94844L96331
8061C47730l83353O2970k53264j40283M39613K81526k14763m13879J84846m82809
8051e71666o70945N09135N16751J53134k56269L0100N01020K76909q12914L43870
8041A9125Q1791K0775J26165J77247J145960m67480q56375Q6437k82309K57408
8031C08744j014557P20057K20543O59453M28682j342089N83578m44861n90195
8022d70645K77007Q92233p95461J28512J03474n92844l1776N4665J195843j24003
8012F37005J24421k00782J64895n71482l84561K14062K23347J61896J51218m15792
$$ plain form
8002 104227 -1053279 -1113700 -590232 -494944 -778620 -761495 -186901 -238710 -246682 -653556 -718677
7991 -718677 -366947 8589 579972 69984 188968 -623270 -175748 -442372 -67710 244207
7981 244207 188690 -176501 -719928 -722237 -861811 64894 1178579 773152 1463918 754233
7971 754233 79932 -308335 -509704 637292 739030 713326 553863 139192 -493104 -244107
7961 -244107 787689 82913 -1094738 -1597834 -732253 243519 -430040 -1167914 -1580781
7952 -1580781 -1353989 -958224 -836437 -665044 -1010373 117397 255485 -911244 -518721
7943 -518721 -530222 -551509 -425177 -275868 687771 1068936 -429830 -589866 -384809 -623344
7933 -623344 -24091 536904 -225008 -650089 -484538 -500082 -356825 -1191030 -1311960 -609988
$$ packed form
8002A04227j157506o0421N23468R5288k83676J7125N74594n1809p972m06874o5121
7991g18677L51730L75536N71383n09988J18984q12238M47522k66624L74662L11917
7981B44207n5517l65191n43427k309j39574R26705J113685m05427O90766p09685
7971G54233o74301l88267k01369J146996J01738k5704j59463m14671o32296K48997
7961b44107J031796p04776j177651n03096Q65581R75772o73559p37874m12867
7952a580781K26792L95765J21787J71393l45329J127770J38088j166729L92523
7943e18721j1501k1287J26332J49309R63639L81165j498766j60036K05057k38535
7933f23344N99253N60995p61912m25081J65551j5544J43257q34205j20930P01972
$$ plain form
7923 -609988 -675397 -378256 171008 -141388 -526526 -455810 -486095 88636 -264718 -518030
7913 -518030 -995290 -1230600 -1231532 -292419 458317 226227 178169 -112158 315914 -311674
7903 -311674 -264973 416251 -273508 -205128 -348705 -1564451 -1908720 -989955 -557124 -703970
7893 -703970 -890407 -349728 -464821 -371109 278360 -115876 -398333 -611991 31455 349376
7883 349376 913093 682531 476070 258456 573978 -41753 -264265 70946 -349488 -217944
7873 -217944 -359057 -398449 -298385 -144191 -411113 -12658 408700 519778 -502284 -706262
7863 -706262 -1010490 -1059482 -735771 -1093407 -830318 -737175 -1317685 -804434 -553692 206718
7853 206718 -438334 -212155 -332445 -478125 170818 105539 -445087 -896249 -304549 -516080
$$ packed form
7923f09988o5409K97141N49264l12396l85138P0716l0285N74731l53354k53312
7913e18030m77260k35310r32R39113P50736k32090m8058k90327M28072o27588
7903c11674M6701O81224o89759O8380j43577j215746l44269R18765M32831j46846
7893g03970j86437N40679j15093R3712O49469l94236k82457k13658O43446L17921
7883C49376N63717k30562k06461k17614L15522o15731k22512L35211m20434J31544
7873b17944j41113l9392J00064J54194k66922L98455M21358J11078j022062k03978
7863g06262l04228m8992L23711l57636K63089R3143n80510N13251K50742P60410
7853B06718o45052K26179j20290j45680O48943o5279n50626m51162N91700k11531
$$ plain form
7843 -516080 -419616 -1413 -71837 474984 -175932 499741 945609 -198677 -948727 -962893
7833 -962893 -831579 -448324 -227667 70906 703269 755245 322301 3432 -132546 -654957
7823 -654957 -947291 -966535 -773060 519309 408702 -530091 -311649 -1106565 -1471713 -295680
7813 -295680 2568670 929829 445869 -186313 43375 -3957 453394 -258411 -1372157
7804 -1372157 -888381 193978 -400007 -340658 -1588 -736937 -688833 -750048 215409 269332
7794 269332 -116089 -347364 -948177 -413565 -385727 -58870 456116 -807239 -1178923 -531457
7784 -531457 -286595 -310404 -53889 -227242 -244229 -263020 -228540 -648612 -63408 88474
7774 88474 688284 338637 28254 -254311 -477880 -661076 -1322845 -1571262 -454849 70499
$$ packed form
7843e16080R6464M18203p0424N46821o50916O75673M45868j144286p50050j4166
7833i62893J31314L83255K20657K98573O32363N1976m32944l18869j35978n22411
7823f54957k92334j9244J93475J292369j10607r38793K18442p94916l65148J176033
7813b95680K864350j638841m83960o32182K29688m7332M57351p11805j113746
7804a372157M83776J082359n93985N9349L39070p35349M8104o1215R65457N3923
7794B69332l85421k31275o00813N34612K7838L26857N14986j263355l71684O47466
7784e31457K44862k3809K56515j73353j6987j8791L4480m20072N85204J51882
7774H8474N99810l49647l10383k82565k23569j83196o61769k48417J116413N25348
$$ plain form
7764 70499 362463 34107 -522421 41458 -336789 367625 141571 189626 346205 -114463
7754 -114463 -65987 -191838 253271 288862 -185289 -541524 -213051 6127 332459 -89241
7744 -89241 270978 565455 504932 579879 -97882 -169155 390719 -219373 -584584 -173741
7734 -173741 -581909 -190620 249154 834037 533654 688661 201292 714018 1335587 -118897
7724 -118897 167183 944450 833747 313743 -20671 37649 413144 167277 215480 392204
7714 392204 -261253 -443495 68123 -452060 -1016611 -424931 -399784 -1251186 -837277 -461022
7704 -461022 -333003 -594716 -90847 174731 748990 893763 681059 285617 309524 180296
7694 180296 678023 711955 167815 705872 393383 780026 392117 -459313 -75186 452480
$$ packed form
7764G0499K91964l28356n56528N63879l78247P04414k26054M8055J56579m60668
7754a14463M8476j25851M45109L5591m74151l56235L28473K19178L26332m21700
7744h9241L60219K94477o0523P4947o77761p1273N59874o10092l65211M10843
7734a73741m08168L91289M39774N84883l00383J55007m87369N12726O21569j454484
7724a18897K86080P77267j10703n20004l34414N8320L75495k45867M8203J76724
7714C92204o53457j82242N11618n20183n64551N91680K5147q51402M13909L76255
7704d61022J28019k61713N03869K65578N74259J44773k12704l95442K3907j29228
7694A80296M97727L3932n44140N38057l12489L86643l87909q51430L84127N27666
$$ plain form
7684 452480 29591 87078 354974 349681 613511 263887 438544 -549998 -661354 -39926
7674 -39926 318185 142343 -146035 101152 230110 5322 -195791 833618 -60789 603596
7664 603596 40169 -485797 -712161 -1079324 -489250 40753 -515491 -711199 -448915 -354053
7654 -354053 81840 656237 189266 -370310 416012 195018 -41443 -178666 299323 840828
7644 840828 593275 461255 284029 376181 -274445 -141441 -175709 -1022221 -436821 -262290
7634 -262290 -486985 -214728 -119823 500054 509457 531372 768996 1203723 860756 52332
7624 52332 -132663 -452461 -292466 -115523 158389 182345 -45209 -510104 -586080 -984919
7614 -984919 -821601 132228 117909 -191843 -438919 -914827 -564511 -446478 117841 -360545
$$ packed form
7684D52480m22889N7487K67896n293K63830l49624J74657r88542j11356O21428
7674c9926L58111j75842k88378K47187J28958k24788k01113J029409q94407O64385
7664F03596n63427n25966k26364l67163N90074N30003n56244j95708K62284R4862
7654c54053M35893N74397m66971n59576P86322k20994k36461j37223M77989N41505
7644H40828k47553j32020j77226R2152o50626J33004l4268q46512N85400J74531
7634b62290k24695K72257R4905O19877R403K1915K37624M34727l42967q08424
7624E2332j84995l19798J59995J76943K73912K3956k27554m64895p5976l98839
7614i84919J63318R53829j4319l09752k47076m75908L50316J18033N64319m78386
$$ plain form
7604 -360545 -149812 -186302 143156 211474 938216 473240 -695560 -495147 -330447 -268833
7594 -268833 351412 813417 390897 1027893 605578 -203475 38798 -85078 265115 38086
7584 38086 -83202 845504 376860 617452 112206 365519 1253494 919587 165534 -315462
7574 -315462 -841459 -16666 -86886 110852 319704 -271667 -175364 284736 -245835 22205
7564 22205 -259900 444986 1440818 644610 515925 94891 527 235658 -284144 184544
7554 184544 303985 566769 403869 725009 1173431 830549 579363 620524 375411 -271274
7544 -271274 38728 -143766 -398686 -350414 -879177 -480064 -247532 -24003 442576 106716
7534 106716 11248 -289911 -165525 -228587 354259 7643 -55150 547652 144304 -113933
$$ packed form
7604c60545K10733l6490L29458O8318P26742m64976j168800K00413J64700O1614
7594b68833O20245M62005m22520O36996m22315q09053K42273j23876L50193k27029
7584C8086j21288R28706m68644K40592n05246K53313Q87975l33907p54053m80996
7574c15462n25997Q24793p0220J97738K08852n91371R6303M60100n30571K68040
7564B2205k82105P04886R95832p96208j28685m21034r4364K35131n19802M68688
7554A84544J19441K62784j62900L21140M48422l42882k51186M1161k45113o46685
7544b71274L10002j82494k54920M8272n28763L99113K32532K23529M66579l35860
7534A06716r5468l01159J24386o3062N82846l46616o2793O02802m03348k58237
$$ plain form
7524 -113933 -49807 -437398 -157879 197401 271004 -675748 -1075820 -226879 72154 -303024
7514 -303024 -712835 -420535 520630 -164997 -639545 -253897 68170 -403591 457194 316170
7504 316170 485627 769776 1005191 97009 -149836 371266 85253 770060 156691 336569
7494 336569 667791 -510065 -374435 414570 220717 -394510 -752668 -126795 -22461 172745
7484 172745 129226 665562 669907 -23603 -19941 -32238 344984 -250776 673404 765666 176298
7473 176298 -91480 -171138 18078 -209888 -581414 -572913 -282472 -8239 331137 -133611
7463 -133611 -465501 -951797 -571398 247742 -40679 714516 875596 -329705 34962 153252
7453 153252 426603 666941 1177489 766887 553582 301605 -498122 -610241 -750933 301472
$$ packed form
7524a13933O4126l87591K79519L55280P3603r46752m00072Q48941K99033l75178
7514c03024m09811K92300R41165o85627m74548L85648L22067m71761Q60785j41024
7504C16170J69457K84149K35415r08182k46845N21102k86013O84807o13369J79878
7494C36569L31222j177856J35630P89005j93853o15227l58158O25873J04334J95206
7484A72745m3519N36336M345o93510L662j2297L77222n95760R24180R2262n89368
7473A76298k67778p9658J89216k27966l71526Q501K90441K74233L39376m64748
7463a33611l31890m86296L80399Q19140k88421P55195J61080j205301L64667J18290
7453A53252K73351K40338N10548m10602k13305k51977p99727j12119j40692J052405
$$ plain form
7443 301472 472067 757896 526639 -373025 -191376 -462139 -515012 10720 176852 -549094
7433 -549094 244631 578150 616500 366190 456327 123391 656635 626590 83520 -993102
7423 -993102 -910977 -96317 308299 -625168 -852702 -972038 -1362420 31775 -345537 -1017054
7413 -1017054 -454870 -147138 891492 674052 620213 1369937 -104522 65684 578292
7404 578292 411809 152735 441547 159097 -107347 -587320 -795451 205055 793363 1113611
7394 1113611 733364 614145 -318507 -380583 6943 1269586 1655157 1057632 493915 296975
7384 296975 737416 -131264 752185 751345 671765 929454 85587 756723 1313120 1252545 1430735
7373 1430735 1228737 1731661 2057208 685721 834258 762552 1046708 652901 498043 353641
$$ packed form
7443C01472J70595K85829k31257q99664J81649k70763n2873N25732J66132p25946
7433e49094P93725L33519L8350k50310R0137l32936N33244l0045n43070j076622
7423i93102Q2125Q14660M04616r33467k27534j19336l90382J394195l77312o71517
7413a017054N62184L07732J038630k17440n3839P49724j474459J70206N12608
7404E78292j66483k59074K88812k82450k66444m79973k08131J000506N88308L20248
7394A113611l80247j19219r32652o2076L87526J262643L85571n97525n63717j96940
7384B96975M40441q68680Q83449q40p9580K57689q43867O71136N56397o0575J78190
7373A430735k01998N02924L25547j371487J48537p1706K84156l93807j54858j44402
$$ plain form
7363 353641 -20873 441029 -116532 745935 156584 684379 448433 152877 150397 561064
7353 561064 806581 365790 500192 570147 328331 11338 202164 1095461 1062162 724233
7343 724233 1122463 662096 1195083 1009772 1381444 1761107 1622889 1194447 1175219 354015
7333 354015 451270 857602 393988 650847 646840 517065 -63374 -50055 96823 508114
7323 508114 445639 599411 704823 365388 849055 1475018 112856 585804 1466138 860130
7313 860130 46670 -287961 195723 574464 561904 758109 696329 313116 773481 1038229
7303 1038229 1149750 1491081 1051260 1495957 1036694 697667 470965 -209545 1060413
7294 1060413 1551539 805982 982914 1159082 1054873 255236 617681 736761 679142 748051
$$ packed form
7363C53641l74514M61902n57561Q62467n89351N27795k35946k95556k480M10667
7353E61064K45517m40791J34402O9955k41816l16993J90826Q93297l3299l37929
7343G24233L98230m60367N32987j85311L71672L79663j38218m28442j9228q21204
7333C54015R7255M06332m63614K56859m007j29775n80439J3319J46878M11291
7323E08114o2475J53772J05412l39435M83667O25963j362162M72948Q80334o06008
7313H60130q13460l34631M83684L78741j2560J96205o1780l83213M60365K64748
7303A038229J11521L41331m39821M44697m59263l39027k26702o80510J269958
7294A060413M91126p45557J76932J76168j04209p99637L62445J19080n7619O8909
$$ plain form
7284 748051 1113725 -40020 228918 776343 -161895 176127 736333 628373 880153 556419
7274 556419 527229 1330675 530908 480098 1134260 918267 614999 -483423 -35074 1083680
7264 1083680 1574319 1107542 1154047 1670121 978196 1240365 444212 673441 598338 514409
7254 514409 809046 721635 355214 233110 280961 -116490 -262910 -154044 27257 4901
7244 4901 52044 808429 317285 885556 793325 603378 605235 902715 275904 -528952 -277488
7233 -277488 233753 435079 540188 747103 645546 287804 1130371 566796 572475 692022
7223 692022 768038 577160 935816 667426 -280333 -286246 -21124 -61601 -35787 535985 1165077
7212 1165077 1110409 843775 603698 93924 434719 1210908 1580791 1144183 1669019 727008
$$ packed form
7284G48051L65674j153745K68938N47425r38238L38022N60206j07960K51780l23734
7274E56419k9190Q03446p99767n0810O54162k15993l03268j098422M48349J118754
7264A083680M90639m66777M6505N16074o91925K62169p96153K29229p5103q3929
7254E14409K94637q7411l66421j22104M7851l97451j46420J08866J81301k2356
7244D901M7143P56385m91144N68271r2231j89947J857K97480o26811q04856K51464
7233b77488N11241K01326J05109K06915j01557l57742Q42567n63575N679J19547
7223F92022P6016j90878L58656k68390r47759n913K65122m0477K5814N71772O29092
7212A165077n4668k66634k40077n09774L40795P76189L69883m36608N24836r42011
$$ plain form
7202 727008 477856 1053372 692897 163081 809916 1126208 873626 1715013 1747937 1279570
7192 1279570 723685 885833 688422 958713 793637 358591 552068 146111 586039 55131
7182 55131 821388 1220716 1347279 2431759 2596833 1917215 1740521 1545595 879365 1060945
7172 1060945 558844 -199933 609105 294866 113447 754246 946510 1008011 670257 1212344
7162 1212344 1436137 1117511 1405307 1201736 256787 19442 -83122 12916 702900 1241054
7152 1241054 1512449 1176538 1286613 1748391 1782377 1509454 803025 835132 1358565 1391171
7142 1391171 1267486 956076 1622853 1471152 130582 440812 1178129 609698 78131
7133 78131 655634 918508 402429 782193 553364 1734588 1282123 697197 299766 500700
$$ packed form
7202G27008k49152N75516l60475n29816O46835L16292k52582Q41387L2924m68367
7192A279570n55885J62148j97411K70291j65076m35046J93477m05957M39928n30908
7182E5131P66257L99328J26563J084480J65074o79618j76694j94926o66230J81580
7172A060945n02101p58777Q09038l14239j81419O40799J92264O1501l37754N42087
7162A212344K23793l18626K87796k03571r44949k37345j02564R6038O89984N38154
7152A241054K71395l35911J10075M61778L3986k72923p06429L2107N23433L2606
7142A391171j23685l11410O66777j51701j340570L10230P37317n68431n31567
7133G8131N77503K62874n16079L79764k28829J181224m52465n84926l97431K00934
$$ plain form
7123 500700 950042 835838 -162772 -479804 274209 602456 1647777 531438 1304499
7114 1304499 787602 409740 1130202 953679 1370551 1196130 763976 1145575 1275186 1668899
7104 1668899 1800918 1528494 1030899 797174 396704 367754 125987 1003935 1951477 687187
7094 687187 304390 162047 562191 1383767 956194 1002137 1117062 704249 1007862 988614
7084 988614 584360 7277 264501 717805 1131566 501001 1090350 1580525 1389318 151347
7074 151347 602326 1004272 1142237 1579007 1756630 1494950 1440332 1397595 1505844 1055067
7064 1055067 1203787 1059549 497350 1293433 1068496 1403469 1812299 1306316 1294570 851562
7054 851562 541236 893342 1510714 2031769 1552341 1670202 921819 757563 1051067 1255152
$$ packed form
7123E00700M49342j14204r98610l17032P54013L28247J045321j116339P73061
7114A304499n16897l77862P20462j76523M16872j74421m32154L81599J29611L93713
7104A668899J32019k72424m97595k33725m00470k8950k41767Q77948R47542j264290
7094F87187l82797j42343M00144Q21576m27573M5943J14925m12813L03613j9248
7084I88614m04254n77083K57224M53304M13761o30565N89349M90175j91207j237971
7074A51347M50979M01946J37965M36770J77623k61680n4618m2737J08249m50777
7064A055067J48720j44238n62199P96083k24937L34973M08830n05983j1746m43008
7054H51562l10326L52106O17372N21055m79428J17861p48383j64256K93504K04085
$$ plain form
7044 1255152 882224 1183428 1404892 1555795 679398 1033147 1489296 1470055 1908979 1322489
7034 1322489 1484282 -336310 267507 -236418 -222201 366279 608648 764402 992606 1178823
7024 1178823 1225569 1739605 1606282 1522460 1754985 2088561 1993231 1958797 1053403 1836737
7014 1836737 768193 1240110 2140073 871274 401281 1084507 901445 707347 504557
7005 504557 1444296 1718257 2386249 2431647 1923608 1326514 2402972 2137673 1825883 1676750
6995 1676750 2017018 2144230 1434958 635856 1608848 869147 170273 600550 798242 1461950
6985 1461950 1344597 825786 357194 1135782 1399951 2358462 2287308 1417641 1077491 1129160
6975 1129160 691250 1133023 1077289 321520 926729 2185219 2272954 1997677 1259394 1480590
$$ packed form
7044A255152l72928L01204K21464J50903q76397L53749M56149j9241M38924n86490
7034A322489J61793j820592O03817n03925J4217N88480K42369J55754K28204J86217
7024A178823M6746N14036j33323q3822K32525L33576r5330l4434r05394P83334
7014A836737j068544M71917Q99963j268799m69993O83226j83062j94098k02790
7005E04557R39739K73961O67992M5398n08039n97094J076458k65299l11790j49133
6995A676750L40268J27212p09272p99102R72992p39701o98874M30277J97692O63708
6985A461950j17353n18811m68592P78588K64169R58511p1154q69667l40150N1669
6975A129160m37910M41773n5734p55769O05209J258490Q7735k75277p38283K21196
$$ plain form
6965 1480590 1549238 585747 795134 1898434 2134522 1157769 1191546 2021368 1519335 1628341
6955 1628341 1433854 1471688 1686604 2046619 1796025 1551116 1706943 1113009 654338 275839
6945 275839 1381252 1114005 1557153 1783433 751627 662298 1067312 1567539 1285466 1019824
6935 1019824 1200832 1416603 2154373 1473496 1258270 1046421 1189696 1317728 1728770 1963480
6925 1963480 646660 478495 1183854 1652165 1942804 2046620 1123205 701629 628563 523261
6915 523261 850369 1293000 1130709 1052277 712697 420191 609823 1141255 901592 1646480
6905 1646480 949976 1532937 1497885 1953086 1582903 1875344 1529829 1183294 1233902 899917
6895 899917 1082794 1922368 2050299 2115548 2262330 2278739 1718753 1452925 971724 324301
$$ packed form
6965A480590O8648r63491K09387J103300K36088r76753L3777Q29822n02033J09006
6955A628341j94487L7834K14916L60015k50594k44909J55827n93934m58671l78499
6945B75839J105413k67247M43148K26280j031806q9329M05014N00227k82073k65642
6935A019824J81008K15771P37770o80877k15226k11849J43275J28032M11042K34710
6925A963480j316820j68165P05359M68311K90639J03816r23415m21576p3066j05302
6915E23261L27108M42631j62291p8432l39580k92506J89632N31432k39663P44888
6905A646480o96504N82961l5052M55201l70183K92441l45515l46535N0608l33985
6895H99917J82877Q39574J27931O5249J46782J6409n59986k65828m81201o47423
$$ plain form
6885 324301 1100304 1814793 1748458 2314272 1512985 1863834 2021694 1541811 1093121 1564353
6875 1564353 1478306 914921 455894 573774 1395731 1613921 1719528 1414160 1852571 1211687
6865 1211687 1026129 1528887 2072140 1761121 1186768 775067 1480647 1997966 2131465 2320324
6855 2320324 2111944 1672262 2151891 1518694 1252645 1600281 1490475 1613088 1721425 1685205
6845 1685205 1784028 1294181 2017030 1712646 1981700 1770178 2320260 1599430 303529 1435410
6835 1435410 2716264 1896716 1830232 1698167 1891775 1884612 1545116 1655624 1920438 2522707
6825 2522707 2677884 1756424 2005265 1648426 2159306 1965145 1961950 2002359 1362174 1432218
6815 1432218 1024668 1380349 1771458 1927031 2106347 1987182 1337228 1328130 2166713 1851693
$$ packed form
6885C24301P76003P14489o6335N65814q01287L50849J57860m79883m48690M71232
6875A564353q6047n63385m59027J17880Q21957K18190J05607l05368M38411o40884
6865A211687j85558N02758N43253l11019n74353m11701P05580N17319J33499J88859
6855B320324k08380m39682M79629o33197k66049L47636j09806J22613J08337l6220
6845A685205R8823m89847P22849l04384K69054k11522N50082p20830j295901J131881
6835A435410J280854q19548o6484j32065J93608p163l39496J10508K64814O02269
6825B522707J55177r21460K48841l56839N10880j94161l195M0409o40185P0044
6815A432218m07550L55681L91109J55573J79316j19165o49954r098Q38583l15020
$$ plain form
6805 1851693 1643381 2198522 2270759 2164428 1931264 1635918 1520968 983224 1867440 2817492
6795 2817492 2543490 2921901 1381486 1917178 2107308 1357343 1480859 1788101 1185945
6786 1185945 1616752 2450153 1965610 2385698 2482059 1642755 1648659 1577791 1899927 1525944
6776 1525944 1857783 1190390 1433494 1796096 2168928 2257420 1281979 1489981 2493689 2551037
6766 2551037 1584591 2420124 2299281 1623975 1522250 1309827 1684182 2808155 2212955
6757 2212955 1449614 1831394 1742450 1355471 2632452 2791353 2210314 2410171 2200290 1481654
6747 1481654 1031150 1153300 1924855 1849185 2024157 1632853 1257353 2232034 1782265 1736751
6737 1736751 1883545 2037310 3136460 3213602 2377728 2246326 2211285 1625982 2331901 2431731
$$ packed form
6805A851693k08312N55141P2237j06331k33164k95346j14950n37744Q84216R50052
6795B817492k74002L78411j540415N35692J90130p49965J23516L07242o02156
6786A185945M30807Q33401m84543M20088R6361q39304N904p0868L22136l73983
6776A525944L31839o67393K43104L62602L72832Q8492r75441K08002J003708N7348
6766B551037r66446Q35533j20843o75306j01725k12423L74355J123973n95200
6757B212955p63341L81780q8944l86979J276981J58901n81039J99857k09881p18636
6747A481654m50504J22150P71555p5670J74972l91304l75500R74681m49769m5514
6737A736751J46794J53765J099150P7142q35874j31402l5041n85303P05919R9830
$$ plain form
6727 2431731 1935534 1579816 2318070 2639228 2972979 3180733 2941323 3316902 3144793 2665480
6717 2665480 2845183 2227897 1846490 2315820 2125780 2631369 2944265 2672724 2398706 2211818
6707 2211818 1960019 2904238 2850607 1945781 1643941 1593210 1921087 2570155 2950553 3923218
6697 3923218 2555388 2157248 2244526 2596871 2495203 2846844 2475533 2083245 2013900 1925070
6687 1925070 2625920 2806135 2414518 2454695 2539974 2679458 2763876 2503214 2511993 1660277
6677 1660277 1857260 2615636 2923804 2923692 3398536 3443676 3167405 2575005 2438134 2622977
6667 2622977 2338130 2940586 3280454 4047814 4076602 3312125 3554718 2736887 2279344 2532099
6657 2532099 2549174 2398839 2274266 3027575 3094423 3215416 3368402 3337154 2447263 2669266
$$ packed form
6727B431731m96197l55718P38254L21158L33751K07754k39410L75579j72109m79313
6717B665480J79703o17286l81407M69330j90040N05589L12896k71541k74018j86888
6707B211818k51799R44219n3631r04826l01840n0731L27877O49068L80398R72665
6697C923218j367830l98140Q7278L52345j01668L51641l71311l92288o9345q8830
6687A925070P00850J80215l91617M0177Q5279J39484Q4418k60662Q779q51716
6677A660277J96983P58376L08168j12M74844M5140k76271n92400j36871J84843
6667B622977k84847O02456L39868P67360K8788p64477K42593q17831m57543K52755
6657B532099J7075j50335j24573P53309O6848J20993J52986l1248q89891K22003
$$ plain form
6647 2669266 2957210 2848591 2859159 3052476 2919664 2772229 3538641 2585412 2736371 2909945
6637 2909945 2175642 2133292 1820009 1899015 2696883 2075664 2688849 3387906 3270805 2697425
6627 2697425 1785275 1745091 2159026 3007044 3559230 3163778 1624626 1954074 3033212
6618 3033212 3459468 2705825 3205046 2288488 2396512 2798317 2173921 2614776 2426846 3034484
6608 3034484 2583839 1898772 2790293 3520340 3138648 3690655 3186959 3680791 3680093 3174247
6598 3174247 2857835 3484104 3565230 3780574 3430007 2583326 2124816 2610823 2939635 2227127
6588 2227127 3321138 3371532 2544260 2905331 3251216 3122713 2861704 2210945 2651945 2623778
6578 2623778 1763754 2496591 3016354 2942801 2897729 3601657 4471919 3872254 2349238 2515151
$$ packed form
6647B669266K87944j08619J0568J93317j32812j47435P66412r53229J50959J73574
6637B909945p34303m2350l13283P9006P97868o21219O13185O99057j17101n73380
6627B697425r12150m0184M13935Q48018N52186l95452j539152L29448J079138
6618C033212M26256p53643M99221r16558J08024M01805o24396M40855j87930O07638
6608C034484m50645o85067Q91521P30047l81692N52007n03696M93832o98n05846
6598C174247l16412O26269Q1126K15344l50567q46681m58510M86007L28812p12508
6588B227127J094011N0394q27272L61071L45885j28503k61009o50759M41000k8167
6578B623778q60024P32837N19763p3553m5072P03928Q70262n99665j523016J65913
$$ plain form
6568 2515151 2495894 3498014 3785120 3666586 3056957 3091408 3186057 3911527 3894116 2967846
6558 2967846 3608701 3568141 3093235 2433464 2561993 2283835 2319072 2948676 2952848 2342138
6548 2342138 2610292 2576793 2396757 2624638 2299704 2977399 3395426 3073203 3313698 2718409
6538 2718409 2464078 3140736 2076408 2373070 3043120 3857333 4235268 3690233 3278280
6529 3278280 3175087 3428661 3807296 3345298 3678123 3940689 3363798 3307424 2840705 3374716
6519 3374716 2893265 2930015 2713888 2899313 3057653 3290029 3757017 3508895 3906854 3878114
6509 3878114 3767794 4255412 4071547 4095222 3181583 3783789 3923739 4645832 3959113 2847222
6499 2847222 3116269 3111496 3381372 3898236 3508231 3661949 3510972 3143432 4028265 3868665
$$ packed form
6568B515151j9257J002120K87106j18534o09629L4451R4649P25470j7411r26270
6558B967846O40855m0560m74906o59771J28529k78158L5237O29604M172o10710
6548B342138K68154l3499j80036K27881l24934O77695M18027l22223K40495n95289
6538B718409k54331O76658j064328K96662O70050Q14213L77935n45035m11953
6529C278280j03193K53574L78635m61998L32825K62566n76891n6374m66719N34011
6519C374716m81451L6750k16127J85425J58340K32376M66988k48122L97959k8740
6509C878114j10320M87618j83865K3675r13639O02206J39950P22093o86719j111891
6499B847222K69047m773K69876N16864l90005J53718j50977l67540Q84833j59600
$$ plain form
6489 3868665 3805138 3910142 4098367 4363263 4846746 4644841 4205943 4683164 4601351 4671791
6479 4671791 4017701 3467001 3235234 3444868 3507474 4132069 4261743 3984970 3491830 3584225
6469 3584225 4484643 4388577 4428248 4476168 4937671 4618274 4551162 5398077 5156471 3857050
6459 3857050 4619088 4445535 4170600 4711141 3927558 3755949 4793385 4926400 5241165
6450 5241165 4887432 4831920 4204326 4103967 4074463 4045353 4756732 3389204 3488348 3924272
6440 3924272 4168888 5442502 4956107 5092275 5321901 4151647 3711719 4942457 4427797
6431 4427797 3777764 4771191 4100508 4757392 4651946 4289003 4107936 4463806 4072941 4503648
6421 4503648 4175349 4352321 4996656 6203174 5698865 4932877 4941914 4336601 4578538 4980378
$$ packed form
6489C868665o3527J05004J88225K64896M83483k01905m38898M77221q1813P0440
6479D671791o54090n50700k31767K09634O2606O24595J29674k76773m93140R2395
6469C584225R00418r6066L9671M7920M61503l19397o7112Q46915k41606j299421
6459C857050P62038j73553k74935N40541p83583j71609J037436J33015L14765
6450E241165l53733n5512o27594j00359k9504k9110P11379j367528R9144M35924
6440C924272K44616J273614m86395J36168K29626j170254m39928J230738n14660
6431D427797o50033R93427o70683O56884j05446l62943j81067L55870l90865M30707
6421D503648l28299J76972O44335J206518n04309p65988R037o05313K41937M01840
$$ plain form
6411 4980378 5368611 5374369 5160547 4501886 5048199 5026412 5108470 5252190 5213949 4738389
6401 4738389 5182024 5274488 4717565 4199099 3814304 4836640 5283134 5657582 5452374 5751756
6391 5751756 5994477 4955775 4940191 4993906 4634579 4962777 5353763 5364959 6248941 6301224
6381 6301224 6169060 5928211 5839959 5231115 5223537 5429446 5109468 4998836 4934775 4893103
6371 4893103 4995141 5903699 6319059 5131553 5488574 5571989 5655302 6804206 7245707 6258331
6361 6258331 5795742 5918690 6685904 5786667 5616029 6556710 6863235 6015855 5579307 6503051
6351 6503051 6907657 6466585 6616664 6791869 7038708 7016779 6995929 6351363 6187420 6601576
6341 6601576 7377399 7863442 7111186 6076229 6271720 7181458 6992863 7892507 7244742
$$ packed form
6411D980378L88233N758k13822o58661N46313k1787Q2058J43720l8241m75560
6401D738389M43635R2464n56923n18466l84795J022336M46494L74448k05208K99382
6391E751756K42721j038702j5584N3715l59327L28198L90986J1196Q83982N2283
6381F301224j32164k40849q8252o08844p578K05909l19978j10632o4061m1672
6371D893103J02038R08558M15360j187506L57021Q3415Q3313J148904M41501r87376
6361F258331m62589J22948P67214q99237j70638R40681L06525q47380m36548R23744
6351F503051M04606m41072J50079J75205K46839k1929k0850o44566j63943M14156
6341F601576P75823M86043p52256j034957J95491R09738j88595Q99644o47765
$$ plain form
6332 7244742 7468049 7803621 8132669 7987128 7651046 8034474 8584495 8095695 7358248 8601526
6322 8601526 8611778 8619382 8649034 9208756 9650268 9521088 9214826 9707713 8982470 9145795
6312 9145795 9580137 9290708 10942628 9979429 9869930 9535799 8822756 9555275 10614861
6303 10614861 11163754 10776885 10908430 10193467 10252357 10174270 10342681 10824496 10861634 11817005
6293 11817005 12047447 11838790 11878235 12039916 12827859 13042698 13220381 13400072 12338311
6284 12338311 12384844 12084177 12794516 13402823 14956223 15165440 14911002 15931683 15791992
6275 15791992 15619072 16137047 16835475 16690977 17085427 17281508 17503281 18230239 18348497
6266 18348497 18962746 19288103 19366480 19615342 20506507 21126059 21973226 22724182 23102082 23055012
$$ packed form
6332G244742K23307L35572L29048j45541l36082L83428N50021m88800p37447J243278
6322H601526J0252P604K9652N59722M41512j29180l06262M92887p25243J63325
6312I145795M34342k89429J651920r63199j09499l34131p13043P32519J059586
6303A0614861N48893l86869J31545p14963N8890p8087J68411M81815L7138R55371
6293A1817005K30442k08657L9445J61681P87943K14839J77683J79691j061761
6284A2338311M6533l00667P10339O08307J553400K09217k54438J020681j39691
6275A5791992j72920N17975O98428j44498L94450J96081K21773P26958J18258
6266A8348497O14249L25357P8377K48862Q91165O19552Q47167P50956L77900m7070
$$ plain form
6256 23055012 23310419 24073856 25185021 25018239 25375511 25578639 26118759 26967206 27397178
6247 27397178 28039033 28115496 28848033 29279993 30485110 31160382 31252952 31226454 30933375 30588858
6237 30588858 31319329 32652417 32739618 32561417 32125730 32140614 32794715 31952175 31637850 32663198
6227 32663198 32058489 31348703 30975288 31373944 31685593 31366432 31154832 31218748 31044256 30502206
6217 30502206 29985746 29680330 29680646 29730239 29533777 30143823 29367822 29127902 28729695 28586946
6207 28586946 29433110 29495833 29070855 29264796 28858553 29910552 30721988 30346044 31386302
6198 31386302 31633418 31567702 31864883 32340995 33336029 34388072 34054225 34344807 34351979 35078211
6188 35078211 35650133 36320360 36465854 37158781 37719404 38000798 37766318 38230293 38390355
$$ packed form
6256B3055012K55407P63437J111165j66782L57272K03128N40120Q48447M29972
6247B7397178O41855P6463P32537M31960J205117O75272R2570k6498k93079l44517
6237C0588858P30471J333088Q7201j78201m35687J4884O54101q42540l14325J025348
6227C2663198o04709p09786l73415L98656L11649l19161k11600O3916j74492n42050
6217C0502206n16460l05416L16M9593j96462O10046p76001k39920l98207j42749
6207B8586946Q46164O2723m24978J93941m06243J051999Q11436l75944J040258
6198C1386302K47116o5716K97181M76112R95034J052043l33847K90582P172P26232
6188C5078211N71922O70227J45494O92927N60623K81394k34480M63975J60062
$$ plain form
6179 38390355 39183102 38742218 38828996 39542857 38458986 39261479 40503039 40680611 40459093
6170 40459093 39630789 40288320 40219505 40235701 40200977 39780534 38783203 38471309 38607098 37679429
6160 37679429 36287332 36332189 35562517 34927682 33150252 33388805 33491969 32130811 32045110
6151 32045110 30921720 29572010 28106258 27361694 27095746 26358766 25369493 24372449 25429385
6142 25429385 25612816 23609495 22140651 21348278 21260809 20296648 20322799 19662140 19589371 19202536
6132 19202536 18674427 17731885 18098491 18130130 17611296 17858212 17962034 18040389 17910304 17337363
6122 17337363 17127619 17257550 17452667 16665542 16410364 16700273 16288664 16837149 16312230
6113 16312230 15797810 15392570 14416255 14898669 15354708 15698899 15148479 15298159 16153532
$$ packed form
6179C8390355P92747m40884Q6778P13861j083871Q02493J241560J77572k21518
6170D0459093q28304O57531o8815J6196l4724m20443r97331l11894J35789r27669
6160C7679429j392097M4857p69672o34835j777430K38553J03164j361158q5701
6151C2045110j123390j349710j465752p44564k65948p36980r89273r97044J056936
6142B5429385J83431k003321j468844p92373q7469r64161K6151o60659p2769l86835
6132A9202536n28109r42542L66606L1639n18834K46916J03822P8355j30085n72941
6122A7337363k09744J29931J95117p87125k55178K89909m11609N48485n24919
6113A6312230n14420m05240r76315M82414M56039L44191n50420J49680Q55373
$$ plain form
6104 16153532 16710507 16224885 15792157 15986163 16012269 16024746 15785986 16456268 16228880 16364669
6094 16364669 16524275 15858107 16238773 15790376 16185980 16328739 17212966 16777099 16489657
6085 16489657 17004424 16628446 16982762 16488752 16421943 17560204 16829526 17030421 16931831 17132445
6075 17132445 17966581 18313982 18846777 18945429 18742045 18150420 18747230 19164034 19507619 19325463
6065 19325463 19390063 19819897 19772520 20516670 20835486 21045934 21711666 21572487 21242397 21281227
6055 21281227 22298949 22369004 22451489 22618582 23402557 23837217 24402121 24773145 25301928 25748753
6045 25748753 25946958 26811245 27059619 27618795 27483096 28208220 29235885 30575516 31494654
6036 31494654 31371945 32261448 32510537 32917044 32872993 33121349 33945311 34522546 34019923 35751179
$$ packed form
6104A6153532N56975m85622m32728J94006K6106J2477k38760O70282k27388J35789
6094A6364669J59606o66168L80666m48397L95604J42759Q84227m35867k87442
6085A6489657N14767l75978L54316m94010o6809J138261p30678K00895r8590K00614
6075A7132445Q34136L47401N32795R8652k03384n91625N96810M16804L43585j82156
6065A9325463O4600M29834m7377P44150L18816K10448O65732j39179l30090L8830
6055B1281227J017722P0055Q2485J67093P83975M34660N64904L71024N28783M46825
6045B5748753J98205Q64287K48374N59176j35699P25124J027665J339631R19138
6036C1494654j22709Q89503K49089M06507m4051K48356Q23962N77235n02623J731256
$$ plain form
6026 35751179 36101942 35983220 37360324 36850984 37237634 37845711 37305384 37916905 38435696
6017 38435696 38665475 38035220 38065635 39702359 40151213 39255293 40068018 40833636 40475088
6008 40475088 41518686 42367142 43042195 43351816 43022998 43741199 45241038 45533338 45250596
5999 45250596 45870818 47121941 47779039 48052889 48544361 49623965 49634215 49982110 50178888
5990 50178888 51598023 51678407 50544003 51451384 52481043 53207936 53837487 54623857 55566083
5981 55566083 57110054 56845946 57868877 59125763 59971821 61558228 62790524 63305188 63923139
5972 63923139 65414699 67094090 67934865 68334935 69389782 69998121 71943877 72755982 73345714
5963 73345714 73163655 73203724 72941266 73789237 74996584 74437239 74239207 74103621 74002479
$$ packed form
6026C5751179L50763j18722J377104n09340L86650O08077n40327O11521N18791
6017C8435696K29779o30255L0415J636724M48854q95920Q12725P65618l58548
6008D0475088J043598Q48456O75053L09621l28818P18201J499839K92300k82742
5999D5250596O20222J251123O57098K73850M91472J079604J0250L47895J96778
5990E0178888J419135Q0384j134404R07381J029659P26893O29551P86370R42226
5981E5566083J543971k64108J022931J256886Q46058J586407J232296N14664O17951
5972F3923139J491560J679391Q40775M00070J054847O08339J945756Q12105N89732
5963G3345714j82059M0069k62458Q47971J207347n59345j98032j35586j01142
$$ plain form
5954 74002479 74122306 74017797 73956530 73450778 73875526 74698032 74578742 75446098 76635858
5945 76635858 76184506 75579941 75869787 77181071 78072435 78598211 79189393 80005064 79790449
5936 79790449 79269583 79734380 79702580 80293763 80743358 80654690 80389134 79935853 79507523 79568225
5926 79568225 78564127 78339884 78154587 77590344 77967039 76839224 76727957 76615219 75483517
5917 75483517 75194186 74748188 73570074 73406071 72523564 71737650 71805745 72317490 72553943
5908 72553943 72207896 72443155 72244091 72105325 71178606 71610575 72303203 72001299 72191063
5899 72191063 73150482 73221077 73808088 73814471 74106464 74155138 75041664 75612182 75748500 76258711
5889 76258711 76357285 76730469 77096957 78337955 78394752 78328881 77994129 78054410 78488754 78554495
$$ packed form
5954G4002479J19827j04509o1267n05752M24748Q22506j19290Q67356J189760
5945G6635858m51352o04565K89846J311284Q91364N25776N91182Q15671k14615
5936G9790449n20866M64797l1800N91183M49595q8668k65556m53281m28330O0702
5926G9568225j004098k24243j85297n64243L76695j127815j11267j12738j131702
5917G5483517k89331m45998j178114j64003q82507p85914O8095N11745K36453
5908G2553943l46047K35259j99064j38766r26719M31969O92628l01904J89764
5899G2191063R59419P0595N87011O383K91993M8674Q86526N70518J36318N10211
5889G6258711R8574L73184L66488J240998N6797o5871l34752O0281M34344O5741
$$ plain form
5879 78554495 78994701 79868898 78849061 78490270 79214662 78385738 77791099 77810695 78363851
5870 78363851 78064187 78096240 77491126 76528905 76252779 75256149 74103268 74106329 73991421 73934021
5860 73934021 72798607 73042675 73149335 72354325 72002724 70884035 70141614 70360626 70637737
5851 70637737 70567024 70308288 69743899 69353414 69224799 69097716 68434568 68973115 69330342 68953384
5841 68953384 68293274 67638264 67579446 67379092 67606086 67135036 66966497 66295846 66432701 66456004
5831 66456004 66309362 66023016 65984836 65504425 64546757 64315199 64280861 63345910 62910760 62985482
5821 62985482 63824403 65019609 64757840 63264245 63426561 63862279 62871379 63553698 63974974
5812 63974974 65455107 65631276 65464431 65380448 64688593 64189531 63568173 63030255 62891224
$$ packed form
5879G8554495M40206Q74197j019837l58791P24392q28924n94639J9596N53156
5870G8363851k99664L2053o05114r62221k76126r96630j152881L061j14908n7400
5860G3934021j135414K44068J06660p95010l51601j118689p42421K19012K77111
5851G0637737p0713k58736n64389l90485j28615j27083o63148N38547L57227l76958
5841F8953384o60110o55010n8818k00354K26994m71050j68539o70651J36855K3303
5831F6456004j46642k86346l8180m80411r57668k31558l4338r34951m35150P4722
5821F2985482Q38921J195206k61769j493595J62316M35718r90900O82319M21276
5812F3974974J480133J76169j66845q3983o91855m99062o21358n37918j39031
$$ plain form
5803 62891224 62262462 61011620 60285612 59659578 57903422 56931419 55618154 55494834 54071527
5794 54071527 53536843 53571977 52936899 52548090 51768326 50870969 51074244 51357487 50739144 50744234
5784 50744234 50652383 51013189 50906290 50142134 50184401 50295483 51468492 51718737 52012494 51928775
5774 51928775 52233034 52826601 52958166 52400626 52481622 52680906 51797952 51758102 51706296 50903841
5764 50903841 50343656 50983663 51525939 51679611 51371953 52082118 52454171 52087019 52336332
5755 52336332 53485967 54198841 53700842 53583071 54367933 55275030 55604209 55507265 55271505
5746 55271505 55563980 55252012 54279901 54075723 53383097 53305192 53144549 52112668 50993554
5737 50993554 50757439 50619948 49937252 50064023 49871231 49921282 49577017 49029114 49058206 48365743
$$ packed form
5803F2891224o28762j250842p26008o26034j756156r72003j313265j23320j423307
5794E4071527n34684L5134o35078l88809p79764q97357K03275K83243o18343N090
5784E0744234r1851L60806j06899p64156M2267J11082J173009K50245K93757q3719
5774E1928775L04259N93567J31565n57540Q0996J99284q82954l9850n1806q02455
5764E0903841n60185O40007N42276J53672l07658P10165L72053l67152K49313
5755E2336332J149635P12874m97999j17771P84862R07097L29179r6944k35760
5746E5271505K92475l11968r72111k04178o92626p7905j60643j031881j119114
5737E0993554k36115j37491o82696J26771j92792N0051l44265n47903K9092o92463
$$ plain form
5727 48365743 49117114 49111678 49373733 48879660 49087084 48618155 49192380 50006997 50424141 50273287
5717 50273287 50143522 50630768 50224703 50855917 51755477 51256021 51133327 51025775 50260103
5708 50260103 50303797 49948043 49522025 48419733 49229569 49669822 49057394 48544879 48342342
5699 48342342 48904211 49168912 48911903 49405426 48832345 48989207 48843939 48232470 48388355
5690 48388355 48792515 49113370 49628581 49892439 50148979 50505650 50155165 50823183 50892802 50669683
5680 50669683 51012269 50683894 50957383 51710574 52062950 52615331 52149018 51966079 51228482
5671 51228482 53322091 53711698 53344062 53873619 54465777 54287000 53701351 54637660 55736792
5662 55736792 56151895 55879619 56091677 56708359 56982921 57963639 57845899 58604714 59368932
$$ packed form
5727D8365743P51371n436K62055m94073K07424m68929N74225Q14617M17144j50854
5717E0273287j29765M87246m06065O31214Q99560m99456j22694j07552p65672
5708E0260103M3694l55754m26018j102292Q09836M40253o12428n12515k02537
5699D8342342N61869K64701k57009M93523n73081J56862j45268o11469J55885
5690D8388355M04160L20855N15211K63858K56540L56671l50485O68018O9619k23119
5680E0669683L42586l28375K73489P53191L52376N52381m66313j82939p37597
5671E1228482K093609L89607l67636N29557N92158j78777n85649R36309J099132
5662E5736792M15103k72276K12058O16682K74562R80718j17740P58815P64218
$$ plain form
5653 59368932 60086047 60739046 60499981 60916148 61066458 61872452 62377710 63567019 62907658
5644 62907658 63299196 63969375 65121227 65337680 65542206 66280928 67691189 67174116 66963213
5635 66963213 68426552 69635906 70670182 70057802 69838500 70287339 71878315 72954334 74050743
5626 74050743 74525139 74228342 75426227 76374695 76015844 76587407 77192216 77836437 79188483
5617 79188483 80533815 81483904 82051709 83485934 83847920 84326093 85465429 85978906 86693237
5608 86693237 88251271 88634392 88808274 89577690 90771496 91595242 93067057 93996594 94339512
5599 94339512 95868979 96828183 97986182 98507903 100653280 101602491 102390398 103145266 104387270
5590 104387270 106045086 107823225 108934669 109659762 111185790 112582577 113657302 114953954
$$ packed form
5653E9368932P17115O52999k39065M16167J50310Q05994N05258J189309o59361
5644F2907658L91538O70179J151852K16453K04526P38722J410261n17073k10903
5635F6963213J463339J209354J034276o12380k19302M48839J590976J076019J096409
5626G4050743M74396k96797J197885R48468l58851N71563O04809O44221J352046
5617G9188483J345332R50089N67805J434225L61986M78173J139336N13477P14331
5608H6693237J558034L83121J73882P69416J193806Q23746J471815R29537L42918
5599I4339512J529467R59204J157999N21721K145377R49211P87907P54868J242004
5590A04387270J657816J778139J111444P25093J526028J396787J074725J296652
$$ plain form
5582 114953954 115804959 116816827 118563312 120346351 122172292 124060924 125408226 127204267
5574 127204267 128530686 130077445 132052169 133090172 134654235 136208659 138396182 140013881
5566 140013881 142855896 144838358 146263621 146917096 149208537 152235072 154319654 155849694
5558 155849694 157458267 159456008 161749977 164231430 165998210 168113453 170713873 172715267
5550 172715267 175027649 177848866 180681950 182365244 185810588 188717085 191539703 194903571
5542 194903571 197366009 200199448 203071833 205997856 209513134 212770156 215736635 219186625
5534 219186625 221367562 224007031 227376148 230248044 233067907 237968272 242083335 244697841
5526 244697841 247451601 250998272 255086918 259888045 263517723 267686870 272128300 276509236
$$ packed form
5582A14953954Q51005J011868J746485J783039J825941J888632J347302J796041
5574A27204267J326419J546759J974724J038003J564063J554424K187523J617699
5566A40013881K842015J982462J425263O53475K291441L026535K084582J530040
5558A55849694J608573J997741K293969K481453J766780K115243K600420K001394
5550A72715267K312382K821217K833084J683294L445344K906497K822618L363868
5542A94903571K462438K833439K872385K926023L515278L257022K966479L449990
5534B19186625K180937K639469L369117K871896K819863M900365M115063K614506
5526B44697841K753760L546671M088646M801127L629678M169147M441430M380936
$$ plain form
5518 276509236 280420586 284091460 288445748 293226925 296674481 300790838 305504362 309974391
5510 309974391 314725234 319180908 323841006 328365285 332609652 336701710 342040458 347007120
5502 347007120 351117305 355280308 359971453 365232038 370774928 375198580 380036250 385357702
5494 385357702 390589361 395235810 399624261 403689626 408268963 413361431 418037467 423167080
5486 423167080 427998574 432544563 436374803 441557386 446486977 451055350 455746812 459352605
5478 459352605 462978982 466665324 471065653 474974260 477613926 480577764 484040544 487027037
5470 487027037 489597211 492047119 494590753 496319573 498890437 500688333 502128697 503264338
5462 503264338 503383111 505377633 506370073 506011262 506032213 506434132 506019324 505084501 503435433
$$ packed form
5518B76509236L911350L670874M354288M781177L447556M116357M713524M470029
5510C09974391M750843M455674M660098M524279M244367M092058N338748M966662
5502C47007120M110185M163003M691145N260585N542890M423652M837670N321452
5494C85357702N231659M646449M388451M065365M579337N092468M676036N129613
5486D23167080M831494M545989L830240N182583M929591M568373M691462L605793
5478D59352605L626377L686342M400329L908607K639666K963838L462780K986493
5470D87027037K570174K449908K543634J728820K570864J797896J440364J135641
5462E03264338J18773J994522R92440l58811K0951M01919m14808r34823j649068
$$ plain form
5453 503435433 500890986 498408004 496340763 494440290 491495573 488805572 485625883 482644887
5445 482644887 478958525 475115462 471030205 466651659 462358613 458072892 454042121 447803179
5437 447803179 443907124 439466137 433756792 427525240 421419693 415905405 410143969 405184842
5429 405184842 399199136 393385833 387534590 382299134 376639724 370537350 364152693 357912316
5421 357912316 351900652 346116189 340751468 335170499 329251481 323721237 318642031 314045171
5413 314045171 308631002 303109204 297032717 291456732 286762350 282344431 277792682 272894704
5405 272894704 267521447 261785319 257641661 252662490 247534515 243519788 240221423 236426693
5397 236426693 231951560 227037322 222603157 219023118 215353607 211377016 207945874 204922887
$$ packed form
5453E03435433k544447k482982k067241j900473k944717k690001l179689k980996
5445D82644887l686362l843063m085257m378546m293046m285721m030771o238942
5437D47803179l896055m440987n709345o231552o105547n514288n761436m959127
5429D05184842n985706n813303n851243n235456n659410o102374o384657o240377
5421C57912316o011664n784463n364721n580969n919018n530244n079206m596860
5413C14045171n414169n521798o076487n575985m694382m417919m551749m897978
5405B72894704n373257n736128m143658m979171n127975m014727l298365l794730
5397B36426693m475133m914238m434165l580039l669511l976591l431142l022987
$$ plain form
5389 204922887 202136035 199026453 196166230 191963823 187907107 184602921 182012307 180114169
5381 180114169 176951058 173535756 170423407 166900534 163355467 161082941 159280701 156656589
5373 156656589 153493067 152261374 150234699 147061995 145335685 143326631 141440222 139879240
5365 139879240 138010412 134495938 132668930 130853191 128950694 127549180 126572371 124192115
5357 124192115 122009380 120451540 118968397 118086457 115702106 114200151 112723547 111758387
5349 111758387 109306645 108388274 107107153 105205802 104638447 102754074 101495491 100144711
5341 100144711 99355390 98161745 97494888 96463021 95076285 93213875 92291584 91786224 90422775
5332 90422775 90869404 90175585 89435694 88426596 86988963 84985143 84040058 83467751 83130395
$$ packed form
5389B04922887k786852l109582k860223m202407m056716l304186k590614j898138
5381A80114169l163111l415302l112349l522873l545067k272526j802240k624112
5373A56656589l163522j231693k026675l172704j726310k009054j886409j560982
5365A39879240j868828l514474j827008j815739j902497j401514r76809k380256
5357A24192115k182735j557840j483143q81940k384351j501955j476604r65160
5349A11758387k451742r18371j281121j901351n67355j884373j258583j350780
5341A00144711p89321j193645o66857j031867j386736j862410r22291n05360j363449
5332I0422775M46629o93819p39891j009098j437633k003820r45085n72307l37356
$$ plain form
5323 83130395 83011984 81611620 81198477 79053341 77749451 77455391 77004087 76884607 76567903
5314 76567903 75170628 74073515 73535657 72826048 72708033 71200181 71411689 71001401 69602889
5305 69602889 68923344 69230520 68573411 67775480 68092274 67462137 67645803 67313409 65950258
5296 65950258 65947573 65328505 64859732 64051663 63831309 63908908 63432918 62598804 62486605 62360638
5286 62360638 62352806 61719018 62142865 61982240 62655214 61512299 61373097 61512402 60129741
5277 60129741 59838374 59695136 60163777 59859435 58743713 58745034 59975670 60275711 60586197
5268 60586197 60149887 59103313 60238327 60253456 59022804 59727652 59732413 60441244 60079169
5259 60079169 60060648 59768091 58934765 59080156 59318278 59128304 59006359 58834422 58730870 57799901
$$ packed form
5323H3130395j18411j400364m13143k145136j303890k94060m51304j19480l16704
5314G6567903j397275j097113n37858p09609j18015j507852K11508m10288j398512
5305F9602889o79545L07176o57109p97931L16794o30137J83666l32394j363151
5296F5950258k685o19068m68773q08069k20354P7599m75990q34114j12199j25967
5286F2360638p832o33788M23847j60625O72974j142915j39202J39305j382661
5277F0129741k91367j43238M68641l04342j115722J321J230636L00041L10486
5268F0586197m36310j046574J135014J5129j230652P04848M761P08831l62075
5259F0079169j8521k92557q33326J45391K38122j89974j21945j71937j03552r30969
$$ plain form
5249 57799901 58050682 57654558 57343629 57415738 56850029 56834465 57714552 57600490 57275071 56369229
5239 56369229 56112527 55873211 57018733 56947274 56536789 56939697 57506860 57598845 57122526 57110091
5229 57110091 55917288 56418423 56605495 57020613 56755959 56700542 55821708 55453878 55909583
5220 55909583 55991883 55053981 54095957 54397865 54026282 52929222 52821084 53169789 52815856
5211 52815856 52581227 52930422 52544431 51685469 51890318 52172120 52086348 51461314 51424626 50619336
5201 50619336 50254587 49583597 50422938 50548527 50231456 50535311 49927708 49776916 49001342
5192 49001342 49593941 49312615 48418581 48914348 48126795 47526694 47290292 46930599 46444555
5183 46444555 45665503 45682050 45218786 45267310 44704179 45035135 45177714 44289175 44127582 43742434
$$ packed form
5249E7799901K50781l96124l10929P2109n65709j5564Q80087j14062l25419r05842
5239E6369229k56702k39316J145522p1459m10485M02908N67163R1985m76319j2435
5229E7110091j192803N01135J87072M15118k64654n5417q78834l67830M55705
5220E5909583Q2300r37902r58024L01908l71583j097060j08138L48705l53933
5211E2815856k34629L49195l85991q58962K04849K81802q5772o25034l6688q05290
5201E0619336l64749o70990Q39341J25589l17071L03855o07603j50792p75574
5192D9001342N92599k81326q94034M95767p87553o00101k36402l59693m86044
5183D6444555p79052J6547m63264M8524n63131L30956J42579q88539j61593l85148
$$ plain form
5173 43742434 43432413 43874467 43668574 43430318 43712475 42485013 42112676 42282808 42677372
5164 42677372 41115073 40537113 40948974 40402262 40912173 40564172 40109360 39350093 39501517
5155 39501517 39316458 39104683 39701756 39481089 39056938 38248980 38026006 37637139 37332597
5146 37332597 37465657 38607522 38701524 37534824 38647270 38993884 38275138 37947087 37084103
5137 37084103 37097380 37530331 36406508 35626554 35960352 35347787 35726824 35508208 34619566
5128 34619566 34191723 33767868 33636763 32843059 32723255 33260624 33524164 33215153 32224441
5119 32224441 31862816 31552036 31823922 31461035 30551923 31755952 31576474 31335532 31296713
5110 31296713 30715380 31132512 31853642 31546105 30171091 30261618 30006039 30195559 30771540
$$ packed form
5173D3742434l10021M42054k05893k38256K82157j227462l72337J70132L94564
5164D2677372j562299n77960M11861n46712N09911l48001m54812p59267J51424
5155C9501517j85059k11775N97073k20667m24151q07958k22974l88867l04542
5146C7332597J33060J141865R4002j166700J112446L46614p18746l28051q62984
5137C7084103J3277M32951j123823p79954L33798o12565L79037k18616q88642
5128C4619566m27843m23855j31105p93704j19804N37369K63540l09011r90712
5119C2224441l61625l10780K71886l62887r09112J204029j79478k40942l8819
5110C1296713n81333M17132P21130l07537j375014R0527k55579J89520N75981
$$ plain form
5101 30771540 30683224 30117527 30559524 31070339 31465934 31335620 31034698 31519353 31210058 30994512
5091 30994512 31219694 31729498 31011474 31484617 32274153 33348544 33805064 33677572 33011569
5082 33011569 33059330 33435215 33578739 34279100 35434671 35785607 36145405 35931177 36474808
5073 36474808 37568560 38320014 38272238 39237596 39484006 39893279 40414627 40225837 40176958 40311390
5063 40311390 41258224 41476002 41454033 42124006 42051662 42143091 42309351 42286905 43570766 44228657
5053 44228657 44540730 44662876 45735673 46460941 46046209 45835414 47276056 47846443 48124700
5044 48124700 48816403 49251957 50168969 50220819 51519818 52525835 53384978 54068605 55008024
5035 55008024 56776116 56587469 57358211 58600144 60025488 60481262 61023554 62439783 64139549
$$ packed form
5101C0771540q8316n65697M41997N10815L95595j30314l00922M84655l09295k15546
5091C0994512K25182N09804p18024M73143P89536J074391M56520j27492o66003
5082C3011569M7761L75885J43524P00361J155571L50936L59798k14228N43631
5073C6474808J093752P51454m7776R65358K46410M09273N21348j88790m8879J34432
5063D0311390R46834K17778k1969O69973p2344R1429J66260k2446J283861O57891
5053D4228657L12073J22146J072797P25268m14732k10795J440642N70387K78257
5044D8124700O91703M35554R17012N1850J298999J006017Q59143O83627R39419
5035E5008024J768092j88647P70742J241933J425344M55774N42292J416229J699766
$$ plain form
5026 64139549 64745795 64487445 65388666 65812224 67031566 67844739 69131065 70995732 70904273
5017 70904273 71268960 72156603 72691103 72960012 73523933 74401576 74641316 75529939 76131310
5008 76131310 76485573 77187657 78504392 78322624 78551256 79767973 78741721 79435537 80330930
4999 80330930 79688463 80351919 81114544 81846633 82728010 83035211 83130594 83182854 83500467 83176775
4989 83176775 83789064 83550963 83364018 83181861 82318414 82892937 82538203 82251311 82436926
4980 82436926 82567488 81476668 80568515 80962370 81035998 81059114 80010464 80268485 80440642
4971 80440642 80053032 79092841 78241095 78657852 78618886 77698324 77280333 76584958 76087673 75660658
4961 75660658 74918576 73959344 73885139 73194626 72823911 72273894 71454067 70754756 70076813 69135435
$$ packed form
5026F4139549O06246k58350R01221M23558J219342Q13173J286326J864667r1459
5017G0904273L64687Q87643N34500K68909N63921Q77643K39740Q88623O01371
5008G6131310L54263P02084J316735j81768K28632J216717j026252O93816Q95393
4999H0330930o42467O63456P62625P32089Q81377L07201R5383N2260L17613l23692
4989H3176775O12289k38101j86945j82157q63447N74523l54734k86892J85615
4980H2436926J30562j090820r08153L93855P3628K3116j048650K58021J72157
4971H0440642l87610r60191q51746M16757l8966r20562m17991o95375m97285m27015
4961G5660658p42082r59232p4205o90513l70715n50017q19827o99311o77943r41378
$$ plain form
4951 69135435 69171901 68580975 68782072 67721546 67276902 66436376 64445719 63784299 63483333
4942 63483333 63054838 62650814 61429860 61015981 61141081 60341471 59748204 59551796 59108735
4933 59108735 58467476 58201909 56794536 56247374 55328646 55014863 54053639 53300364 52427402
4924 52427402 52764770 52175619 52017550 51121189 50517582 50071934 49305550 48315106 47482427
4915 47482427 46640623 45484631 46277421 45833937 44966836 44325229 43228257 43349536 43365746
4906 43365746 43561315 43222198 42164790 41281536 41112014 41781211 41774344 41668457 40925119 39948541
4896 39948541 39855639 40787440 41220687 40187899 39964031 40166648 39149235 39216818 39626498
4887 39626498 39497330 39402330 39589642 39752115 38478975 37782879 38031020 38497413 38359572
$$ packed form
4951F9135435L6466n90926K01097j060526m44644q40526j990657o61420l00966
4942F3483333m28495m04024j220954m13879J25100p99610n93267j96408m43061
4933E9108735o41259k65567j407373n47162r18728l13783r61224p53275q72962
4924E2427402L37368n89151j58069q96361o03607m45648p66384r90444q32679
4915D7482427q41804j155992P92790m43484q67101o41607j096972J21279J6210
4906D3365746J95569l39117j057408q83254j69522O69197o867j05887p43338r76578
4896C9948541r2902R31801M33247j032788k23868K02617j017413O7583M09680
4887C9626498j29168r5000J87312J62473j273140o96096K48141M66393j37841
$$ plain form
4878 38359572 37795253 37137927 36614809 37019752 37007225 36904896 36629054 36255973 35732036 35971332
4868 35971332 35873199 34889332 35024193 34535293 34273068 33349342 32618856 33644932 33731840 33672557
4858 33672557 34054489 33328322 32368569 32524183 32885762 32420780 32030006 31442182 31165824
4849 31165824 32640383 32801219 32479734 33327914 33486696 33912662 32910819 33224394 33504866
4840 33504866 34789801 34892064 34449080 34530259 34964935 34856673 35584541 36408725 36344055 37642660
4830 37642660 37891218 38213393 38903949 39825634 39675791 39946336 40878902 41332507 42028066
4821 42028066 42955225 43348552 43693266 44779885 45153419 45849225 46263947 47917135 48445794
4812 48445794 49229044 49673179 50696775 52173847 53356864 54912610 56196904 57232840
$$ packed form
4878C8359572n64319o57326n23118M04943j2527j02329k75842l73081n23937K39296
4868C5971332r8133r83867J34861m88900k62225r23726p30486J026076Q6908n9283
4858C3672557L81932p26167r59753J55614L61579m64982l90774n87824k76358
4849C1165824J474559J60836l21485Q48180J58782M25966j001843L13575K80472
4840C3504866J284935J02263m42984Q1179M34676j08262P27868Q24184o4670J298605
4830C7642660K48558L22175O90556R21685j49843K70545R32566M53605O95559
4821D2028066R27159L93327L44714J086619L73534O95806M14722J653188N28659
4812D8445794P83250M44135J023596J477072J183017J555746J284294J035936
$$ plain form
4804 57232840 58745350 59977333 60553006 62534843 63925350 65339013 66013043 66648436 68376466
4795 68376466 70998778 72866162 74295837 76307391 79038919 81113198 82727670 84469952
4787 84469952 87033508 89868790 93024017 95433560 98836312 102021409 105274620 108707114
4779 108707114 111921415 116286040 120812932 124841709 129224468 133709860 138268059 142468013
4771 142468013 148170800 152815131 157002598 160248810 163402103 166219919 170122440 172038329
4763 172038329 174079080 177201534 179568997 182861313 185327039 186357559 187600874 188177466
4755 188177466 189035994 189113268 188767752 187264124 186751142 186195785 184855143 182512595 180411210
4746 180411210 178508365 175788010 173231501 169807792 167043204 164837229 162416100 159984834
$$ packed form
4804E7232840J512510J231983N75673J981837J390507J413663O74030O35393J728030
4795F8376466K622312J867384J429675K011554K731528K074279J614472J742282
4787H4469952K563556K835282L155227K409543L402752L185097L253211L432494
4779A08707114L214301M364625M526892M028777M382759M485392M558199M199954
4771A42468013N702787M644331M187467L246212L153293K817816L902521J915889
4763A72038329K040751L122454K367463L292316K465726J030520J243315N76592
4755A88177466Q58528P7274l45516j503628n12982n55357j340642k342548k101385
4746A80411210j902845k720355k556509l423709k764588k205975k421129k431266
$$ plain form
4738 159984834 157325708 153983730 149746482 145753968 140820213 135231581 130724533 125717344
4730 125717344 120148305 114793181 109526663 105650920 101338951 97220795 94417407 90025624
4722 90025624 86638178 83040466 81222487 78691162 75994446 74084333 72304446 70304756
4714 70304756 68584066 66460504 64511715 62921457 60647259 60064617 59368469 56866491
4706 56866491 55638888 54643819 53526276 51734041 50838529 50228359 49850013 48293922 47801907
4697 47801907 47176229 45643149 45165312 44480366 43991546 42944370 41567343 41454518 40141283
4688 40141283 39372136 39211682 38668216 37944306 36735716 36409114 35963039 35632091 35391540
4679 35391540 34564667 34646430 34154865 33501750 31866435 30217082 30657768 30462777 30736998
$$ packed form
4738A59984834k659126l341978m237248l992514m933755n588632m507048n007189
4730A25717344n569039n355124n266518l875743m311969m118156k803388m391783
4722I0025624l387446l597712j817979k531325k696716j910113j779887j999690
4714G0304756j720690k123562j948789j590258k274198n82642o96148k501978
4706E6866491j227603r95069j117543j792235q95512o10170l78346j556091m92015
4697D7801907o25678j533080m77837o84946m88820j047176j377027j12825j313235
4688D0141283p69147j60454n43466p23910j208590l26602m46075l30948k40551
4679C5391540q26873Q1763m91565o53115j635315j649353M40686j94991K74221
$$ plain form
4670 30736998 30235199 29138486 28237416 27601059 27380456 27333371 27283322 26117234 25633845
4661 25633845 25564431 25583201 24841352 24246438 23629410 22360022 21721887 22064766 22157645 21433935
4651 21433935 20529269 20637397 20496383 19681578 19288387 19681208 19240010 18689094 17675095
4642 17675095 17324733 17836296 17724734 17706176 17210349 16926564 16665264 16681910 16722767 15356130
4632 15356130 15537434 15933608 15260891 15138993 15149686 14572287 14557393 15094095 14865654 14189909
4622 14189909 13862635 14082794 13367099 12685964 12404815 11946420 11320998 11882835 12066093
4613 12066093 12694431 12115557 11782806 11839118 11864428 11620612 11179529 11157096 11218568 10806592
4603 10806592 11787652 11632665 11409603 10891882 10248895 10516094 10610448 9846750 9720656 10230900
$$ packed form
4670C0736998n01799j096713r01070o36357k20603m7085n0049j166088m83389
4661B5633845o9414J8770p41849n94914o17028j269388o38135L42879R2879p23710
4651B1433935r04666J08128j41014q14805l93191L92821m41198n50916j013999
4642A7675095l50362N11563j11562j8558m95827k83785k61300J6646M0857j366637
4632A5356130J81304L96174o72717j21898J0693n77399j4894N36702k28441o75745
4622A4189909l27274K20159p15695o81135k81149m58395o25422N61837J83258
4613A2066093O28338n78874l32751N6312K5310k43816m41083k2433O1472m11976
4603A0806592R81060j54987k23062n17721o42987K67199R4354p63698j26094N10244
$$ plain form
4593 10230900 10827839 10032783 9292049 9443855 9231600 10246454 10224290 10074012 10261168
4584 10261168 10323566 10175304 10114241 10605857 10410908 10178808 10165059 10332837 9620688 9234653
4574 9234653 9543376 10109935 10741812 10495919 10449814 10387891 10233394 10248594 10324630 9753635
4564 9753635 9557742 9379606 10437177 10154804 9686303 9164238 9374672 8803627 9120242
4555 9120242 9325543 9270651 8948232 8984554 10064591 9875685 10200072 10088503 9897101 9212630
4545 9212630 8627186 9019083 9775942 10042232 9771159 9986496 9640540 9152437 10465788
4536 10465788 10465737 9351938 10058913 11028635 10615893 11408392 11096803 10745259 11265020 11153045
4526 11153045 10405759 9576333 10156146 10521467 10367345 9892163 9406085 10218651 9981748
$$ packed form
4593A0230900N96939p95056p40734J51806k12255J014854k2164j50278J87156
4584A0261168O2398j48262o1063M91616j94949k32100j3749J67778p12149l86035
4574I234653L08723N66559O31877k45893m6105o1923j54497J5200P6036n70995
4564I753635j95893j78136J057571k82373m68501n22065K10434n71045L16615
4555I120242K05301n4892l22419L6322J080037j88906L24387j11569j91402o84471
4545I212630n85444L91897P56859K66290k71073K15337l45956m88103J313351
4536A0465788n1j113799P06975R69722m12742P92499l11589l51544N19761j11975
4526A1153045p47286q29426N79813L65321j54122m75182m86078Q12566k36903
$$ plain form
4517 9981748 10336706 10265972 9376243 8594914 9609527 10269430 10798787 9906241 9549192 9792469
4507 9792469 10474375 10607549 10303623 10501339 10764589 11036887 9933571 10240020 10885176
4498 10885176 10663357 10729738 10558192 10475886 10007302 10649447 11575084 11225391 10899869 10623020
4488 10623020 11869922 10959815 10897106 11055059 11360952 11238200 11226038 11345295 12072087 12450724
4478 12450724 12932391 13337765 13130807 13624048 13269286 13491779 13679361 13666318 13493481 14099322
4468 14099322 13971022 14517905 14909892 13972162 13568913 14942163 15404817 14866712 15359013
4459 15359013 15910757 15774458 15560170 16785206 17906503 17845043 17683715 18774110 19557907
4450 19557907 19373580 18881436 18855945 18723247 20208839 21066830 20837973 21110956 21986722
$$ packed form
4517I981748L54958p0734q89729p81329J014613O59903N29357q92546l57049K43277
4507I792469O81906J33174l03926J97716K63250K72298j103316L06449O45156
4498A0885176k21819O6381j71546q2306m68584O42145R25637l49693l25522k76849
4488A0623020J246902r10107o2709J57953L05893j22752j2162J19257P26792L78637
4478A2450724M81667M05374k06958M93241l54762K22493J87582j3043j72837O05841
4468A4099322j28300N46883L91987r37730m03249J373250M62654n38105M92301
4459A5359013N51744j36299k14288J225036J121297o1460j61328J090395P83797
4450A9557907j84327m92144k5491j32698J485592Q57991k28857K72983Q75766
$$ plain form
4441 21986722 22297176 22780286 23758241 24600698 24250042 24233955 24603691 24975689 26213065
4432 26213065 26795582 25988496 27446051 28114677 28285289 29625022 30603667 30829974 31295761
4423 31295761 32387112 32770953 33138302 34442963 34764881 35234245 36558702 37646535 38295028
4414 38295028 39469550 40734911 41552633 42351780 43509402 44099570 45251165 46730204 47625879
4405 47625879 49364246 50702835 51518319 52742939 54721651 55995533 57129620 58974929
4397 58974929 61042153 62940445 64697070 67768032 70096343 72350924 75058165 77050669
4389 77050669 80696858 85521612 90156310 94669240 99719166 105680527 112528681 120272672
4381 120272672 128075672 134556873 140527321 146536794 152384785 157944262 165181918 173784565
$$ packed form
4441B1986722L10454M83110R77955Q42457l50656j6087L69736L71998J237376
4432B6213065N82517q07086J457555O68626J70612J339733R78645K26307M65787
4423C1295761J091351L83841L67349J304661L21918M69364J324457J087833O48493
4414C8295028J174522J265361Q17722P99147J157622N90168J151595J479039Q95675
4405D7625879J738367J338589Q15484J224620J978712J273882J134087J845309
4397E8974929K067224J898292J756625L070962K328311K254581K707241J992504
4389G7050669L646189M824754M634698M512930N049926N961361O848154P743991
4381A20272672P803000O481201N970448O009473N847991N559477P237656Q602647
$$ plain form
4373 173784565 182731049 189402499 195760505 200220661 202224512 203596929 206517316 210682660
4365 210682660 215086821 220084396 222299585 220130858 214736962 208002948 201289465 195347231
4357 195347231 190874544 187222687 184165645 178644859 170005348 160261516 150744823 142355586
4349 142355586 135178568 129076149 123469182 117118917 110021801 102050297 95993389 89321609
4341 89321609 82716316 77039906 72768339 68852017 65694136 62939829 60429248 58075695
4333 58075695 56129862 55360663 53778221 51775786 50375788 49692236 48527532 46891877
4325 46891877 46816899 46165970 46528305 45916437 45351148 45167608 44089555 44941801 45268126
4316 45268126 45392887 45583758 46151016 45317735 45474589 45409845 45231175 45474168 45579293 45906689
$$ packed form
4373A73784565Q946484O671450O358006M460156K003851J372417K920387M165344
4365B10682660M404161M997575K215189k168727n393896o734014o713483n942234
4357A95347231m472687l651857l057042n520786q639511r743832r516693q389237
4349A42355586p177018o102419n606967o350265p097116p971504o056908o671780
4341H9321609o605293n676410m271567l916322l157881k754307k510581k353553
4333E8075695j945833p69199j582442k002435j399998o83552j164704j635655
4325D6891877p4978o50929L62335o11868n65289j83540j078053Q52246L26325
4316D5268126J24761J90871N67258q33281J56854o4744j78670K42993J05125L27396
$$ plain form
4306 45906689 46791680 47301284 48067922 49169011 49270094 49691218 50988622 51151769 51585325
4297 51585325 52178478 51905027 53199293 54202884 55662297 56726956 57346501 58378731 59846714
4288 59846714 60440785 61576434 62723893 64351357 65529842 66634806 68700178 70303918
4280 70303918 72247957 73322147 75095164 77006218 79496725 82028545 85218657 87336171
4272 87336171 90411172 93641420 97217184 100684532 104018852 108421987 114310822 120311415
4264 120311415 126797691 133169274 139712551 148448355 156426948 165774458 176015249 187188866
4256 187188866 200016574 213761881 227370233 241435024 254256907 264778804 272861450
4249 272861450 276811569 275874678 269378031 260362515 247257930 231778592 214469103 196267162
$$ packed form
4306D5906689Q84991N09604P66638J101089J01083M21124J297404J63147M33556
4297E1585325N93153k73451J294266J003591J459413J064659O19545J032230J467983
4288E9846714N94071J135649J147459J627464J178485J104964K065372J603740
4280G0303918J944039J074190J773017J911054K490507K531820L190112K117514
4272H7336171L075001L230248L575764L467348L334320M403135N888835O000593
4264A20311415O486276O371583O543277Q735804P978593R347510J0240791J1173617
4256A87188866J2827708J3745307J3608352J4064791J2821883J0521897Q082646
4249B72861450L950119r36891o496647r015516j3104585j5479338j7309489j8201941
$$ plain form
4241 196267162 180759215 166361734 152264104 140916418 129451732 120927490 113057692
4234 113057692 106424554 99365164 92898228 87133473 82554374 77781113 73386729 70360603
4226 70360603 66510816 63452858 59834224 57491889 55706525 53545233 51163711 49127633
4218 49127633 46304297 44484623 42785142 41653707 39773514 38526946 37737618 36693601
4210 36693601 35400233 33818588 32737683 31503880 30595392 30286381 29581679 27780174 26765644
4201 26765644 26775562 26165796 26060473 25404935 25321966 24373457 23176651 23772854 22206598 22063681
4191 22063681 22805942 21375259 20354353 19923759 19999544 19691924 19459780 18544526 17999823
4182 17999823 18555665 17873967 17609028 18118498 17473575 17686616 17126285 16163879 15701598
$$ packed form
4241A96267162j5507947j4397481j4097630j1347686j1464686q524242p869798
4234A13057692o633138p059390o466936n764755m579099m773261m394384l026126
4226G0360603l849787l057958l618634k342335j785364k161292k381522k036078
4218D9127633k823336j819674j699481j131435j880193j246568p89328j044017
4210C6693601j293368j581645j080905j233803r08488l09011p04702j801505j014530
4201B6765644R918o09766j05323o55538q2969r48509j196806N96203j566256j42917
4191B2063681P42261j430683j020906m30594P5785l07620k32144r15254n44703
4182A7999823N55842o81698k64939N09470o44923K13041n60331r62406m62281
$$ plain form
4173 15701598 15715551 15926121 15842683 16539148 15967043 14794234 15054600 15475718 15015464 14799834
4163 14799834 15460651 15683606 15357141 14230992 14259782 15840456 15884180 14398333 14079050
4154 14079050 13969583 13693888 14339688 13625742 13603801 14298667 14356127 15138055 15124191 15585632
4144 15585632 15785068 15989681 16282427 15094877 15902750 16784312 16303792 16363367 16157683
4135 16157683 15613211 15575097 16359680 16332873 16727738 16335520 16411448 16947585 17350916 17689441
4125 17689441 17573474 18101608 18917241 18895901 19380366 19695685 20362568 19793810 20104817 20629794
4115 20629794 20889536 21127357 21412020 21711839 23303927 23923618 23669384 23843853 24964732
4106 24964732 25559228 25378549 26081044 27432374 28738930 29163075 30831466 30359497 31180931
$$ packed form
4173A5701598J3953K10570q3438O96465n72105j172809K60366M21118m60254k15630
4163A4799834O60817K22955l26465j126149K8790J580674M3724j485847l19283
4154A4079050j09467k75695O45800p13946k1941O94866N7460P81928j3864M61441
4144A5585632J99436K04613K92746j187550Q07873Q81562m80520N9575k05684
4135A6157683n44472l8114P84583k6807L94865l92218P5928N36137M03331L38525
4125A7689441j15967N28134Q15633k1340M84465L15319O66883n68758L11007N24977
4115B0629794K59742K37821K84663K99819J592088O19691k54234J74469J120879
4106B4964732N94496j80679P02495J351330J306556M24145J668391m71969Q21434
$$ plain form
4097 31180931 32790064 33510324 34767381 35637129 36091643 37513051 37642498 39061348 40808151
4088 40808151 41447795 41645710 43524461 45071716 45641110 47441406 48024085 49177173 49973080
4079 49973080 50108108 50677820 51118504 51989765 52536262 53999694 54522802 54598762 53796398
4070 53796398 54106019 54374006 54823420 54968299 54516026 54114511 53909380 53112801 53248812
4061 53248812 53178496 53081152 52156321 51388623 50484329 48905919 48774328 47999749 46914688
4052 46914688 46518499 45956055 44461761 41728198 41605792 40631034 38675981 38067654 36590086
4043 36590086 35496022 34146648 33256149 32012392 31046372 30447647 28978952 27432977 25947751
4034 25947751 24612855 24691991 24361555 23063004 22295776 21521065 20530100 20532762 19604770 18782638
$$ packed form
4097C1180931J609133P20260J257057Q69748M54514J421408J29447J418850J746803
4088D0808151O39644J97915J878751J547255N69394J800296N82679J153088P95907
4079D9973080J35028N69712M40684Q71261N46497J463432N23108P5960q02364
4070E3796398L09621K67987M49414J44879m52273m01515k05131p96579J36011
4061E3248812p0316r7344r24831p67698r04294j578410j31591p74579j085061
4052D6914688l96189n62444j494294k733563j22406r74758j955053o08327j477568
4043C6590086j094064j349374q90499j243757r66020n98725j468695j545975j485226
4034B5947751j334896P9136l30436j298551p67228p74711r90965K662r27992q22132
$$ plain form
4024 18782638 18570981 18296395 17232278 15826625 15580194 15749820 15053469 13806567 13486351
4015 13486351 13363787 14224294 14050406 13527597 12978433 11763440 12063785 11650708 11440902
4006 11440902 11397707 10713529 10585462 9904716 10191399 11049623 10219875 9957252 10118041 9787822
3996 9787822 9828810 9146308 8706408 9148889 9244918 8723015 8178771 8758767 8653462 8651008
3986 8651008 7198042 7979807 8237309 9304182 8783864 8575523 8357570 8383521 8785040
3977 8785040 9437414 8406868 8881948 8657046 7442508 7964282 8837350 7872009 7474496
3968 7474496 7796627 7771178 8444873 9937283 9829343 8640727 8429390 8328767 7802549
3959 7802549 7841667 7995884 7189030 7200340 7199255 7654353 6950799 7414672 6871949 7266096
$$ packed form
4024A8782638k11657k74586j064117j405653k46431J69626o96351j246902l20216
4015A3486351j22564Q60507j73888n22809n49164j214993L00345m13077k09806
4006A1440902m3195o84178j28067o80746K86683Q58224q29748k62623J60789l30219
3996I787822M0988o82502m39900M42481R6029n21903n44244N79996j05305k454
3986H651008j452966P81765K57502J066873n20318k08341k17953K5951M01519
3977H785040O52374j030546M75080k24902j214538N21774Q73068r65341l97513
3968G474496L22131k5449O73695J492410j07940j188616k11337j00623n26218
3959G802549L9118J54217q06854J1310j085M55098p03554M63873n42723L94147
$$ plain form
3949 7266096 6032891 5574782 6005650 6709321 6220513 8107307 7487768 6826053 6927969
3940 6927969 6610051 6712097 5988308 5628057 5239540 5712864 5090652 4988874 5460216 4858214
3930 4858214 4095941 5206534 6471438 6209152 6062923 5448201 5818090 5738566 5728465 5640976
3920 5640976 5696167 5835311 5341560 5383408 5509498 5345046 5603229 4896140 5528764 5902540
3910 5902540 6049733 5743173 4967013 5029624 4738226 4710736 4948864 5117269 5287277 4996174
3900 4996174 5198094 6096916 6536135 5862191 6367238 7535842 6606007 6386114 6060578
3891 6060578 6636258 6085196 5694812 5760872 6637031 6286140 5986999 6378913 5520821 6136235
3881 6136235 6761354 5577203 5831010 6129947 6302218 6371325 6236932 6231121 6700733 6794833
$$ packed form
3949G266096j233205m58109M30868P03671m88808J886794o19539o61715J01916
3940F927969l17918J02046p23789l60251l88517M73324o22212j01778M71342o02002
3930D858214p62273J110593J264904k62286j46229o14722L69889p9524j0101q7489
3920E640976N5191J39144m93751M1848J26090j64452K58183p07089O32624L73776
3910E902540J47193l06560p76160O2611k91398k7490K38128J68405J70008k91103
3900D996174K01920Q98822M39219o73944N05047J168604r29835k19893l25536
3891F060578N75680n51062l90384O6060Q76159l50891k99141L91914q58092O15414
3881F136235O25119j184151K53807K98937J72271O9107j34393n811M69612R4100
$$ plain form
3871 6794833 6791026 6781737 6292553 6002749 5975027 7140426 6794643 6069640 5687621 6117851
3861 6117851 6687527 7114140 7035885 7024840 7223025 6711236 7342609 6645556 6795308 7078806
3851 7078806 6321897 6573849 6726375 6936970 6947117 6691884 6183118 6429298 6755273 6188286
3841 6188286 6553083 7077244 7715841 8215852 7844378 7888078 8498018 9010318 8177146 7871936
3831 7871936 7545780 8384173 8983885 9120909 9054515 9709702 9832329 9556827 9374244 9482845
3821 9482845 9587753 8585043 9514912 9393294 8976952 9018399 9702390 9861554 10102793 9813344
3811 9813344 10032019 10368104 10279346 10820970 11202522 11453367 10724055 10433368 11583975 11452305
3801 11452305 11645032 12504623 11682183 11455601 12608164 12716784 12726536 13000145 13191710 13577208
$$ packed form
3871F794833l807r289m89184k89804k7722J165399l45783p25003l82019M30230
3861F117851N69676M26613p8255j1045J98185n11789O31373o97053J49752K83498
3851G078806p56909K51952J52526K10595J0147k55233n08766K46180L25975n66987
3841F188286L64797N24161O38597N00011l71474M3700O09940N12300q33172l05210
3831G871936l26156Q38393N99712J37024o6394O55187J22627k75502j82583J08601
3821I482845J04908j002710R29869j21618m16342M1447O83991J59164K41239k89449
3811I813344K18675L36085q8758N41624L81552K50845p29312k90687J150607j31670
3801A1452305J92727Q59591q22440k26582J152563J08620R752K73609J91565L85498
$$ plain form
3791 13577208 13581107 13705466 14207031 15033303 14895424 14644739 14976817 15308210 14606012 15017552
3781 15017552 15175779 15492905 15518688 14979334 15957574 17142483 17347062 16984677 17501346
3772 17501346 17878589 18453596 17861313 18364647 18716225 18999880 19811630 20820917 20745015
3763 20745015 20680630 21473189 22203871 21644903 22259625 23491699 24472245 24500841 24961951 25675294
3753 25675294 26022364 26454705 27648665 27710969 27317493 28683609 29099716 29606612 29898298
3744 29898298 30496053 30106925 30742609 31442799 31861085 32553826 33332180 34048681 34275887
3735 34275887 34108692 34304457 35003984 36817303 36096078 35968800 36758124 37055170 37116986
3726 37116986 37073419 38747745 40157493 40668824 41497727 41984360 42795348 43134153 44043610
$$ packed form
3791A3577208L899J24359N01565Q26272j37879k50685L32078L31393p02198M11540
3781A5017552J58227L17126K5783n39354R78240J184909K04579l62385N16669
3772A7501346L77243N75007n92283N03334L51578K83655Q11750J009287p5902
3763B0745015o4385P92559P30682n58968O14722J232074R80546K8596M61110P13343
3753B5675294L47070M32341J193960O2304l93476J366116M16107N06896K91686
3744B9898298N97755l89128O35684P00190M18286O92741P78354P16501K27206
3735C4275887j67195J95765O99527J813319p21225j27278P89324K97046O1816
3726C7116986m3567J674326J409748N11331Q28903M86633Q10988L38805R09457
$$ plain form
3717 44043610 45659460 46688746 46916872 47286377 48879275 50087480 51724451 53867978
3709 53867978 55200277 56064660 57569822 59553433 61014457 62996649 64070610 65931632
3701 65931632 67989452 69317519 70406009 72359066 74299252 75640731 77526571 78896151
3693 78896151 80707253 81640469 82818693 84824002 86633885 87925524 88890566 89200570 90053037
3684 90053037 91844759 92137584 92202214 92614932 93293966 93608515 92920125 92338498 91284859
3675 91284859 89884075 89082853 88800738 88462967 86993688 85896139 85074619 84160416 82643179
3666 82643179 80466479 78876758 77886016 76490161 75059698 73826832 72259454 70941079
3658 70941079 69459510 66410320 64061477 62768112 61662948 59821684 58050965 56889026
$$ packed form
3717D4043610J615850J029286K28126L69505J592898J208205J636971K143527
3709E3867978J332299Q64383J505162J983611J461024J982192J073961J861022
3701F5931632K057820J328067J088490J953057J940186J341479J885840J369580
3693G8896151J811102R33216J178224K005309J809883J291639R65042L10004Q52467
3684I0053037J791722K92825O4630M12718O79034L14549o88390n81627j053639
3675I1284859j400784q01222k82115l37771j469279j097549q21520r14203j517237
3666H2643179k176700j589721r90742j395855j430463j232866j567378j318375
3658G0941079j481569l049190k348843j293365j105164j841264j770719j161939
$$ plain form
3650 56889026 54825289 53062386 51305745 50530255 49789654 49036695 46889422 45483007 45088402
3641 45088402 44430520 43797144 42473390 42261437 42823899 43073332 42201672 40982252 40443853
3632 40443853 40625756 40994183 40922995 40440681 40421216 40294773 40495867 40537487 40318638 41250761
3622 41250761 41004153 40191518 39669341 39770228 40571711 41557131 42177687 42104414 41357276 41751774
3612 41751774 41676094 41066103 41606285 41968674 41213233 41767714 42318800 42698642 43139068 43374060
3602 43374060 43052098 43323738 43446076 43111101 43428278 44687879 45041011 45432497 46801221
3593 46801221 47172958 47757564 49515534 49740054 51146287 51174166 51631851 53028064 53403718
3584 53403718 53538045 54052533 54657973 54918126 55699864 55911940 56268076 56586140 57354280
$$ packed form
3650E6889026k063737j762903j756641p75490p40601p52959k147273j406415l94605
3641D5088402o57882o33376j323754k11953N62462K49433q71660j219420n38399
3632D0443853J81903L68427p1188m82314j9465j26443K01094M1620k18849R32123
3622D1250761k46608q12635n22177J00887Q01483R85420O20556p3273p47138L94498
3612D1751774p5680o09991N40182L62389p55441N54481N51086L79842M40426K34992
3602D3374060l21962K71640J22338l34975L17177J259601L53132L91486J368724
3593D6801221L71737N84606J757970K24520J406233K7879M57685J396213L75654
3584E3403718J34327N14488O05440K60153P81738K12076L56136L18064P68140
$$ plain form
3575 57354280 57603796 57480468 57472776 57684653 58270861 58348248 57908526 59131080 60299362 60082390
3565 60082390 60000902 61105771 61834250 63134047 64417752 64491202 65330179 66333890 66970283
3556 66970283 68074931 69350715 70729273 71972995 72946109 74635543 76466151 77253637
3548 77253637 79157578 81646447 83253358 85236292 88637075 91379696 93331566 95427751
3540 95427751 98558935 100559690 102914550 105754318 108962577 111796340 113938225 116064360
3532 116064360 119217830 122054498 124397393 126750699 129293406 132079452 134471941 136867690
3524 136867690 139433161 141198269 143384332 145732894 147994171 149773820 152722759 155144982
3516 155144982 157192354 159330195 161395471 162934570 163863826 166144295 167255204 167835077
$$ packed form
3575E7354280K49516j23328p692K11877N86208P7387m39722J222554J168282k16972
3565F0082390q1488J104869P28479J299797J283705P3450Q38977J003711O36393
3556F6970283J104648J275784J378558J243722R73114J689434J830608P87486
3548G7253637J903941K488869J606911J982934L400783K742621J951870K096185
3540I5427751L131184K000755K354860K839768L208259K833763K141885K126135
3532A16064360L153470K836668K342895K353306K542707K786046K392489K395749
3524A36867690K565471J765108K186063K348562K261277J779649K948939K422223
3516A55144982K047372K137841K065276J539099R29256K280469J110909N79873
$$ plain form
3508 167835077 167947510 168151616 168117658 167604848 166279565 164351372 162085602 159837719 157127504
3499 157127504 154461570 151426750 147732103 144342481 141052491 138348045 135296755 131814220
3491 131814220 129194721 126202415 123210297 120718904 118918724 117206208 113940477 110964432
3483 110964432 108088790 104943361 102300881 99848804 97177063 94226292 91387037 88601180
3475 88601180 86114723 82767390 80757201 78731939 75412369 72476560 70286245 68332396
3467 68332396 66122501 64731480 62490423 60831518 59427320 57966985 56726472 55399531
3459 55399531 54296996 52848544 52349484 51189436 48759798 47657258 48141922 47381107 47315511
3450 47315511 47590113 47057177 46453651 45947431 45313426 44771269 44485624 43686602 43600038 43099254
$$ packed form
3508A67835077J12433K04106l3958n12810j325283j928193k265770k247883k710215
3499A57127504k665934l034820l694647l389622l289990k704446l051290l482535
3491A31814220k619499k992306k992118k491393j800180j712516l265731k976045
3483A10964432k875642l145429k642480k452077k671741k950771k839255k785857
3475H8601180k486457l347333k010189k025262l319570k935809k190315j953849
3467F8332396k209895j391021k241057j658905j404198j460335j240513j326941
3459E5399531j102535j448452m99060j160048k429638j102540M84664p60815o5596
3450D7315511K74602n32936o03526n06220o34005n42157k85645p99022q6564n00784
$$ plain form
3440 43099254 44062538 44291759 44124459 44672607 44244284 43522234 43007839 42739447 42647128 42548673
3430 42548673 41586919 41221757 41419000 40567357 39918741 39295133 39160750 37989865 36721275
3421 36721275 36167826 35781185 35700004 34833977 33673356 32776584 32238061 31990012 31752761
3412 31752761 30494839 30396864 30367619 30274332 29330857 28586412 28659770 28345494 27859644 27807776
3402 27807776 27798172 27226811 26672389 27035550 27631164 27552125 27934316 26805854 26466524 26944879
3392 26944879 26745582 26823320 26786238 26543673 25786907 25685376 26161066 26364579 26735526 26937514
3382 26937514 26988380 27966194 27136946 28563083 28587354 28716184 28330708 27752605 28423809 28893575
3372 28893575 29115600 29383649 29444779 29977857 30097001 29813987 30121745 30551384 30966463 31651460
$$ packed form
3440D3099254R63284K29221j67300N48148m28323p22050n14395k68392r2319r8455
3430D2548673r61754l65162J97243q51643o48616o23608j34383j170885j268590
3421C6721275n53449l86641q1181q66027j160621q96772n38523k48049k37251
3412C1752761j257922r7975k9245r3287r43475p44445P3358l14276m85850n1868
3402B7807776r604n71361n54422L63161N95614p9039L82191j128462l39330M78355
3392B6944879j99297P7738l7082k42565p56766j01531M75690K03513L70947K01988
3382B6937514N0866R77814q29248J426137K4271J28830l85476n78103O71204M69766
3372B8893575K22025K68049O1130N33078J19144k83014L07758M29639M15079O84997
$$ plain form
3362 31651460 32363938 32476011 32918866 33320812 33166066 33100250 34181912 35149044 36483306
3353 36483306 37104386 37341315 37247308 37343103 38267771 38906619 39373186 39287388 39669315 41140022
3343 41140022 42284556 42358165 43397890 44867708 45679539 46607118 47122200 47504117 48140484
3334 48140484 49370272 49865456 50820112 52110136 52489763 54540212 56275342 57257151 58722117
3325 58722117 60003986 61024816 61472523 62682613 64355565 66161485 67554319 69071244
3317 69071244 69989864 71778555 73043346 75167687 77557505 79403185 81144974 83261120
3309 83261120 85188379 87338237 89248167 91673918 94260536 96671581 99033727 101787427
3301 101787427 105322889 109238541 113006961 117124253 121750911 125632590 130230798 134154435
$$ packed form
3362C1651460P12478J12073M42855M01946j54746o5816J081662R67132J334262
3353C6483306O21080K36929r4007R5795R24668O38848M66567q5798L81927J470707
3343D1140022J144534P3609J039725J469818Q11831R27579N15082L81917O36367
3334D8140484J229788M95184R54656J290024L79627K050449J735130R81809J464966
3325E8722117J281869J020830M47707J210090J672952J805920J392834J516925
3317F9071244R18620J788691J264791K124341K389818J845680J741789K116146
3309H3261120J927259K149858J909930K425751K586618K411045K362146K753700
3301A01787427L535462L915652L768420M117292M626658L881679M598208L923637
$$ plain form
3293 134154435 138430988 143978372 148691220 154236483 160058961 165025763 170516524 176961202
3285 176961202 182206679 187483480 193261990 198432699 201644128 206764978 210922765 214461015
3277 214461015 216782733 218012739 219333266 221083395 221831906 221294485 219581197 217641034
3269 217641034 215542523 213660747 211204542 207261986 203433996 198966421 194596084 188751896
3261 188751896 182893921 176326579 170405469 164995124 157793920 150417420 144937923 138582711
3253 138582711 132546301 127637583 122599949 117434337 112470912 107582822 102745101 98393949
3245 98393949 95154123 92063994 88315267 84859536 81609905 78456094 76431123 75310539
3237 75310539 73845091 70626075 67140775 66277714 65117498 63457266 61629510 60154403
$$ packed form
3293A34154435M276553N547384M712848N545263N822478M966802N490761O444678
3285A76961202N245477N276801N778510N170709L211429N120850M157787L538250
3277B14461015K321718J230006J320527J750129P48511n37421j713288j940163
3269B17641034k098511j881776k456205l942556l827990m467575m370337n844188
3261A88751896n857975o567342n921110n410345p201204p376500n479497o355212
3253A38582711o036410m908718n037634n165612m963425m888090m837721m351152
3245I8393949l239826l090129l748727l455731l249631l153811k024971j120584
3237G5310539j465448l219016l485300q63061j160216j660232j827756j475107
$$ plain form
3229 60154403 58682097 57080109 56609252 55509782 54429133 53973897 52886011 51416289
3221 51416289 50899743 51093897 50642826 49754454 49259712 48080602 47672018 46973301 47066692
3212 47066692 46996780 45630601 45469847 44919809 44279488 44578654 43102672 42595597 43078866
3203 43078866 44201888 43068264 42270509 41966477 42591013 42769797 42723565 41909327 42381617
3194 42381617 42206705 41541188 42055088 42814053 43451168 43610933 43653768 43666736 43995210 44344163
3184 44344163 43615033 43902988 44086908 44283809 43786103 43215394 43326512 43698289 44200823
3175 44200823 44491961 45700090 45198989 45223864 46482240 46732379 46689309 46435207 46834624
3166 46834624 47483244 48220312 49572755 50117436 50540739 51308541 52509888 53539258 54328847
$$ packed form
3229F0154403j472306j601988m70857j099470j080649m55236j087886j469722
3221E1416289n16546J94154m51071q88372m94742j179110m08584o98717R3391
3212D7066692o9912j366179j60754n50038o40321K99166j475982n07075M83269
3203D3078866J123022j133624p97755l04032O24536J78784m6232q14238M72290
3194D2381617j74912o65517N13900P58965O37115J59765M2835J2968L28474L48953
3184D4344163p29130K87955J83920J96901m97706n70709J11118L71777N02534
3175D4200823K91138J208129n01101K4875J258376K50139m3070k54102L99417
3166D6834624O48620P37068J352443N44681M23303P67802J201347J029370P89589
$$ plain form
3157 54328847 55167286 56107642 57538209 58516369 59381352 60045393 61497956 64137090 65602040
3148 65602040 66391144 68679891 70980982 72947350 75321472 76406416 78477675 81121940
3140 81121940 83715014 86244278 88954635 91941531 95480815 97052742 99413728 102699527
3132 102699527 104789877 106584356 109513331 111749095 114101304 114591162 114912620 115406019
3124 115406019 115700452 115029804 114908667 114080330 112790176 110815676 108626694 107059124 105062761
3115 105062761 102684079 100230355 96171048 93612169 89722508 85820146 83262554 80100611
3107 80100611 77031451 73551580 70436483 67344085 64508188 62168971 58785472 56261679
3099 56261679 54001370 52291893 51135214 49711570 47516454 46243473 45795193 43097920
$$ packed form
3157E4328847Q38439R40356J430567R78160Q64983O64041J452563K639134J464950
3148F5602040P89104K288747K301091J966368K374122J084944K071259K644265
3140H1121940K593074K529264K710357K986896L539284J571927K360986L285799
3132A02699527K090350J794479K928975K235764K352209M89858L21458M93399
3124A15406019K94433o70648j21137q28337j290154j974500k188982j567570j996363
3115A05062761k378682k453724m059307k558879l889661l902362k557592l161943
3107H0100611l069160l479871l115097l092398k835897k339217l383499k523793
3099E6261679k260309j709477j156679j423644k195116j272981m48280k697273
$$ plain form
3091 43097920 41538783 41236984 40057885 38789377 37968903 36768551 36123875 34948060 33864403
3082 33864403 33331878 32590720 32169604 31687804 31508699 31132642 30459208 29726987 29144154
3073 29144154 30301347 30041612 29350868 29724155 29132043 28302555 28219972 28481737 28434215 27589568
3063 27589568 27681244 27759335 27986311 27815313 27326091 26701464 26530401 26061900 25299293 24899039
3053 24899039 24474349 23859368 22991504 22087527 23492074 23515068 22457183 22882888 22331930
3044 22331930 21792400 21773580 21430640 20660748 21001681 20613726 20051424 19628205 19799764 20288987
3034 20288987 19906816 19803296 19484382 19607481 19898706 20189801 19656263 19696306 19126425 19124461
3024 19124461 18891705 19681047 19513688 19356571 19373979 19280567 19366179 19190468 19207347 18922319
$$ packed form
3091D3097920j559137l01799j179099j268508q20474j200352o44676j175815j083657
3082C3864403n32525p41158m21116m81800j79105l76057o73434p32221n82833
3073B9144154J157193k59735o90744L73287n92112q29488q2583K61765m7522q44647
3063B7589568R1676P8091K26976j70998m89222o24627j71063m68501p62607m00254
3053B4899039m24690o14981q67864r03977J404547K2994j057885M25705n50958
3044B2331930n39530j8820l42940p69892L40933l87955n62302m23219J71559M89223
3034B0288987l82171j03520l18914J23099K91225K91095n33538M0043n69881j964
3024A9124461k32756P89342j67359j57117J7408r3412Q5612j75711J6879k85028
$$ plain form
3014 18922319 18925819 19070097 19018404 19825973 19964349 19234244 20447906 20084760 19999554 20437276
3004 20437276 20479077 20339699 20120208 20352741 20793449 21170224 20852004 21582185 21954807 21864785
2994 21864785 20814322 22013221 22937796 22940658 22389677 22803462 23615759 23568666 23990506 23760618
2984 23760618 23941955 24455289 25377085 25133650 25375817 25525457 25923928 26818036 26988937
2975 26988937 27073820 27149874 28065878 28237614 28732740 29021083 29096361 29275575 30239222 30714080
2965 30714080 30729329 31990532 33251780 34789499 34414298 34701383 35746968 36047426 36908630
2956 36908630 37725685 37807256 38961415 40196815 40148739 40216248 40910505 42359152 43782034
2947 43782034 45284149 46254170 47331419 47957917 48528846 49253511 50754611 51903339 52880132
$$ packed form
3014A8922319L500J44278n1693Q07569J38376p30105J213662l63146q5206M37722
3004B0437276M1801j39378k19491K32533M40708L76775l18220P30181L72622r0022
2994B1864785j050463J198899R24575K862n50981M13785Q12297m7093M21840k29888
2984B3760618J81337N13334R21796k43435K42167J49640L98471Q94108J70901
2975B6988937Q4883P6054R16004J71736M95126K88343P5278J79214R63647M74858
2965C0714080J5249J261203J261248J537719l75201K87085J045585L00458Q61204
2956C6908630Q17055Q1571J154159J235400m8076O7509O94257J448647J422882
2947D3782034J502115R70021J077249O26498N70929P24665J501100J148728R76793
$$ plain form
2938 52880132 54732803 55543705 57070107 57715317 59065919 60435967 62040335 63332734
2930 63332734 65063700 65976201 67655158 69516079 71578711 73441583 75093160 76888360
2922 76888360 78602394 80799601 83297945 85491780 87213506 89694525 92288329 94935926
2914 94935926 98513606 101029276 103964629 106951058 110330608 113212393 116394721 118982526
2906 118982526 122911641 126461033 129991867 134205809 137988192 142236422 147299216 152764861
2898 152764861 158603999 165261419 170934620 176901322 183171754 190287544 198529963 207841121
2890 207841121 217288630 227493617 238647090 250021592 262660289 276413575 290272799
2883 290272799 306328313 324001391 341714964 360799820 381362374 401436836 421584472
$$ packed form
2938E2880132J852671Q10902J526402O45210J350602J370048J604368J292399
2930F3332734J730966R12501J678957J860921K062632J862872J651577J795200
2922G6888360J714034K197207K498344K193835J721726K481019K593804K647597
2914I4935926L577680K515670K935353K986429L379550K881785L182328K587805
2906A18982526L929115L549392L530834M213942L782383M248230N062794N465645
2898A52764861N839138O657420N673201N966702O270432P115790Q242419R311158
2890B07841121R447509J0204987J1153473J1374502J2638697J3753286J3859224
2883B90272799J6055514J7673078J7713573J9084856K0562554K0074462K0147636
$$ plain form
2876 421584472 439590597 455914405 468640655 476243277 477392312 471731708 459882060
2869 459882060 442557434 421519057 397270017 372067621 347165108 323571773 300577850
$$ packed form
2876D21584472J8006125J6323808J2726250P602622J149035n660604j1849648
2869D59882060j7324626k1038377k4249040k5202396k4902513k3593335k2993923
$$ [...]
##END NTUPLES=NMR SPECTRUM
##END=
