##TITLE=1H_CA-9169-24
 CDCl3
 8 sc, 
 6.7.2023
##JCAMPDX= 6.0         $$ Bruker NMR JCAMP-DX V2.0
##DATA TYPE= NMR SPECTRUM
##DATA CLASS= NTUPLES
##ORIGIN= UXNMR, Bruker Analytische Messtechnik GmbH
##OWNER= root
$$ XWIN-NMR		Version 3.5
$$ Thu Jul  6 14:23:46 2023 Russian Standard Time (UT+4h)  she@DPX200
##.OBSERVE FREQUENCY= 200.13135
##.OBSERVE NUCLEUS= ^1H
##.ACQUISITION MODE= SIMULTANEOUS
##.ACQUISITION SCHEME= undefined
##.AVERAGES= 8
##.DIGITISER RES= 18
##SPECTROMETER/DATA SYSTEM= spect
##.PULSE SEQUENCE= zg30
##.SOLVENT NAME= CDCl3
##.SHIFT REFERENCE= (INTERNAL, CDCl3, 0, 15.7271)
##AUDIT TRAIL= $$ (NUMBER, WHEN, WHO, WHERE, WHAT)
$$ ##TITLE= Audit trail, XWIN-NMR		Version 3.5
$$ ##JCAMPDX= 5.01
$$ ##ORIGIN= Bruker BioSpin GmbH
$$ ##OWNER= she
$$ F:/spectra/data/she/nmr/H-F/1/pdata/1/auditp.txt
$$ ##AUDIT TRAIL=  $$ (NUMBER, WHEN, WHO, WHERE, WHAT)
(   1,<2023-07-06 14:20:09.15 +0400>,<she>,<DPX200>,
      <created by zg, POWCHK disabled, PULCHK disabled
       configuration hash MD5:
       00 E9 B6 7A A2 85 ED C7 34 08 36 98 17 FE 4E 26
       data hash MD5: 16K
       FF 5D 77 28 85 72 D5 3B E0 3B 81 F8 90 E8 1C 2E>)
(   2,<2023-07-06 14:20:14.50 +0400>,<she>,<DPX200>,
      <Start of raw data processing
       efp BC_mod = 2 LB = 0.24 FT_mod = 6 PKNL = 1 PHC0 = -20790.41 PHC1 = 13.85272 SI = 16K 
       data hash MD5: 16K
       53 71 E9 91 20 51 87 26 91 B1 F4 28 47 88 21 D9>)
(   3,<2023-07-06 14:20:33.93 +0400>,<she>,<DPX200>,
      <pk PHC0 = 6.06028 PHC1 = -6.599999 
       data hash MD5: 16K
       75 A1 4A 23 72 EA 9B DD F5 6A 4F AF 72 97 8A B0>)
(   4,<2023-07-06 14:20:37.46 +0400>,<she>,<DPX200>,
      <abs ABSG = 5 
       data hash MD5: 16K
       C9 FC CB B3 C5 D0 4D A2 74 78 24 F9 8E 6F 0C 65>)
(   5,<2023-07-06 14:22:54.57 +0400>,<she>,<DPX200>,
      <pk PHC0 = 1.234459 PHC1 = -1.4 
       data hash MD5: 16K
       E2 DD 1D 32 AA 02 46 8E 31 42 F1 46 61 FB C2 55>)
(   6,<2023-07-06 14:22:58.28 +0400>,<she>,<DPX200>,
      <abs ABSG = 5 
       data hash MD5: 16K
       F0 17 D4 E3 8E 65 2E 4D AC 88 4A DF EC 86 4F 34>)
$$ ##END=
$$ 
$$ hash MD5
$$ F7 A6 D8 52 AF 00 55 26 19 37 41 5C EC A0 D7 67
##$RELAX= 
##$RELAX= 
##$RELAX= 
##$RELAX= 
##$RELAX= 
##$RELAX= 
$$ Bruker specific parameters
$$ --------------------------
##$DU= <F:/spectra>
##$EXPNO= 1
##$NAME= <H-F>
##$PROCNO= 1
##$TYPE= <nmr>
##$USER= <she>
##$AMP= (0..31)
100 100 100 100 100 100 100 100 100 100 100 100 100 100 100 100 100 100 
100 100 100 100 100 100 100 100 100 100 100 100 100 100 
##$AQSEQ= 0
##$AQ_mod= 1
##$AUNM= <au_zg>
##$AUTOPOS= <>
##$BF1= 200.13
##$BF2= 200.13
##$BF3= 200.13
##$BF4= 200.13
##$BF5= 200.13
##$BF6= 200.13
##$BF7= 200.13
##$BF8= 200.13
##$BYTORDA= 1
##$CFDGTYP= 0
##$CFRGTYP= 5
##$CHEMSTR= <none>
##$CNST= (0..31)
1 1 145 1 1 1 1 1 1 1 1 1 1 1 1 1 1 1 1 1 1 1 1 1 1 1 1 1 1 1 1 1 
##$CPDPRG= <>
##$CPDPRG1= <>
##$CPDPRG2= <>
##$CPDPRG3= <>
##$CPDPRG4= <mlev>
##$CPDPRG5= <mlev>
##$CPDPRG6= <mlev>
##$CPDPRG7= <mlev>
##$CPDPRG8= <mlev>
$$ [...]
##$SUBNAM3= <"">
##$SUBNAM4= <"">
##$SUBNAM5= <"">
##$SUBNAM6= <"">
##$SUBNAM7= <"">
##$SUBNAM8= <"">
##$SUBNAM9= <"">
##$SW= 18.05172834244
##$SWIBOX= (0..15)
0 0 2 0 0 0 0 0 0 0 0 0 0 0 0 0 
##$SW_h= 3612.71676300578
##$TD= 16384
##$TD0= 1
##$TE= 0
##$TE2= 300
##$TE3= 300
##$TEG= 300
##$TL= (0..7)
0 120 120 120 120 120 120 120 
##$TP= (0..7)
150 150 150 150 150 150 150 150 
##$TP07= 0
##$TPNAME0= <>
##$TPNAME1= <>
##$TPNAME2= <>
##$TPNAME3= <>
##$TPNAME4= <>
##$TPNAME5= <>
##$TPNAME6= <>
##$TPNAME7= <>
##$TPOAL= (0..7)
0.5 0.5 0.5 0.5 0.5 0.5 0.5 0.5 
##$TPOFFS= (0..7)
0 0 0 0 0 0 0 0 
##$TUNHIN= 0
##$TUNHOUT= 0
##$TUNXOUT= 0
##$USERA1= <user>
##$USERA2= <user>
##$USERA3= <user>
##$USERA4= <user>
##$USERA5= <user>
##$V9= 5
##$VALIST= <valist>
##$VCLIST= <CCCCCCCCCCCCCCC>
##$VD= 0
##$VDLIST= <DDDDDDDDDDDDDDD>
##$VPLIST= <PPPPPPPPPPPPPPP>
##$VTLIST= <TTTTTTTTTTTTTTT>
##$WBST= 1024
##$WBSW= 4
##$XGAIN= (0..3)
0 0 0 0 
##$XL= 0
##$YL= 0
##$YMAX_a= 318304
##$YMIN_a= -265591
##$ZGOPTNS= <>
##$ZL1= 120
##$ZL2= 120
##$ZL3= 120
##$ZL4= 120
##$ABSF1= 15.72816
##$ABSF2= -2.323689
##$ABSG= 5
##$ABSL= 3
##$ALPHA= 0
##$AQORDER= 0
##$ASSFAC= 0
##$ASSFACI= 0
##$ASSFACX= 0
##$ASSWID= 0
##$AUNMP= <proc_1d>
##$AZFE= 0.1
##$AZFW= 0.1
##$BCFW= 0
##$BC_mod= 2
##$BYTORDP= 0
##$COROFFS= 0
##$CY= -3
##$DATMOD= 1
##$DC= 0
##$DFILT= <>
##$DTYPP= 0
##$F1P= 0
##$F2P= 0
##$FCOR= 1
##$FTSIZE= 16384
##$FT_mod= 6
##$GAMMA= 0
##$GB= 0
##$INTBC= 1
##$INTSCL= 3.70164e-10
##$ISEN= 128
##$LB= 0.24
##$LEV0= 0
##$LPBIN= 0
##$MAXI= 10000
##$MC2= 0
##$MEAN= 0
##$ME_mod= 0
##$MI= 1.114404
##$NCOEF= 0
##$NC_proc= -7
##$NLEV= 6
##$NOISF1= 3.799351
##$NOISF2= 2.8
##$NSP= 0
##$NTH_PI= 0
##$NZP= 0
##$OFFSET= 15.72706
##$PC= 1
##$PHC0= -20783.12
##$PHC1= 5.852721
##$PH_mod= 1
##$PKNL= yes
##$PPARMOD= 0
##$PSCAL= 0
##$PSIGN= 0
##$REVERSE= no
##$SF= 200.130008903428
##$SI= 16384
##$SIGF1= 3
##$SIGF2= 2
##$SINO= 5.538805
##$SIOLD= 16384
##$SREGLST= <1H.CDCl3>
##$SSB= 0
##$STSI= 16384
##$STSR= 0
##$SW_p= 3612.71676300578
##$SYMM= 0
##$S_DEV= 0
##$TDeff= 16384
##$TDoff= 0
##$TI= <>
##$TILT= no
##$TM1= 0
##$TM2= 0
##$TOPLEV= 0
##$USERP1= <user>
##$USERP2= <user>
##$USERP3= <user>
##$USERP4= <user>
##$USERP5= <user>
##$WDW= 1
##$XDIM= 16384
##$YMAX_p= 472214557
##$YMIN_p= -694603
$$ End of Bruker specific parameters
$$ ---------------------------------
##NTUPLES= NMR SPECTRUM
##VAR_NAME=  FREQUENCY,     SPECTRUM/REAL,   SPECTRUM/IMAG
##SYMBOL=    X,             R,               I
##VAR_TYPE=  INDEPENDENT,   DEPENDENT,       DEPENDENT
##VAR_FORM=  AFFN,          ASDF,            ASDF
##VAR_DIM=   16384,         16384,           16384
##UNITS=     HZ,            ARBITRARY UNITS, ARBITRARY UNITS
##FACTOR=    0.220516191357247, 1,           1
##FIRST=     3147.45672146472, 0,            0
##LAST=      -465.260041541059, 0,           0
##MIN=       -465.260041541059, -694603,     0
##MAX=       3147.45672146472, 472214557,    0
$$ Real data points
##PAGE= N=1
##DATA TABLE= (X++(R..R)), XYDATA
$$ [...]
7207A23992J18568o7837J6283o461j09496l8534J12054R168P7730Q2916K6489
$$ 123992 242560 174723 191006 184545 75049 36515 148569 157737 235467 318383 344872
7196C44872K7564k17414k3178J03535J2001l0289k0889m9316Q7513J47328j2802
$$ 344872 372436 155022 131844 235379 247380 217091 196202 146886 234399 381727 368925
7185C68925j34468q0100M7915q216L2048P581L6925j30043k2313J44592J8928
$$ 368925 234457 154357 202272 194056 226104 233685 270610 140567 118254 262846 281774
7174B81774k6109K5211k7772N5682J3305l4587j83652M6753N7179R9830m3993
$$ 281774 255665 280876 253104 308786 322091 287504 103852 150605 207784 307614 263621
7163B63621m5168R7727k65370L2172J10329N0120L5952K6774q2003l7886P9517
$$ 263621 218453 316180 50810 82982 193311 243431 279383 306157 224154 186268 265785
7152B65785l2255K4797P349p0038m6436L9020K7532L3368L3495M9644j27526Q1874
$$ 265785 233530 258327 265676 195638 149202 188222 215754 249122 282617 332261 204735 286609
7140B86609L4996o7932j8198o2672J81540m1813Q5080m3972j06505m4849N4123
$$ 286609 321605 253673 235475 172803 354343 312530 397610 353638 247133 202284 256407
7129B56407J91119L5682n9131l3989k41384j11870K78819K6503j29466q5726O9856
$$ 256407 447526 483208 424077 390088 148704 36834 315653 342156 212690 126964 196820
7118A96820J04452Q203J6012O943l3538M3416m5123k2715J25667R497l1769Q5635
$$ 196820 301272 309475 325487 332430 298892 342308 297185 274470 400137 409634 377865 463500
7106D63500j17889J3227O0447j08182Q9801p0287J2523L859j1610J4427p6569
$$ 463500 345611 358838 419285 311103 400904 330617 343140 346999 335389 349816 273247
7095B73247J31931O5380q9841M4101r4449P8126q4630n7819m799L8446m4373J22136
$$ 273247 405178 470558 380717 424818 330369 408495 323865 266046 261247 299693 255320 377456
7083C77456O4021k7053j04899j60156K8198J83455J93172p4439p2266m4711m9126
$$ 377456 441477 414424 309525 149369 177567 361022 554194 479755 407489 362778 313652
7072C13652k2041O2096M559P5698J3116K9591j85125N5169l9234p1301J55540
$$ 313652 291611 353707 358266 433964 447080 476671 291546 346715 307481 236180 391720
7061C91720J9679j15223O8881j1240J28008r2860L7369K0099q26J30122K4247
$$ 391720 411399 296176 365057 353817 481825 388965 426334 446433 445607 575729 599976
7050E99976L2628j89554N6646J02013n8925k27849P3963J023L7753N7291q3824
$$ 599976 632604 443050 499696 601709 542784 314935 388898 389921 427674 484965 401141
7039D01141L343J48590K2865J0929J11163m3811m1649k0265j28609q169M246L2565
$$ 401141 404484 553074 575939 586868 698031 654220 612571 592306 463697 455528 459774 492339
7027D92339L705P4914M0081J8187q1098o5673M8867j02332O4359J2890M8102n2486
$$ 492339 496044 570958 611039 629226 548128 482455 531322 428990 493349 506239 554341 501855
7015E01855Q3507O4355r8250j96680R8863L0870J20749M6691M7859o392n3654
$$ 501855 585362 649717 551467 354787 453650 484520 605269 651960 699819 693427 639773
7004F39773p0160O6193O532N0212N1120q8585J502m100N0963l2911O5038J66771
$$ 639773 569613 635806 642338 692550 743670 655085 656587 652487 703450 670539 735577 902348
6992I02348n3933k73583J77695n421l1253k9516L5388n5138M2892L1033p8549
$$ 902348 848415 574832 752527 747106 715853 686337 721725 666587 709479 740512 661963
6981F61963K6210O0395O6791k6310K6659Q0345j37886k0032J35552o4817n3053
$$ 661963 688173 748568 815359 789049 815708 896053 758167 738135 873687 808870 755817
6970G55817J29152M790k3825Q7589j09069r7001J0701n0843o6287J27656M2758
$$ 755817 884969 889759 865934 953523 844454 747453 758154 707311 641024 768680 811438
6959H11438j6820J22554m9603K6742L3508L0638R9776q2713Q1785l3945J8489
$$ 811438 794618 917172 867569 894311 927819 958457 1058233 975520 1057305 1023360 1041849
6948A041849k0828p3149N6002J9158J21124j39600m937J04368K2173l7059p31
$$ 1041849 1021021 947872 1003874 1023032 1144156 1004556 999619 1103987 1126160 1089101 1088370
6937A088370j59329k9810J09100k5071J06044p5566K8853j6536O7805J62939j09139
$$ 1088370 929041 899231 1008331 983260 1089304 1013738 1042591 1026055 1093860 1256799 1147660
6926A147660r7238j11502J14561P5027n451o8266L3798O6911o4357O2148K367
$$ 1147660 1050422 938920 1053481 1128508 1123057 1054791 1088589 1155500 1091143 1153291 1155658
6915A155658o6607l5143K5492J32788P8167k15978R8083q368J0118O0766K0154
$$ 1155658 1089051 1053908 1079400 1212188 1290355 1074377 1172460 1164092 1174210 1234976 1255130
6904A255130K4837p419J00262o0510j12771J4669K02228j0252j55094P1078J45849
$$ 1255130 1279967 1272548 1372810 1312300 1199529 1214198 1416426 1406174 1251080 1322158 1468007
6893A468007K551N2621j00769o5377j3700J1956M6621j01654M1378O7292k043
$$ 1468007 1470558 1523179 1422410 1357033 1343333 1355289 1401910 1300256 1341634 1408926 1406883
6882A406883K20929j69890j58395R0175J20346j19075L8362O3596n2499O6454
$$ 1406883 1627812 1457922 1299527 1389702 1510048 1390973 1429335 1492931 1440432 1506886
6872A506886n0604l6154K381J46838J58851j11243o0415J31937j47004J5765k603
$$ 1506886 1456282 1420128 1422509 1569347 1728198 1616955 1556540 1688477 1541473 1557238 1554635
6861A554635Q0403J876m3564Q5762N1836N3034l5077l7435p9872o884J22456J0750
$$ 1554635 1635038 1636914 1593350 1679112 1730948 1783982 1748905 1711470 1631598 1624714 1747170 1757920
6849A757920O4244m5704k4710Q8418j8097j65112J85374n3969L6122J50600r0264
$$ 1757920 1822164 1776460 1751750 1840168 1822071 1656959 1842333 1788364 1824486 1975086 1884822
6838A884822p6436r986R0081j4492k2879O7886j9460J03392o0607q2533Q009l0914
$$ 1884822 1808386 1798400 1888481 1873989 1851110 1918996 1899536 2002928 1942321 1859788 1867797 1836883
6826A836883J05955J0283N5965P0023r6841R9718R1777j07196Q4275J56262q2166
$$ 1836883 1942838 1953121 2009086 2079109 1982268 2081986 2173763 2066567 2150842 2307104 2224938
6815B224938q6958m6789R5134K9791K1093R0574O850l8697p0122J36410M7837
$$ 2224938 2137980 2091191 2186325 2216116 2237209 2327783 2334633 2295936 2225814 2362224 2410061
6804B410061l6498O2511N6531l3798R1720n9741m7572P1794P5926L114M6373L2306
$$ 2410061 2373563 2436074 2492605 2458807 2550527 2490786 2443214 2515008 2590934 2594048 2640421 2672727
6792B672727J5002L1721o1762n83K00714Q4827p4702n9035R1161P0251N5398j9913
$$ 2672727 2687729 2719450 2657688 2657105 2857819 2942646 2867944 2808909 2900070 2970321 3025719 3005806
6780C005806O5691l3065q5891q5645J40103K3091Q8957m9732K1711m1054J83847
$$ 3005806 3071497 3038432 2952541 2866896 3006999 3030090 3119047 3069315 3091026 3049972 3233819
6769C233819n3716M1368P8837j00121L8108K6672P5381K4026J87115P0816o1775
$$ 3233819 3180103 3221471 3300308 3200187 3238295 3264967 3340348 3364374 3551489 3622305 3560530
6758C560530j05920P8084J06757P6674j05540p0982P941J90531N6507O0477O4002
$$ 3560530 3454610 3532694 3639451 3716125 3610585 3539603 3547544 3738075 3794582 3855059 3919061
6747C919061j34729J25838j262p6632J14321L2550Q4450q6084J83184J14669o046
$$ 3919061 3784332 3910170 3908908 3832276 3946597 3979147 4063597 3977513 4160697 4275366 4269320
6736D269320p8673O1806J22132j8063J6553M8462O2661Q9310k8932o892K691J06762
$$ 4269320 4190647 4252453 4374585 4356522 4373075 4421537 4484198 4573508 4544576 4537684 4540375 4647137
6724D647137J43464P4464o1264O3750R4022n7047J12657J44574J07944K5867j9416
$$ 4647137 4790601 4865065 4803801 4867551 4961573 4904526 5017183 5161757 5269701 5295568 5276152
6713E276152N0867p2375Q9486O8647m158Q0936M0010K41801J14544o6198j7538
$$ 5276152 5327019 5254644 5344130 5412777 5408619 5489555 5529565 5771366 5885910 5819712 5802174
6702E802174M6053K28763R7291o5804q9100J92168M2722J01505M2757j15949K03169
$$ 5802174 5848227 6076990 6174281 6108477 6019377 6211545 6254267 6355772 6398529 6282580 6485749
6691F485749K47910J15339M397J0556k3817J72249L9646M3250J87200R6785K2960
$$ 6485749 6733659 6848998 6853395 6863951 6840134 7012383 7052029 7095279 7282479 7379264 7402224
6680G402224l9378J61285J33365J6382K60117R1540N2601J21632O8690j8808J22917
$$ 7402224 7362846 7524131 7657496 7673878 7933995 8025535 8078136 8199768 8268458 8249650 8372567
6669H372567N7251J06586K0608P4733K10227m3346N1819J74648J25568J44061
$$ 8372567 8429818 8536404 8557012 8631745 8841972 8798626 8850445 9025093 9150661 9294722
6659I294722J63379Q5196Q6181J10902r2435K15976K81177o767J38871J28605
$$ 9294722 9458101 9543297 9629478 9740380 9647945 9863921 10145098 10138331 10277202 10405807
6649A0405807P9213K23632N4511J08661N9235J18410K91764L44990M5343O2617
$$ 10405807 10485020 10708652 10763163 10871824 10931059 11049469 11341233 11686223 11731566 11794183
6639A1794183J91584J03778K23784Q5322J84256P3433J21835J50764P4209J94689
$$ 11794183 11985767 12089545 12313329 12398651 12582907 12656340 12778175 12928939 13003148 13197837
6629A3197837J61460K34682J94471K2560J37114J65337J48065J03040J39693J78663
$$ 13197837 13359297 13593979 13788450 13811010 13948124 14113461 14261526 14364566 14504259 14682922
6619A4682922K97164K40168Q3165K04980J28398K933K69130K32224J90181K52193
$$ 14682922 14980086 15220254 15303419 15508399 15636797 15639730 15908860 16141084 16331265 16583458
6609A6583458J39983R0666K18019J89372K76964K79736J91556J46516J17194K49644
$$ 16583458 16723441 16814107 17032126 17221498 17498462 17778198 17969754 18116270 18233464 18483108
6599A8483108K36893J17192K35398K41535K97553J07771Q7702L5419K95068L65696
$$ 18483108 18720001 18837193 19072591 19314126 19611679 19719450 19807152 19842571 20137639 20503335
6589B0503335K30230K73103K7525Q2053J68525K03839L72663J95929K28610K66345
$$ 20503335 20733565 21006668 21034193 21116246 21284771 21488610 21861273 22057202 22285812 22552157
6579B2552157K11949J50505J34223K39661R0211Q9328J74387K52069R5683L07719
$$ 22552157 22764106 22914611 23048834 23288495 23378706 23468034 23642421 23894490 23990173 24297892
6569B4297892K20640J67781k7270J60947K02592J93505J71713J45174R6657J32838
$$ 24297892 24518532 24686313 24659043 24819990 25022582 25216087 25387800 25532974 25629631 25762469
6559B5762469K27557J66769O9930K09407J88993J42564J15957r53P605Q2090J51587
$$ 25762469 25990026 26156795 26226725 26436132 26625125 26767689 26883646 26882693 26890298 26972388 27123975
6548B7123975n11Q1146k9944j7461J44032R6793L4045j08260J13409L1029K7839
$$ 27123975 27123464 27204610 27174666 27157205 27301237 27398030 27432075 27323815 27437224 27468253 27496092
6537B7496092o8377q3721M1553q2538o5331p9019J6321m4664k6059p8363K1501
$$ 27496092 27427715 27343994 27385547 27303009 27237678 27158659 27174980 27130316 27104257 27025894 27047395
6526B7047395o85j49279j44360p3751j00587j64204Q684k39836l04760n0873k00465
$$ 27047395 27046710 26897431 26753071 26679320 26578733 26414529 26423213 26183377 25878617 25827744 25627279
6515B5627279j85109m0915j84445j43236j09641k21835j38737k86027k33374j20922
$$ 25627279 25442170 25401255 25216810 25073574 24963933 24742098 24603361 24317334 24083960 23963038
6505B3963038k00205k47199j59391j00462j44832j89178k25619k38496j59062
$$ 23963038 23762833 23515634 23356243 23255781 23110949 22921771 22696152 22457656 22298594
6496B2298594k40679k92153j05563q0568l10472k63234j80947k61295k94306n1276
$$ 22298594 22057915 21765762 21660199 21579631 21269159 21005925 20824978 20563683 20269377 20218101
6486B0218101j62207k77946k78779j99587j56853k13059k59812k79599k00556
$$ 20218101 20055894 19777948 19499169 19299582 19142729 18929670 18669858 18390259 18189703
6477A8189703j72103k17660M505j38523j15302j89653k14240l48384k83531n9422
$$ 18189703 18017600 17799940 17804445 17665922 17550620 17360967 17146727 16798343 16514812 16455390
6467A6455390k30362j44072r7577k42411k99023j53894J7563j61891k42772k41712
$$ 16455390 16225028 16080956 15983379 15740968 15441945 15288051 15305614 15143723 14900951 14659239
6457A4659239l66625k21415p6793q8458k38002p0464j79320k69313j12036k7062
$$ 14659239 14292614 14071199 13994406 13905948 13667946 13597482 13418162 13148849 13036813 13009751
6447A3009751k6194j73993k78776r0066k25056j76102l8568q9751j72176k38003
$$ 13009751 12983557 12809564 12530788 12440722 12215666 12039564 12000996 11911245 11739069 11501066
6437A1501066r7150J9941k43582j51329l4218p2941k17370q5619n3168j05913
$$ 11501066 11403916 11423857 11180275 11028946 10994728 10921787 10704417 10618798 10565630 10459717
6427A0459717j29685k26640j23131j58198j48349j47128k4880q5512L3890K6036
$$ 10459717 10330032 10103392 9980261 9822063 9673714 9526586 9501706 9416194 9450084 9476120
6417I476120k07691k17346j12924j43049j11649j07284r9124j1635p7775j35026
$$ 9476120 9268429 9051083 8938159 8795110 8683461 8576177 8477053 8465418 8387643 8252617
6407H252617q0809q594q1923l0759j40554r0948r3948j19530r7144p9399m8869
$$ 8252617 8171808 8163214 8081291 8050532 7909978 7819030 7725082 7605552 7508408 7429009 7380140
6396G380140m4833k9163j06634j67473o6199p360o3369p4673o2430j09159l7259
$$ 7380140 7335307 7306144 7199510 7032037 6965838 6958478 6895109 6820436 6758006 6648847 6611588
6385F611588k04473P9346L0689j50690j14871n8935Q2507k1115r8206k15937l7051
$$ 6611588 6407115 6486461 6517150 6366460 6251589 6192654 6275161 6254046 6155840 5939903 5902852
6374E902852q9935j89012p4583M4352r1631K8551o8486O4395N6634l0060k13224
$$ 5902852 5812917 5623905 5549322 5593674 5502043 5530594 5462108 5526503 5583137 5553077 5339853
6363E339853j04891K8983L0008l0049n6316o2956j03152j09676j50144J02520
$$ 5339853 5234962 5263945 5293953 5263904 5207588 5144632 5041480 4931804 4781660 4884180
6353D884180p3805j34327N0426j46865m5214j4662J3202j9980n6191O465j12657
$$ 4884180 4810375 4676048 4726474 4579609 4534395 4519733 4532935 4512955 4456764 4463229 4350572
6342D350572L5541q8647k8554N315J37808m2326k14251j8327m2250m4547J4308
$$ 4350572 4386113 4297466 4268912 4274227 4412035 4369709 4155458 4137131 4094881 4050334 4064642
6331D064642P6954r0743o1996l2190j23162m1935L701m8004m2099k0400o8330
$$ 4064642 4141596 4050853 3988857 3956667 3833505 3791570 3795271 3747267 3705168 3684768 3616438
6320C616438l8137J00769q3256r2893M2983o0039L8522j39108n572k5292N110
$$ 3616438 3578301 3679070 3595814 3502921 3545904 3485865 3524387 3385279 3379707 3354415 3359525
6309C359525K6024N5037j40758J7736n6875k8237j18295j37223R7820R4062K3185
$$ 3359525 3385549 3440586 3299828 3317564 3260689 3232452 3114157 2976934 3074754 3168816 3192001
6298C192001M2342l9993j97492p2286p7832R7027n0228L4190n9008L3802l1326
$$ 3192001 3234343 3194350 2996858 2924572 2846740 2943767 2893539 2927729 2868721 2902523 2871197
6287B871197j97992n194J31839Q3129j48290j12539O3138L7372j36321q4546J50848
$$ 2871197 2673205 2668011 2799850 2882979 2734689 2622150 2685288 2722660 2586339 2501793 2652641
6276B652641P0393j27083R1515N6124m9393j06452n5828k1925K6265M3509r5003
$$ 2652641 2723034 2595951 2687466 2743590 2694197 2587745 2531917 2509992 2536257 2579766 2484763
6265B484763K9790j04324J24m8894j10106r3173J4139p1475Q6684J11250j57087
$$ 2484763 2514553 2410229 2410353 2361459 2251353 2158180 2172319 2100844 2187528 2298778 2141691
6254B141691k790j504m0645O3354j9556n9310m1025J4385K4649K0742j2161J1182
$$ 2141691 2138901 2137397 2096752 2160106 2140550 2081240 2040215 2054600 2079249 2099991 2087830 2099012
6242B099012j49614j19578K6161q0298J74215M1524j93520J38218k6099R049J4853
$$ 2099012 1949398 1829820 1855981 1775683 1949898 1991422 1797902 1936120 1910021 1919070 1933923
6231A933923j65786L4503J19612r5876l6761K13580P5974k19096j50018M9482
$$ 1933923 1768137 1802640 1922252 1826376 1789615 2003195 2079169 1860073 1710055 1759537
6221A759537J05918m8870k3738p2329M2897R0935j3601j17506j32670J3471l2093
$$ 1759537 1865455 1816585 1792847 1720518 1763415 1854350 1840749 1723243 1590573 1604044 1571951
6210A571951k8873R4215n2724N0417m2542n9391O3810P5103j9047j05256q7664
$$ 1571951 1543078 1637293 1584569 1634986 1592444 1533053 1596863 1671966 1652919 1547663 1459999
6199A459999j05998J22955J3237j13956O5458q2079k1L3366o5774J21734l0375
$$ 1459999 1354001 1476956 1490193 1376237 1441695 1359616 1359595 1392961 1327187 1448921 1418546
6188A418546N3942N6878K9819m8990N2970O399P666M889j01459k58612J37406
$$ 1418546 1472488 1529366 1559185 1510195 1563165 1569564 1577230 1582119 1480660 1222048 1359454
6177A359454j6909M6533p130M4270R040k6668J22658j22868j05420m2954P5628
$$ 1359454 1342545 1389078 1381948 1426218 1435258 1408590 1531248 1408380 1302960 1260006 1335634
6166A335634j2036M9732k4464l4548R8271j09759J19348J8918j85766n4557J38191
$$ 1335634 1323598 1373330 1348866 1314318 1412589 1302830 1422178 1441096 1255330 1200773 1338964
6155A338964j10954R5370N8178j58881J06157Q7610j12892K3361n0710K67609
$$ 1338964 1228010 1323380 1381558 1222677 1328834 1416444 1303552 1326913 1276203 1543812
6145A543812R1533j13656j7145k0011n3200q2085P2618J12119j38156j16955K3083
$$ 1543812 1635345 1521689 1504544 1484533 1431333 1349248 1421866 1533985 1395829 1278874 1301957
6134A301957j25531M814K8678o6677J03851J93208q6096j09455j85224M4418m4464
$$ 1301957 1176426 1181240 1209918 1143241 1247092 1440300 1354204 1244749 1059525 1103943 1059479
6123A059479Q393J315J09367N3563K0378n6831n085k5107K5783p1013O6111o5426
$$ 1059479 1067872 1069187 1178554 1232117 1252495 1195664 1190579 1165472 1191255 1120242 1186353 1120927
6111A120927p962L6303L3646j05971k2499j3756k7684P7940q8586J11870K117
$$ 1120927 1112965 1149268 1182914 1076943 1054444 1040688 1013004 1090944 1002358 1114228 1116345
6100A116345k8722j7099N0696L9256O915L7625l1598p3616k8923O6068L1208J58459
$$ 1116345 1087623 1070524 1121220 1160476 1167391 1205016 1173418 1099802 1070879 1136947 1168155 1326614
6088A326614r3885k29478O0555K55355q2314q0603N7944J17519M540J33478N9589
$$ 1326614 1232729 1003251 1063806 1319161 1236847 1156244 1214188 1331707 1336247 1469725 1529314
6077A529314o2293m7790k6582q0394k9189J54872P1244N5549n629M049l2905o0525
$$ 1529314 1467021 1419231 1392649 1312255 1283066 1437938 1509182 1564731 1559102 1563151 1530246 1469721
6065A469721j17509r4966M4837J56706p8827R6998O1371J4340R7955o8389J65004
$$ 1469721 1352212 1257246 1302083 1458789 1379962 1476960 1538331 1552671 1650626 1582237 1747241
6054A747241k1193n8449J20701o3469K59752m1416Q2183K1696J77750k9209k25423
$$ 1747241 1726048 1667599 1788300 1724831 1984583 1943167 2025350 2047046 2224796 2195587 1970164
6043A970164q4263p123j18342j09702J24769O0383l9148K6208J84052n3338p2498
$$ 1970164 1885901 1878778 1760436 1650734 1775503 1835886 1796738 1822946 2006998 1953660 1881162
6032A881162j8352L9808m074K0103l109K37688R6805J6838l6890J18093J30279
$$ 1881162 1862810 1902618 1898544 1918647 1915538 2153226 2250031 2266869 2229979 2348072 2478351
6021B478351j8243K1288q0060K00598M4187k75286M7136o3630j56481m9625j91368
$$ 2478351 2460108 2481396 2401336 2601934 2646121 2370835 2417971 2354341 2197860 2148235 1956867
6010A956867K5546J04834Q3006r9642j947p8322Q1348L9591p9849N3651N6004
$$ 1956867 1982413 2087247 2170253 2070611 2068664 1990342 2071690 2111281 2031432 2085083 2141087
5999B141087L852o239J25657j3602l4447K566K843n027L0176j0118j0023L088
$$ 2141087 2144939 2138700 2264357 2250755 2216308 2218874 2221717 2216690 2246866 2236748 2226725 2229813
5987B229813J67106P3273j43016j47558P2699P592m7760j30681m8483N6007j16149
$$ 2229813 2396919 2470192 2327176 2179618 2252317 2259909 2212149 2081468 2032985 2088992 1972843
5976A972843j67212r4871O6541l5150j21155P4246j2559J02608M1567o2780O4373
$$ 1972843 1805631 1710760 1777301 1742151 1620996 1695242 1682683 1785291 1826858 1764078 1828451
5965A828451j10514K0771j5160J47416j33782m9157L5383n0859J00586m7066n4437
$$ 1828451 1717937 1738708 1723548 1870964 1737182 1688025 1723408 1672549 1773135 1726069 1671632
5954A671632k7897m7315j76388L3769R6412j01740m2751K0434n0540J1453r6467
$$ 1671632 1643735 1596420 1420032 1453801 1550213 1448473 1405722 1426156 1375616 1387069 1290602
5943A290602n9346J22674j83514K1079J0645K0701K13369l2750l1063K2419R3993
$$ 1290602 1231256 1353930 1170416 1191495 1202140 1222841 1436210 1403460 1372397 1394816 1488809
5932A488809P3109o9551L0365r7150K1944k9175n7133m6256j9336r7261R5298
$$ 1488809 1561918 1492367 1522732 1425582 1447526 1418351 1361218 1314962 1295626 1198365 1293663
5921A293663j9045M6379J67468p1300p1482n5501J05974o5305o8113P3040K54253
$$ 1293663 1274618 1320997 1488465 1417165 1345683 1290182 1396156 1330851 1262738 1335778 1590031
5910A590031n5956r2880J8476L3125M4303l0661O212O207n8617L5796L9359K4444
$$ 1590031 1534075 1441195 1459671 1492796 1537099 1506438 1512650 1518857 1460240 1496036 1535395 1559839
5898A559839j04488O4386O9801N8578k0252J766j6050O52K5500N9668n8157p7652
$$ 1559839 1455351 1519737 1589538 1648116 1627864 1629630 1613580 1614232 1639732 1699400 1641243 1563591
5886A563591j1575l7689J00051J38613L3109j2177p3249J64245M3933k4044N3331
$$ 1563591 1552016 1514327 1614378 1752991 1786100 1773923 1700674 1864919 1908852 1884808 1938139
5875A938139J5406N643O1593k6095J26187N5271m80j9880j9508J10510M2194K1340
$$ 1938139 1953545 1959188 2020781 1994686 2120873 2176144 2175664 2155784 2136276 2246786 2288980 2310320
5863B310320K4505Q9069Q7451J05703l3142r7218l8559J35835M1730o5629J59373
$$ 2310320 2334825 2423894 2511345 2617048 2583906 2486688 2448129 2583964 2625694 2560065 2719438
5852B719438J14047J7876n5430N7964K23699j637N5560j05417J41824O6983J19163
$$ 2719438 2833485 2851361 2795931 2853895 3077594 3075957 3131517 3026100 3167924 3234907 3354070
5841C354070K43526m7371r4305J41159L1979J06403J74543J38018J54972n7243
$$ 3354070 3597596 3550225 3455920 3597079 3629058 3735461 3910004 4048022 4202994 4145751
5831D145751J3785J97183J82543Q6483Q2957J15000l3191K63282R4143O4462M7970
$$ 4145751 4159536 4356719 4539262 4625745 4708702 4823702 4790511 5053793 5147936 5212398 5260368
5820E260368K6517J99256J53483K65526K01875q837K55003K33070L86826K59492
$$ 5260368 5286885 5486141 5639624 5905150 6107025 6098188 6353191 6586261 6973087 7232579
5810G232579K02480K65366K30575K53245K55786L49262K17570J76517P9789K71334
$$ 7232579 7435059 7700425 7931000 8184245 8440031 8789293 9006863 9183380 9263169 9534503
5800I534503K94595L60739J89295K59181K52177K71476J54447K84449N60447L59671
$$ 9534503 9829098 10189837 10379132 10638313 10890490 11161966 11316413 11600862 12161309 12520980
5790A2520980K50209L35308L69218L17109O4223K42269N26200L60484K81442K33020
$$ 12520980 12771189 13106497 13475715 13792824 13857047 14099316 14625516 14986000 15267442 15500462
5780A5500462L66634L76228L36639L96709M19934O24419N26920M64685M84075
$$ 15500462 15867096 16243324 16579963 16976672 17396606 18021025 18547945 19012630 19496705
5771A9496705M81563M76888M64691N86823L67208L80737K86846K90571M71206
$$ 19496705 19978268 20455156 20919847 21506670 21873878 22254615 22541461 22832032 23303238
5762B3303238N05572N63054O14097O16415O19078O86330P26582N13426L58240
$$ 23303238 23808810 24371864 24985961 25602376 26221454 26907784 27634366 28147792 28506032
5753B8506032L84608K79713J89096J86739J41548m4162M928P8238J89017J85096
$$ 28506032 28890640 29170353 29359449 29546188 29687736 29643574 29648502 29726740 29915757 30100853
5743C0100853L35327J82607K68051K85916L4654l9107K2763p6314l12650j46260
$$ 30100853 30436180 30618787 30886838 31172754 31207408 31168301 31191064 31114750 30802100 30655840
5733C0655840J00166j32802k72506j08731p8699j04768J5287m7453R9758L28522
$$ 30655840 30756006 30623204 30350698 30241967 30163268 30058500 30073787 30026334 30126092 30454614
5723C0454614K20542M08892M42688L79134M90440O51328N86128M49314P11472
$$ 30454614 30675156 31084048 31526736 31905870 32396310 33047638 33633766 34083080 34794552
5714C4794552O53971L07014M44161M78108N08070O98859N97662P30910R84376
$$ 34794552 35448523 35755537 36199698 36677806 37185876 37884735 38482397 39213307 40197683
5705D0197683R79768J114080J361537J419860J400417J797937K147875K306471
$$ 40197683 41177451 42291531 43653068 45072928 46473345 48271282 50419157 52725628
5697E2725628K404309K617183K741273K916000K668108K554715K308792J772819
$$ 52725628 55129937 57747120 60488393 63404393 66072501 68627216 70936008 72708827
5689G2708827J400389Q10199N06581K48056j51599l87464o22473j252373j546530
$$ 72708827 74109216 74919415 75425996 75674052 75522453 75134989 74512516 73260143 71713613
5680G1713613j996436k331550k388582k337068k535916k476655k597646k554147
$$ 71713613 69717177 67385627 64997045 62659977 60124061 57647406 55049760 52495613
5672E2495613k576584k572477k658523k437262k184904k249586k012221j837847
$$ 52495613 49919029 47346552 44688029 42250767 40065863 37816277 35804056 33966209
5664C3966209j543434j417832j163126j068684p76117o93699m61892m23716l71167
$$ 33966209 32422775 31004943 29841817 28773133 27997016 27303317 26841425 26417709 26046542
5655B6046542k84748j16498j53044p0190J08766L3694J61592Q4752k46768l88553
$$ 26046542 25761794 25645296 25492252 25422062 25530828 25564522 25726114 25810866 25564098 25175545
5645B5175545l42017n68079r00849j017795j088010j075925j131705r69949q06753
$$ 25175545 24833528 24265449 23364600 22346805 21258795 20182870 19051165 18081216 17274463
5636A7274463r26998r18145o59170o17969n93223n73199m57421k22938k39719
$$ 17274463 16347465 15429320 14770150 14152181 13558958 12985759 12528338 12305400 12065681
5627A2065681k16701k53146l17037j90920J33754l5127j11643K0271j25644P2399
$$ 12065681 11848980 11595834 11278797 11087877 11221631 11186504 11074861 11095132 10969488 11041887
5617A1041887q5289k79160m54420m13152l39396k39846m07372m50795j83925l05293
$$ 11041887 10956598 10677438 10223018 9809866 9470470 9230624 8823252 8372457 8188532 7883239
5607G883239k15149k02569j36689k85634l18563r0314k1073j54664o0280k43927
$$ 7883239 7668090 7465521 7328832 7043198 6724635 6634321 6613248 6458584 6398304 6154377
5597F154377o209L0582j25337m9675j16095L4960q796k6516J1654O1645P0993
$$ 6154377 6148168 6178750 6053413 6003738 5887643 5922603 5913807 5887291 5898945 5960590 6031583
5586F031583O0215L10175R4974j83289J00389K5389j69863j44074j33789k46780
$$ 6031583 6091798 6401973 6496947 6313658 6414047 6439436 6269573 6125499 5991710 5744930
5576E744930k24755l72050j34670q6857j72687j20478j89098j29873j48698j39385
$$ 5744930 5520175 5148125 5013455 4926598 4753911 4633433 4444335 4314462 4165764 4026379
5566D026379J09853p4332j06161o5145r5260m5539p0952m8087j25159J0128o9068
$$ 4026379 4136232 4061900 3955739 3890594 3795334 3749795 3678843 3630756 3505597 3515725 3446657
5555C446657j16722L1518K5246k6203k32017J06078m5556m9208l3514j28597J1163
$$ 3446657 3329935 3361453 3386699 3360496 3128479 3234557 3189001 3139793 3106279 2977682 2988845
5544B988845n3316K7582o3040N1144N1152J08920n4476j04091r1319N7030j00232
$$ 2988845 2935529 2963111 2900071 2951215 3002367 3111287 3056811 2952720 2861401 2918431 2818199
5533B818199J82755J4137j40088p9691r1405P1109j11816o0831N8165M7196P5602
$$ 2818199 3000954 3015091 2875003 2795312 2703907 2775016 2663200 2602369 2660534 2707730 2783332
5522B783332J63726j0255j88073L7661J19473J6932r258M4545n4527O9483m8573
$$ 2783332 2947058 2936803 2748730 2786391 2905864 2922796 2913538 2958083 2903556 2973039 2924466
5511B924466j7971l5508J3730j2574m198o095J21322J12422p2968J27578j3211
$$ 2924466 2906495 2870987 2884717 2872143 2867945 2861850 2983172 3095594 3022626 3150204 3136993
5500C136993p3346m3346K0746Q8052j9290p1592l199R4626J04684Q7360P0380
$$ 3136993 3063647 3020301 3041047 3129099 3109809 3038217 3035018 3129644 3234328 3321688 3392068
5489C392068j174j34895J9073J97855n0796l2350Q8079J20240J14317m7934J4087
$$ 3392068 3390894 3255999 3275072 3472927 3422131 3389781 3477860 3598100 3712417 3664483 3678570
5478C678570N7693K11935J09019R234M8504m489J04195J03226N5964k7141J44202
$$ 3678570 3736263 3948198 4057217 4066451 4114955 4110466 4214661 4317887 4373851 4346710 4490912
5467D490912J25856l9906k0008R6997O7960J05719J48694q731J10833J57660N3655
$$ 4490912 4616768 4576862 4556854 4653851 4721811 4827530 4976224 4967493 5078326 5235986 5289641
5456E289641J55560J05247N7657j52002K75359R8806J46258K07244J55222K63226
$$ 5289641 5445201 5550448 5608105 5456103 5731462 5830268 5976526 6183770 6338992 6602218
5446F602218J65415J25757K29862R5718Q1185J45586K16638K54398K32795K16948
$$ 6602218 6767633 6893390 7123252 7218970 7300155 7445741 7662379 7916777 8149572 8366520
5436H366520L17563L23685K21297M08915L63099K20605L46778L64028K10954K34885
$$ 8366520 8684083 9007768 9229065 9637980 10001079 10221684 10568462 10932490 11143444 11378329
5426A1378329L03798M54945M11866L85695N09541K57143L45117N29461L93105
$$ 11378329 11682127 12137072 12548938 12934633 13444174 13701317 14046434 14575895 14969000
5417A4969000J71590M24017K12815J09467M10918K90202K45023J88790M82083
$$ 14969000 15140590 15564607 15777422 15886889 16297807 16588009 16833032 17021822 17503905
5408A7503905L27758L88288N38040M26621N94235Q96156Q77109R61262J104677
$$ 17503905 17831663 18219951 18757991 19184612 19778847 20675003 21552112 22513374 23618051
5399B3618051J240044J214000J379121J513656J827374J969766K115576K155692
$$ 23618051 24858095 26072095 27451216 28964872 30792246 32762012 34877588 37033280
5391C7033280K187215K376627K281076K077573K274127J930577J606282J196566
$$ 37033280 39220495 41597122 43878198 45955771 48229898 50160475 51766757 52963323
5383E2963323M72377p4567n57423q11666j004562r24011r19769p37311l75607
$$ 52963323 53435700 53361133 52803710 51992044 50987482 50063471 49143702 48406391 48030784
5374D8030784j49680K12872O18692R61757J483805J755391K226938K651123K897436
$$ 48030784 47881104 48093976 48712668 49674425 51158230 52913621 55140559 57791682 60689118
5365F0689118L230315L544605L765872L932830L858050L801808L542829L235478
$$ 60689118 63919433 67464038 71229910 75162740 79020790 82822598 86365427 89600905
5357H9600905K659772K075419J369921M31120l60777j335242k323256l007470
$$ 89600905 92260677 94336096 95706017 96137137 95776360 94441118 92117862 89110392
5349H9110392l496741l993018m362517m742119m533713m239587m520829m173550
$$ 89110392 85613651 81620633 77258116 72515997 67982284 63742697 59221868 55048318
5341E5048318l753505l610099l621673l188043k740331k617020k231360k072801
$$ 55048318 51294813 47684714 44063041 40874998 38134667 35517647 33286287 31213486
5333C1213486k029996j751815j422088j507823j272898j118805r89118r12353
$$ 31213486 29183490 27431675 26009587 24501764 23228866 22110061 21120943 20208590
5325B0208590q71431q73779q70331p37399o28368n39481n22830n11520n69480
$$ 20208590 19337159 18463380 17593049 16855650 16227282 15687801 15164971 14653451 14083971
5316A4083971o00512n59817l78385k07193l41478l85961l75633l44699k69074
$$ 14083971 13483459 12923642 12545257 12338064 11996586 11610625 11234992 10890293 10621219
5307A0621219k70415k43407j52915j60187k95010j55874j12961j33087n5689o390
$$ 10621219 10350804 10107397 9954482 9794295 9499285 9343411 9230450 9097363 9041674 9035284
5297I035284q157m7582N0446j19870j16917l5463j41465j91363q2595j202j72349
$$ 9035284 9027127 8979545 9029991 8910121 8793204 8757741 8616276 8424913 8342318 8341116 8168767
5286H168767j44435j51335l15722k10895j36007k01497q5047k67728k54242j00776
$$ 8168767 8024332 7872997 7557275 7346380 7210373 7008876 6923829 6656101 6401859 6301083
5276F301083k20342m2373j02865m7655K7708K133j09115n5191r9295p4173O8031
$$ 6301083 6080741 6038368 5935503 5887848 5915556 5917689 5808574 5753383 5654088 5579915 5647946
5265E647946K2135p1140m4149j53890p6518j34133q0277n1121j28944O6000m8934
$$ 5647946 5670081 5598941 5554792 5400902 5324384 5190251 5109974 5058853 4929909 4995909 4946975
5254D946975M9316n6704l30192K872p5965o2233P9493j65592M2501j5270k7414
$$ 4946975 4996291 4939587 4609395 4612267 4536302 4474069 4553562 4387970 4430471 4415201 4387787
5243D387787j31321J02865J68552J02063m9737l3237J03414J06609J49668m3366
$$ 4387787 4256466 4359331 4527883 4629946 4580209 4546972 4650386 4756995 4906663 4863297
5233D863297j39373n53J25628o6741R5023O4941n4960l8048k118J37192j22910
$$ 4863297 4723924 4723371 4848999 4782258 4877281 4942222 4887262 4849214 4847096 4984288 4861378
5222D861378j8085l1242J3308J60k4828J15189q2527n2323k09904j59920J92074
$$ 4861378 4843293 4812051 4825359 4825519 4800691 4915880 4833353 4781030 4571126 4411206 4603280
5211D603280j29352k4875j65227j73635j69318q3926J5245j59495r6580Q1859
$$ 4603280 4473928 4449053 4283826 4110191 3940873 3856947 3872192 3712697 3616117 3697976
5201C697976J9089r1526j10685Q7985J29321n0990j4462J08930n9429j1810R9735
$$ 3697976 3717065 3625539 3514854 3602839 3732160 3681170 3666708 3775638 3716209 3704399 3804134
5190C804134L4373P820j1470j02943R3975j1068q9022j16096j88697P296m8308
$$ 3804134 3838507 3846327 3834857 3731914 3825889 3814821 3725799 3609703 3421006 3428302 3379994
5179C379994n8318k46915r7110m3062m1424p8999J8266j01232n9245j9630O6971
$$ 3379994 3321676 3074761 2977651 2934589 2893165 2814166 2832432 2731200 2671955 2652325 2719296
5168B719296j7831j17605k16838k8536n6565K9834k51226p2805O7386n8762J5433
$$ 2719296 2701465 2583860 2367022 2338486 2281921 2311755 2060529 1987724 2055110 1996348 2011781
5157B011781n2845p9363p2797J37216o6943k9849j1585L2611P6813O309j53232
$$ 2011781 1958936 1879573 1806776 1943992 1877049 1847200 1835615 1868226 1945039 1951348 1798116
5146A798116Q45q1673l8060M0509O5138m2105r9908n5581l2333K6805K4443l4025
$$ 1798116 1798961 1717288 1679228 1719737 1784875 1742770 1642862 1587281 1554948 1581753 1606196 1572171
5134A572171k1059K1706l0804r5368r1619J0557l9863J14267j03931m9938P6871
$$ 1572171 1551112 1572818 1542014 1446646 1355027 1365584 1325721 1439988 1336057 1286119 1362990
5123A362990k603n3454j66305p1326J08144J96929q1278k0134K6330j8828K9189
$$ 1362990 1360387 1306933 1140628 1069302 1177446 1374375 1293097 1272963 1299293 1280465 1309654
5112A309654k335M9176m8930p6577l656J23520j09878k600K8575q136k1262m3615
$$ 1309654 1307319 1356495 1307565 1230988 1227332 1350852 1240974 1238374 1266949 1258813 1237551 1193936
5100A193936K0911P8153j03674O0908M4200k3335J7916l4396N2957J8283j41508
$$ 1193936 1214847 1293000 1189326 1250234 1294434 1271099 1289015 1254619 1307576 1325859 1184351
5089A184351k1944K747j05966J23595N0484J9212K4791J29221J35793p0246n8767
$$ 1184351 1162407 1165154 1059188 1182783 1233267 1252479 1277270 1406491 1542284 1472038 1413271
5078A413271l7212P3332J02921M8909r7916k2174r285K6996K1410Q3593R6798
$$ 1413271 1376059 1449391 1552312 1601221 1503305 1481131 1471846 1498842 1520252 1603845 1700643
5067A700643r6041K1218m8652J28226j07419J37783j5623m0744R2198J03433O6065
$$ 1700643 1604602 1625820 1577168 1705394 1597975 1735758 1720135 1679391 1771589 1875022 1941087
5056A941087k8833j2498P358M8905M6083K0931j02220N6462J21240P9179j7466
$$ 1941087 1912254 1899756 1907114 1956019 2002102 2023033 1920813 1977275 2098515 2177694 2160228
5045B160228l6824R7425L8210J52204K5278M5243J36979J7854J2297J08460J3352
$$ 2160228 2123404 2220829 2259039 2411243 2436521 2481764 2618743 2636597 2648894 2757354 2770706
5034B770706O8430K55021Q8728Q1154K0936J26055p2760p3013P7304p7698P1725
$$ 2770706 2839136 3094157 3182885 3264039 3284975 3411030 3338270 3265257 3342561 3264863 3336588
5023C336588q3567m2564p9191j7669J0100M040j29748j1488J21529k8443J61393
$$ 3336588 3253021 3210457 3131266 3113597 3123697 3127737 2997989 2986501 3108030 3079587 3240980
5012C240980K4876K1787l8095Q4329K1512J14274K7146J03414J38015J17322O572
$$ 3240980 3265856 3287643 3249548 3333877 3355389 3469663 3496809 3600223 3738238 3855560 3862132
5001C862132o1137o3305J04362O6971j08053L2389J43709O9508p0871N3425p3665
$$ 3862132 3800995 3737690 3842052 3909023 3800970 3833359 3977068 4046576 3975705 4029130 3955465
4990C955465L8820R2753k5539l7060j17100j07409J72904J29094o7943j45523
$$ 3955465 3994285 4087038 4061499 4024439 3907339 3799930 3972834 4101928 4033985 3888462
4980C888462q4367m1582j96929j23342k3279j10532k31090n6828N3369k894m086
$$ 3888462 3804095 3762513 3565584 3442242 3418963 3308431 3077341 3020513 3073882 3070988 3066902
4969C066902j3010j59621o4321J71351O2635j65837m7015P8738O0838n8435M524
$$ 3066902 3053892 2894271 2829950 3001301 3063936 2898099 2851084 2929822 2990660 2932225 2936749
4958B936749p529k1748J17848N8962l4041j21145k021m8663j2791j22075j77399
$$ 2936749 2929220 2907472 3025320 3084282 3050241 2929096 2927075 2878412 2865621 2743546 2566147
4947B566147l4805j7136j58357m161O5078j44363j42980o0974j01375N5487j13022
$$ 2566147 2531342 2514206 2355849 2351688 2416766 2272403 2129423 2068449 1967074 2022561 1909539
4936A909539r150K2998N5221r0631q5883N4580P255n1988o521L1482q1211R530
$$ 1909539 1900389 1923387 1978608 1887977 1802094 1856674 1863929 1811941 1805420 1836902 1755691 1765221
4924A765221R809r6152q0040R428N7027J75015M1373j7402q2252n6167O184Q415
$$ 1765221 1775030 1678878 1598838 1608266 1665293 1840308 1881681 1864279 1782027 1725860 1732044 1740459
4912A740459N838K8835j12327O2312J36945k8402j46654q0707J62186K909N0991
$$ 1740459 1746297 1775132 1662805 1725117 1862062 1833660 1687006 1606299 1768485 1771394 1822385
4901A822385k8491k8751L9333Q382r0314p3328N6178l6162N1859J85229O929P7479
$$ 1822385 1793894 1765143 1804476 1812858 1722544 1649216 1705394 1669232 1721091 1906320 1913249 1990728
4889A990728K02407j54258N1099q5636o150R1912L9917l3720r7734o5086J04651
$$ 1990728 2193135 2038877 2089976 2004340 1998190 2090102 2130019 2096299 1998565 1933479 2038130
4878B038130j17593N2702L0808j16719L1273M1684m2741l6407L467J5325P2356
$$ 2038130 1920537 1973239 2004047 1887328 1918601 1960285 1917544 1881137 1884604 1899929 1972285
4867A972285k5455m2864o9884Q0718Q5185O5157M8040P0559m010j52832l4682
$$ 1972285 1946830 1903966 1834082 1914800 1999985 2065142 2113182 2183741 2179731 2026899 1992217
4856A992217l3569K3237N2889M2094O8981M1507p7593L9997J33149K4710q9359
$$ 1992217 1958648 1981885 2034774 2076868 2145849 2187356 2109763 2149760 2282909 2307619 2218260
4845B218260j31412R0527L8731M789o3396r4976Q1216J65763P3188k6387m2247
$$ 2218260 2086848 2177375 2216106 2220895 2157499 2062523 2143739 2309502 2382690 2356303 2314056
4834B314056J8152m2873m0350R8059K78846j8461m2490o9155k9294o2324J46136
$$ 2314056 2332208 2289335 2248985 2347044 2625890 2607429 2564939 2495784 2466490 2404166 2550302
4823B550302J48335o1069M4462j31378J32N4413N0425l8412J62239J33811q1828
$$ 2550302 2698637 2637568 2682030 2550652 2550784 2605197 2655622 2617210 2779449 2913260 2831432
4812B831432P8830J1311K6257K1770M5951j02761m0338J44949J17758o9996o017
$$ 2831432 2910262 2921573 2947830 2969600 3015551 2912790 2872452 3017401 3135159 3065163 3059146
4801C059146J73719Q4892j7530N9775P579N784J82425Q9358K5410J25492J51016
$$ 3059146 3232865 3317757 3300227 3360002 3367581 3373365 3555790 3645148 3670558 3796050 3947066
4790C947066J61097O2707o4911l2811J34608m1354j15033J32651J85632J78935
$$ 3947066 4108163 4170870 4105959 4073148 4207756 4166402 4051369 4184020 4369652 4548587
4780D548587k4084P5637J18822J70303L36835J64250K01732K02272K74544M24032
$$ 4548587 4524503 4600140 4718962 4889265 5226100 5390350 5592082 5794354 6068898 6492930
4770F492930M60238M36188N06409K13783j30485l52255m42288l00170j98952k45344
$$ 6492930 6953168 7389356 7895765 8109548 7979063 7626808 7184520 6884350 6685398 6440054
4760F440054l5153J93036j19092J45907J03448M6797Q3539R9573R0415J05573
$$ 6440054 6404901 6597937 6478845 6624752 6728200 6774997 6858536 6958109 7048524 7154097
4750G154097N2439J32532J18159J95832J73057J795O3152K02658K10206m2360
$$ 7154097 7206536 7339068 7457227 7653059 7826116 7827911 7891063 8093721 8303927 8261567
4740H261567R2274J24079K91624K2449J04989K05737K78007K46329K56300K10827
$$ 8261567 8353841 8477920 8769544 8791993 8896982 9102719 9380726 9627055 9883355 10094182
4730A0094182K87292K20615K45200L82264L39462L65446P1306J89759J30702M3987
$$ 10094182 10381474 10602089 10847289 11229553 11569015 11934461 12005767 12195526 12326228 12370215
4720A2370215R1129K05615Q5683M6583J34421K1087J68237L35963M13957L98182
$$ 12370215 12461344 12666959 12752642 12799225 12933646 12954733 13122970 13458933 13872890 14271072
4710A4271072L97386M29965K87568J65955j42996j3210p2668p4970j9365K0725
$$ 14271072 14668458 15098423 15385991 15551946 15408950 15395740 15323072 15248102 15228737 15249462
4700A5249462J91127J75119R0371J87232K07089M35869K80766L31794L78361J83987
$$ 15249462 15440589 15615708 15706079 15893311 16100400 16536269 16817035 17148829 17527190 17711177
4690A7711177L10130J98168K97869M30581L21827K84274L91290L90901L65706
$$ 17711177 18021307 18219475 18517344 18947925 19269752 19554026 19945316 20336217 20701923
4681B0701923L50136L25605L28417K70755L63142L22658K42184M02699K38452
$$ 20701923 21052059 21377664 21706081 21976836 22339978 22662636 22904820 23307519 23545971
4672B3545971K47986L55232L25701K13539L46618M57977N98401N02051O13038
$$ 23545971 23793957 24149189 24474890 24688429 25035047 25493024 26091425 26593476 27206514
4663B7206514N61799O26574P59906R15961R48820R23280R15022O94279R41623
$$ 27206514 27768313 28394887 29154793 30070754 31019574 31942854 32857876 33552155 34493778
4654C4493778P81127Q03132O33194M28855L85218M62941M60812J55842J23159
$$ 34493778 35274905 36078037 36711231 37140086 37525304 37988245 38449057 38604899 38728058
4645C8728058L07187K57426L14848N69579N56027P50256Q95459Q94106J130502
$$ 38728058 39035245 39292671 39607519 40177098 40733125 41483381 42378840 43272946 44403448
4636D4403448J233753J234097J076020J133616J126102Q88655Q81272Q48873P56070
$$ 44403448 45637201 46871298 47947318 49080934 50207036 51095691 51976963 52825836 53581906
4627E3581906P36535N61057M99491M65037L51082j8227k45091l40256n31372n56148
$$ 53581906 54318441 54879498 55378989 55844026 56195108 56176881 55931790 55591534 55060162 54504014
4617E4504014p14414p65780o05803l95762l93585j56451M5122K37648K50874N04048
$$ 54504014 53789600 53023820 52418017 52022255 51628670 51472219 51517341 51754989 52005863 52509911
4607E2509911O43863O49927P66339Q04487Q25625O41771O94640Q87685Q27261
$$ 52509911 53153774 53803701 54570040 55374527 56200152 56841923 57536563 58424248 59251509
4598E9251509P05209O43446P07097R61609Q91015J112970J184839J474011J687571
$$ 59251509 59956718 60600164 61307261 62268870 63159885 64272855 65457694 66931705 68619276
4589F8619276J925664K266939K504526K921742K983481L172518L331060L227091
$$ 68619276 70544940 72811879 75316405 78238147 81221628 84394146 87725206 90952297
4581I0952297K950175K707073K533874K104950J781061J473948J354133J293052
$$ 90952297 93902472 96609545 99143419 101248369 103029430 104503378 105857511 107150563
4573A07150563J398571J577020J210702P27803j0102j013969k343692l226235
$$ 107150563 108549134 110126154 111336856 112064659 112054557 111040588 108696896 105470661
4565A05470661m052226m422951m808591m821138m506974m486788m211974l556019
$$ 105470661 101418435 96995484 92186893 87365755 82858781 78371993 74160019 70604000
4557G0604000l276065l118799k735826k372399k102253j789723j818240j513947
$$ 70604000 67327935 64209136 61473310 59100911 56998658 55208935 53390695 51876748
4549E1876748j329985j430891j065023p64351o78790n17043l29798j43397J5753
$$ 51876748 50546763 49115872 48050849 47286498 46607708 46090665 45760867 45617470 45633223
4540D5633223L87582L91401N55536O51877P90474R41032R27187R16396Q22026
$$ 45633223 46020805 46412206 46967742 47619619 48410093 49351125 50278312 51194708 52016734
4531E2016734P62454M93537O06893M69049L99323K64167J70912J21566L01147
$$ 52016734 52779188 53272725 53879618 54348667 54747990 55012157 55183069 55304635 55605782
4522E5605782L12986N12967O48268P42455Q85912J099746J154022J447207J621752
$$ 55605782 55918768 56431735 57080003 57822458 58708370 59808116 60962138 62409345 64031097
4513F4031097J489560J416143J260558J175685J138537Q55175N26782J56889j16315
$$ 64031097 65520657 66936800 68197358 69373043 70511580 71366755 71893537 72050426 71934111
4504G1934111k80705o82637p27336p19084p98365n95894q11457p36497p40973
$$ 71934111 71653406 70970769 70243433 69524349 68725984 68130090 67318633 66582136 65841163
4495F5841163r76205r97773j091366j167842j076926j014156r29888p44845o32509
$$ 65841163 64864958 63867185 62775819 61607977 60531051 59516895 58587007 57842162 57209653
4486E7209653o03891m18543j88604k33742l97351l93856l96843o04089q32403
$$ 57209653 56605762 56187219 55998615 55764873 55367522 54973666 54576823 53972734 53140331
4477E3140331q17733r57672r51025j149833j139924q60541q16607m60015m20748
$$ 53140331 52322598 51364926 50413901 49264068 48124144 47263603 46446996 45986981 45566233
4468D5566233l7465J22147J74737M47487N06082O53050O16096O78820P65996N19482
$$ 45566233 45528768 45650915 45825652 46273139 46779221 47432271 48048367 48727187 49493183 50012665
4458E0012665L47707N4774l32487m09658p02944p04911m93016l76147n54266o09842
$$ 50012665 50360372 50415146 50082659 49673001 48970057 48265146 47772130 47395983 46841717 46231875
4448D6231875p46067j233366j532772j429122j213160j071478j064332j223850
$$ 46231875 45485808 44252442 42719670 41290548 40077388 39005910 37941578 36717728
4440C6717728j026780j053750j033304r32450p35929p12337m42750m57636n17979
$$ 36717728 35690948 34637198 33603894 32671444 31935515 31223178 30780428 30322792 29804813
4431B9804813k48409j69308k96624l16972k29370k08149k91440k42386j85297
$$ 29804813 29556404 29387096 29090472 28773500 28544130 28335981 28044541 27802155 27616858
4422B7616858j28881k65776j82522J9204J47051K18336k2600K79062N91476O37477
$$ 27616858 27487977 27222201 27039679 27058883 27205934 27424270 27401670 27680732 28272208 28909685
4412B8909685N58925O95026O10634O50774P05458M94468L45745Q6036p1008k30209
$$ 28909685 29468610 30163636 30774270 31425044 32130502 32624970 32970715 33056751 32985743 32755534
4402C2755534l59708m92022m73117l33436j92398k29373J188R3656R3686K94796
$$ 32755534 32395826 31903804 31430687 31097251 30904853 30675480 30676668 30770324 30864010 31158806
4392C1158806L50205L27400M29670M66849O96237R53568J020172J290392J370122
$$ 31158806 31509011 31836411 32266081 32732930 33429167 34382735 35402907 36693299 38063421
4383C8063421J530607J741858K221833K561077K933047L700996M376399N252570
$$ 38063421 39594028 41335886 43557719 46118796 49051843 52752839 57129238 62381808
4375F2381808O082599P014359O975624N677505K569025j751808n385552p151035
$$ 62381808 68464407 75478766 82454390 88131895 90700920 88949112 83563560 76412525
4367G6412525p176072o351047n227849l991730l058186k351033j911170j602202
$$ 76412525 69236453 62885406 57657557 53665827 50607641 48256608 46345438 44743236
4359D4743236j095353q10344p81099n35150m97831k92268J09954J04197K59343
$$ 44743236 43647883 42837539 42056440 41521290 41023459 40731191 40841145 40945342 41204685
4350D1204685J85643M29992M41215O41440P06441P73443R57173R83115J112435
$$ 41204685 41390328 41820320 42261535 42902975 43609416 44382859 45340032 46323147 47435582
4341D7435582J146763J141886J275322J274486J222380J349465J429129J532481
$$ 47435582 48582345 49724231 50999553 52274039 53496419 54845884 56275013 57807494
4333E7807494J653128J762628J909913K118486K156850K416100K618179K905853
$$ 57807494 59460622 61223250 63133163 65251649 67408499 69824599 72442778 75348631
4325G5348631L107487L457763L736768L844216M269713M676812N019350N597447
$$ 75348631 78456118 81913881 85650649 89494865 93764578 98441390 103460740 109058187
4317A09058187O332853O947586P997897Q879631R956056J1250123J2931698J4878447
$$ 109058187 115391040 122338626 130336523 139216154 149172210 160422333 173354031 188232478
4309A88232478J7140198K0069778K3610586K7613897L1798903L5260013L6682281
$$ 188232478 205372676 225442454 249053040 276666937 308465840 343725853 380408134
4302C80408134L4882661K9291237K0058678P573847o420797k0441469l2178936
$$ 380408134 415290795 444582032 464640710 472214557 465793760 445352291 413173355
4295D13173355l9055504m0955442l8414293l4134818k9166182k4485373k0647557
$$ 413173355 374117851 333162409 294748116 260613298 231447116 206961743 186314186
4288A86314186j7354470j4905437j2940511j1379401r959291r043972q027329
$$ 186314186 168959716 154054279 141113768 129734367 119775076 110731104 102703775
4281A02703775p260917o169960n525143m957702m370830l879147l319813l041693
$$ 102703775 95442858 89272898 83747755 78790053 74419223 70540076 67220263 64178570
4273F4178570k729176k511557k288044k160893k012833j951674j867692k024047
$$ 64178570 61449394 58937837 56649793 54488900 52476067 50524393 48656701 46632654
4265D6632654j814597j767975j640326j559319j481268j530155j294489j208948
$$ 46632654 44818057 43050082 41409756 39850437 38369169 36839014 35544525 34335577
4257C4335577j321641j120035j058766j063815r28070q95903q22853q04811o80202
$$ 34335577 33013936 31893901 30835135 29771320 28843250 27947347 27124494 26319683 25639481
4248B5639481p78518o55029n32871o75686p30912p02620m97390n34807m51770
$$ 25639481 24860963 24205934 23673063 22997377 22266465 21563845 21066455 20531648 20079878
4239B0079878n18134n23979n52921m21408m82862l12050n17526l42491m17945
$$ 20079878 19561744 19037765 18484844 18063436 17580574 17268524 16750998 16408507 15990562
4230A5990562m31748k98370l11757m63932j83937j43143k49385m73870m06218
$$ 15990562 15558814 15260444 14948687 14484755 14300818 14157675 13908290 13434420 13028202
4221A3028202j43749l07975l15169k28391k56512j75343k78112k94502k33746
$$ 13028202 12884453 12576478 12261309 12032918 11776406 11601063 11322951 11028449 10794703
4212A0794703k21060p2412k16366r9397k92494j39289k05809P878j44228j76189
$$ 10794703 10573643 10501231 10284865 10185468 9892974 9753685 9547876 9555754 9411526 9235337
4202I235337M9886k6240j51388j22822j38326j19120Q4946o6169k81609l9151
$$ 9235337 9285223 9258983 9107595 8984773 8846447 8727327 8812273 8746104 8464495 8425344
4192H425344o5029l4223O2613j87332q1298m7074k24741j54113r6777j42343m1305
$$ 8425344 8360315 8326092 8388705 8201373 8120075 8073001 7848260 7694147 7597370 7455027 7413722
4181G413722k42119j51366L1550q4788k41276Q6823J7764o5477j21196n0054j49918
$$ 7413722 7171603 7020237 7051787 6966999 6725723 6812546 6830310 6764833 6643637 6593583 6443665
4170F443665o6598P8715j05029l0625J9047k8667n1098N5755l8279P6915O9132
$$ 6443665 6377067 6455782 6350753 6320128 6339175 6310508 6259410 6315165 6276886 6353801 6422933
4159F422933o8176m8199j19716O7822j19841r9844n9918R879j9326R2639j28824
$$ 6422933 6354757 6306558 6186842 6254664 6134823 6034979 5975061 5984940 5965614 6058253 5929429
4148E929429K969j6657m9636N3270M0569p5295l04300l1210j00643j30118n0454
$$ 5929429 5932398 5915741 5866105 5919375 5959944 5884649 5580349 5549139 5448496 5318378 5267924
4137E267924M7571j24420K1666K3062J51685j10663J4154J2346n039p5904K0636
$$ 5267924 5315495 5191075 5212741 5235803 5387488 5276825 5290979 5303325 5298286 5222382 5243018
4126E243018l4225j04982j40284p9643k323k0195J806N64m7089M1968j08860J8035
$$ 5243018 5208793 5103811 4963527 4883884 4881561 4861366 4863172 4863736 4816647 4858615 4749755 4767790
4114D767790q3320J33849K7148J3225N9109m7178j67174j9854l3335J17770O0838
$$ 4767790 4684470 4818319 4845467 4858692 4917801 4870623 4703449 4683595 4650260 4768030 4828868
4103D828868n2300J07175m4419j4682n8571N4468N890J38059m4157J00770l1786
$$ 4828868 4776568 4883743 4839324 4824642 4766071 4820539 4826429 4964488 4920331 5021101 4989315
4092D989315m8036J04687J81748M872R8295M1031N6645n319J62560K5195m443
$$ 4989315 4941279 5045966 5227714 5232586 5330881 5371912 5428557 5423238 5585798 5610993 5606550
4081E606550L4142r0393J60884J50099K3087J64785Q4042K21927K7101L3808R9798
$$ 5606550 5640692 5550299 5711183 5861282 5884369 6049154 6133196 6355123 6382224 6416032 6515830
4070F515830L9872K04977M6072J14113K11908L2425j20825J89820k0429j81949
$$ 6515830 6555702 6760679 6806751 6920864 7132772 7165197 7044372 7234192 7213763 7031814
4060G031814J65269J40218Q1002K29483N1560N2205R7748l8843K8640J4863J66459
$$ 7031814 7197083 7337301 7418303 7647786 7699346 7751551 7849299 7810456 7839096 7853959 8020418
4049H020418J78175J68256N451J89055J54277N7691K37740J40388L6354J95520
$$ 8020418 8198593 8366849 8372300 8561355 8715632 8773323 9011063 9151451 9187805 9383325
4039I383325J73291Q4371J50602J32280K48311K02363K04749L12947K11224L45194
$$ 9383325 9556616 9640987 9791589 9923869 10172180 10374543 10579292 10892239 11103463 11448657
4029A1448657L03441J89063M63842M18474K27501L98841M31721M50097O04341
$$ 11448657 11752098 11941161 12405003 12823477 13050978 13449819 13881540 14331637 14935978
4020A4935978N54598O47892O38052O67948O83730P04274P28849O39424P43846
$$ 14935978 15490576 16138468 16776520 17444468 18128198 18832472 19561321 20200745 20944591
4011B0944591N32196M40538N06361P26556O08033N34991Q19357P48288Q66727
$$ 20944591 21476787 21917325 22423686 23150242 23758275 24293266 25112623 25860911 26727638
4002B6727638P48138P65537O83785P90694M62039L59779M40230M89857K91339
$$ 26727638 27475776 28241313 28925098 29715792 30177831 30537610 30977840 31467697 31759036
3993C1759036M57683N51643M41130M57293L05950L42940J71447R9208j31884k77081
$$ 31759036 32216719 32768362 33209492 33666785 33972735 34315675 34487122 34586330 34454446 34177365
3983C4177365l51324n70388n08760n94731m92114n22347m59125l81127k97776
$$ 34177365 33826041 33255653 32746893 32152162 31660048 31137701 30678576 30297449 29999673
3974B9999673l67682m61366m47848q11009q10211q67800r24095r32221r15907
$$ 29999673 29631991 29170625 28722777 27911768 27101557 26233757 25309662 24377441 23461534
3965B3461534q89592q20989p14847o40072n55576p36386o53088n76987p47847
$$ 23461534 22571942 21750953 21036106 20396034 19840458 19104072 18450984 17873997 17126150
3956A7126150o08927p01061o72858q37304p11580n61800o07776o44331n38897
$$ 17126150 16517223 15816162 15143304 14306000 13594420 13032620 12424844 11780513 11241616
3947A1241616m90986m16632m52427m38698l54685k50212m84098m06777k04370
$$ 11241616 10750630 10333998 9881571 9442873 9088188 8837976 8353878 7947101 7742731
3938G742731l10542j77127l85793k05523k53446k37354k13403k89932j53893j39291
$$ 7742731 7432189 7255062 6869269 6663746 6410300 6172946 5959543 5669611 5515718 5376427
3928E376427o3732r5389k18273k55452j25758j73031j52516k03774m9248q0433
$$ 5376427 5312695 5217306 4999033 4743581 4617823 4444792 4292276 4088502 4039254 3958821
3918C958821j99719q0727r5783j52721m5024m8375j45089M4689j5782q9682j66202
$$ 3958821 3759102 3678375 3582592 3429871 3384847 3336472 3191383 3236072 3220290 3130608 2964406
3907B964406N1229L904n2560j23129j38147J26341p6991r5683m3573j11725l2739
$$ 2964406 3015635 3019539 2966979 2843850 2705703 2832044 2755053 2659370 2615797 2504072 2471333
3896B471333J9954j74040k3232j19260j33864p005k6470k6416l9458j28025M9608
$$ 2471333 2491287 2317247 2294015 2174755 2040891 2033886 2007416 1981000 1941542 1813517 1863125
3885A863125l9828j26549P8879n8556j0787K9811l0896j03835j1851r3472m1469
$$ 1863125 1823297 1696748 1775627 1717071 1706284 1736095 1705199 1601364 1589513 1496041 1454572
3874A454572M1063L661N1091k7979Q2228J27383j15079n7841r8593m9181Q0096
$$ 1454572 1495635 1499296 1550387 1522408 1604636 1732019 1616940 1559099 1460506 1411325 1491421
3863A491421J48678o2414l6923j150n3557j62379k82K2455q0222q432M2730n9391
$$ 1491421 1640099 1577685 1540762 1539612 1486055 1323676 1323394 1345849 1265627 1257195 1299925 1240534
3851A240534K15682j75278j67251J44669p2981q9884J52546Q1850o6832J29456
$$ 1240534 1456216 1280938 1113687 1258356 1185375 1095491 1248037 1329887 1263055 1392511
3841A392511j44031N2977J00301l569k3727l4653j4641m3872N2555L6508M3856
$$ 1392511 1248480 1301457 1401758 1398189 1374462 1339809 1325168 1281296 1333851 1370359 1414215
3830A414215O335p0328L9499j04782j18094o7398Q2344k4665j4884J9765n1547
$$ 1414215 1420550 1350222 1389721 1284939 1166845 1099447 1181791 1157126 1142242 1162007 1110460
3819A110460J6786p3543j8827Q9877J37842m4413j75570J03934n2738J00303J57188
$$ 1110460 1127246 1053703 1034876 1124753 1262595 1218182 1042612 1146546 1093808 1194111 1351299
3808A351299j45860j53689N699J6517J1547J13061j4119o9760J9387m7611K9821
$$ 1351299 1205439 1051750 1057449 1073966 1085513 1198574 1184455 1114695 1134082 1086471 1116292
3797A116292J03683Q8853l4398j14716n9647J8093J44161m1042K6016R7905j31415
$$ 1116292 1219975 1308828 1274430 1159714 1100067 1118160 1262321 1221279 1247295 1345200 1213785
3786A213785q3056n7495M1019O8300M8992o1621L8237J11537j55230n5712L3758
$$ 1213785 1130729 1073234 1114253 1182553 1231545 1169924 1208161 1319698 1164468 1108756 1142514
3775A142514M5875n2894L010k7061o9664Q8375m4116J44298m7005L4712R6131
$$ 1142514 1188389 1135495 1138505 1111444 1041780 1130155 1086039 1230337 1183332 1218044 1314175
3764A314175j5268j8743k4484n393j45822m0024J49891O7064j68074p5958j1551
$$ 1314175 1298907 1280164 1255680 1250287 1104465 1064441 1214332 1281396 1113322 1037364 1025813
3753A025813J64767J39183j37893q9616L6458P9044p1582p5739O4433n3455k990
$$ 1025813 1190580 1329763 1191870 1102254 1138712 1217756 1146174 1070435 1134868 1081413 1078423
3742A078423L7360P575k8283Q0874n3367L1237K1385K7829o6359l6552k6010M4248
$$ 1078423 1115783 1123358 1095075 1175949 1122582 1153819 1175204 1203033 1136674 1100122 1074112 1118360
3730A118360Q3990N4723M4417p7094k08215J11820N5778j05570p0944K8753L0246
$$ 1118360 1202350 1257073 1301490 1224396 1016181 1128001 1183779 1078209 1007265 1036018 1066264
3719A066264J48128N1836j82583o7255P9483K31007J2366j12925n868J08020N8007
$$ 1066264 1214392 1266228 1083645 1016390 1095873 1326880 1339246 1226321 1220453 1328473 1386480
3708A386480K8406r9490K07819L8101j27801j69185N2834m2656L679J39813n4652
$$ 1386480 1414886 1315396 1523215 1561316 1433515 1264330 1317164 1274508 1278187 1418000 1363348
3697A363348j05589O5901P4098O5282k1108m4J35514j70J7768j39525k1234J76229
$$ 1363348 1257759 1323660 1397758 1463040 1441932 1441888 1577402 1577232 1595000 1455475 1434241 1610470
3685A610470O9984o2507j11076J35080o425n6712J42215n3285Q651Q2694Q9781
$$ 1610470 1680454 1617947 1506871 1641951 1635526 1578814 1721029 1667744 1676395 1759089 1848870
3674A848870K1262j01644K0510N0020m7954m8302K678L7491j11147j05176L2921
$$ 1848870 1870132 1768488 1788998 1839018 1791064 1742762 1745440 1782931 1671784 1566608 1599529
3663A599529J49501J27089J5024R290r2838J7484M9204k696l0616L5950p8377
$$ 1599529 1749030 1876119 1891143 1900433 1807595 1825079 1874283 1871587 1840971 1876921 1798544
3652A798544R0305P7997k29004N9142j8412L0547k4011k1926O1347M8661K6391
$$ 1798544 1888849 1966846 1737842 1796984 1778572 1809119 1785108 1763182 1824529 1873190 1899581
3641A899581j22893N0240j608M6780L0340j36621O6123p2884r9044p163J60677
$$ 1899581 1776688 1826928 1825320 1872100 1902440 1765819 1831942 1759058 1660014 1652851 1813528
3630A813528r1104M0736N5358k0413O5793n40N4939J5706o7369M5261o5816K8133
$$ 1813528 1722424 1763160 1818518 1798105 1863898 1863358 1918297 1934003 1866634 1911895 1846079 1874212
3618A874212P4926R0741R0968k11418k0895O0936J9842L1691n8780J92292K465
$$ 1874212 1949138 2039879 2130847 1919429 1898534 1959470 1979312 2011003 1952223 2144515 2146980
3607B146980j8357J71959R9884q5449j27099O2788M0509J9110O7776j0493j5701
$$ 2146980 2128623 2300582 2400466 2315017 2187918 2250706 2291215 2310325 2378101 2367608 2351907
3596B351907J79066J08905R0167J4152j41610R0919R5773p0822O4420M2067Q9674
$$ 2351907 2530973 2639878 2730045 2744197 2602587 2693506 2789279 2718457 2782877 2824944 2914618
3585B914618L0057o4814n8362L06291m3903J7551J33290P9358n1635j6175K5143
$$ 2914618 2944675 2879861 2821499 3127790 3083887 3101438 3234728 3314086 3262451 3246276 3271419
3574C271419K5591m0547R6208J22732P1386M2773j39097n1176O6903m7908L4104
$$ 3271419 3297010 3256463 3352671 3475403 3546789 3589562 3450465 3399289 3466192 3418284 3452388
3563C452388l3769J5238J25395K7564J28710K7432k0776l740l2871j5832M7980
$$ 3452388 3418619 3433857 3559252 3586816 3715526 3742958 3722182 3718442 3685571 3669739 3717719
3552C717719l087O5555l2389Q9070l5279R4363k3318l1567J61981L9900L9979
$$ 3717719 3714632 3780187 3747798 3836868 3801589 3895952 3872634 3841067 4003048 4042948 4082927
3541D082927k9832R4600K34666O3020J19325J46882J06940J19484P7176P1817
$$ 4082927 4053095 4147695 4382361 4445381 4564706 4711588 4818528 4938012 5015188 5087005
3531E087005q0096k3741Q6579n435K40642J53410J080J88633p0210M9643L8959
$$ 5087005 5006909 4983168 5069747 5064312 5304954 5458364 5459444 5648077 5577867 5627510 5666469
3520E666469m8238L7415J06286J37525K5629k6822N9401P5889j01754n3777J67178
$$ 5666469 5618231 5655646 5761932 5899457 5925086 5898264 5957665 6033554 5931800 5878023 6045201
3509F045201L7177o143K9821K7098N7893N696K3139j4183p70O6402N4587R7384
$$ 6045201 6082378 6076235 6106056 6133154 6191047 6196743 6219882 6205699 6204929 6271331 6325918 6423302
3497F423302K5628N2331J22999J52494Q4898j03218J82226J19445N4033J07035
$$ 6423302 6448930 6501261 6624260 6776754 6861652 6758434 6940660 7060105 7114138 7221173
3487G221173J29583O3831L9851J77412O7486K80308J00818J9641N2125J14211
$$ 7221173 7350756 7414587 7454438 7631850 7699336 7979644 8080462 8100103 8152228 8266439
3477H266439K62005o051J84333J71282P5701J01374P7761Q4663K03796K07115
$$ 8266439 8528444 8522393 8706726 8878008 8953709 9055083 9132844 9217507 9421303 9628418
3467I628418J11776J23566K49704P4772O7431K85820K76538J48470J44224L10300
$$ 9628418 9740194 9863760 10113464 10188236 10255667 10541487 10818025 10966495 11110719 11421019
3457A1421019L74043M73802L08289L37824N26855L90214L45086M18221L09334
$$ 11421019 11795062 12268864 12577153 12914977 13441832 13832046 14177132 14595353 14904687
3448A4904687J28617K97572K87534J85891K17407K92760K79387J32349K54245
$$ 14904687 15033304 15330876 15618410 15804301 16021708 16314468 16593855 16726204 16980449
3439A6980449K55082K20930J94512K01622K25784J93099J39067K7687K34593J29034
$$ 16980449 17235531 17456461 17650973 17852595 18078379 18271478 18410545 18438232 18672825 18801859
3429A8801859J04282J56102J13009J81012J13017R8568J91774L14010J57976K41860
$$ 18801859 18906141 19062243 19175252 19356264 19469281 19567849 19759623 20073633 20231609 20473469
3419B0473469L38861L50130M05824M14302M93958M73530N94090P70335P47448
$$ 20473469 20812330 21162460 21568284 21982586 22476544 22950074 23544164 24314499 25061947
3410B5061947P62341P72913R43323J062212J129285J053579J233691J443734J572276
$$ 25061947 25824288 26597201 27540524 28602736 29732021 30785600 32019291 33463025 35035301
3401C5035301J635847J796712K070217J956649K231568K353857K492104K744528
$$ 35035301 36671148 38467860 40538077 42494726 44726294 47080151 49572255 52316783
3393E2316783K722852K553435K731766K480252K430567K474475K287375K184378
$$ 52316783 55039635 57593070 60324836 62805088 65235655 67710130 69997505 72181883
3385G2181883J682219J526791J516468J130158P20957L24179M72744o9002m56789
$$ 72181883 73864102 75390893 76907361 78037519 78758476 79082655 79555399 79486397 79029608
3376G9029608n69816q48274o75709r27101r44409j228300j306849j493837j684681
$$ 79029608 78459792 77611518 76935809 76008708 75064299 73835999 72529150 71035313 69350632
3367F9350632j929709k035038k357778k455244k528449k638369k638206k498419
$$ 69350632 67420923 65385885 63028107 60572863 58044414 55406045 52767839 50269420
3359E0269420k309153k284997k115991j876586j861567j661671j287434j229549
$$ 50269420 47960267 45675270 43559279 41682693 39821126 38159455 36872021 35642472
3351C5642472j221208r89322q13120p48721o07693m80509m59568k97348l79752
$$ 35642472 34421264 33431942 32618822 31870101 31262408 30781899 30322331 30024983 29645231
3342B9645231j32032m2741k76232m1930k0709J34606J84266K17092K90196K99854
$$ 29645231 29513199 29470458 29194226 29152296 29131587 29266193 29450459 29667551 29957747 30257601
3332C0257601N088K82477M27986K51208J19712J10944J54045K00851K7155M2427
$$ 30257601 30262689 30545166 30973152 31224360 31344072 31455016 31609061 31809912 31837067 31879494
3322C1879494K16777K79430J39670J63244J93618J44976K60165L22592K38133
$$ 31879494 32096271 32375701 32515371 32678615 32872233 33017209 33277374 33599966 33838099
3313C3838099K30977K91225K85300J43435J43309J73409L09699L53778K16854
$$ 33838099 34069076 34360301 34645601 34789036 34932345 35105754 35415453 35769231 35986085
3304C5986085K38848L04466N22300M12404N72297N98184O78105P33069P64044
$$ 35986085 36224933 36529399 37051699 37464103 38036400 38634584 39312689 40045758 40809802
3295D0809802N92814P78285J059457J042802J012522J036077J258710J176502
$$ 40809802 41402616 42180901 43240358 44283160 45295682 46331759 47590469 48766971
3287D8766971J523888J486142J395875J547440J580758J612245J398998J581557
$$ 48766971 50290859 51777001 53172876 54720316 56301074 57913319 59312317 60893874
3279F0893874J446833J394913J428482J183095J179331J105262R83086J022239
$$ 60893874 62340707 63735620 65164102 66347197 67526528 68631790 69614876 70637115
3271G0637115J073577J163859J194959J398558J508073J733984K040580K236559
$$ 70637115 71710692 72874551 74069510 75468068 76976141 78710125 80750705 82987264
3263H2987264K464115K757955L050298L570865L788256M227995M573685N112024
$$ 82987264 85451379 88209334 91259632 94830497 98618753 102846748 107420433 112532457
3255A12532457N568609O183291O609136P123787P648020P881925Q194119Q149995
$$ 112532457 118101066 124284357 130893493 138017280 145665300 153547225 161741344 169891339
3247A69891339Q142732P603083O875781O074649M918385L899627K941640J967807
$$ 169891339 178034071 185637154 192512935 198587584 203505969 207405596 210347236 212315043
3239B12315043J260816Q12969O14027O17234O73460P97265R68196O35361J66896
$$ 212315043 213575859 214388828 215002855 215620089 216293549 217090814 218059010 218694371 218861267
3230B18861267k73238j094682k102832l307959m347922n130548n844561o420015
$$ 218861267 218588029 217493347 215390515 212082556 207734634 202604086 196759525 190339510
3222A90339510o527814o451172o638673o377431n963827n323550n006339m550652
$$ 190339510 183811696 177360524 170721851 164344420 158380593 153057043 148050704 143500052
3214A43500052m103447l369612l006059k476200j902368j367840q69068m45326
$$ 143500052 139396605 136026993 133020934 130544734 128642366 127274526 126405458 125960132
3206A25960132J19309O15813J090875J609849K182298K540990K663517K975326
$$ 125960132 126079441 126695254 127786129 129395978 131578276 134119266 136782783 139758109
3198A39758109K708699K430313K138989J447462Q78897N2152j128966j872842
$$ 139758109 142466808 144897121 147036110 148483572 149362469 149414621 148285655 146412813
3190A46412813k651393l410552m182177m764683n174000n036821m981804m856619
$$ 146412813 143761420 140350868 136168691 131404008 126230008 121193187 116211383 111354764
3182A11354764m419259m041800l401653l043086k558276k335454k024705j602247
$$ 111354764 106935505 102893705 99492052 96448966 93890690 91555236 89530531 87928284
3174H7928284j350456j153968r14362q85047r62179r44339r59377j179593j283608
$$ 87928284 86577828 85423860 84509498 83624451 82662272 81717933 80758556 79578963 78295355
3165G8295355j483019j755798j877694j809092k020268k080039k029363k025819
$$ 78295355 76812336 75056538 73178844 71369752 69349484 67269445 65240082 63214263
3157F3214263j831465j880536j910218j741114j438135j425604j157564j096663
$$ 63214263 61382798 59502262 57592044 55850930 54412795 52987191 51829627 50732964
3149E0732964q89249o60018n99562m69190m68456l28689m26819l63907k17387
$$ 50732964 49843715 49183697 48584135 48114945 47646489 47317800 46890981 46527074 46309687
3140D6309687k35766j68307j31800o1215j16078j23327r0881j33252J3410K73981
$$ 46309687 46073921 45905614 45773814 45712599 45596521 45473194 45382313 45249061 45262471 45536452
3130D5536452K39721J39910M11286L67338L74498L39785M68877L63230O56099
$$ 45536452 45776173 45916083 46327369 46694707 47069205 47408990 47877867 48241097 48897196
3121D8897196N55105K69467M90450L16586K85185K80790J63470O2729k8061M284
$$ 48897196 49452301 49721768 50212218 50528804 50813989 51094779 51258249 51320978 51292917 51297201
3111E1297201k49109k12265l85210m22758m00256j96473j59447j17812Q0975J77931
$$ 51297201 51048092 50835827 50450617 50027859 49627603 49431130 49271683 49153871 49234846 49412777
3101D9412777K97216O37993N31751R09940J281198J631751J701543J793175K070119
$$ 49412777 49709993 50347986 50879737 51789677 53070875 54702626 56404169 58197344 60267463
3092F0267463K291341K625600K547808K454748K752234K566883K283893J891614
$$ 60267463 62558804 65184404 67732212 70186960 72939194 75506077 77789970 79681584
3084G9681584J519744J363725R29813N24379K30665k1087l00505l51056m14265
$$ 79681584 81201328 82565053 83494866 84019245 84249910 84228823 83928318 83577262 83162997
3075H3162997m43935n53125o93027p17997r49500j170710j487020k050104k236871
$$ 83162997 82719062 82165937 81472910 80754913 79805413 78634703 77147683 75097579 72860708
3066G2860708k698040k874391l081196l318303l316149l256148l027076k828806
$$ 72860708 70162668 67288277 64207081 60888778 57572629 54316481 51289405 48460599
3058D8460599k555309k459278k344535j941403j874766j692204j596188j580931
$$ 48460599 45905290 43446012 41101477 39160074 37285308 35593104 33996916 32415985
3050C2415985j419520r73481r98561q71551r12809r29630p47283o32925p17332
$$ 32415985 30996465 30022984 29024423 28152872 27240063 26310433 25563150 24930225 24212893
3041B4212893n20698o21317l96804k37959l48291l46013k74649m56899l21525
$$ 24212893 23692195 23070878 22674074 22436115 22087824 21741811 21467162 21010263 20688738
3032B0688738j98410m60862k10250k53093r3447k10549j35706l6065k08619l025
$$ 20688738 20490328 20029466 19819216 19566123 19472676 19262127 19126421 19090356 18881737 18878712
3022A8878712L303k5473n789P7582J00414K21159O8963J61053J75752K0174n3122
$$ 18878712 18882015 18856542 18850753 18928335 19028749 19249908 19318871 19479924 19655676 19675850 19622728
3011A9622728j70387k24027l65377l99812m34288n05804m87272m95856o92421
$$ 19622728 19452341 19228314 18862937 18463125 18028837 17523033 17035761 16539905 15847484
3002A5847484m01761m43064l09901k63681m49400l06566k93957k58709k50650
$$ 15847484 15445723 15002659 14692758 14429077 13979677 13673111 13379154 13120445 12869795
2993A2869795j55263k63940j00443p1445j63226k53326q4356q1304j05489k21510
$$ 12869795 12714532 12450592 12350149 12278704 12115478 11862152 11777796 11696492 11591003 11369493
2983A1369493O2896j20879r1125J43793j67974q844R2758j3250J18032O7928Q2131
$$ 11369493 11432389 11311510 11220385 11364178 11196204 11187360 11280118 11266868 11384900 11452828 11534959
2972A1534959J39722k018R3713o590J27414l7674M5088N3118J48679O7788P4532
$$ 11534959 11674681 11672663 11766376 11759786 11887200 11849526 11894614 11947732 12096411 12164199 12238731
2961A2238731r0554J14094R8151O8803J34838q8218J28490J51479J26253j2350
$$ 12238731 12148177 12262271 12360422 12429225 12564063 12475845 12604335 12755814 12882067 12869717
2951A2869717J42829K62275Q2199J78063K31863K38454K44948K55744m217M30279
$$ 12869717 13012546 13274821 13357020 13535083 13766946 14005400 14250348 14506092 14501875 14932154
2941A4932154K79522K07668J32466J90052L01591L21626L25893L04035L05557
$$ 14932154 15211676 15419344 15551810 15741862 16043453 16365079 16690972 16995007 17300564
2932A7300564J49707M21993L7966K70647L28436J71540J15030M21123M59831L97190
$$ 17300564 17450271 17872264 17910230 18180877 18509313 18680853 18795883 19217006 19676837 20074027
2922B0074027K65148L78530L66502L22610L46320M69167N52437O10269N18514
$$ 20074027 20339175 20717705 21084207 21406817 21753137 22222304 22774741 23385010 23903524
2913B3903524O04941O93782O74686Q47218O90085P09096O11828P15479N22297
$$ 23903524 24508465 25202247 25876933 26724151 27414236 28123332 28735160 29450639 29972936
2904B9972936P50834O89162O22335P25653Q40024J024810J023412J055536J145249
$$ 29972936 30723770 31412932 32035267 32760920 33600944 34625754 35649166 36704702 37849951
2895C7849951J112007J012183J170388J137253J010848R85660J162961J355498
$$ 37849951 38961958 39974141 41144529 42281782 43292630 44278290 45441251 46796749
2887D6796749J423649J444833J701511J828906J903324K240932K375655K521726
$$ 46796749 48220398 49665231 51366742 53195648 55098972 57339904 59715559 62237285
2879F2237285K647508K825462L013354L300067L666849M048264L873633M030304
$$ 62237285 64884793 67710255 70723609 74023676 77690525 81738789 85612422 89642726
2871H9642726L936903L412202K548206J996602J286508J035392J281483J838407
$$ 89642726 93579629 96991831 99540037 101536639 102823147 103858539 105140022 106978429
2863A06978429K291277K682495L418987M205595M880188N831903O890807P881136
$$ 106978429 109269706 111952201 115371188 119576783 124456971 130288874 137179681 145060817
2855A45060817R204745J0414836J2019598J3772187J5688185J7910378K0353170
$$ 145060817 154265562 164680398 176699996 190472183 206160368 224070746 244423916
2848B44423916K3149365K6104781K8279665K8916936K6522073J9923310R047015
$$ 244423916 267573281 293678062 321957727 350874663 377396736 397320046 406367061
2841D06367061m174886j7386026k7256616l2191025l2752939l0924258k7448922
$$ 406367061 402192175 384806149 357549533 325358508 292605569 261681311 234232389
2834B34232389k4036230k0687516j7612657j5314876j3234483j1678255j0292128
$$ 234232389 210196159 189508643 171895986 156581110 143346627 131668372 121376244
2827A21376244r245331q024193p120567o406631n740932n191534m420273l919296
$$ 121376244 112130913 104106720 96986153 90579522 84838590 79647056 75226783 71307487
2819G1307487l510879l050773k746018k618106k182398k030312j948893j740472
$$ 71307487 67796608 64745835 61999817 59381711 57199313 55169001 53220108 51479636
2811E1479636j655675j591055j585678j539163j269487j244556j048320q75023
$$ 51479636 49823961 48232906 46647228 45108065 43838578 42594022 41545702 40670679
2803D0670679q38505o98579n34970j89541q8095O8979K95106N22111P38331R43579
$$ 40670679 39832174 39133595 38598625 38409084 38320989 38389968 38685074 39207185 39945516 40889095
2793D0889095J033193Q94238N09915l83924j053545j968367k476958k694030k531329
$$ 40889095 41922288 42816526 43326441 42942517 41888972 39920605 37443647 34749617 32218288
2784C2218288k198828j767279j635136j612165j314443j196691j023662r14266
$$ 32218288 30019460 28252181 26617045 25004880 23690437 22493746 21470084 20555818
2776B0555818r13472q68177p75900o61241o71948n24470m57260m32888n15768
$$ 20555818 19642346 18774169 17998269 17337028 16665080 16140610 15683350 15250462 14734694
2767A4734694n09368m33765k61932k42918m61165k72025l11833l13304k75909
$$ 14734694 14225326 13791561 13529629 13286711 12825546 12553521 12241688 11928384 11652475
2758A1652475l46135l60027k50955l87887j87008j19024k94327j90999k27076
$$ 11652475 11306340 10946313 10695358 10307471 10120463 10001439 9707112 9516113 9289037
2749I289037k58459p4717k90972j48099j26712j22086m3338j89601k43342K4694
$$ 9289037 9030578 8955861 8664889 8516790 8390078 8267992 8224654 8035053 7791711 7816405
2739G816405J9217p3197m3465j43539m8866j51424q9879k4206L7406n1790m38302
$$ 7816405 7835622 7762425 7718960 7575421 7526555 7375131 7285252 7261046 7298452 7246662 6808360
2728F808360k34860j61496M1298j07030j64012k68540r1671o9639j77066q2024
$$ 6808360 6573500 6412004 6453302 6346272 6182260 5913720 5822049 5752410 5575344 5493320
2718E493320l6478j4148O0968j60547k47096K8055j45191m7565k427L1779j2945
$$ 5493320 5456842 5442694 5503662 5343115 5096019 5124074 4978883 4931318 4928891 4960670 4947725
2707D947725J24646l6867p7603k97293q8339j83680l6578j27439n1673Q8184j32190
$$ 4947725 5072371 5035504 4957901 4660608 4572269 4388589 4352011 4224572 4172899 4261083 4128893
2696D128893p2307j03262R796k1076j6668j47315j02669j54506Q4966r9791j65340
$$ 4128893 4056586 3953324 3963120 3942044 3925376 3778061 3675392 3520886 3605852 3506061 3340721
2685C340721r007m6118P4581q7238J12272j05675n6201k8643L6338J03819o8687
$$ 3340721 3331714 3285596 3360177 3272939 3385211 3279536 3223335 3194692 3231030 3334849 3266162
2674C266162m3305j69942m2771J56748q6968j75887r48r2967j9575Q6734J31609
$$ 3266162 3222857 3052915 3010144 3166892 3079924 2904037 2903089 2810122 2790547 2877281 3008890
2663C008890j51144O0979r6719o2464j20015M1313N9342K3595j01085M7139L1132
$$ 3008890 2857746 2918725 2822006 2759542 2639527 2680840 2740182 2763777 2662692 2709831 2740963
2652B740963j28877q7337r6680J5618P8399j09580j0982N5284r612o4426m4012
$$ 2740963 2612086 2524749 2428069 2443687 2522086 2412506 2401524 2456808 2447196 2382770 2338758
2641B338758j77404q0152o9466O9946Q3233K2108N8174j00275m9274O0437K5557
$$ 2338758 2161354 2081202 2011736 2081682 2164915 2187023 2245197 2144922 2095648 2156085 2181642
2630B181642p1622l0936k1228J8146L4561J6100N1334P2275j07137r5772J1632
$$ 2181642 2110020 2079084 2057856 2076002 2110563 2126663 2177997 2250272 2143135 2047363 2058995
2619B058995j5900n3647n6332q9522J37148M006n3902k61625n9320J13982P5282
$$ 2058995 2043095 1989448 1933116 1843594 1980742 1984748 1930846 1669221 1609901 1723883 1799165
2608A799165p2727L2837p866j5677J8523Q7060K2025J7373n1484m2154j45110
$$ 1799165 1726438 1759275 1751409 1735732 1754255 1841315 1863340 1880713 1829229 1787075 1641965
2597A641965L2881j0248k0906r5698J96119R004k4468n2041m3625m5123p0060
$$ 1641965 1674846 1664598 1643692 1547994 1744113 1753117 1728649 1676608 1632983 1587860 1517800
2586A517800J57031M5273j72382O6001Q2047n5758K995j41190l9455q2517J79457
$$ 1517800 1674831 1720104 1547722 1613723 1695770 1640012 1643007 1501817 1462362 1379845 1559302
2575A559302L60177J00193j62276Q2552O1803J17354R6733N377o0106p8032J54059
$$ 1559302 1919479 2019672 1857396 1939948 2001751 2119105 2215838 2221215 2161109 2083077 2237136
2564B237136R7644J24037K2099J171K69035L9418j23226n7011o1385k4962k06861
$$ 2237136 2334780 2458817 2480916 2482087 2751122 2790540 2667314 2610303 2548918 2523956 2317095
2553B317095k37394j43637n7325j27039l9255K1320m908q98k14979r5814l940
$$ 2317095 2079701 1936064 1878739 1751700 1712445 1733765 1728857 1727959 1512980 1417166 1413226
2542A413226q0151r6697j29680o7736k2719j23210P4963n9592J40351l7164p3124
$$ 1413226 1333075 1236378 1106698 1038962 1016243 893033 967996 908404 1048755 1011591 938467
2531I38467j2578N5603j09681j82104J8114J35721n6945j564J38663R598j35753
$$ 938467 925889 981492 871811 689707 707821 843542 786597 785033 923696 933294 797541
2520G97541L124R1722j1838o4758m8504l8767j206Q2336n3401J24113k00P1454
$$ 797541 800665 892387 880549 815791 767287 728520 727314 809650 756249 880362 880162 951616
2508I51616n8211j27801R1067l9723m1236m4220j04129J4324j34419k8196J73067
$$ 951616 893405 765604 856671 816948 775712 731492 627363 641687 507268 479072 652139
2497F52139N7650o9456q0222R5413p7615R983N5229K0953M596n4890J5060p414
$$ 652139 709789 640333 560111 655524 577909 587892 643121 664074 668670 613780 628840 621426
2485F21426j9876J5590J12689n8956k15659O2282J05128J54900q3678q8220L6133
$$ 621426 601550 617140 729829 670873 455214 517496 622624 777524 693846 605626 641759
2474F41759n8556N6663m0227l7879J0835k9654J902L8752j7087n1715K9083j8376
$$ 641759 583203 639866 599639 561760 572595 542941 544843 583595 566508 514793 543876 525500
2462E25500J4246p93p4243l310r3439n3945M979J22181J5058j5044J1600l2106
$$ 525500 539746 538953 464710 461400 367961 314016 318995 441176 456234 441190 452790 420684
2450D20684j3108j17616p7576R1296J7149J23257J9763n0370J6042N7710k1107
$$ 420684 407576 289960 212384 303680 320829 444086 463849 413479 429521 487231 466124
2439D66124j12375r7433o8689J59587J30652j85302q8694R3368m975P9314K8168
$$ 466124 353749 256316 187627 347214 477866 292564 203870 297238 292263 371577 399745
2428C99745j2360p4230m7379N4591j2071O4563l7394Q4647J687l933p1113q3218
$$ 399745 387385 313155 265776 320367 308296 372859 335465 420112 421799 417866 346753 263535
2416B63535P7384R8128N4930j4557m3461j80918J6239J7089m0254N937P5279J9382
$$ 263535 340919 439047 493977 479420 435959 255041 271280 288369 248115 254052 329331 348713
2404C48713N5785p7074M8716q4614m1729K3623o6092N8312j70017Q2792J05521
$$ 348713 404498 327424 376140 291526 249797 273420 207328 265640 95623 178415 283936
2393B83936P0610n518o3904m1637n142P8256P848L4659K1603P0180K0828k7599
$$ 283936 354546 349028 285124 243487 238345 316601 324449 359108 380711 450891 471719 444120
2381D44120M5557n5166J1941j5901L327q6892R8982N0627j18577n397j99397J92539
$$ 444120 489677 434511 446452 430551 433878 346986 445968 496595 378018 372621 173224 365763
2369C65763Q3908J1427m5104j33742M1376n7074j09404j4934L9077L7738J07285
$$ 365763 449671 461098 415994 282252 323628 266554 157150 142216 181293 219031 326316
2358C26316k836n1821O4076k9577m2897P6398j10961j05303J33397L2249J2360
$$ 326316 323480 271659 335735 306158 263261 339659 228698 123395 256792 289041 301401
2347C01401k7920m4588M2728J54481j65641p8697K8280L9861j2972m7910n211
$$ 301401 273481 228893 271621 426102 260461 181764 210044 249905 236933 189023 183812
2336A83812q056R3597R821o5369j8773J51573O0501M4887L3406j61452p7851o5386
$$ 183812 175756 269353 279174 213805 195032 346605 407106 451993 485399 323947 246096 180710
2324A80710P202R4705j6409r9046K24028M8049q6193L0520j60232R0483j39185
$$ 180710 187912 282617 266208 167162 391190 439239 353046 383566 223334 313817 174632
2313A74632l6901j1100P2003p7930O4133j103j4999K4666K4966q810J41287m4601
$$ 174632 137731 126631 198634 120704 184837 183734 168735 193401 218367 209557 350844 306243
2301C06243j56356j05484Q7681J34862j9919n4263k0820j06217O8534O6797j493
$$ 306243 149887 44403 132084 266946 247027 192764 171944 65727 134261 201058 199565
2290A99565j22280K0959P5891k2006L3734m9256K7293J7856J54643n5242m6606
$$ 199565 77285 98244 174135 152129 185863 136607 163900 181756 336399 281157 234551
2279B34551M180o6421l0957R9558p9066J5135Q3901N2678l526J5202l7315j28365
$$ 234551 238731 172310 141353 240911 161845 176980 260881 313559 310033 325235 287920 159555
2267A59555l9208j08044M1514J45222J10203j02493j10295Q5578j3591N8653j6981
$$ 159555 120347 12303 53817 199039 309242 206749 96454 182032 168441 227094 210113
2256B10113n4507q8662J09171J05878R3285o4194m3452j79355O3095J36556N9257
$$ 210113 155606 66944 176115 281993 375278 311084 267632 88277 151372 287928 347185
2245C47185P5283j250r9942q1146J00949r8720l7093J86222j1732o4865j4109
$$ 347185 422468 421218 321276 240130 341079 242359 205266 391488 379756 314891 300782
2234C00782O9560P2139p0587j925O6283L3374o7476q7093J38272j42423q3228
$$ 300782 370342 442481 371894 369969 436252 469626 402150 315057 453329 310906 227678
2223B27678r1204P4840J14468J06101j40455j11937J58324L4797Q2284j55320
$$ 227678 136474 211314 325782 431883 291428 179491 337815 372612 454896 299576
2213B99576M1186Q1388K3762L2615R57m5149j41172L9434K16422Q0667o1123j22289
$$ 299576 340762 422150 445912 478527 479484 434335 293163 332597 549019 629686 568563 446274
2201D46274R5902n8921M4356P4357q8503j03721M5824J55496J7760L8740M2504
$$ 446274 542176 483255 527611 601968 513465 409744 455568 611064 628824 667564 710068
2190G10068J23315j21214m5991l6765k1982J27648l7523j13644m109O0658K3087
$$ 710068 833383 712169 666178 629413 607431 735079 697556 583912 579803 640461 663548
2179F63548J19680k7512n3760Q9857N5216j09651J63102j3980K8282Q5021R6337
$$ 663548 783228 755716 701956 791813 847029 737378 900480 886500 914782 999803 1096140
2168A096140M2181p6393k0842Q3232P2602n831J8031O0016l302J02501J09430
$$ 1096140 1138321 1061928 1041086 1124318 1196920 1191089 1209120 1269136 1265834 1368335 1477765
2157A477765o5103J21088O6851J3892L2164J1100Q8875P0700P0621L7751L4825
$$ 1477765 1412662 1533750 1600601 1614493 1646657 1657757 1746632 1817332 1887953 1925704 1960529
2146A960529P8871K44506J23717J13614O2845j02576J97269J37628J12887J08995
$$ 1960529 2039400 2283906 2407623 2521237 2584082 2481506 2678775 2816403 2929290 3038285
2136C038285J77382K02925J1889K33937K23473J99354R2552K96748L94223K94363
$$ 3038285 3215667 3418592 3430481 3664418 3887891 4087245 4179797 4476545 4870768 5165131
2126E165131L50182M28074L88373M82773M08378N07659P81694Q82069R57457J135377
$$ 5165131 5515313 5943387 6331760 6814533 7222911 7730570 8512264 9394333 10351790 11487167
2116A1487167J646771K130311K873435L945554M944184N153133M007247q1767
$$ 11487167 13133938 15264249 18137684 22083238 27027422 32180555 36187802 36106035
2108C6106035m755261o432012n486244m022814k708485k136665j519366j048734
$$ 36106035 31350774 24918762 19432518 15409704 12701219 10564554 9045188 7996454
2100G996454q46778o55475n40030k07138k58883l04825n06290m28788l46295l31768
$$ 7996454 7149676 6494201 5954171 5747033 5488150 5183325 4677035 4248247 3901952 3570184
2090C570184m27359j85763j92406j46903j29210j97818k7104m5252L7202k26389
$$ 3570184 3142825 2957062 2764656 2617753 2488543 2290725 2263621 2218369 2255571 2029182
2080B029182n9974K9932j05165k0919n4692j13717p0871j01048L776j01245p0963
$$ 2029182 1969208 1999140 1893975 1873056 1818364 1704647 1633776 1532728 1536504 1435259 1364296
2069A364296l520p9122q688j13421o1069j0806r5068q4378n9557R1677r9348J6778
$$ 1364296 1360776 1281654 1272966 1159545 1098476 1087670 992602 908224 848667 940344 840996 857774
2057H57774j48598N8316J27122p0562K449j22690Q402k6963J5123j1585m0664
$$ 857774 709176 767492 894614 824052 826501 703811 712213 685250 700373 688788 648124
2046F48124m5938J2351N3463j09847j07915n6634P6004L5955p1697J9930R9916
$$ 648124 602186 614537 668000 558153 450238 393604 469608 505563 433866 453796 553712
2035E53712o8360J2109J7279p5882P7322o5239j35175N330L9095R4962k9712J9953
$$ 553712 485352 497461 514740 438858 516180 450941 315766 321096 360191 455153 425441 445394
2023D45394o384Q7819p2083j42405j966J3375O2387m1245m2633K3568j7267o0974
$$ 445394 439010 526829 454746 312341 310375 323750 386137 344892 302259 325827 308560 247586
2011B47586L5693L7604R18j8568Q880j06366M125J7850J78172m3044j6993j11916
$$ 247586 283279 320883 321801 303233 312113 205747 209872 227722 405894 362850 345857 233941
1999B33941P6991j0973j5289J32604n5766j57417j9252L5153j11350Q1940l6510
$$ 233941 310932 299959 284670 417274 361508 204091 184839 219992 108642 190582 154072
1988A54072n858j23561M6643l2674Q5928J36196k11293j05142m6955K36511J8891
$$ 154072 148214 24653 71296 38622 124550 260746 49453 -55689 -102644 133867 152758
1977A52758l8208k0131K9796L0735j97154n4339J99042N8757J0997J22314l3569
$$ 152758 114550 94419 124215 154950 -42204 -96543 102499 161256 172253 294567 260998
1966B60998j33224j37252P7595P7032m1490Q2665r9275J7419j5966M8843j141
$$ 260998 127774 -9478 68117 145149 103659 186324 87049 104468 88502 137345 136204
1955A36204n5119k0962k7440j00301M368J10780M7967L2257k04283R6295P2625
$$ 136204 81085 60123 32683 -67618 -63250 47530 95497 127754 -76529 19766 92391
1944I2391o7265l6745N2937R1735j26683N9659l1796j50787J07423j0834L5528
$$ 92391 25126 -11619 41318 133053 6370 66029 34233 -116554 -9131 -19965 15563
1933A5563n2249J00904O54l2628O663J8621m1512j7039k1880N1057m1451R6038
$$ 15563 -36686 64218 64872 32244 38907 57528 16016 -1023 -22903 28154 -13297 82741
1921H2741l4901P600j2760j20037J28526J1773n9316j42945K1607J26502P6677
$$ 82741 47840 55440 42680 -77357 51169 62942 3626 -139319 -117712 8790 85467
1910H5467r0401j3489J15328l5098P0531j16138O6894j01511j46509N4054L195
$$ 85467 -4934 -18423 96905 61807 132338 16200 83094 -18417 -164926 -110872 -107677
1899a07677J42225n5753J3009P7723K4461L1364L9537r1222m1841l6051p3217
$$ -107677 34548 -21205 -8196 69527 93988 125352 164889 73667 31826 -4225 -77442
1888g7442R7091K2065o8071M3681O8866p9711j1293L149o1143Q0239l3369r72
$$ -77442 19649 41714 -26357 17324 86190 6479 -4814 -1665 -62808 17431 -15938 -16910
1876a6910j8726K6688O7295o9901J8750R317j29699k5375J14380R718N0657o3835
$$ -16910 -35636 -8948 58347 -11554 7196 16513 -113186 -138561 -24181 -14463 36194 -27641
1864b7641l3547L138M1727O7460L7841Q0453j83156r4893N9502R0104j2185J5100
$$ -27641 -61188 -58050 -16323 51137 88978 169431 -13725 -108618 -49116 40988 28803 43903
1852D3903n5584J31556m1339m9410o9996M3207R8593n5914L8943n6935J02707
$$ 43903 -11681 119875 78536 29126 -40870 2337 100930 45016 83959 27024 129731
1841A29731J56042n7620l9868o5607n9742k4871N5272l8438j9589p4744o1547
$$ 129731 285773 228153 188285 122678 62936 38065 93337 54899 35310 -39434 -100981
1830a00981J7746N3141j19898n7473R5365J5364M4315m5782L5498j01338q7590
$$ -100981 -83235 -30094 -149992 -207465 -112100 -96736 -52421 -98203 -62705 -164043 -251633
1819b51633J85709P4009O5900l9291j7612J7911j56284k7078n5229o1558J49450
$$ -251633 -65924 8085 73985 34694 17082 34993 -121291 -148369 -203598 -265156 -115706
1808a15706O2964j21125o8390J01047J26540J14178L4965j1432k7499M5481j7476
$$ -115706 -52742 -173867 -242257 -141210 -14670 99508 134473 123041 95542 141023 123547
1797A23547q8868L605m8685J24854m5873k6264j03404N6280J15411n4806m024
$$ 123547 34679 38284 -10401 114453 68580 42316 -61088 -4808 110603 55797 51773
1786E1773m6382j6316j4936L6432L8899n8331L553K4166o8017j39497Q3616J66985
$$ 51773 5391 -10925 -25861 10571 49470 -8861 -5308 18858 -49159 -188656 -105040 61945
1774F1945j05133M6089Q2219j38329m9012O89M4171k6728l4673O1224m1874r7991
$$ 61945 -43188 2901 85120 -53209 -102221 -101532 -57361 -84089 -118762 -57538 -99412 -197403
1762a97403M1000J33824k9305L629q9034J36147J38543K3603l5758r4654j36688
$$ -197403 -156403 -22579 -51884 -48255 -137289 -1142 137401 161004 125246 30592 -106096
1751a06096l8814J09742j80082J35480N91O1705O7104o4617q4762K4997J0618
$$ -106096 -144910 -35168 -215250 -79770 -79179 -17474 49630 -14987 -99749 -74752 -64134
1740f4134J12254O1265r1774Q2776Q9111j04320q6092N4060l7793l4106j6512
$$ -64134 48120 109385 17611 100387 189498 85178 -914 53146 15353 -18753 -35265
1729c5265L2065O4918l8166M8797j482n8805j8246P5800j31247n8079J25897J68478
$$ -35265 -3200 61718 23552 72349 70867 12062 -6184 69616 -61631 -119710 6187 174665
1717A74665j01304j23661p5357m5047J2588Q6503J21505k7582p4128q5080q2560
$$ 174665 73361 -50300 -125657 -170704 -158116 -71613 49892 22310 -51818 -136898 -219458
1706b19458R5299P9894n3156j4225M9665M2710m0454N0728j128K7257J042j34729
$$ -219458 -124159 -44265 -97421 -111646 -61981 -19271 -59725 -8997 -10125 17132 18174 -116555
1694a16555ML9220K3913j9917j45825R6958K01478q6241m1264p9137N6453J27956
$$ -116555 -116551 -77331 -53418 -73335 -219160 -122202 79276 -6965 -48229 -127366 -70913 57043
1682E7043j37065l1915k2164J03158N9494p4621O9064J5530j44421L4754l9699
$$ 57043 -80022 -111937 -134101 -30943 28551 -46070 22994 38524 -105897 -71143 -110842
1671a10842m1909k8284R3882l1092M3180J294M0354O0441l0151j54812m6599J92997
$$ -110842 -152751 -181035 -87153 -118245 -75065 -73771 -33417 27024 -3127 -157939 -204538 -11541
1659a1541J49457r1327r1446j26142O1048o7562P7796r187M4043k4375p4311k0452
$$ -11541 137916 46589 -44857 -170999 -109951 -177513 -99717 -108904 -64861 -89236 -163547 -183999
1647a83999l8109R6409M8840j10000L7783j7774J24130Q3267j37302Q4463k7719
$$ -183999 -222108 -125699 -76859 -186859 -149076 -166850 -42720 40547 -96755 -12292 -40011
1636d0011r454j230k0150N8669j44597L0823M907J02669m2882j8670N2598M23
$$ -40011 -49465 -50695 -70845 -12176 -156773 -125950 -121043 -18374 -61256 -79926 -27328 -26905
1624b6905j17408J31998J45222q2014r1901j31950J03138j12699J05235M7880
$$ -26905 -144313 -12315 132907 50893 -41008 -172958 -69820 -182519 -77284 -29404
1614b9404R0061m7938q972q4193R1444K1246L3072p8753m7794K6177j33361j62044
$$ -29404 60657 12719 3747 -80446 10998 32244 65316 -13437 -61231 -35054 -168415 -330459
1602c30459N9212K66825K061j086K4489J2678o4604p7848J23985P0635k0257q5018
$$ -330459 -271247 -4422 -2361 -3447 21042 33720 -30884 -108732 15253 85888 65631 -19387
1590a9387j3529P774L1039o8728Q6399L4267j45585j25686K32831j2739r748j9852
$$ -19387 -32916 -25142 5897 -62831 23568 57835 -87750 -213436 19395 6656 -3092 -22944
1578b2944N1422l9468j22531j7664N3084J27137L8841o7997j53330L5561J50345
$$ -22944 28478 -10990 -133521 -151185 -98101 29036 67877 -120 -153450 -117889 32456
1567C2456k2927p4679r337p2935q3192K7064J6052J06563Q1789Q550j20551r4900
$$ 32456 9529 -65150 -74487 -147422 -230614 -203550 -187498 -80935 854 9404 -111147 -206047
1555b06047J36821l091l8736k4655J19270n5059n7966L8698N3361m8881m0734
$$ -206047 -69226 -72317 -111053 -135708 -16438 -71497 -129463 -90765 -37404 -86285 -127019
1544a27019p6941p190M9765j02565m7478K95297J6666j14164O2658j5698N0947
$$ -127019 -203960 -211150 -161385 -263950 -311428 -16131 535 -113629 -50971 -66669 -15722
1533a5722J08960j9014O196j2569l4427l3157J9952O2132o6078q4776n7380j5121
$$ -15722 93238 74224 80420 67851 33424 267 20219 82351 16273 -68503 -125883 -141004
1521a41004R0375N4335L6910L2185r5702N1333N013r5660J23513J8787j28436
$$ -141004 -50629 3706 40616 72801 -22901 28432 33445 -62215 61298 80085 -48351
1510d8351Q6285j60444N3310L7652M3012K2348k3564k13107m3745J44140K3775
$$ -48351 37934 -122510 -69200 -31548 11464 33812 10248 -202859 -246604 -102464 -78689
1499g8689P6200J32146j27491j15341P3565o0303J64392j68565P780J1096J484
$$ -78689 -2489 129657 2166 -113175 -39610 -99913 64479 -104086 -96306 -85210 -83726
1488h3726J05699J3786j27046k361p950m9872J27342J20774j18140k7702O5342
$$ -83726 21973 35759 -91287 -93648 -101598 -151470 -24128 96646 -21494 -49196 16146
1477A6146l9523j04157J5358K199r3337k0020q262Q8722J61321N3832r929j14703
$$ 16146 -23377 -127534 -112176 -109977 -203314 -223334 -231596 -142874 18447 72279 62350 -52353
1465e2353q3362R3477r6082J59068J11949l6218l5990j81755M223J10118p653
$$ -52353 -135715 -42238 -138320 20748 132697 96479 60489 -121266 -117043 -6925 -14578
1454a4578j64595l2573m3567O5723L2601O9083J1229q6417J28440r4971Q5253
$$ -14578 -179173 -211746 -255313 -189590 -156989 -87906 -76677 -163094 -34654 -129625 -44372
1443d4372M189j85589R8208K0648R135M3247J693j55986K3849J19731l9399p7871
$$ -44372 -40183 -225772 -127564 -106916 -97781 -54534 -52841 -208827 -184978 -65247 -104646 -182517
1431a82517M2378j4048J41164k2310K0379P5829J20578q4843j46986J33869J6118
$$ -182517 -140139 -154187 -13023 -35333 -14954 60875 181453 96610 -50376 83493 99611
1420I9611m7910k1942q8915j965L2866J3405m4162K0086n2454k8609O8959K2406
$$ 99611 51701 29759 -59156 -61121 -28255 -14850 -59012 -38926 -91380 -119989 -51030 -28624
1408b8624J3222K6192J81570j82351P6783m1819j25989j21282L5134N4639L6124
$$ -28624 -15402 10790 192360 10009 86792 44973 -81016 -202298 -167164 -112525 -76401
1397g6401J6580r6327J38268J01136q0120j47055j2882O5482l040P2429k6903
$$ -76401 -59821 -156148 -17880 83256 3136 -143919 -156801 -91319 -94359 -21930 -48833
1386d8833K3174r0219K4987J96905J987j6071Q8080j59180q8516P4872J13742
$$ -48833 -25659 -115878 -90891 106014 108001 91930 180010 20830 -67686 7186 120928
$$ [...]
##END NTUPLES=NMR SPECTRUM
##END=
