##TITLE=1H_CA-9169-23
 CDCl3
 8 sc, 
 6.7.2023
##JCAMPDX= 6.0         $$ Bruker NMR JCAMP-DX V2.0
##DATA TYPE= NMR SPECTRUM
##DATA CLASS= NTUPLES
##ORIGIN= UXNMR, Bruker Analytische Messtechnik GmbH
##OWNER= root
$$ XWIN-NMR		Version 3.5
$$ Thu Jul  6 14:09:16 2023 Russian Standard Time (UT+4h)  she@DPX200
##.OBSERVE FREQUENCY= 200.13135
##.OBSERVE NUCLEUS= ^1H
##.ACQUISITION MODE= SIMULTANEOUS
##.ACQUISITION SCHEME= undefined
##.AVERAGES= 8
##.DIGITISER RES= 18
##SPECTROMETER/DATA SYSTEM= spect
##.PULSE SEQUENCE= zg30
##.SOLVENT NAME= CDCl3
##.SHIFT REFERENCE= (INTERNAL, CDCl3, 0, 15.7271)
##AUDIT TRAIL= $$ (NUMBER, WHEN, WHO, WHERE, WHAT)
$$ ##TITLE= Audit trail, XWIN-NMR		Version 3.5
$$ ##JCAMPDX= 5.01
$$ ##ORIGIN= Bruker BioSpin GmbH
$$ ##OWNER= she
$$ F:/spectra/data/she/nmr/H-F/1/pdata/1/auditp.txt
$$ ##AUDIT TRAIL=  $$ (NUMBER, WHEN, WHO, WHERE, WHAT)
(   1,<2023-07-06 14:07:30.03 +0400>,<she>,<DPX200>,
      <created by zg, POWCHK disabled, PULCHK disabled
       configuration hash MD5:
       00 E9 B6 7A A2 85 ED C7 34 08 36 98 17 FE 4E 26
       data hash MD5: 16K
       EA 37 15 B4 59 E3 65 A5 84 C9 60 A7 B4 AC 0B 5D>)
(   2,<2023-07-06 14:07:54.87 +0400>,<she>,<DPX200>,
      <Start of raw data processing
       efp BC_mod = 2 LB = 0.24 FT_mod = 6 PKNL = 1 PHC0 = -20632.66 PHC1 = 13.65272 SI = 16K 
       data hash MD5: 16K
       AA 4D 4E 4B A3 18 BB F7 C9 10 DE F5 67 80 E3 32>)
(   3,<2023-07-06 14:08:17.17 +0400>,<she>,<DPX200>,
      <pk PHC0 = -155.332 PHC1 = -2 
       data hash MD5: 16K
       81 E9 AB 04 C5 B7 61 64 32 F1 79 81 67 C1 E3 12>)
(   4,<2023-07-06 14:08:20.35 +0400>,<she>,<DPX200>,
      <abs ABSG = 5 
       data hash MD5: 16K
       D8 77 29 3E 56 E3 CE 28 1C E2 71 CE DC CB 78 5D>)
$$ ##END=
$$ 
$$ hash MD5
$$ BE CF C8 99 4A 9E FF F0 52 FC 2E 64 69 5A D0 A0
##$RELAX= 
##$RELAX= 
##$RELAX= 
##$RELAX= 
##$RELAX= 
##$RELAX= 
$$ Bruker specific parameters
$$ --------------------------
##$DU= <F:/spectra>
##$EXPNO= 1
##$NAME= <H-F>
##$PROCNO= 1
##$TYPE= <nmr>
##$USER= <she>
##$AMP= (0..31)
100 100 100 100 100 100 100 100 100 100 100 100 100 100 100 100 100 100 
100 100 100 100 100 100 100 100 100 100 100 100 100 100 
##$AQSEQ= 0
##$AQ_mod= 1
##$AUNM= <au_zg>
##$AUTOPOS= <>
##$BF1= 200.13
##$BF2= 200.13
##$BF3= 200.13
##$BF4= 200.13
##$BF5= 200.13
##$BF6= 200.13
##$BF7= 200.13
##$BF8= 200.13
##$BYTORDA= 1
##$CFDGTYP= 0
##$CFRGTYP= 5
##$CHEMSTR= <none>
##$CNST= (0..31)
1 1 145 1 1 1 1 1 1 1 1 1 1 1 1 1 1 1 1 1 1 1 1 1 1 1 1 1 1 1 1 1 
##$CPDPRG= <>
##$CPDPRG1= <>
##$CPDPRG2= <>
##$CPDPRG3= <>
##$CPDPRG4= <mlev>
##$CPDPRG5= <mlev>
##$CPDPRG6= <mlev>
##$CPDPRG7= <mlev>
##$CPDPRG8= <mlev>
##$CPDPRGB= <>
##$CPDPRGT= <>
##$D= (0..31)
0 1.2 0 0 0 0 0 0 0 0.06 0 0.03 0 0 0 0 0.0002 0 0 0 0 0 0 0 0 0 0 0 0 
0 0 0 
##$DATE= 1688638049
##$DBL= (0..7)
120 120 120 120 120 120 120 120 
##$DBP= (0..7)
150 150 150 150 150 150 150 150 
##$DBP07= 0
##$DBPNAM0= <>
##$DBPNAM1= <>
##$DBPNAM2= <>
##$DBPNAM3= <>
##$DBPNAM4= <>
$$ [...]
##$SUBNAM3= <"">
##$SUBNAM4= <"">
##$SUBNAM5= <"">
##$SUBNAM6= <"">
##$SUBNAM7= <"">
##$SUBNAM8= <"">
##$SUBNAM9= <"">
##$SW= 18.05172834244
##$SWIBOX= (0..15)
0 0 2 0 0 0 0 0 0 0 0 0 0 0 0 0 
##$SW_h= 3612.71676300578
##$TD= 16384
##$TD0= 1
##$TE= 0
##$TE2= 300
##$TE3= 300
##$TEG= 300
##$TL= (0..7)
0 120 120 120 120 120 120 120 
##$TP= (0..7)
150 150 150 150 150 150 150 150 
##$TP07= 0
##$TPNAME0= <>
##$TPNAME1= <>
##$TPNAME2= <>
##$TPNAME3= <>
##$TPNAME4= <>
##$TPNAME5= <>
##$TPNAME6= <>
##$TPNAME7= <>
##$TPOAL= (0..7)
0.5 0.5 0.5 0.5 0.5 0.5 0.5 0.5 
##$TPOFFS= (0..7)
0 0 0 0 0 0 0 0 
##$TUNHIN= 0
##$TUNHOUT= 0
##$TUNXOUT= 0
##$USERA1= <user>
##$USERA2= <user>
##$USERA3= <user>
##$USERA4= <user>
##$USERA5= <user>
##$V9= 5
##$VALIST= <valist>
##$VCLIST= <CCCCCCCCCCCCCCC>
##$VD= 0
##$VDLIST= <DDDDDDDDDDDDDDD>
##$VPLIST= <PPPPPPPPPPPPPPP>
##$VTLIST= <TTTTTTTTTTTTTTT>
##$WBST= 1024
##$WBSW= 4
##$XGAIN= (0..3)
0 0 0 0 
##$XL= 0
##$YL= 0
##$YMAX_a= 730726
##$YMIN_a= -627983
##$ZGOPTNS= <>
##$ZL1= 120
##$ZL2= 120
##$ZL3= 120
##$ZL4= 120
##$ABSF1= 15.73697
##$ABSF2= -2.314879
##$ABSG= 5
##$ABSL= 3
##$ALPHA= 0
##$AQORDER= 0
##$ASSFAC= 0
##$ASSFACI= 0
##$ASSFACX= 0
##$ASSWID= 0
##$AUNMP= <proc_1d>
##$AZFE= 0.1
##$AZFW= 0.1
##$BCFW= 0
##$BC_mod= 2
##$BYTORDP= 0
##$COROFFS= 0
##$CY= -3
##$DATMOD= 1
##$DC= 0
##$DFILT= <>
##$DTYPP= 0
##$F1P= 0
##$F2P= 0
##$FCOR= 1
##$FTSIZE= 16384
##$FT_mod= 6
##$GAMMA= 0
##$GB= 0
##$INTBC= 1
##$INTSCL= 3.70164e-10
##$ISEN= 128
##$LB= 0.24
##$LEV0= 0
##$LPBIN= 0
##$MAXI= 10000
##$MC2= 0
##$MEAN= 0
##$ME_mod= 0
##$MI= 1.114404
##$NCOEF= 0
##$NC_proc= -6
##$NLEV= 6
##$NOISF1= 3.799351
##$NOISF2= 2.8
##$NSP= 0
##$NTH_PI= 0
##$NZP= 0
##$OFFSET= 15.72706
##$PC= 1
##$PHC0= -20787.99
##$PHC1= 11.65272
##$PH_mod= 1
##$PKNL= yes
##$PPARMOD= 0
##$PSCAL= 0
##$PSIGN= 0
##$REVERSE= no
##$SF= 200.130008902405
##$SI= 16384
##$SIGF1= 3
##$SIGF2= 2
##$SINO= 5.538805
##$SIOLD= 16384
##$SREGLST= <1H.CDCl3>
##$SSB= 0
##$STSI= 16384
##$STSR= 0
##$SW_p= 3612.71676300578
##$SYMM= 0
##$S_DEV= 0
##$TDeff= 16384
##$TDoff= 0
##$TI= <>
##$TILT= no
##$TM1= 0
##$TM2= 0
##$TOPLEV= 0
##$USERP1= <user>
##$USERP2= <user>
##$USERP3= <user>
##$USERP4= <user>
##$USERP5= <user>
##$WDW= 1
##$XDIM= 16384
##$YMAX_p= 440063616
##$YMIN_p= -305731
$$ End of Bruker specific parameters
$$ ---------------------------------
##NTUPLES= NMR SPECTRUM
##VAR_NAME=  FREQUENCY,     SPECTRUM/REAL,   SPECTRUM/IMAG
##SYMBOL=    X,             R,               I
##VAR_TYPE=  INDEPENDENT,   DEPENDENT,       DEPENDENT
##VAR_FORM=  AFFN,          ASDF,            ASDF
##VAR_DIM=   16384,         16384,           16384
##UNITS=     HZ,            ARBITRARY UNITS, ARBITRARY UNITS
##FACTOR=    0.220516191357247, 1,           1
##FIRST=     3147.45672144863, 0,            0
##LAST=      -465.260041557148, 0,           0
##MIN=       -465.260041557148, -305731,     0
##MAX=       3147.45672144863, 440063616,    0
$$ Real data points
##PAGE= N=1
##DATA TABLE= (X++(R..R)), XYDATA
$$ [...]
7825 19420 2218 -20397 -60210 -12478 -67940 -75439 -19505 -27610 -16773 -16520 8483 55816 -32115
7812 -32115 14598 -174160 -305731 -100746 -77187 -108142 -163114 -2055 1569 -21450 -14187
7801 -14187 -11143 6493 -9974 -23688 -30936 -25303 -11756 -5522 -15445 -10789 -22935 41594 41641 -9170
7787 -9170 -48284 -39319 -12046 -31358 -63491 -55468 -1715 -103252 -40810 40402 35006 16241
7775 16241 54828 67460 -26165 -38816 72173 -983 18008 14603 -37988 5958 21233 48823
7763 48823 -25310 -27078 16778 7384 31480 89439 75178 77668 80178 78493 73095 105447 60832
7750 60832 104786 189821 164068 138260 104914 116054 147705 124051 108314 99383 137035 188594
7738 188594 135502 92374 59038 15398 82714 130110 120274 74178 51986 38395 38776 -3621
7726 -3621 -50631 -42423 3310 -19396 -60139 -35876 -12560 -4295 10945 -22421 -43558 -66103
7714 -66103 -94926 -92299 -128117 -73745 -84849 -25532 26520 2497 13450 -30520 14193 45046
7702 45046 16260 69857 37206 12828 -31730 -18464 4560 39947 -6205 7150 -75270 -44523
7690 -44523 -43468 -57505 30894 24943 -56610 -86926 -63821 -54393 -22241 -79963 -22095 -55846
7678 -55846 -134533 -73661 -42699 -54012 -109748 -38877 16360 4013 -16245 -45097 -8640 9625
7666 9625 21871 57267 9244 -30272 19535 38883 -4062 7789 -46307 -63099 -46787 -26731
7654 -26731 -36153 -15716 -19375 -32589 -14318 8970 43063 -26832 21408 4526 -48610 -45415
7642 -45415 -12523 -26533 -38803 -3122 -6695 19817 73974 44203 8974 -22305 23155 64014
7630 64014 66751 31730 36604 24703 37840 36041 47836 -23501 5884 64759 61932 22835 58596
7617 58596 7785 -51520 -8641 22144 36736 -16797 -54906 -9346 55320 54052 -4320 -8297
7605 -8297 3319 13793 7147 4274 46497 40395 61437 77689 92429 53149 35001 354 62625
7592 62625 110336 122906 136152 60107 85860 82642 62500 1416 56923 71081 36816 14655
7580 14655 796 74012 66206 82374 96939 80463 63061 99219 43680 -39566 -47946 -4037
7568 -4037 -27501 -13389 28245 35086 93082 46813 60496 29923 29447 70461 97176 106114 58488
7555 58488 46443 84267 73638 47468 37705 60329 23248 25962 13446 21241 -42683 37065
7543 37065 125126 156652 119988 -19497 15113 -17574 44308 42635 -26594 73043 124148 91188
7531 91188 55816 107798 152632 92863 110453 101483 135340 172403 175459 127703 138850 233679
7519 233679 265780 237041 279941 311477 330275 272963 224484 197110 226384 245560 242224 236657
7507 236657 301398 306792 282935 288585 274071 236939 270495 339028 260618 227964 229399 186116
7495 186116 168887 143045 172633 227095 201121 147374 174542 155567 207503 130248 118934 130726
7483 130726 143854 139288 135325 89531 82503 72363 11118 6363 58073 63484 38674 -8136 53903
7470 53903 67911 87245 122409 75877 9182 -1048 32916 83358 141185 100837 158135 138040
7458 138040 156542 151832 118573 84313 125505 102697 50811 80874 64574 42403 111450 66859
7446 66859 26055 35365 52731 24427 21368 57828 40021 99651 167684 187371 178920 149260
7434 149260 97873 102063 135454 129977 153216 78885 54083 46060 102302 145236 146760 112958
7422 112958 114646 157729 185767 166977 150161 203658 204364 191741 211632 165375 212042 182447
7410 182447 177862 198841 205927 191836 217310 151447 155246 193653 212411 231841 241616 312804
7398 312804 331207 389581 389276 391381 377753 351507 393383 448467 489292 499220 526159 503186
7386 503186 514792 583977 550611 501270 450737 424359 452703 447725 441652 472068 417229 369383
7374 369383 407532 407793 403551 355073 307353 277450 244515 246938 257993 207670 168866 140530
7362 140530 169797 166840 190580 170063 98873 160546 185666 59927 30954 121815 76506 100876
7350 100876 124679 142786 173106 159723 184112 204370 150326 201399 194352 161958 194377 250512
7338 250512 196852 218956 215060 162467 155697 197314 154454 204393 193009 185084 189904 144401
7326 144401 159190 143658 182220 162881 146379 257929 277913 247255 261964 233849 294609
7315 294609 349638 327701 307921 338677 411128 403159 388094 444517 372639 397071 470082 470920
7303 470920 424797 363582 322171 354576 423835 356419 275610 351885 393355 338945 300030 244340
7291 244340 162866 211727 304144 268187 310801 264721 132320 166539 147787 180132 162265
7280 162265 190052 205352 142102 190828 138868 155218 111058 128415 121306 138618 145502 98476
7268 98476 75589 89519 91359 43453 73316 164592 117117 59281 90798 82294 78709 79299 78755
7255 78755 77539 76892 58106 60520 172357 141178 59876 116895 117616 75053 106072 51160 10276
7242 10276 106893 91552 97254 158367 91955 36041 82592 148383 137163 73074 72195 118861
7230 118861 111119 96226 91235 76615 160120 180402 167521 128158 189708 208128 148193 102187
7218 102187 162694 170658 181745 186564 168449 158753 134576 118698 114334 57844 24054 87697
7206 87697 109502 175608 195811 172432 230316 200622 206833 184575 172870 169734 202871 232060
7194 232060 225507 194034 237370 286394 305264 298593 295437 271544 237629 264881 297604 279573
7182 279573 301898 381739 393093 351910 366446 370174 392199 417505 403156 418122 467269 532424
7170 532424 576178 664223 619898 641666 652343 694513 685297 714074 743460 734866 710910 633797
7158 633797 608141 623541 611034 548170 548032 525725 532400 483316 389819 412272 389157 437494
7146 437494 473044 454046 387008 330052 387340 403303 391306 382510 416926 486144 516130 494695
7134 494695 440177 460542 502900 522602 443906 473526 589272 599501 606854 663747 651754 683659
7122 683659 705853 721108 731090 744136 786566 865761 894620 876233 872773 888443 848551 861947
7110 861947 894828 888668 864668 840355 810642 754114 709505 621883 603872 526547 531378 493944
7098 493944 487998 508043 443328 473562 389437 322370 354193 367959 363489 366099 413286 331621
7086 331621 333352 293633 239687 278570 299346 292212 204367 208950 239354 243935 261152 281644
7074 281644 241215 279860 303489 265951 243807 188049 235247 188605 248224 268547 276763 284761
7062 284761 252749 201429 213627 258618 259159 192920 178632 191333 186075 152770 252164 225837
7050 225837 229170 214174 208063 242040 206882 242996 202342 240906 201267 233844 287908 262506
7038 262506 258701 244820 131614 216214 231104 185930 251027 292082 255780 211807 267667 211403
7026 211403 198359 254121 290204 256401 263560 276621 212189 259517 265316 255636 236159 218278
7014 218278 197450 141726 188401 259548 231817 133427 99740 190296 169602 203567 167584 213812
7002 213812 235051 238072 184196 176863 250499 256504 222056 192351 183320 218830 235342 199317
6990 199317 207370 315641 307258 235452 247786 298433 242577 253159 330410 352858 396034 357790
6978 357790 351785 387623 361934 270463 293490 262987 280632 312402 338916 271038 242928 325711
6966 325711 372462 337891 361816 392716 371861 409815 400092 352075 327527 348254 400017 362125
6954 362125 322751 311008 385621 441701 389528 402598 417310 346011 334015 351940 301921 327267
6942 327267 351191 336609 384708 393727 354641 360736 393129 371417 387139 361025 353318 343821
6930 343821 337207 286882 340095 355054 330535 302771 366555 374315 353363 378912 348401 371963
6918 371963 300725 355341 310354 295645 320716 358293 367568 389739 350601 359609 333986 359124
6906 359124 467994 367187 383610 452455 479517 445836 387665 450572 455288 412156 480798
6895 480798 506394 425773 357459 432972 462652 444914 353752 414858 447743 409296 498026 510238
6883 510238 539961 565878 569316 619230 561657 544893 615241 601829 556266 530950 506751 449206
6871 449206 450352 499891 556076 547841 535701 495584 537442 567739 523479 515674 538216 581848
6859 581848 578269 541251 549151 500863 541021 598152 556419 619778 617205 570899 590131 647348
6847 647348 570824 584668 626153 576906 543223 580758 599130 573468 551949 605841 653871 563083
6835 563083 553209 575293 553642 499685 498442 486294 505878 522026 506000 543061 518359 521552
6823 521552 468543 496956 530303 555015 550252 571550 583892 477270 487203 452565 489569 457765
6811 457765 512381 532906 465145 462963 510155 533103 515134 530722 521973 526483 566116 589700
6799 589700 603881 594448 572894 608863 609082 585794 583071 583473 594866 573768 584835 605437 622809
6786 622809 608192 578308 574616 540462 515233 543840 497724 526165 572158 540451 563617 603549
6774 603549 534176 541518 577799 569515 566954 543055 547544 535296 479371 486131 473485 502502 536028
6761 536028 581770 630944 570217 571251 615953 628380 651320 675557 623589 637711 588680 574723
6749 574723 636379 616626 537443 546669 588144 621115 586635 587810 638365 602964 647047 687834
6737 687834 679394 637732 684423 630576 590182 622741 652272 680012 632403 616438 634036 591597
6725 591597 583241 628704 631668 676331 674045 715263 703920 719654 694635 585906 532699 624100
6713 624100 707811 688179 652527 726265 763493 632038 633959 672100 596597 688458 741973 751154
6701 751154 724947 715293 756347 724144 657748 670786 766290 809469 751931 695462 662743 663895
6689 663895 705560 688754 725294 724141 706884 798011 799011 787185 757845 749534 801110 804108
6677 804108 732298 696176 692448 749230 689998 695560 732346 739768 744316 779065 802538 777757
6665 777757 861706 906009 839649 783989 819775 818318 791575 790004 844588 872608 876127 880790
6653 880790 909150 903143 882675 876972 889997 892959 869658 854695 855710 791185 822926 825825 925639
6640 925639 897622 892226 881767 881607 924100 887170 912714 891556 906178 940887 990556 911530
6628 911530 851097 849876 835146 860170 846474 890077 931139 910972 949754 969629 979107 960147
6616 960147 898743 912532 919919 922924 928671 945872 963163 1040484 970817 930267 957091 926922
6604 926922 952363 987142 974854 978582 995329 1023559 1011000 1016105 1056295 1106821 1066862 1085114
6592 1085114 1128274 1136181 1134265 1024728 1039663 1040798 1085093 1122812 1077061 1108727 1122544 1079459
6580 1079459 1108514 1162430 1166333 1217794 1186283 1139141 1106370 1122690 1172827 1144471 1156175 1174248
6568 1174248 1174046 1107756 1142400 1191485 1196448 1178239 1196820 1165447 1146659 1120939 1143322 1117227
6556 1117227 1134183 1154360 1154708 1208302 1272197 1261359 1179258 1156421 1256290 1217686 1253473 1267907
6544 1267907 1279456 1352013 1378367 1345000 1342027 1347920 1347180 1354626 1368296 1339169 1308800 1341928
6532 1341928 1289479 1299696 1364610 1375230 1380907 1432530 1401782 1413872 1381475 1468860 1460753 1449678
6520 1449678 1448329 1477167 1464594 1470668 1429228 1456455 1557073 1561914 1532656 1531532 1570754 1581961
6508 1581961 1544563 1570106 1581675 1646738 1602865 1591439 1545913 1594047 1627784 1612186 1685598
6497 1685598 1732388 1703579 1596516 1623006 1689547 1730280 1719708 1710497 1747686 1757239 1718091 1771206
6485 1771206 1709338 1774965 1806130 1800061 1791783 1768431 1814081 1849185 1896306 1844862 1787210 1799644
6473 1799644 1885024 1887801 1931404 1966422 1888102 1898581 1889577 1972863 1950466 1926904 1907658 1954865
6461 1954865 1994456 2040885 2040838 2023355 2053373 2058286 2096167 2075518 2094771 2096844 2102836 2170124 2105440
6448 2105440 2076885 2157431 2161353 2209321 2224417 2210294 2214483 2238947 2256620 2246494 2226330 2242714
6436 2242714 2251668 2224887 2218900 2239362 2318215 2345402 2379549 2362670 2416647 2432870 2475399 2466217
6424 2466217 2472233 2485471 2531041 2556179 2553284 2531142 2547117 2482846 2488482 2597923 2619380 2624382
6412 2624382 2631444 2621434 2614809 2706052 2703651 2693833 2630984 2667017 2668745 2692473 2704184 2736741
6400 2736741 2754048 2775206 2795515 2827144 2908953 2892033 2846215 2845245 2926440 2910604 2869707 2936797
6388 2936797 2965344 2976570 3017962 3077231 3077854 3083955 3081932 3109774 3131474 3129819 3126295 3168362 3160141
6375 3160141 3190428 3198697 3206608 3232656 3289515 3299968 3327416 3315008 3328293 3402539 3410745 3424861
6363 3424861 3423243 3384615 3356379 3427769 3464993 3533743 3557615 3598132 3613264 3617656 3712240 3760704
6351 3760704 3776272 3790229 3776005 3810045 3841209 3852973 3887413 3939637 3971229 4011291 4048227
6340 4048227 4066454 4084254 4086093 4072733 4097581 4112173 4127258 4190291 4259926 4320139 4300344 4254092
6328 4254092 4339169 4416147 4349984 4365228 4394232 4482179 4491247 4505467 4596028 4622243 4665593 4694022
6316 4694022 4714683 4741656 4738989 4766797 4771497 4835731 4917098 4877729 4917523 4959112 4996624 5029572
6304 5029572 4987195 5007707 5034676 5042387 5048293 5145384 5239253 5243572 5216046 5353417 5348218 5336580
6292 5336580 5448549 5510606 5535764 5476255 5535913 5570958 5682177 5725343 5677437 5706650 5775555
6281 5775555 5800362 5848815 5911721 5952893 5976978 5996990 6040079 6061884 6061479 6121576 6193005 6233582
6269 6233582 6245157 6246499 6284538 6300850 6376716 6477296 6556957 6572259 6578556 6629907 6625371 6653890
6257 6653890 6750147 6837810 6843141 6904220 6933879 6959241 6979110 7026227 7046128 7068851 7093352 7133811
6245 7133811 7192281 7230272 7303774 7370855 7465472 7577994 7553512 7586206 7581572 7594055 7701833
6234 7701833 7755254 7811531 7892053 7921852 7972980 8062366 8173534 8201717 8220084 8295255 8356155
6223 8356155 8434886 8483838 8543203 8607383 8656940 8691605 8729960 8860958 8911167 8923599 8938174
6212 8938174 8977453 9029795 9161185 9279579 9297263 9403121 9456508 9505763 9565940 9593289 9712576
6201 9712576 9728774 9764196 9868088 9900503 9977525 10135223 10189573 10209268 10229418 10270278 10374366
6190 10374366 10427838 10537871 10661426 10748979 10738596 10849093 10810908 10868961 10931441 11002939 11093339
6179 11093339 11261717 11331393 11363468 11456615 11536947 11614317 11748211 11864593 11853377 11913040 11982507
6168 11982507 12039697 12132279 12205385 12309044 12420118 12479607 12490076 12641977 12745611 12812695
6158 12812695 12962269 13040920 13057327 13081790 13132671 13225100 13321839 13372714 13387205 13508010 13609785
6147 13609785 13603717 13678436 13757592 13840459 13901062 13940474 14018569 14158697 14258576 14396461 14516036
6136 14516036 14616715 14732259 14855221 15000641 15118934 15332425 15550453 15777264 15995844
6127 15995844 16154621 16327085 16434094 16447971 16326233 16133166 15942446 15799062 15657332 15640757
6117 15640757 15623350 15615986 15632121 15614020 15543710 15590226 15629661 15608540 15664414 15724439 15694143
6106 15694143 15676045 15679016 15659549 15682533 15769419 15765001 15741035 15758783 15788319 15739157 15781793 15799816
6094 15799816 15750353 15789321 15844298 15878521 15844569 15835321 15849907 15944731 16015891 15980125 15956453
6083 15956453 15992528 15960408 15982618 15922051 15915033 15883145 15844095 15889988 15983373 15925381 15846880
6072 15846880 15848412 15846566 15806844 15796020 15719744 15654797 15704863 15695651 15729378 15613067 15582607 15532603
6060 15532603 15530165 15537927 15556710 15443644 15406391 15350658 15294871 15367316 15335985 15253260 15231585
6049 15231585 15201058 15053921 14971138 15034958 15076595 15041331 15005817 14909588 14868455 14842633 14735670
6038 14735670 14719291 14737759 14662442 14654752 14538095 14499979 14423783 14338268 14330566 14302268 14243878
6027 14243878 14176133 14067718 13976043 13997863 13949314 13812708 13809265 13815884 13772080 13650441 13584010
6016 13584010 13587753 13550529 13526890 13422889 13334581 13224372 13203918 13158868 13107043 13053176 12951545
6005 12951545 12859512 12798337 12777142 12730617 12710021 12620471 12559915 12463826 12424741 12392722 12279927
5994 12279927 12223787 12174719 12132086 12065973 12000731 11949584 11904573 11901909 11807669 11789569 11795711 11720321
5982 11720321 11698721 11585614 11533074 11474793 11461052 11442470 11377386 11323867 11289176 11209910 11073380
5971 11073380 11021147 11023326 10963162 10897237 10869336 10839612 10773494 10730518 10748126 10653949 10581609
5960 10581609 10555064 10543031 10449715 10394316 10376326 10260870 10248034 10241563 10202074 10184366 10087490
5949 10087490 10032250 9988282 9943260 9856505 9808486 9849843 9798667 9780692 9709960 9630083 9652678
5938 9652678 9681610 9661383 9630611 9648613 9644837 9576419 9537273 9475918 9430258 9413465 9344858 9303711
5926 9303711 9254767 9167250 9142794 9152124 9138540 9122841 9089995 9090730 9073826 9084173 9099831 9122971
5914 9122971 9121578 9144734 9120777 9046190 9026173 8978052 8948749 8919857 8869943 8783107 8632724
5903 8632724 8594412 8520514 8405765 8294409 8204201 8222062 8236283 8158792 8066174 8019555 8008193
5892 8008193 8039517 8018244 7953962 7901250 7848437 7870096 7897404 7920966 7932636 7967770 7970183 7997347
5880 7997347 8070572 8146960 8219428 8325132 8425135 8522880 8666653 8779332 8893473 8905897
5870 8905897 8766001 8432773 8259051 8096078 7913982 7757380 7639052 7531563 7424280 7330262
5860 7330262 7302801 7227325 7177653 7135686 7108677 6996599 6995022 7055833 7010550 6982236 6950153
5849 6950153 6939978 6979307 6953199 6895674 6899515 6901955 6899637 6817048 6791461 6792706 6767397 6721978
5837 6721978 6840650 6853289 6876784 6888692 6901167 6956280 6927712 6969163 7004677 7007345 6997956 7033790
5825 7033790 7085351 7082396 7113765 7169393 7154690 7267601 7333824 7332894 7357925 7413948 7527091 7626124
5813 7626124 7646117 7729287 7867603 7925530 7983502 8085375 8172468 8268823 8301923 8370471 8457573
5802 8457573 8525043 8592191 8557125 8513450 8467771 8493753 8534737 8499814 8479958 8516002 8564643
5791 8564643 8604240 8605936 8606960 8632959 8734672 8793150 8826955 8848490 8922921 8945394 9047165
5780 9047165 9049746 9079576 9127275 9180549 9259155 9257086 9270027 9328649 9292643 9256468 9302237 9309314
5768 9309314 9291037 9359200 9393107 9410836 9449250 9453577 9499456 9598700 9692223 9768754 9858706 9895998
5756 9895998 10033126 10127786 10253632 10421817 10544493 10725120 10907372 11056778 11208660 11399035
5746 11399035 11622828 11797716 11948045 12181332 12425480 12658238 12948548 13249020 13550536
5737 13550536 13885195 14311847 14708004 15181306 15676415 16111802 16687476 17280222 17931020
5728 17931020 18595397 19237741 19928814 20652110 21338360 22032262 22695367 23350598 24016563
5719 24016563 24718595 25464807 26173148 26679481 27120865 27567939 27778042 27775167 27630527 27332195
5709 27332195 27082336 26768224 26465368 26260233 26074493 25970261 25950261 25986847 25996348 26075539
5699 26075539 26212325 26438984 26677753 27006780 27292536 27671073 28185300 28664121 29016953
5690 29016953 29519766 29971140 30488715 31091943 31748435 32521888 33342938 34170313 35025076
5681 35025076 35910258 36859073 37775235 38757258 39704916 40711712 41700480 42796882 43904026
5672 43904026 45089924 46451162 47927929 49433642 51102872 52869582 54637483 56583505
5664 56583505 58501461 60329715 61943827 63534715 64831467 65917424 66663293 67210948
5656 67210948 67557605 67641449 67678610 67530210 67305770 67028317 66673114 66336450 66072418 65676687
5646 65676687 65322380 64873378 64625635 64476747 64425059 64401715 64519395 64835963 65247209 65957467
5636 65957467 66698702 67474345 68208843 68889496 69320372 69482766 69196558 68512778 67270493
5627 67270493 65551099 63470620 61114443 58499538 55883552 53198098 50605281 48073244
5619 48073244 45685761 43487039 41423011 39462475 37651838 35934237 34376044 32958768
5611 32958768 31697432 30611214 29580555 28656089 27765216 26972663 26378817 25759760 25172985
5602 25172985 24751004 24251162 23717010 23266479 22886989 22568140 22317374 22099232 21834714
5593 21834714 21633120 21483208 21424700 21320410 21295737 21208218 21043947 20887093 20700938 20399846
5583 20399846 20163757 19893909 19536459 19186557 18827192 18519331 18198236 17936144 17668728
5574 17668728 17598046 17537020 17603784 17680443 17724795 17913106 18136229 18409928 18671124 18884561
5564 18884561 19016657 18951097 18667419 18211438 17708479 17008112 16287292 15606893 15005190 14464591
5554 14464591 13995224 13556380 13091050 12689593 12337092 12136357 11879009 11636346 11432551
5545 11432551 11163878 11050356 10892619 10649166 10450368 10283311 10203060 10039517 9959477 9872925
5535 9872925 9741761 9698430 9668770 9595906 9551242 9509149 9542862 9538214 9548577 9567154 9591765
5524 9591765 9664963 9656451 9624052 9557307 9486964 9333045 9251261 9112441 8959854 8732134 8540221
5513 8540221 8336826 8217751 8027991 7780800 7676968 7532451 7360460 7305638 7197012 7140488
5503 7140488 7031279 6950997 6862577 6860190 6789127 6732554 6759570 6668705 6632290 6648332 6674423
5492 6674423 6611031 6541854 6486856 6445292 6477190 6485455 6465422 6365765 6333163 6292451 6278391 6230441
5480 6230441 6251071 6274861 6240100 6272629 6306872 6313711 6301974 6327414 6321519 6383559 6342773 6392374
5468 6392374 6466718 6430887 6488016 6497877 6479498 6494270 6483861 6491972 6559575 6617790 6671973 6705413
5456 6705413 6760653 6808470 6788549 6808632 6933325 6960662 6991713 7050875 7158440 7177577 7177005
5445 7177005 7347107 7420079 7462112 7495705 7623042 7718017 7815981 7871514 8040434 8240292 8349921
5434 8349921 8421486 8620725 8807305 9016277 9125660 9336296 9571552 9835591 9992272 10216499
5424 10216499 10471288 10743333 11106078 11421090 11766297 12141799 12499481 12852271 13141019
5415 13141019 13414622 13724227 14070207 14378805 14791361 15217068 15671212 16109736 16541616
5406 16541616 17083601 17736372 18398703 19057926 19775336 20479258 21183106 21836792 22386950
5397 22386950 22946247 23406459 23642731 23803698 23856130 23788919 23539754 23330522 23030014 22721756
5387 22721756 22512158 22308718 21952934 21453762 20801294 20244157 19856168 19616259 19451281
5378 19451281 19423331 19472056 19616618 19874833 20130973 20506772 20974670 21496935 22138209 22846398
5368 22846398 23589138 24469876 25496638 26638686 27855474 29127101 30521567 32015344
5360 32015344 33586844 35319754 37134018 38944217 40763814 42516694 44116962 45248210
5352 45248210 45989177 46285199 46337021 46418561 46457201 46583407 46869297 47304686 47907534 48606780
5342 48606780 49548919 50710118 52023916 53429741 54919032 56455917 57825332 58936061
5334 58936061 59804384 60311361 60274941 59791219 58951239 57722146 56222781 54618906 52931024
5325 52931024 51297192 49682813 48309378 47103169 45998177 45035084 44313643 43710700 43462272
5316 43462272 43641970 43994265 44524342 45240916 46174534 47268109 48420724 49614189 50886414
5307 50886414 51963013 52752873 53391735 53617110 53423061 52863113 51790695 50350513 48693935
5298 48693935 46705772 44509931 42265637 39961223 37738813 35562424 33479458 31462010
5290 31462010 29520794 27805612 26232597 24751465 23396860 22141936 21032610 20046900
5282 20046900 19183481 18330306 17592606 16919845 16296730 15740921 15279696 14839671 14450032
5273 14450032 14034981 13688803 13338679 13052695 12828301 12707369 12571127 12386865 12261803
5264 12261803 12157308 12094581 12093352 12032410 12055206 12066957 12106925 12226225 12448178 12639104 12831639
5253 12831639 13080144 13312265 13681341 13967830 14335308 14572491 14907945 15310384 15603026
5244 15603026 15856671 16034490 15973999 15808945 15458764 15072523 14500343 13882319 13430997 12860311
5234 12860311 12241600 11686160 11152248 10639233 10121274 9666849 9336565 8925159 8561246
5225 8561246 8264212 7994304 7696886 7422383 7232157 7077163 6880349 6747640 6568175 6464205
5215 6464205 6411787 6293771 6180286 6172328 6196843 6162743 6087773 5992885 5883429 5779556 5711490
5204 5711490 5529146 5430545 5342668 5238414 5182111 5148476 5095479 4999493 4921729 4924995 4884047
5193 4884047 4900275 4891942 4875318 4887158 4909849 4869838 4882397 4874632 4832608 4781768 4660593 4579327
5181 4579327 4463578 4442318 4342317 4169234 4110839 4056289 4009006 3941177 3876404 3886122 3825479
5170 3825479 3771140 3688044 3683883 3704457 3635117 3622553 3673160 3607925 3536427 3602816 3520683 3467980
5158 3467980 3432137 3436752 3491479 3474480 3468816 3435836 3402647 3445414 3434966 3427190 3458532 3476210
5146 3476210 3514881 3661679 3722178 3720521 3804529 3906715 3979014 4101561 4198600 4313417 4376614
5135 4376614 4414780 4448249 4478672 4481907 4512055 4480210 4427368 4381883 4274702 4227974 4207731
5124 4207731 4196097 4244144 4287848 4262958 4271292 4221413 4197400 4083217 4049884 4028567 3950875
5113 3950875 3885545 3852259 3757099 3603701 3497360 3415775 3373733 3308385 3197837 3130239 3107638
5102 3107638 3016540 2881468 2847372 2869017 2839775 2748968 2710793 2556013 2511405 2496797 2510219
5091 2510219 2541897 2505601 2433231 2412707 2318997 2302821 2311938 2284591 2313171 2327554 2411891 2351453
5079 2351453 2303550 2279648 2250253 2229813 2233193 2215515 2226983 2257741 2253459 2253283 2313722 2301597
5067 2301597 2292629 2290709 2373486 2353238 2365269 2353227 2315674 2390767 2403717 2423178 2474421 2502847
5055 2502847 2480383 2504631 2503458 2526693 2616744 2688535 2573556 2668274 2775666 2738963 2736758
5044 2736758 2712475 2684467 2725674 2671989 2613354 2531059 2541419 2495270 2477385 2522249 2451157
5033 2451157 2453320 2501606 2553568 2528879 2512671 2481176 2531760 2595379 2549400 2519117 2568818 2606948
5021 2606948 2609400 2559829 2568093 2612515 2582163 2530759 2540982 2579952 2577647 2542797 2526581 2548716
5009 2548716 2506023 2421497 2369567 2420542 2449577 2523473 2519000 2542853 2547738 2605298 2681815 2716487
4997 2716487 2777778 2782254 2764761 2767884 2822590 2767290 2788740 2725051 2701677 2665701 2597717 2586423
4985 2586423 2577135 2575809 2505779 2472932 2336612 2410591 2437701 2433663 2440284 2436871 2463795 2397412
4973 2397412 2464416 2474411 2399825 2352233 2417833 2460890 2485231 2435193 2420550 2395469 2398184 2358852
4961 2358852 2362808 2390834 2367960 2360161 2373499 2401291 2387310 2446886 2504041 2467308 2493492 2478413
4949 2478413 2506477 2472125 2509350 2602623 2642324 2596378 2590428 2566724 2610390 2651592 2679419 2638822
4937 2638822 2609994 2648188 2664343 2711620 2731497 2662372 2655032 2666041 2693723 2746475 2721353 2752008
4925 2752008 2784763 2751504 2813993 2822654 2830598 2848554 2860398 2901337 2902245 2856564 2828263 2873974
4913 2873974 2888692 2922200 2879881 2865459 2898659 2961350 2932640 2939615 2996382 2985782 2971847 2939104
4901 2939104 2908794 2876391 2925469 2911592 2883264 2926433 2948175 2951780 2980397 3058518 3000692 3061366
4889 3061366 3156735 3215393 3242375 3296129 3387912 3405465 3475432 3566830 3570923 3639444 3749259
4878 3749259 3933576 4041830 4027757 4025028 3942906 3837637 3789954 3629922 3597868 3540546 3447064
4867 3447064 3465455 3427634 3358076 3333167 3344050 3354166 3355486 3337126 3319558 3326322 3315455 3401531
4855 3401531 3511732 3476191 3455340 3596773 3639905 3643065 3679975 3675365 3730937 3732650 3744000 3799052
4843 3799052 3886159 4019381 3999006 4021906 4154072 4247790 4224934 4279633 4294631 4284708 4288005
4832 4288005 4317096 4351340 4402547 4469841 4517602 4513386 4534315 4523165 4507698 4493529 4478055 4525103
4820 4525103 4565531 4658270 4652417 4630118 4738045 4830358 4906345 4894286 4956771 5054711 5107351
4809 5107351 5146644 5238792 5282420 5269526 5350353 5413576 5442416 5509875 5595986 5637844 5724854
4798 5724854 5829115 5953812 6101835 6174679 6254316 6406213 6476481 6518803 6576034 6620828 6645260
4787 6645260 6682036 6744950 6899775 7018376 7167796 7230772 7305876 7459207 7601304 7715543
4777 7715543 7865906 7984815 8055810 8185573 8465795 8634869 8838066 9034613 9202077 9454089
4767 9454089 9725081 9864864 10147493 10423981 10668999 10966128 11200517 11374986 11619670 11904768
4757 11904768 12230743 12610020 12964696 13398675 13854435 14391170 15042506 15662504 16384316
4748 16384316 17259543 18205754 19372746 20701316 22143364 23787091 25790985 28364690
4740 28364690 31697792 36084611 42005410 49272748 57618549 65643479 69593449 67897418
4732 67897418 61704026 52091959 42741955 35856851 31203699 28140603 25877186 24263754
4724 24263754 23062047 22130821 21314329 20805706 20363084 20090311 19840696 19746840 19766948 19783583
4714 19783583 19799203 19850350 19947199 20129562 20293770 20417847 20552571 20820770 21185973 21579034
4704 21579034 21983791 22516197 23103209 23844676 24698861 25596007 26545347 27573369 28760129
4695 28760129 30240226 31922526 33874577 36223941 39171185 43058633 48293768 54817541
4687 54817541 62010850 69475958 73479018 72379217 69237394 63336734 54363800 46052827
4679 46052827 40008290 35905132 33037268 30867485 29191371 27991632 27005562 26184228
4671 26184228 25534301 25132664 24835990 24600814 24417765 24280581 24246981 24260522 24274455 24288254
4661 24288254 24232916 24166997 24136360 24148747 24057366 24076978 24091363 24152625 24294116 24480936 24730074
4650 24730074 24929274 25085504 25328562 25482299 25650579 25793327 25891036 25995506 26119649 26123760
4640 26123760 26174945 26196645 26235403 26383391 26455303 26570874 26722775 26906429 27218708 27528057
4630 27528057 27882961 28408619 28974764 29468699 29968104 30598486 31163919 31670793 32221510
4621 32221510 32758604 33145016 33504953 33798721 33970523 34007523 33886828 33720093 33441663 33170076
4611 33170076 32829809 32398188 31953608 31541680 31123285 30742030 30452099 30235006 30013243
4602 30013243 29906783 29867608 29865599 29931260 30043234 30240858 30411663 30683496 30977038 31251903
4592 31251903 31459195 31655863 31853307 32125219 32311246 32472193 32644267 32841733 32882676 32968906
4582 32968906 33095465 33108264 33041045 33077008 33110400 33134725 33251083 33388603 33535121 33744053
4572 33744053 33963349 34232005 34531000 34837625 35193283 35575492 35959364 36386716 36827352
4563 36827352 37337142 37854729 38398272 39037683 39826046 40571578 41357263 42250109 43112367
4554 43112367 43991798 45016970 45970489 46952779 47925824 48870582 49957168 50983425 51985665
4545 51985665 52917220 53802775 54626308 55366481 56044028 56695549 57274196 57827920 58390330
4536 58390330 58887343 59406663 59894103 60434594 60884330 61223067 61352826 61264958 60961657 60542278
4526 60542278 60037531 59506007 59099175 58777193 58643505 58650973 58812994 59021838 59288277 59594492
4516 59594492 59975258 60246985 60460833 60577191 60599123 60466397 60340856 60262298 60251928 60284345
4506 60284345 60449683 60786659 61163382 61620443 62302466 62984219 63775129 64706830 65702754
4497 65702754 66729914 67761335 68864550 69966577 70988928 71891745 72606090 73094687 73486269
4488 73486269 73712268 73765044 73743627 73677045 73618869 73590549 73553481 73551306 73524218 73367391 72991234
4477 72991234 72550852 71942215 71121926 70048808 68896039 67682182 66457782 65254778 64013504
4468 64013504 62931568 61937322 60964389 60194097 59525151 59031153 58542498 58081011 57832572
4459 57832572 57710099 57690864 57779253 57991938 58455575 59014715 59711206 60470926 61284263 62167102
4449 62167102 63016835 63765157 64405811 65010415 65355905 65645512 65690806 65524009 65243744 64866475
4439 64866475 64259269 63556091 62891764 62199775 61530322 61034043 60641272 60378112 60304745 60400933
4429 60400933 60651183 60980900 61467704 62039100 62746103 63597226 64428374 65292695 66037920
4420 66037920 66706193 67263779 67755814 68221628 68685366 69154265 69625489 70267756 70824640
4411 70824640 71247015 71408788 70416049 68707996 67239877 66085073 65234357 64713574 64369410
4402 64369410 64129063 64006716 63919477 63862956 63721540 63591120 63415900 63113806 62870885 62554970
4392 62554970 62331979 62107538 61950475 61859199 61758899 61695682 61578167 61353452 61056454 60920732
4382 60920732 60849777 60867074 61096750 61353257 61663558 62079202 62515484 62945298 63381218 63811363
4372 63811363 64003783 64128415 64052491 63800150 63465250 63060038 62607325 62145994 61725232 61332615
4362 61332615 61006059 60768408 60579121 60611584 60727212 60999587 61524954 62062060 62875553 63809561
4352 63809561 64860833 66096956 67498783 69177918 70976639 72945084 75206293 77822377
4344 77822377 80772960 84144425 87853627 91636310 95003479 97131811 97355653 95401613
4336 95401613 91926871 88038274 84523879 81763708 79766902 78438201 77572687 77062855
4328 77062855 76928481 77156635 77554547 78221789 79139389 80323386 81820098 83648354 85711726
4319 85711726 88009517 90756715 93971435 97619651 101688363 106336481 111542298 117207312
4311 117207312 123576574 130639835 138709642 147918413 158883010 171874270 186998663 204109824
4303 204109824 222671608 241429014 258131488 270325752 276575847 276271675 269722283 258115935
4295 258115935 243225677 226729678 210154573 194496219 180069354 166651359 153824243
4288 153824243 141665853 130279276 119930644 111068039 103740572 97609931 92473410 87986037
4280 87986037 83969809 80220473 76743033 73433341 70356381 67562131 65147652 62935042
4272 62935042 61111984 59437858 58059779 56836666 55811959 54914335 54153619 53523433 53164519
4263 53164519 52852597 52630594 52565700 52552000 52642840 52906466 53190587 53544938 54045939 54600635
4253 54600635 55261337 55992537 56850339 57762460 58888034 60117862 61468788 62986501 64738422
4244 64738422 66758115 69114746 71791345 74741802 78151491 82072092 86464031 91420203
4236 91420203 97012263 103384215 110610544 118763548 127949332 138351928 149803128 162136145
4228 162136145 174724490 186563734 196490292 202756099 204078298 199698326 190121046 177084699
4220 177084699 162576428 148067261 134434874 122230610 111431995 101984380 93771966
4213 93771966 86614758 80294063 74815120 70020767 65775101 61977375 58673629 55751082
4205 55751082 53204895 50839935 48708757 46822762 45155007 43583991 42216160 41014085
4197 41014085 39882297 38951910 38075170 37355981 36837781 36318267 35872339 35390048 34798766
4188 34798766 34099037 33375997 32756462 32251631 31665746 31090446 30460678 29756608 28980266
4179 28980266 28013402 27105851 26117246 25237579 24335972 23584159 22888599 22216426 21674227
4170 21674227 21150721 20593547 20098795 19764091 19417485 19090745 18811605 18578025 18381070
4161 18381070 18263466 18063382 17787640 17609724 17283675 16945083 16550203 16107267 15744056
4152 15744056 15292122 14928520 14524746 14174537 13798461 13448638 13216293 12965649 12739782
4143 12739782 12540826 12347133 12211096 12125760 11962448 11806568 11634881 11578247 11449636 11346229
4133 11346229 11244065 11154554 11077260 11060909 10964375 10888840 10802723 10775373 10740804 10628822 10547495
4122 10547495 10510282 10429940 10284497 10088630 9875532 9760030 9545385 9365403 9294715 9201646
4112 9201646 9107972 9050461 8998953 8934172 8818198 8844880 8794676 8703450 8660059 8593688 8526454
4101 8526454 8465536 8388039 8302469 8279823 8327705 8271871 8177282 8135827 8138656 8158650 8117275 8106550
4089 8106550 8134774 8165354 8188362 8137088 8127504 8045038 8050802 8055833 8022725 8045628 8041918 8013097
4077 8013097 7979683 7996207 8010834 8043075 8112172 8210407 8301056 8362156 8423394 8548053 8660472
4066 8660472 8733600 8793254 8883266 8895314 8886563 8942441 9013573 9095077 9156010 9217389 9342977
4055 9342977 9500672 9544590 9696940 9807501 9881439 10004570 10102221 10245838 10298148 10439292
4045 10439292 10611215 10688522 10818495 10979286 11134668 11213836 11386108 11575157 11767835 11924216
4035 11924216 12110517 12312947 12388209 12432495 12520493 12644870 12687123 12797434 12880103 13018552
4025 13018552 13196683 13315410 13424874 13618125 13766725 13969260 14166439 14296390 14452776
4016 14452776 14681543 14992119 15289885 15410102 15642320 15850324 16004894 16302953 16530462
4007 16530462 16766062 16997792 17327707 17579635 17903112 18278522 18748143 19183210 19668145
3998 19668145 20240747 20813024 21445428 22141257 22771099 23366524 23970015 24637295 25323600
3989 25323600 25930968 26629293 27392786 28173352 29046117 29908234 30810894 31672779 32541181
3980 32541181 33376006 33965987 34528867 35038363 35412778 35798026 36174847 36491170 36909783
3971 36909783 37393582 37841832 38265543 38664736 38862004 38922711 38859457 38561572 38082284 37550772
3961 37550772 36960385 36469001 35934943 35422627 34988103 34597366 34130126 33672992 33107793
3952 33107793 32445064 31756969 30878063 30040067 29090957 28010425 27015087 26072476 25196437
3943 25196437 24365095 23607445 22893877 22155263 21403174 20677775 19939326 19249403 18535411
3934 18535411 17809917 17017836 16336990 15744505 15150311 14556943 14019764 13549834 13036019
3925 13036019 12704891 12387862 12011201 11645591 11295978 10863809 10544445 10142354 9729933
3916 9729933 9464105 9119586 8789405 8419866 8155642 7878609 7592786 7382671 7135294 6914827
3906 6914827 6723396 6546805 6347707 6138319 5918623 5785591 5683942 5549501 5421493 5261251
3896 5261251 5172431 5080753 4872637 4715044 4602384 4499433 4396319 4295994 4231570 4138081
3886 4138081 4050436 4003862 3941934 3789558 3745227 3702003 3632534 3592876 3522342 3437149 3347408
3875 3347408 3331267 3280979 3227789 3242269 3237095 3237459 3179899 3080621 3016122 2991449 2998908 2936701
3863 2936701 2913176 2827501 2746240 2694623 2641771 2662110 2615835 2480515 2499882 2473912 2438518
3852 2438518 2471219 2433752 2420394 2394507 2307760 2304984 2360197 2333598 2266258 2234580 2291765 2288658
3840 2288658 2193650 2200825 2220891 2159271 2093852 2049958 2089524 2070585 2052500 2087233 2059118 2002983
3828 2002983 2013134 1928639 1839152 1886615 1896170 1882584 1931171 1904102 1886818 1866233 1875784 1870362
3816 1870362 1772959 1769088 1802928 1875235 1783473 1769901 1769973 1707339 1736472 1782304 1750961 1768832
3804 1768832 1691588 1646499 1696597 1719657 1668174 1614395 1643067 1645546 1609843 1580278 1634395 1633604
3792 1633604 1626843 1621859 1580739 1565233 1531313 1570621 1589552 1573422 1571715 1562438 1537748 1510455
3780 1510455 1485059 1483983 1481087 1477190 1518775 1503171 1580286 1581151 1533284 1503265 1496125 1580291 1544184
3767 1544184 1497388 1426583 1381966 1365102 1447332 1415250 1412435 1436972 1481128 1454742 1435222 1462029
3755 1462029 1375891 1442793 1416218 1433712 1436491 1437632 1434757 1432738 1402373 1410125 1450073 1481005
3743 1481005 1429787 1391970 1395285 1397501 1414422 1398182 1410153 1431257 1383331 1428562 1422990 1458545
3731 1458545 1547358 1538286 1516469 1518976 1513025 1494631 1465011 1459559 1452503 1452928 1399834 1458222 1531649
3718 1531649 1474099 1463598 1546835 1553358 1567827 1552590 1546344 1574483 1536507 1431500 1397353 1489293
3706 1489293 1534556 1505923 1505214 1519043 1476738 1435395 1439818 1446017 1463035 1558118 1584791 1525917
3694 1525917 1493903 1550515 1545220 1519198 1554705 1619838 1631265 1626624 1563134 1618557 1651171 1610489
3682 1610489 1668121 1667867 1663646 1666199 1673529 1682610 1671975 1638526 1701978 1747019 1706144 1677214 1719341
3669 1719341 1736462 1724182 1702747 1636228 1697910 1719761 1770074 1759595 1719152 1765478 1776281
3658 1776281 1790925 1843261 1794792 1731470 1760878 1756021 1768396 1739170 1845017 1880769 1834771
3647 1834771 1856643 1896381 1926315 1846182 1859277 1912783 1923144 1941362 1992277 1981122 1926253
3636 1926253 1948109 1967931 1998982 2053626 2044998 2066069 2096424 2096773 2136158 2171578 2176979 2244588
3624 2244588 2216839 2172757 2120341 2176043 2208801 2246059 2210847 2296936 2357372 2399227 2391593 2276195
3612 2276195 2301677 2292725 2323119 2291359 2334005 2370212 2364305 2403410 2340276 2356389 2431424 2454407
3600 2454407 2460203 2454623 2474560 2507106 2553885 2569165 2640432 2565616 2527731 2604988 2592252 2696149
3588 2696149 2714336 2745617 2754303 2777993 2840032 2854633 2871803 2833271 2880925 2979790 2972234 3034855
3576 3034855 3055768 3025527 3076305 3151827 3108937 3105021 3175702 3204476 3211093 3300145 3328178 3277040
3564 3277040 3311926 3316009 3339073 3375132 3406759 3440165 3432958 3449507 3493678 3475059 3500063 3505336
3552 3505336 3544014 3565095 3594061 3599404 3680856 3678869 3763565 3870644 3899428 3925073 3958628 3969161
3540 3969161 4037209 4103599 4171001 4219931 4199777 4220295 4267016 4240882 4305193 4323617 4423455
3529 4423455 4470868 4428213 4483375 4619779 4646059 4658532 4711884 4715020 4752534 4845670 4926947
3518 4926947 5022227 5137568 5169976 5246761 5288068 5311556 5332023 5425071 5463313 5551120 5614782
3507 5614782 5625484 5676449 5663530 5670483 5757909 5826785 5878017 5899990 5972246 6038410 6127807 6191844
3495 6191844 6237191 6241258 6239700 6356935 6387315 6356197 6439221 6501306 6530375 6573525 6597139 6654883
3483 6654883 6746303 6842160 6847597 6914379 6964780 7022453 7122563 7186831 7292299 7296693 7337974
3472 7337974 7413333 7454737 7501021 7574981 7670476 7772811 7769524 7823880 7947681 8020353 8083096
3461 8083096 8119665 8176472 8246204 8316347 8349272 8406851 8433033 8459413 8536250 8562621 8636880
3450 8636880 8742956 8731202 8760168 8850023 8945164 9035652 9066652 9133013 9113478 9202658 9312609
3439 9312609 9341847 9365395 9371838 9366459 9409463 9581385 9645795 9737084 9810391 9879745 9985157
3428 9985157 10138633 10212407 10324744 10441625 10562637 10738572 10864885 10959035 11105627 11231486
3418 11231486 11289116 11428446 11468703 11534410 11603685 11718886 11886500 11950051 12021747 12068711 12162033
3407 12162033 12267700 12308773 12400451 12420218 12424074 12477003 12561745 12573050 12705127 12700180 12688742
3396 12688742 12738171 12787586 12914110 13012201 13081135 13186322 13229016 13370146 13555402 13675301
3386 13675301 13800875 13915133 14026907 14260715 14401936 14528930 14737861 14878393 14953666 15155734
3376 15155734 15383048 15521476 15760217 15963527 16133538 16312021 16487020 16677545 16920404
3367 16920404 17172064 17473324 17730226 18023999 18282253 18488813 18689281 18992004 19274180
3358 19274180 19549159 19863345 20181713 20465115 20855764 21181111 21500537 21822970 22200207
3349 22200207 22605354 22857458 23102760 23492993 23927780 24261941 24568658 24989224 25379833
3340 25379833 25784654 26136860 26527533 26928133 27400375 27828645 28255264 28686992 29195153
3331 29195153 29680128 30234310 30748273 31321266 31992875 32602353 33310775 34099655 34900689
3322 34900689 35679699 36626786 37611168 38709230 39847201 41107135 42352343 43814529 45429854
3313 45429854 47052404 48863142 50765811 52832047 55167803 57615243 60263909 63133798
3305 63133798 66171602 69306231 72607693 75944107 79352402 82807983 86152797 89376488
3297 89376488 92385902 95195691 97707954 99858304 101781074 103307581 104573541 105529450
3289 105529450 106300121 106889915 107245332 107586285 107856154 107929721 107855826 107669504 107262953 106718665
3279 106718665 105807412 104595357 103154873 101374800 99557956 97570444 95553400 93634515
3271 93634515 91747102 89970742 88396557 86979876 85788120 84794044 84012841 83389845 83016861
3262 83016861 82878393 82836814 82960232 83299993 83772513 84374912 85192376 86092473 87223666
3253 87223666 88563995 90085912 91709298 93408787 95193096 97051420 98957513 100912652
3245 100912652 102849899 104797541 106911922 109217103 111680720 114289111 117255126 120502523
3237 120502523 124055905 128055905 132364000 137203712 142478031 148221070 154340249 160791160
3229 160791160 167408858 173973316 180218388 186011844 191031811 195113299 198278610 200293891
3221 200293891 201289671 201536306 201164044 200384082 199447107 198388304 197294197 196081378 194484032
3212 194484032 192467691 189913292 186495177 182142702 176871577 170761332 164061811 156811832
3204 156811832 149396645 141930750 134733979 127905323 121552386 115729832 110383987 105642913
3196 105642913 101464063 97712081 94520414 91748762 89412937 87426194 85554328 83652636
3188 83652636 81887287 80297773 78989890 77930256 76898596 76048981 75192591 74446525 73593117
3179 73593117 72720826 71840108 70977740 70108286 69100869 68090088 67146954 66313340 65498615
3170 65498615 64677234 64031938 63406637 62961512 62592117 62307212 62212434 62211797 62322290 62637419
3160 62637419 63062941 63417402 63316008 62734758 62019434 61461674 61025372 60803540 60767198 60877808
3150 60877808 61000967 61189499 61604482 62079250 62558859 63250549 64050051 64904002 65937143
3141 65937143 67195569 68589837 70075746 71744785 73579531 75547202 77621681 79810153
3133 79810153 82107990 84432467 86796288 89251761 91738447 94079882 96233281 98012114
3125 98012114 99200865 100200256 100948699 101460855 101813698 101985084 102129441 102402931 102648093
3116 102648093 103131599 103893197 104946040 106446515 108289270 110491110 112985220 115815077
3108 115815077 118988522 122332218 125829349 129428545 132889866 136255322 139336862 142018107
3100 142018107 144180146 145717466 146602603 146711402 146068635 144698512 142802839 140443105
3092 140443105 137814644 134979152 132070243 129323908 126868969 124682823 122902530 121422685
3084 121422685 120231496 119402863 118812130 118497073 118212993 117951067 117787189 117723771 117642481
3075 117642481 117445136 117279522 117203921 117113882 116981565 116811735 116594437 116290280 115956714 115403957
3065 115403957 114639851 113725892 112656510 111337036 109830235 108180792 106527770 104807885
3057 104807885 103126231 101571115 100101184 98915651 97937480 97020603 96181892 95473901 94783596
3048 94783596 94031699 92955296 91641831 90058027 88178514 86055734 83593638 80925403
3040 80925403 78153386 75262160 72446609 69772384 67234187 64882708 62657691 60644312
3032 60644312 58887087 57315979 55876765 54592030 53366339 52192762 51047885 49937876
3024 49937876 48830529 47626066 46463598 45244278 43993196 42657467 41392791 40175027
3016 40175027 38945416 37794734 36722087 35669000 34650612 33754091 32986617 32239048 31511147
3007 31511147 30895568 30357424 29852628 29535848 29238302 29009530 28774737 28595889 28493284
2998 28493284 28405989 28342193 28288967 28322793 28380586 28373814 28322237 28264365 28161356 27962584 27638504
2987 27638504 27253398 26777482 26174864 25649947 25083142 24517408 23981153 23363557 22773130
2978 22773130 22300795 21808808 21393011 21090604 20715592 20481343 20181548 19875986 19546294
2969 19546294 19298014 19055387 18940329 18809415 18693610 18560197 18410174 18340137 18264803 18133553
2959 18133553 18111654 18106250 18034462 17991785 17880774 17816674 17892402 17945026 17885313 17889475 17988074
2948 17988074 18039762 18077766 18219837 18307767 18344189 18440196 18536114 18674046 18859217 18966573
2938 18966573 19102330 19238495 19350456 19490234 19571905 19695630 19852218 20008325 20145889 20212895
2928 20212895 20363496 20490954 20672252 20853555 21115733 21348565 21622781 21920720 22155522
2919 22155522 22413672 22719298 23074782 23457865 23831534 24240698 24683277 25127473 25707855
2910 25707855 26267295 26765621 27244651 27793411 28220347 28709358 29249065 29709445 30162909
2901 30162909 30706279 31313694 31921923 32507813 33170732 33854559 34545466 35342375 36208219
2892 36208219 37011772 37869943 38826578 39882455 40965018 42090016 43360734 44726590 46191888
2883 46191888 47669395 49190335 50778139 52416993 54027381 55469895 56898693 58381011
2875 58381011 59837032 61330591 62860600 64498723 66200310 68071312 70120727 72308235
2867 72308235 74704802 77083478 79534831 81961660 84476827 87016239 89504055 92144432
2859 92144432 94904907 97775414 100691770 103753392 106978446 110337899 113886227 117704024
2851 117704024 122026831 126824747 132323265 138647913 145744097 153897266 163095902 173286266
2843 173286266 184425994 196861983 210797611 226516328 244401573 264837392 288104272
2836 288104272 314088329 342340065 371713689 399771278 423361910 438001503 440063616
2829 440063616 428263944 404392827 373287902 339821303 307419363 277966265 251920763
2822 251920763 229143952 209275749 191740738 176119814 162247150 149936939 138960530
2815 138960530 129201272 120691708 113127754 106321883 100384760 94990518 90069710 85626291
2807 85626291 81513034 77701767 74238693 71019995 68074771 65303452 62634968 60142115
2799 60142115 57842285 55640049 53591179 51674653 49867473 48142880 46560237 45142778
2791 45142778 43636579 42334200 41016666 39854596 38593377 37468477 36485518 35400249
2783 35400249 34431438 33543949 32735718 31971560 31243600 30485838 29874813 29329103 28789276
2774 28789276 28341974 27984384 27669819 27527575 27391290 27298739 27297371 27337874 27258961 27102451
2764 27102451 26774123 26416752 25967478 25602317 25361087 25166825 24985298 24738428 24373582
2755 24373582 23615131 22736182 21723827 20742888 19947103 19250131 18581728 18051296 17674653
2746 17674653 17329273 17121334 16880674 16748503 16839471 16942819 17092402 17355666 17626691 17687874
2736 17687874 17588751 17076997 16309613 15418081 14573522 13820249 13153010 12570619 12060889 11742634
2726 11742634 11363226 11001006 10657067 10314365 10012227 9733839 9523267 9327720 9076348
2717 9076348 8860153 8705168 8565552 8439933 8286360 7985148 7776841 7572450 7543704 7409331
2707 7409331 7148337 7081357 6985545 6864808 6774033 6654038 6521460 6384048 6319220 6221551
2697 6221551 6099681 6094096 6103632 5994533 5888373 5728218 5590308 5513128 5440384 5397540 5268405
2686 5268405 5140288 5108308 5015034 4932902 4855806 4750979 4729598 4689664 4675550 4628934 4592167
2675 4592167 4560775 4587238 4546233 4529808 4559310 4567707 4545447 4480953 4472938 4389766 4342090 4320530
2663 4320530 4319798 4297958 4251330 4234935 4122627 4056716 4047460 3980069 3978363 3914287 3840868 3698591
2651 3698591 3638035 3534056 3484258 3465806 3425197 3369729 3368202 3355036 3368147 3301758 3243824
2640 3243824 3314867 3261807 3270017 3251062 3299833 3297135 3205905 3176171 3141395 3072608 3035573 2956655
2628 2956655 2932415 2867128 2896522 2909533 2956457 2941595 2845766 2768102 2735757 2710460 2697957
2617 2697957 2610429 2652647 2674382 2629975 2534055 2533737 2487775 2447283 2434669 2432907 2410225 2449947
2605 2449947 2476429 2420647 2442307 2432002 2475383 2482138 2479955 2493282 2536074 2555450 2536519 2500318
2593 2500318 2528762 2514051 2483651 2507626 2473950 2466208 2485428 2497127 2489975 2431647 2431324 2431605 2457313
2580 2457313 2389537 2293262 2312397 2410170 2412216 2457386 2437868 2388415 2451451 2403261 2382075 2410875
2568 2410875 2440434 2431255 2501692 2576585 2586224 2589851 2669124 2709939 2729705 2747732 2738663 2803474
2556 2803474 2821625 2913780 3001203 3065712 3147410 3295803 3499973 3531703 3457377 3487952 3481552
2545 3481552 3469778 3334622 3184903 3100848 2947438 2859722 2735434 2587309 2429034 2326830
2535 2326830 2310090 2204516 2141780 2099356 2035006 1919199 1887412 1888309 1814513 1766614 1751550
2524 1751550 1712126 1644857 1607305 1526388 1578403 1546741 1486508 1483694 1454190 1456480 1529711 1543603
2512 1543603 1454521 1405580 1348581 1272976 1298401 1366103 1390823 1345136 1328139 1313616 1267694
2501 1267694 1253090 1259352 1242809 1126961 1183624 1179507 1138035 1103208 1129005 1143614 1133836 1126364
2489 1126364 1170456 1091496 1082091 1072751 1053934 1049126 1050844 1143070 1062845 1014479 1092043 1042671
2477 1042671 1018012 1050217 964626 974480 1020389 946137 957895 983110 993008 941883 843745 852863
2465 852863 876978 882149 876048 910688 949475 915188 879786 842705 818743 833360 894876 865653
2453 865653 777827 860494 931217 855955 810330 790935 744910 774750 733498 709809 731794 759942
2441 759942 788560 721701 692676 750285 742308 715275 698401 683813 704086 759050 649267 626239
2429 626239 591660 649938 668852 641091 614074 642910 672442 638719 570684 564950 589934 580257
2417 580257 593761 587539 591609 512121 479535 494866 485941 511320 565878 547997 575171 661902
2405 661902 568569 539862 584415 598749 636407 603341 658959 699824 583703 540031 496069
2394 496069 445900 490046 525729 512169 538790 454597 497829 512831 413560 469612 501906 460799
2382 460799 462565 531310 504208 493693 503884 481498 526138 511742 441451 473022 486078 532232
2370 532232 514527 464247 478449 488257 492762 489589 500296 492366 485798 491838 504151 518362 424838
2357 424838 392806 413265 463395 465896 457925 440984 457724 431393 435518 431086 493503 468365
2345 468365 421989 469405 417343 399577 499869 476073 397476 370071 445972 459312 447973
2334 447973 417838 399898 408604 422728 442783 438149 419973 362883 385064 419636 449558 360000
2322 360000 417346 396765 433655 400679 380597 430655 437329 496260 418487 385674 424560 414114
2310 414114 401683 409876 428794 330597 327773 368350 298780 251098 240604 304737 350309 325942
2298 325942 315865 314868 299452 303173 319930 381177 344521 286647 347560 342554 300012 283481
2286 283481 218129 197742 294659 347761 332181 329456 293957 271284 285502 290919 322544 328187
2274 328187 284331 345392 425962 389560 320789 307178 351136 381080 365625 362265 291028 303816
2262 303816 327729 328532 353545 322025 344915 359036 295204 308499 351870 396434 372374 391246
2250 391246 332569 355168 411982 378066 362555 304590 299193 302820 236112 315807 339683 289412
2238 289412 331637 375703 370683 328588 373466 336915 354144 278888 325489 332529 341782 354481
2226 354481 290013 308921 285426 289995 296728 356979 283681 239051 321768 360958 315375 276970
2214 276970 362770 373504 346199 334974 333378 340522 335780 310447 330081 424496 424105 380283 364834
2201 364834 365891 414161 406055 399699 415290 390254 415106 464331 456027 471892 383284 382196 403701
2188 403701 400184 399846 367829 358810 425896 416721 417801 457965 484093 497209 476495 468712 569367
2175 569367 485792 462607 512891 551560 576537 597982 592262 622056 667025 668542 687631 595293
2163 595293 569570 579779 711869 763330 788804 740141 720974 717403 736967 687636 713389 741946
2151 741946 755681 794283 861025 818258 844495 902159 989970 1058806 1128658 1110501 1100075 1140796
2139 1140796 1240035 1332237 1310542 1369236 1386083 1479591 1550149 1638831 1734203 1816311 1944193
2128 1944193 2119963 2338131 2533267 2696425 2842572 2968716 3150197 3366505 3724213 4206843
2118 4206843 4796779 5540061 6519820 7781756 9700846 12070323 14330662 16617501 16437459
2109 16437459 13000580 9601997 7273140 5876910 4957365 4140238 3616771 3129055 2799864
2100 2799864 2575531 2356176 2192032 2143378 2068396 1955771 1784976 1603795 1542950 1450740
2090 1450740 1337641 1247202 1130706 1106035 1088020 1014559 947589 914928 856734 872107 862991
2079 862991 846507 780712 767898 755909 779255 723634 644989 725838 661085 655150 627992 550254
2067 550254 555573 574191 574389 504861 507141 515069 506383 516160 507991 547267 471235 479529 421406
2054 421406 392014 436487 380124 324741 392734 348933 355842 294211 319425 338934 312505 301071
2042 301071 343771 269190 230594 256720 261455 225456 231608 246246 257151 307588 332273 297534
2030 297534 242521 216435 166860 238569 256901 284393 239891 183581 182945 212242 208645 218173
2018 218173 189075 166601 136853 163747 192561 228895 176104 150214 150385 105048 122041 136914
2006 136914 114055 136696 179137 193318 120907 143483 154291 122349 132868 159121 183139 112418
1994 112418 169608 123432 145703 145413 113215 76758 133820 239818 179788 108969 77272 83482
1982 83482 111122 123691 88107 95978 92987 133648 149804 129720 79798 87652 48177 62270
1970 62270 105512 125295 103996 141746 172491 114662 216600 156471 75151 68772 56349 68880
1958 68880 56947 102313 124214 141784 65642 59814 87206 79826 89265 167734 166809 154529 136776
1945 136776 88016 89670 76634 81497 115756 75448 68421 99897 105593 86577 48761 41907 49813
1932 49813 16804 -9001 -26700 50559 63475 81201 60424 59164 70042 40111 -15956 14708
1920 14708 107837 99449 128067 109511 84433 83384 31061 38529 47105 75270 113287 16705 18131
1907 18131 103463 196071 148329 69465 51958 37649 21936 69159 140521 114561 99919 123508
1895 123508 128408 111602 7133 15053 78122 56765 23646 83267 80941 79810 38246 126213
1883 126213 50584 -22165 18547 68466 72948 86751 52851 7358 36956 35189 76344 123828
1871 123828 80132 56552 47695 -65482 -53654 -36850 34718 149262 155784 123794 68397 98471
1859 98471 15110 55183 70091 78113 54711 2594 40929 22079 79744 70554 37987 51221
1847 51221 82065 115210 121741 68538 128474 157035 109275 118057 59564 9575 66027 47409
1835 47409 22075 -904 54354 75492 65423 5491 94269 59680 13402 35771 69683 99988
1823 99988 103479 68132 -7082 38721 53882 72032 58452 29089 44604 69184 28837 -4949
1811 -4949 47127 85047 44598 86909 49962 -9665 45258 57666 77529 67923 21209 71604
1799 71604 46945 -727 84679 30890 41992 69682 75083 98632 95750 74793 40399 81491
1787 81491 28520 35715 -22643 -51833 -96326 -43885 11709 1460 36030 30067 36928 56151
1775 56151 71889 69169 51546 38371 26884 40830 32199 75475 38095 21152 17073 15143 17496
1762 17496 40393 35262 10145 2836 -22841 66195 69372 51483 -21218 34131 45279 37769 -31234
1749 -31234 40033 55388 -5746 -44151 -17056 9429 91656 81257 50839 42945 77215 41587
1737 41587 -19084 -18934 -9070 24687 -23590 -16073 -34688 14811 32894 680 19687 54786 95434
1724 95434 107114 106240 68734 67544 8426 50977 65033 47904 83254 84822 89083 4580 3227
1711 3227 -40667 -34243 83782 108860 29729 29150 19013 63439 17935 -20677 -23628 -14428 15586
1698 15586 24774 7232 45645 75611 58450 6074 -11100 13239 23839 1122 -8623 -53872
1686 -53872 -76181 -59440 25178 88548 69305 18795 13865 3562 22287 21441 26557 35503 -27262
1673 -27262 -20456 -7096 33805 51878 -5791 -63373 -56262 5611 26470 24297 -12242 -12328 89703
1660 89703 122021 51300 17989 81207 83289 73564 25392 38325 60902 95941 8182 -47151
1648 -47151 24234 49889 38142 27212 47278 49996 67031 -27267 3140 15740 20219 -68897
1636 -68897 -49573 -68074 -93087 -62838 29802 35343 -24646 2522 11658 -13008 -16498 -11422 6952
1623 6952 42902 32104 -46543 -64571 -8260 17221 74083 32397 749 -45555 89455 65954
1611 65954 65092 61298 15848 96571 55631 -15765 -23574 -65068 -11982 16559 -39162 -48204 2029
1598 2029 -39335 10477 63370 29990 -20382 -30621 10806 -18779 -18149 76831 17323 -87631
1586 -87631 -25749 -3765 30897 44287 12815 79599 59628 19855 -5362 -17335 46867 29197
1574 29197 45418 51230 52020 11360 -834 -41649 -100771 30427 51667 35202 107051 49570
1562 49570 43415 68126 29016 21121 48312 30645 42611 25158 -3046 7005 11436 35870
1550 35870 51028 -21321 -82418 -76040 -65338 25258 68377 43710 65446 56360 18774 80717
1538 80717 97253 21738 -4682 7868 46604 -3957 -36029 -12029 30310 21592 18458 17441
1526 17441 -28919 -11900 5293 50082 -18953 13884 34321 27877 30180 74004 81781 14603
1514 14603 68999 59114 75171 36687 -66426 -37129 -27309 -58885 -67178 -11944 -43223 -25919
1502 -25919 70679 -26709 -40931 59169 55549 68688 39231 -6421 -3665 -24500 28594 -5937
1490 -5937 -8253 3855 -52066 -44747 -115239 -43378 3501 13653 17095 9253 -57576 -94190 -13671
1477 -13671 -30515 -55636 -35787 5149 -22221 -594 58851 34232 -19302 -57489 -62547 -57851
1465 -57851 -38651 -30437 -32039 -35489 -30856 -31086 -65433 4079 -4566 -32102 -32921 -20926 -58937 -42445
1451 -42445 -21776 -2497 54441 492 -79406 -15074 22648 -34128 32133 60862 21219 29015
1439 29015 -36244 -6779 17270 -31333 -17053 -16113 6650 36676 12680 16140 -2628 -8779 19544
1426 19544 33791 50669 103591 -22674 -37184 7939 -16641 -19859 -4914 -54912 -17767 24754
1414 24754 55056 25273 -25625 33830 33852 -17228 -64576 32008 40011 -11356 -13113 -43714 -37880
1401 -37880 -30585 -13559 -19263 59340 63737 33423 90114 30380 24560 26770 22283 10832 -15318
1388 -15318 -19772 -5322 -4857 -34611 -32816 43075 31508 -28445 -25557 -25489 -41133 -21665 38796
1375 38796 21182 -2911 25228 -49646 -7689 94573 88586 31137 64889 25352 25231 19821
1363 19821 30847 70581 52846 59249 108920 67778 11433 -64591 -17421 -20305 10082 43009
1351 43009 69416 67426 -42527 -23486 11151 28732 53405 -32710 916 87634 81357 14384
1339 14384 -52102 -24076 -15777 -52484 -37281 -63536 -74579 -74238 -3660 33969 34446 -19749 -30555
1326 -30555 44169 13806 -11932 -9312 -1994 -26509 -39816 -58215 10607 8189 -15200 -40557
1314 -40557 -19635 -33569 8968 70709 92161 42702 -6492 31232 24569 44079 47612 47530 82158
1301 82158 -23834 -39588 16724 41285 25593 -22062 16406 54403 -27707 -53742 -30161 11985
1289 11985 44197 -30105 -2223 33213 40749 13585 -30445 -21930 16243 4470 -26664 59385
1277 59385 -3208 -58961 -10105 43304 8693 34177 18702 76060 81898 32340 66050 56017
1265 56017 -22503 39027 78957 100413 87236 47544 19140 62832 52591 41054 70992 48560
1253 48560 35669 -52446 -20131 9764 15661 -31930 -79679 -77708 -31686 2383 -46190 -54563
1241 -54563 -50988 -5939 11142 -30753 72398 45504 -18541 -15601 37492 -2126 -29530 -66703
1229 -66703 -47176 7597 -41335 -63267 6764 1704 -41571 -47665 -35154 -61609 -22227 45749
1217 45749 13417 -17048 -16729 -53141 -110176 -98708 -2656 -4310 -19745 -70697 -21108 -36079
1205 -36079 -428 46281 46455 24310 -9061 11416 -49459 -27276 -12073 8258 -15770 -6290
1193 -6290 30651 22363 -38390 -22747 -27243 -81998 -74568 2424 -16185 12598 -40979 -89155 -60929
1180 -60929 -29825 -22315 -22891 -49885 -44274 -58945 -7940 51739 35790 44126 69223 -15237 -33625
1167 -33625 13057 -36807 30687 -18373 -37342 -13331 10878 -28173 -50449 -102738 -110069 -38059
1155 -38059 -19442 -64045 -21003 20316 12630 9271 -13768 -8706 -33466 8894 -19670 -23769 -28884
1142 -28884 -59539 -36158 -57633 -81044 -40505 -55809 -53157 -9188 -31667 -23209 -10553 24781
1130 24781 11797 46270 57688 -24144 25111 76424 65187 55327 21527 6933 13286 6476
1118 6476 800 -233 -80970 -50856 -56429 -107831 -81089 -63994 49122 45682 11547 70575 88858
1105 88858 44920 -47002 -51377 -18208 -4445 -20996 11066 63656 23739 30087 -31164 -22323
1093 -22323 25372 -10815 14152 -14191 33097 52916 4088 -24420 -35866 -37058 -18725 -14437
1081 -14437 13070 12336 18469 -8743 -25861 41586 -37410 -13252 -32709 -12729 2310 30605
1069 30605 30304 -20940 -51129 -32133 674 24717 -5459 -31377 -71690 -60506 -34057 -13174
1057 -13174 4643 -31142 -5927 38521 -8673 -4442 36530 8221 -1922 -11945 68506 29991
1045 29991 -929 61849 63239 122659 57627 25386 -14521 -79090 -67202 -15308 36995 -29500
1033 -29500 2526 56704 77507 70877 25136 -43988 -64754 -50460 15327 -56140 -76788 -32197
1021 -32197 27167 -72793 -28949 -42413 4557 32094 -58722 -63982 -77143 -18161 -9923 -53262
1009 -53262 -113648 -126634 -50404 -33096 7101 23964 -6554 25112 31569 18078 -27310 23165
997 23165 3964 -61820 -13140 -42296 -113368 -40447 -34097 -61687 -54756 -75655 -52876 -17615
985 -17615 -49421 -42872 -59744 -50129 -27476 -56707 -21021 -31094 25103 22840 -57567 -59988 -56069
972 -56069 -11284 -48092 -32741 -59731 -28726 -43479 -2585 -59553 -95244 -19765 -1907 27682
960 27682 -15139 -11442 46819 32712 -27704 -32085 3588 -64337 -52413 -60760 -124657 -48695 -17541
947 -17541 62310 57611 52614 56017 8221 66206 16860 -67068 -33746 -17503 17419 1151 -56141
934 -56141 -45853 8203 -25080 -73337 -106089 -51782 -83292 -108404 -39316 -62159 -22668 -14834
922 -14834 28556 18420 -5519 -78121 -62399 28644 20574 21009 26032 44120 72708 4120 46073
909 46073 32422 -17318 -4449 -42380 16578 40895 -46652 -119832 -91898 7194 18743 -9222
897 -9222 -20801 -64889 -60217 -39602 -19454 -35840 -53063 -106796 -60026 -24077 34677 38922 -32442
884 -32442 -36459 -68928 -62045 -37591 -23581 -1710 51196 66705 80790 40961 16812 22503 -70924
871 -70924 -48901 -19519 -39524 -61424 -61097 -23673 -4282 -78668 -67370 -13153 16776 -46351
859 -46351 -73397 -18090 -81944 -65741 -24943 -52424 -61926 -77543 -47611 -36894 -16163 -44850
847 -44850 -9120 -15237 -18644 826 -9628 -33526 -67331 -40031 -16932 -27488 40895 -7520
835 -7520 -52558 -93382 -36389 -8333 -14114 27191 84467 86206 8549 40185 -2103 -11493 -57831
822 -57831 -30175 -24846 11836 18513 6545 18301 21390 -3254 -10356 44326 18561 -4059 -55346
809 -55346 -71240 28204 7879 -25696 -30571 -11243 2287 38130 21309 -29233 -14699 26407
797 26407 18008 -13487 7875 -1795 16765 52508 19411 22040 -24892 -11772 40520 46461 17129
784 17129 32487 -1405 -48044 -7772 74997 32852 42447 86318 46432 -61764 -80622 -59147
772 -59147 378 43105 37348 39540 -3631 -8713 40611 72106 70776 33403 51580 33800 -12596
759 -12596 -52553 -10561 36935 9172 48678 26755 -17400 -16581 -9195 -34701 71398 9850
747 9850 67019 49230 -24218 -48093 -39210 29386 50581 97773 88617 35495 53878 -4842 8657
734 8657 22188 -1008 16577 36189 -63620 -75743 -10562 -18731 632 -3548 14339 7726 72145
721 72145 23594 -87851 -47149 34221 19478 4118 -43643 -34048 35242 -2958 1603 57774
709 57774 54947 -12468 15950 26413 -27715 -58868 -60646 -60438 -59546 -56763 -3962 -3090 -42999 26034
695 26034 59714 51862 24754 24687 -15894 -393 20600 22658 -27358 -6044 44595 24128 5764
682 5764 -38849 -9841 23997 25061 2342 7205 37511 22049 -11127 27260 -5951 -55081 -53074
669 -53074 -25599 -3000 -38127 652 -10378 -17293 -15646 10522 -6869 -17599 -12125 25874 105918
656 105918 59159 80550 94959 60139 53444 4581 49127 17461 -38572 -77562 -36599 -77118
644 -77118 -13353 60174 -18182 -20867 -13024 -35222 -32784 5016 17464 22734 -71282 -46644 33753
631 33753 1445 22433 -60 -10881 -44996 12816 18513 -11299 5814 -51771 16166 65785
619 65785 18915 -20527 -17977 3768 -1311 -107904 -67562 -90993 -24711 -17184 -25665 -33975 10204
606 10204 9030 24561 79368 64773 5122 -39751 -34374 -9419 771 -1851 6615 26987 56485
593 56485 -15125 -43377 -41739 -43937 -7808 69440 58654 66794 77931 76058 93288 117218 35775
580 35775 -1943 -35149 -50528 -53284 -51045 -23908 -51497 -54655 -46285 -38261 -22984 51680 45703
567 45703 -42497 -37847 -59067 -55110 -5564 -17573 18094 8721 -31043 2030 21149 -112 -26993
554 -26993 19386 45977 17765 9120 -58598 -46780 -51922 -62857 -19865 22564 -53504 -117668
542 -117668 -100404 -55887 -14597 -22146 -26731 19904 37898 -31321 17099 -10810 866 -3594
530 -3594 -38452 -69352 -14019 28617 7279 9708 15348 7305 34791 56899 45394 26569 24028
517 24028 54544 61231 13727 -32975 14176 -69194 -60585 -18004 37488 28475 -10196 19586 11340
504 11340 34645 29564 -6986 -32999 -15555 29107 1911 -1499 -7971 5388 -18246 -54346 28339
491 28339 17939 2629 -8740 8923 22031 -33341 -21865 119 -36924 29398 46727 26761
479 26761 -8073 17346 -6467 -30413 -55786 -73574 5928 -19125 -10717 42428 14688 -7054
467 -7054 36788 51598 45383 17166 62969 29737 -31676 -16652 25812 17765 39120 10568 44809
454 44809 22496 -48561 5916 -82649 -89779 -15407 7994 109597 44597 -40051 26613 -41877
442 -41877 -39172 -29128 44141 89550 82148 32342 23924 30630 75404 64782 29450 91332 48587
429 48587 -44723 10592 14859 23808 32434 58525 20543 -27450 -39685 -18554 -23242 -27688 -35039
416 -35039 -10351 -29219 5566 37674 -42558 31166 -28940 24702 81141 69356 25967 22404
404 22404 12 -46759 1034 59378 12854 36412 55217 41086 -21093 562 40846 56464
392 56464 7485 30835 34112 44772 6057 36026 45837 41204 51158 51274 108112 104244 45170
379 45170 22331 36479 18099 8574 -810 84328 125302 122613 48936 18724 63303 92982 88413
366 88413 -1042 20619 -35883 -25774 -69781 -87960 -75654 -57763 -925 11302 32058 -13446
354 -13446 -2055 6785 8876 -3614 67061 74457 142131 79194 24736 20631 11152 43327 11802
341 11802 -14443 8019 63496 30848 34415 118622 98558 74548 18729 68953 75735 92108
329 92108 65249 61529 21380 -11233 -8211 -3625 76065 74453 43551 -14306 -7486 -16006 -42921
316 -42921 1145 19369 4521 6592 21357 9247 -28651 28788 59007 41166 66903 39182
304 39182 19515 9562 -11639 17521 41598 68207 77643 64047 116428 79456 -5772 -27098
292 -27098 -1743 -4596 -3920 45657 46781 12851 -8114 -6464 -44078 -48585 -8061 27077 9193
279 9193 29783 64877 52773 51049 15722 64888 51428 -11834 24511 127970 103566 81942
267 81942 79537 38521 80987 58588 52210 26918 48792 -12039 17123 -1853 -7835 2921 89644
254 89644 80166 83747 125539 65381 82045 78892 107178 79657 93117 93697 53742 36973 47951
241 47951 -37049 -45571 -24548 4315 11973 28142 87194 61400 25112 62672 11998 -7267
229 -7267 22859 -40024 -40058 -16842 -62967 -16497 -23741 -7056 -46780 -66149 -25256 10496 42122
216 42122 50998 57520 42560 48028 36057 66256 83132 83547 35794 -19105 18957 85716 66607
203 66607 55089 65012 60142 -11345 -52437 -62957 32623 88418 99742 53452 45461 75173 75516
190 75516 81069 33995 4022 13172 -17007 -5348 20036 4984 -29028 -12935 -22767 -50116 32213
177 32213 75516 48752 47088 38000 20805 -34479 -28618 5172 -8582 -9500 -6765 1647 37490
164 37490 47326 67602 58027 -19391 -24208 45382 64375 9129 15742 58887 110225 47038 -3859
151 -3859 -11808 36188 88757 90466 27475 132 61509 80652 51580 6685 2691 19675 58390
138 58390 40412 32782 -43709 -32153 -2134 22468 54598 33742 53089 29098 33820 65725
126 65725 91714 7085 -3132 -29134 -60161 -65039 30941 73866 94733 50124 22511 -7473
114 -7473 -47063 3568 19837 72861 35569 2079 41967 92662 33175 34774 33515 50319 63669
101 63669 49659 40428 30804 88448 125167 74115 14263 -17792 20297 38307 84937 28096
89 28096 52814 96296 45523 36547 43404 52663 31477 24725 32788 49541 49110 50624 54606 80014
75 80014 50520 53539 37128 5207 32937 54518 18113 17290 25717 2646 7212 26643 17249
62 17249 -4498 -35548 -2101 23907 33006 19352 16222 5271 -11170 -26941 7334 22260 9143
49 9143 -9192 -22215 -35093 14068 70496 65626 31168 12199 -773 -34995 -40050 -1143 29998
36 29998 -29019 -16595 -3022 -2276 -4722 15570 22201 56432 63944 69590 71687 61653 57271 32828
22 32828 58977 74543 39618 47785 58924 18710 28436 -11603 52254 44346 23634 70248 75862
9 75862 72611 44726 -2787 19175 20283 6862 2494 -10205 25667
0 25667
$$ Imaginary data points
##PAGE= N=2
##DATA TABLE= (X++(I..I)), XYDATA
16383 -3114562 -3098481 -3037349 -3012919 -3003509 -2939081 -2902043 -2888084 -2815999 -2763772 -2705194 -2670826
16372 -2670826 -2622724 -2570307 -2560720 -2517606 -2452358 -2395790 -2346685 -2346490 -2333192 -2272552 -2214384 -2129206
16360 -2129206 -2099194 -2077423 -2027651 -2061912 -2005923 -1947691 -1917739 -1857348 -1768238 -1757023 -1671194
16349 -1671194 -1625876 -1625819 -1588008 -1539229 -1433916 -1388911 -1391753 -1335962 -1292591 -1263339 -1228232 -1189096
16337 -1189096 -1162789 -1101376 -1041161 -978834 -977833 -926399 -911575 -876000 -836036 -853363 -783076
16326 -783076 -739004 -698970 -679670 -628289 -582190 -511559 -443491 -422668 -425937 -356717 -327826 -292748
16314 -292748 -226386 -177923 -147214 -114198 -49152 -25024 -23493 -51186 -14617 23761 57396 141823
16302 141823 214613 242471 263177 313245 327811 334713 368511 408808 443966 486206 460959 475303
16290 475303 554776 613177 645731 736001 719413 696414 698259 802999 834902 839898 880202 933596
16278 933596 989443 1000083 1078836 1113545 1071093 1110518 1190775 1201921 1224127 1258006 1267496 1341339
16266 1341339 1337195 1323595 1361537 1345983 1362976 1426865 1431125 1425524 1558194 1610836 1669839 1648333
16254 1648333 1662961 1708156 1709921 1707692 1690698 1799645 1790110 1876393 1880526 1899793 1921398 1911100
16242 1911100 1950455 2014045 2021524 2018147 2026177 2113875 2122276 2078684 2066690 2097046 2204578 2211664
16230 2211664 2221579 2230777 2253577 2275469 2288911 2324981 2362084 2414834 2372131 2398447 2434097 2356288
16218 2356288 2361640 2388271 2401899 2467491 2543087 2542213 2592259 2600613 2618816 2602171 2634995 2645862
16206 2645862 2612433 2612195 2659851 2632070 2669412 2763843 2772622 2787121 2770433 2785932 2799856 2821336
16194 2821336 2821084 2787696 2790954 2823745 2907592 2898718 2873649 2947953 2985183 2979515 2998122 2990991
16182 2990991 3013628 3018621 3034057 3118628 3143300 3106568 3150238 3149662 3157779 3115653 3116486 3131911
16170 3131911 3167824 3180408 3182466 3194659 3145840 3115991 3171637 3130607 3155679 3171894 3236942
16159 3236942 3231233 3209134 3243058 3246361 3256409 3241802 3269523 3250984 3269166 3298301 3309525 3287034
16147 3287034 3302938 3340323 3415016 3358095 3329908 3371359 3352976 3361367 3367325 3379291 3444213 3448603
16135 3448603 3378688 3355597 3386213 3469624 3480738 3523686 3529442 3472753 3493159 3497812 3510140 3549943
16123 3549943 3548100 3484879 3471630 3473850 3571323 3515498 3445795 3486153 3552440 3557251 3485456 3512304
16111 3512304 3547943 3557795 3576841 3555615 3571733 3594671 3595889 3636919 3635718 3613865 3604632 3579112
16099 3579112 3582787 3595600 3589797 3690724 3718940 3651837 3610983 3619302 3624297 3604552 3563168 3540359
16087 3540359 3603807 3606617 3616978 3632202 3638352 3650298 3580157 3557506 3564210 3629021 3669724 3702041
16075 3702041 3728395 3652104 3615625 3657617 3641218 3666317 3742958 3695230 3673713 3677908 3692981
16064 3692981 3646117 3682793 3704713 3687390 3697681 3669587 3718032 3732502 3718910 3751847 3735497
16053 3735497 3729976 3701591 3723701 3680390 3647606 3660826 3704120 3692150 3704837 3702780 3696772 3673060
16041 3673060 3704334 3703856 3665062 3673010 3722817 3656489 3666084 3669298 3683055 3710673 3717266 3739383
16029 3739383 3684708 3630705 3688263 3718849 3695975 3767683 3801386 3826459 3784694 3773931 3745414
16018 3745414 3797285 3804071 3732112 3661221 3707418 3626097 3685444 3701602 3744402 3785564 3747661
16007 3747661 3739295 3742942 3779634 3772349 3775552 3748073 3766913 3777466 3809089 3753208 3718034 3729931
15995 3729931 3779389 3714224 3770344 3753073 3687054 3696434 3769840 3774055 3760334 3804727 3734021 3820095
15983 3820095 3896742 3847873 3798201 3819110 3865792 3792803 3777564 3860260 3814634 3789229 3727625
15972 3727625 3731528 3714599 3753094 3769769 3730424 3661968 3700002 3723971 3766747 3769632 3704136 3727891
15960 3727891 3738496 3708412 3695858 3706070 3709571 3701473 3716637 3754654 3727990 3681660 3713962 3718885
15948 3718885 3663830 3634836 3712081 3737497 3781253 3783527 3785900 3798795 3765132 3813507 3822496 3795290
15936 3795290 3802001 3740649 3719079 3650171 3674619 3684473 3688587 3666605 3640014 3705283 3764791 3786799
15924 3786799 3775717 3795727 3827627 3853227 3826166 3819261 3791503 3779168 3769557 3762112 3772151 3787437
15912 3787437 3763901 3773491 3755837 3718909 3707893 3741248 3744149 3827673 3807222 3774238 3747025 3749325
15900 3749325 3801514 3794992 3808404 3737157 3692423 3728182 3744949 3718092 3726004 3856502 3829017
15889 3829017 3815942 3771314 3781210 3838425 3783907 3754360 3794423 3804606 3774184 3773650 3781389 3832777
15877 3832777 3813226 3784729 3774489 3754163 3768531 3777104 3784563 3776002 3720405 3733690 3778344 3761014
15865 3761014 3793206 3828913 3778271 3685626 3706016 3694889 3711578 3751968 3731727 3716504 3729926
15854 3729926 3746351 3780683 3764118 3753006 3778570 3760600 3782978 3782237 3739140 3739864 3824778 3812642
15842 3812642 3810599 3799731 3759913 3800232 3751353 3767349 3792326 3866888 3845948 3803855 3828653
15831 3828653 3900059 3881873 3786586 3835211 3853480 3783804 3822606 3804540 3775244 3862176 3917624
15820 3917624 3829426 3782740 3813625 3826379 3838672 3796435 3821664 3848009 3882355 3815669 3768743
15809 3768743 3860969 3826319 3748083 3773972 3810040 3872812 3797168 3755779 3800390 3830431 3822392
15798 3822392 3829775 3750745 3751256 3792466 3821122 3851386 3842602 3875380 3881872 3828602 3763737 3797828
15786 3797828 3784605 3836957 3893616 3822588 3806751 3830002 3813354 3812682 3870395 3909658 3829410 3808218
15774 3808218 3816445 3788018 3806056 3803473 3806728 3801563 3881395 3857151 3869043 3862951 3843760 3816340
15762 3816340 3758513 3754728 3821711 3796969 3765376 3734854 3757530 3786233 3823684 3808037 3764798
15751 3764798 3820730 3802955 3765776 3707369 3788009 3803141 3782337 3817337 3800169 3850536 3891255
15740 3891255 3899200 3883009 3805080 3756040 3796470 3804077 3759441 3802720 3793744 3788111 3860066 3830256
15728 3830256 3818596 3802159 3768566 3764444 3788969 3769473 3793773 3809678 3794813 3860933 3886054
15717 3886054 3868363 3899611 3893386 3902730 3848009 3808130 3815622 3746006 3712171 3736173 3836127 3835799
15705 3835799 3870139 3822950 3781579 3805152 3809139 3862624 3865915 3841550 3884813 3826636 3840481 3828034
15693 3828034 3841210 3877480 3836604 3865718 3823457 3815579 3874117 3905831 3831567 3819312 3865719
15682 3865719 3861476 3863970 3879942 3866544 3833009 3861594 3819875 3806362 3890484 3894449 3828708 3820534
15670 3820534 3873189 3895307 3878187 3837008 3827985 3855062 3811938 3805602 3872207 3841263 3885139 3883716
15658 3883716 3857622 3910056 3934052 3946767 3918571 3904468 3936568 3919205 3862082 3833666 3840006
15647 3840006 3861643 3890895 3882584 3871879 3904310 3900146 3900448 3828230 3875877 3869568 3850896 3884548
15635 3884548 3890804 3793352 3842325 3838503 3796648 3815704 3845209 3840050 3821857 3855928 3905768 3960508
15623 3960508 3942456 3937570 3896248 3867123 3880657 3881776 3823841 3812757 3833267 3774182 3794321 3818092
15611 3818092 3886965 3851394 3869626 3910770 3862578 3843166 3859866 3906028 3821438 3866218 3849415
15600 3849415 3901315 3861742 3822521 3836404 3847148 3824775 3845144 3824573 3831910 3836175 3898808 3967114
15588 3967114 4007358 4085923 4045981 3925342 3874981 3818044 3790408 3816647 3920221 3889262 3848930
15577 3848930 3852337 3811095 3849702 3844480 3842318 3840046 3891112 3863179 3845104 3798614 3829343 3880335
15565 3880335 3884877 3876714 3910320 3911060 3936747 3904747 3934948 3923746 3974218 4007939 3936324 3914768
15553 3914768 3881968 3903755 3872448 3888401 3830419 3867707 3911308 3811074 3684867 3728317 3800197
15542 3800197 3806974 3885762 3869759 3907289 3914255 3899461 3897800 3901294 3922097 3952595 3924841 3863161
15530 3863161 3853412 3905974 3943860 3981418 3949412 3964197 3973369 3843250 3875795 3887450 3895041 3898261
15518 3898261 3878163 3866450 3885441 3872192 3876371 3903314 3842506 3806053 3895590 3878972 3879980 3930854
15506 3930854 3960306 3975640 3940815 3926062 3927910 3862237 3843534 3887616 3883995 3936877 3941137 3916936
15494 3916936 3947366 3950510 3939753 3863767 3842904 3864429 3909000 3951764 3990349 3951866 3923318
15483 3923318 3898208 3940052 3904871 3918693 3903201 3886891 3962545 3924645 3915858 3959817 3897370
15472 3897370 3900615 3898261 3942668 3985365 3922492 3943010 3942585 3993649 3920375 3878998 3826795 3910499
15460 3910499 3954386 3907381 3909773 3899018 3911743 3951543 3977230 3976297 3920388 3984727 4017553 3984405
15448 3984405 3978590 3913425 3875015 3945893 3929583 3914651 3910424 3964594 3985772 3912108 3861729 3907392
15436 3907392 3877959 3910035 3889526 3879930 3932508 3935686 3925997 3891980 3924352 4019338 3987279 3943085
15424 3943085 3927942 3906455 3945779 3948189 3971805 3939135 3961669 3990787 3934777 3980709 3993718
15413 3993718 3986967 3964127 3920015 3989551 3975867 3938277 3907592 3911543 3880423 3946292 3945804 3995747
15401 3995747 3979217 3889518 3878668 3920149 3965335 3983293 3981362 4005617 4036271 4020963 3932622
15390 3932622 3912729 3968112 3995090 3974888 3933901 3916011 3908264 3933201 3928858 3950642 3971013 3988407
15378 3988407 4022743 3974828 3969861 3981880 3967463 3957525 3998153 3957578 3877357 3954233 3960786 3942972
15366 3942972 3914072 3928360 3964040 3985827 3959597 3907195 3921238 3971798 3912284 3914624 4050158
15355 4050158 3996520 3968673 3957393 3941271 3986471 3941625 3949099 3914908 3921117 3857777 3947242 4054994
15343 4054994 4073200 4054403 4028978 4000523 4025409 4067329 4055687 3959463 3926663 3934599 3925248 3964154
15331 3964154 3925750 3867012 3971547 4061532 4037222 4048497 4009284 4008243 3996839 3944235 3893285
15320 3893285 3939728 3915940 4006215 4056686 4013866 3950247 3973866 4017803 4043291 4103883 4086724
15309 4086724 3997938 3958568 3941481 4033914 3995917 4011524 4035243 4045714 3934946 3873544 4003691
15298 4003691 4035731 3946277 3969676 3964512 3898014 3955861 3960321 3981530 3922687 3917329 3917397 3943235
15286 3943235 3998570 4005174 3977494 3902944 3940406 4019824 4013736 4032801 4010747 3997310 4031269 4011512
15274 4011512 4000254 4026438 4056717 4037219 4011631 3980252 4021800 3985252 4031120 4024135 3969110
15263 3969110 3934591 3925747 3971194 3995355 3993014 3909566 3962319 4018539 4009322 3977221 4045212 4093413
15251 4093413 4065713 4037235 4061371 4017127 3980311 3997473 4002205 3992272 4026500 3966081 3992303 4004365
15239 4004365 4039942 3956023 4072103 4150437 4082683 4032576 3993312 3989210 3953383 4021934 4063940
15228 4063940 4065996 3976513 3951498 4068134 4092586 4047794 3993013 3990516 3983468 3945986 3969281 3999208
15216 3999208 3997765 3961260 3976087 4004578 4057607 4028787 4017352 4023996 3996405 3985161 4025069 4060094
15204 4060094 4029596 4019961 3979215 3947569 4015524 4047410 3985852 4020128 4036643 3974512 4018454
15193 4018454 3971809 3991485 4081590 4083399 4008016 4041780 4057521 4047295 3996036 4033808 4051982
15182 4051982 4018490 4063153 4075560 4034085 3998598 4052487 3979419 4010240 4024990 3944575 3985315
15171 3985315 4085910 4075436 3967694 4044484 4058350 4002630 4081719 4043211 4043091 4089662 4044923
15160 4044923 4015684 3992999 4025860 4028449 4115999 4169007 4117343 4142944 4125566 4100217 4071393
15149 4071393 4060908 4071991 4017949 3963771 4013750 4071210 4060438 4043996 4070277 3964604 3996698
15138 3996698 3994258 3973561 4003880 3987514 4017185 4031888 4034635 4042889 4080887 4049835 4050122 4029580
15126 4029580 4042848 4095311 4059595 4088389 4118104 4127454 4117293 4106241 4139555 4109991 4160760
15115 4160760 4193474 4121691 4054227 4121444 4104097 4081934 4077111 4044128 4060377 4062875 4075217 4104524
15103 4104524 4095290 4093226 4073628 4046289 4076984 4108007 4085768 4080116 4106426 4131267 4104816 4069620
15091 4069620 4050936 4143169 4103693 4100368 4119290 4106083 4109215 4078602 4058813 3979912 4011800 4092437
15079 4092437 4131912 4113125 4150017 4124685 4079929 4144680 4123417 4061042 4101391 4044610 4129330
15068 4129330 4178534 4102783 4063452 4073509 4070218 4069745 4094752 4051211 4045221 4073911 4127631 4111663
15056 4111663 4112270 4124467 4086774 4082475 4087480 4091260 4054622 4134348 4192301 4084802 4096081 4066261
15044 4066261 4081783 4136842 4119442 4100608 4074065 4079046 4063263 4120978 4151611 4125965 4073134
15033 4073134 4084146 4128614 4104239 4114021 4028517 4010588 4077321 4060397 4085500 4086645 4121933 4151805
15021 4151805 4103740 4095008 4138579 4008161 4042467 4031272 4046864 4110942 4098593 4159377 4103462
15010 4103462 4150078 4114362 4131951 4126770 4130342 4069331 4150637 4166574 4154896 4165665 4148297 4161087
14998 4161087 4102699 4099928 4094554 4073630 4071089 4085459 4017231 4001202 4082714 4144557 4106442 4070773
14986 4070773 4105768 4125483 4129747 4131511 4115542 4126825 4181437 4200805 4185033 4174458 4132289 4136543
14974 4136543 4168536 4184874 4165562 4190221 4164604 4117564 4098731 4113092 4096546 4209100 4207951
14963 4207951 4204267 4162150 4191589 4154230 4178488 4204411 4187110 4179011 4175662 4146866 4164121 4212266
14951 4212266 4179042 4154944 4115734 4098038 4105092 4143384 4156543 4155804 4185355 4155309 4239424 4170143
14939 4170143 4054526 4050132 4044430 4130733 4121075 4140434 4153244 4095346 4083090 4082402 4088206 4134952
14927 4134952 4120612 4089128 4067860 4097069 4055188 4134733 4155996 4127513 4130362 4205879 4145466
14916 4145466 4138473 4112011 4116000 4090376 4141291 4176660 4231987 4165151 4137338 4083147 4044090 4135442
14904 4135442 4087037 4063543 4082835 4137673 4099154 4089482 4120177 4118952 4175535 4123412 4167948 4135873
14892 4135873 4149791 4146466 4132636 4137279 4149624 4175425 4122496 4111512 4180839 4207371 4194058 4197612
14880 4197612 4161469 4211367 4161308 4214747 4205243 4192609 4188081 4187000 4186056 4183261 4183545 4195934 4155832
14867 4155832 4158353 4144648 4175868 4261653 4252572 4174953 4158073 4169173 4190691 4164100 4231575 4258336
14855 4258336 4259627 4269933 4219513 4139047 4157903 4168726 4174942 4200869 4195189 4253749 4214860 4174020
14843 4174020 4158495 4158882 4207719 4201923 4158432 4227182 4182378 4189625 4199421 4171313 4172325 4139779
14831 4139779 4178556 4179446 4126349 4123673 4153164 4163566 4234975 4240733 4206644 4220748 4262563 4261217
14819 4261217 4223776 4173460 4207030 4210861 4215586 4148200 4167668 4201258 4197563 4222056 4216121 4247659
14807 4247659 4229926 4207983 4192006 4194286 4165062 4204568 4212520 4220219 4199825 4164728 4222853 4225949
14795 4225949 4169007 4219648 4252152 4244170 4240916 4250437 4229660 4254149 4321332 4258196 4257550 4218492
14783 4218492 4226260 4246826 4226499 4226994 4233806 4261944 4206699 4247655 4206982 4193566 4241031 4224179
14771 4224179 4195939 4252293 4276067 4263003 4263649 4257112 4184485 4137763 4199968 4191754 4207305 4208020
14759 4208020 4197639 4207290 4243924 4169342 4224802 4279744 4280287 4280559 4230433 4217518 4228265 4254252
14747 4254252 4254260 4257258 4200881 4252719 4231465 4216254 4232298 4204118 4224531 4265558 4249812 4240843
14735 4240843 4166848 4155182 4239010 4218663 4214534 4223912 4227829 4204596 4238693 4210601 4192234 4190026
14723 4190026 4224145 4280020 4273063 4267000 4258844 4204514 4270829 4205440 4221666 4310539 4215636 4273265
14711 4273265 4198003 4155760 4183276 4235248 4187617 4216568 4290152 4326483 4334876 4261638 4184626
14700 4184626 4220877 4242388 4234592 4184073 4226940 4210562 4199633 4265542 4236248 4252933 4198053
14689 4198053 4205636 4208603 4221497 4253965 4302054 4237779 4218035 4199327 4239047 4216306 4262516 4297146
14677 4297146 4241917 4247904 4237104 4261710 4261061 4281611 4319841 4294390 4325676 4338772 4341364 4300403
14665 4300403 4316474 4345140 4358176 4334787 4231532 4258647 4287083 4306319 4311681 4281388 4311528
14654 4311528 4368544 4345192 4305990 4283150 4360613 4391059 4350185 4273779 4272277 4271513 4264755 4312207
14642 4312207 4315525 4223955 4257911 4250907 4237408 4309069 4326930 4284891 4272154 4300129 4250143 4266968
14630 4266968 4274538 4233980 4274434 4339589 4339658 4304974 4239932 4277814 4272935 4281245 4348647 4338322
14618 4338322 4289312 4276489 4266936 4222942 4293878 4322681 4315835 4367687 4421285 4356716 4356951 4327512
14606 4327512 4380597 4394760 4383257 4315429 4256007 4295289 4186009 4225571 4233399 4244186 4271936
14595 4271936 4211182 4260997 4342814 4275312 4255768 4261404 4206221 4227758 4278855 4244680 4312753
14584 4312753 4250644 4226957 4234349 4208762 4271185 4296433 4287069 4302663 4289883 4305192 4260209 4222556
14572 4222556 4273268 4302873 4278837 4243244 4293793 4247499 4199551 4221976 4323420 4325783 4315873
14561 4315873 4353201 4336311 4328210 4281578 4304441 4319168 4281169 4291882 4354201 4367038 4345292
14550 4345292 4335289 4295092 4315620 4303494 4361028 4320040 4269847 4316930 4352598 4388973 4357262
14539 4357262 4361916 4306507 4332176 4349209 4334672 4388310 4305307 4250512 4240348 4308792 4345940
14528 4345940 4318460 4340760 4273505 4278286 4209267 4267773 4294333 4347689 4308084 4274630 4318687
14517 4318687 4303420 4294315 4282367 4271947 4248139 4363302 4344185 4302405 4250663 4255420 4344188
14506 4344188 4321463 4322839 4253897 4352021 4394848 4347359 4352066 4305157 4313337 4298012 4299113 4325578
14494 4325578 4413595 4317162 4277915 4261087 4302420 4328863 4334345 4336078 4360384 4348739 4360992 4429564
14482 4429564 4388341 4307942 4336323 4284019 4286953 4347519 4324268 4275417 4266464 4290544 4372107 4411951
14470 4411951 4413336 4456566 4440182 4341717 4351938 4373860 4374329 4336775 4349953 4376325 4302230 4328009
14458 4328009 4349552 4403829 4427608 4345510 4304204 4295176 4238388 4279482 4337641 4321797 4339159
14447 4339159 4363475 4322653 4366824 4336522 4298473 4329839 4334298 4322545 4325460 4424876 4336869 4347468
14435 4347468 4419389 4384810 4377210 4361895 4395078 4353230 4414717 4395173 4399158 4302132 4295599 4330027
14423 4330027 4289006 4375800 4409858 4372221 4449889 4464981 4423491 4425208 4347191 4358409 4371041
14412 4371041 4284045 4318905 4384189 4383049 4379595 4362771 4394091 4389940 4406622 4401913 4343061 4415193
14400 4415193 4404749 4368546 4437350 4398891 4328301 4333520 4356726 4366490 4445251 4491250 4452192 4439292
14388 4439292 4418888 4423904 4454687 4436004 4438013 4420424 4422382 4434586 4418123 4385501 4420096 4470014
14376 4470014 4483199 4491301 4488851 4480073 4480821 4430446 4374745 4392552 4343005 4345817 4441083 4483801
14364 4483801 4412512 4449790 4456864 4399915 4441466 4466205 4435713 4475823 4454319 4408207 4436382
14353 4436382 4441305 4465378 4509982 4433727 4394786 4480422 4442657 4433401 4442769 4383315 4421339 4424462
14341 4424462 4392106 4460875 4442700 4439528 4445079 4358208 4309992 4352526 4397887 4441608 4454781 4407930
14329 4407930 4483648 4417760 4414694 4448561 4415089 4429220 4384543 4337994 4336400 4358664 4342747 4382507
14317 4382507 4448061 4455680 4385174 4436937 4441832 4429439 4422785 4428880 4410295 4429636 4460359 4430909
14305 4430909 4406034 4444547 4480261 4416756 4412166 4456794 4438273 4499076 4443077 4473274 4513759
14294 4513759 4502681 4493788 4472534 4442141 4472597 4439365 4439794 4467215 4453661 4482163 4487166 4494078
14282 4494078 4462793 4436157 4414286 4463090 4458612 4437834 4432805 4434832 4451199 4414582 4396838 4440372
14270 4440372 4445506 4519133 4516685 4427810 4442400 4481951 4459708 4468010 4504382 4468054 4417301 4471885
14258 4471885 4399589 4458502 4527823 4437978 4377750 4372489 4434408 4505780 4537421 4533429 4608081 4530777
14246 4530777 4484473 4532819 4477044 4458070 4466193 4465723 4531902 4524882 4459012 4418632 4435688 4511971
14234 4511971 4535335 4533348 4441623 4469417 4497980 4434712 4486267 4509965 4400229 4342315 4377744
14223 4377744 4457327 4496240 4504363 4495837 4457674 4404381 4457757 4507765 4511316 4450921 4456067 4517217
14211 4517217 4531255 4497997 4512702 4494260 4535115 4499557 4476984 4451635 4396898 4463790 4553568
14200 4553568 4521372 4483846 4538046 4470485 4488289 4478025 4475248 4499767 4536315 4494589 4449644
14189 4449644 4451980 4467872 4444134 4421182 4439217 4416980 4389839 4513193 4554878 4519228 4490138
14178 4490138 4475778 4504330 4520102 4507223 4475699 4440582 4420555 4515990 4591200 4523184 4483990
14167 4483990 4535179 4555810 4575045 4552929 4538896 4455125 4475211 4466905 4478127 4556621 4511994
14156 4511994 4484075 4502063 4502186 4481184 4514217 4519964 4553079 4563853 4547230 4516971 4547884 4570746
14144 4570746 4580927 4556564 4538999 4553837 4550667 4509056 4492683 4597346 4590384 4521731 4472242
14133 4472242 4477528 4545012 4518727 4523912 4579492 4554739 4535858 4566225 4563098 4577420 4595372 4575911
14121 4575911 4559679 4607336 4611498 4562253 4580401 4604209 4568585 4519687 4496428 4513577 4466059
14110 4466059 4480577 4499717 4540139 4537159 4585151 4541828 4488642 4485145 4553175 4590170 4580365 4577234
14098 4577234 4503186 4520700 4521300 4574774 4611744 4575259 4518027 4544538 4587965 4557211 4562616 4540562
14086 4540562 4519646 4524293 4541395 4532111 4567843 4555131 4527770 4504837 4504610 4552716 4534200 4529157
14074 4529157 4546749 4558020 4508566 4505187 4518107 4532586 4496406 4508396 4540754 4583636 4537509
14063 4537509 4541374 4532248 4549208 4609805 4603186 4579275 4638944 4615973 4588644 4502561 4490495 4546828
14051 4546828 4596146 4596316 4567072 4523540 4607491 4590441 4626620 4677405 4517649 4535701 4626579
14040 4626579 4557051 4573706 4586953 4555241 4547149 4520430 4562949 4613353 4548911 4548231 4573380 4594532
14028 4594532 4604922 4577257 4572114 4540585 4548418 4554538 4578679 4535660 4632147 4639233 4614987 4576366
14016 4576366 4566163 4594282 4620087 4546013 4533845 4591370 4612034 4619946 4606684 4589385 4621771
14005 4621771 4644487 4633599 4558808 4610920 4596750 4645202 4617411 4574758 4582683 4582920 4638099 4620265
13993 4620265 4607660 4582447 4646222 4684097 4605124 4535436 4587188 4609444 4583708 4632573 4636720
13982 4636720 4598596 4604349 4581412 4554433 4560464 4619589 4625722 4645201 4590624 4577830 4581880 4587494
13970 4587494 4569405 4587373 4605793 4561814 4542478 4568661 4588844 4559986 4619179 4624742 4612873
13959 4612873 4641305 4613431 4591884 4642865 4659033 4623049 4642513 4603190 4566918 4625376 4626953
13948 4626953 4652421 4636279 4650083 4597730 4603330 4546009 4550351 4601264 4587915 4624801 4672492 4720793
13936 4720793 4673637 4679699 4686176 4681788 4669099 4613058 4687225 4642759 4595943 4612725 4614977 4635386
13924 4635386 4585388 4645989 4666762 4639395 4578352 4613130 4631654 4595139 4589367 4683533 4624792
13913 4624792 4703841 4648518 4644891 4690385 4628201 4621474 4615033 4674983 4613129 4622097 4593336 4609503
13901 4609503 4627804 4639296 4667024 4669167 4646181 4659803 4625663 4635485 4723382 4733834 4724329 4683935
13889 4683935 4656980 4704309 4787735 4682694 4634266 4664617 4684824 4685839 4714524 4707393 4718731
13878 4718731 4699494 4689900 4755363 4685144 4644674 4681463 4685434 4662036 4670913 4729713 4783114 4755492
13866 4755492 4728483 4714695 4740309 4758820 4758639 4683253 4682604 4630756 4646942 4645971 4611042 4634431
13854 4634431 4619896 4612282 4619890 4685072 4670435 4662933 4658788 4607214 4657289 4673541 4671146 4682544
13842 4682544 4698835 4687720 4646257 4699756 4658174 4680108 4706508 4678725 4668502 4701651 4698583
13831 4698583 4672739 4684808 4699698 4732393 4696427 4632256 4682521 4685681 4686596 4709529 4716438 4720483
13819 4720483 4726488 4689873 4742642 4720477 4664102 4669166 4657432 4660371 4600840 4644993 4706315 4709988
13807 4709988 4693142 4681760 4732966 4758344 4720134 4727482 4689110 4699156 4639951 4761425 4750762
13796 4750762 4736188 4764820 4716167 4702896 4683357 4691500 4696132 4677289 4729227 4700626 4677110 4729699
13784 4729699 4746110 4696416 4744783 4748366 4678612 4697437 4651306 4698646 4715156 4724602 4735106 4810971
13772 4810971 4809806 4767767 4757257 4737534 4785834 4757720 4758076 4796680 4788817 4757098 4728666 4747124
13760 4747124 4728929 4675982 4710791 4701768 4698690 4766674 4786128 4735957 4652752 4689103 4738455 4723431
13748 4723431 4743455 4749864 4716079 4698409 4694234 4697238 4685606 4700005 4721712 4728237 4687292 4743141
13736 4743141 4725448 4766263 4685720 4708383 4810827 4792188 4702344 4756350 4746329 4745303 4738669
13725 4738669 4763314 4694796 4659030 4746447 4761028 4793184 4742678 4787111 4802692 4797244 4722505
13714 4722505 4693770 4708253 4733267 4740611 4820191 4794318 4819883 4798603 4795391 4791027 4742910 4775539
13702 4775539 4793257 4849405 4845133 4821639 4749816 4779196 4824670 4789372 4797360 4793847 4821376 4784571
13690 4784571 4783987 4800417 4745912 4740491 4766586 4815111 4770447 4739842 4747894 4755308 4755932 4713191 4787144
13677 4787144 4816214 4740075 4748709 4789449 4767310 4770920 4713449 4759812 4764890 4739992 4761345 4753663
13665 4753663 4731651 4736229 4752647 4759404 4731225 4759514 4790381 4809240 4796512 4834290 4824201 4818093
13653 4818093 4837668 4821824 4795844 4758277 4804639 4804874 4818308 4779087 4794160 4801154 4836006 4925578
13641 4925578 4889283 4763133 4774379 4756678 4833838 4823560 4803024 4782590 4762985 4777273 4822182
$$ [...]
##END NTUPLES=NMR SPECTRUM
##END=
