##TITLE=1H_CA-9169-2
 CDCl3
 8 sc, 
 5.7.2023
##JCAMPDX= 6.0         $$ Bruker NMR JCAMP-DX V2.0
##DATA TYPE= NMR SPECTRUM
##DATA CLASS= NTUPLES
##ORIGIN= UXNMR, Bruker Analytische Messtechnik GmbH
##OWNER= root
$$ XWIN-NMR		Version 3.5
$$ Wed Jul  5 14:16:13 2023 Russian Standard Time (UT+4h)  she@DPX200
##.OBSERVE FREQUENCY= 200.13135
##.OBSERVE NUCLEUS= ^1H
##.ACQUISITION MODE= SIMULTANEOUS
##.ACQUISITION SCHEME= undefined
##.AVERAGES= 8
##.DIGITISER RES= 18
##SPECTROMETER/DATA SYSTEM= spect
##.PULSE SEQUENCE= zg30
##.SOLVENT NAME= CDCl3
##.SHIFT REFERENCE= (INTERNAL, CDCl3, 0, 15.716)
##AUDIT TRAIL= $$ (NUMBER, WHEN, WHO, WHERE, WHAT)
$$ ##TITLE= Audit trail, XWIN-NMR		Version 3.5
$$ ##JCAMPDX= 5.01
$$ ##ORIGIN= Bruker BioSpin GmbH
$$ ##OWNER= she
$$ F:/spectra/data/she/nmr/H-F/1/pdata/1/auditp.txt
$$ ##AUDIT TRAIL=  $$ (NUMBER, WHEN, WHO, WHERE, WHAT)
(   1,<2023-07-05 14:14:54.67 +0400>,<she>,<DPX200>,
      <created by zg, POWCHK disabled, PULCHK disabled
       configuration hash MD5:
       00 E9 B6 7A A2 85 ED C7 34 08 36 98 17 FE 4E 26
       data hash MD5: 16K
       75 31 0F B2 C8 D3 80 79 50 DC 63 66 72 E9 D7 D4>)
(   2,<2023-07-05 14:15:02.07 +0400>,<she>,<DPX200>,
      <Start of raw data processing
       efp BC_mod = 2 LB = 0.24 FT_mod = 6 PKNL = 1 PHC0 = -20627 PHC1 = 9.25272 SI = 16K 
       data hash MD5: 16K
       85 8C 16 30 6E 23 CF CB 2A DF 51 65 2D 64 14 58>)
(   3,<2023-07-05 14:15:21.73 +0400>,<she>,<DPX200>,
      <pk PHC0 = 0.3426632 PHC1 = 2.235174e-07 
       data hash MD5: 16K
       8B 1B 3C 38 3E 62 13 F2 3D 3B 17 A2 21 36 01 D6>)
(   4,<2023-07-05 14:15:25.46 +0400>,<she>,<DPX200>,
      <abs ABSG = 5 
       data hash MD5: 16K
       B9 F9 86 D3 22 00 0C C2 E7 A8 7B ED 3E C6 BE 4C>)
$$ ##END=
$$ 
$$ hash MD5
$$ DA 72 9C AD 7A 50 62 28 68 36 E0 BA AB 15 B8 7C
##$RELAX= 
##$RELAX= 
##$RELAX= 
##$RELAX= 
##$RELAX= 
##$RELAX= 
$$ Bruker specific parameters
$$ --------------------------
##$DU= <F:/spectra>
##$EXPNO= 1
##$NAME= <H-F>
##$PROCNO= 1
##$TYPE= <nmr>
##$USER= <she>
##$AMP= (0..31)
100 100 100 100 100 100 100 100 100 100 100 100 100 100 100 100 100 100 
100 100 100 100 100 100 100 100 100 100 100 100 100 100 
##$AQSEQ= 0
##$AQ_mod= 1
##$AUNM= <au_zg>
##$AUTOPOS= <>
##$BF1= 200.13
##$BF2= 200.13
##$BF3= 200.13
##$BF4= 200.13
##$BF5= 200.13
##$BF6= 200.13
##$BF7= 200.13
##$BF8= 200.13
##$BYTORDA= 1
##$CFDGTYP= 0
##$CFRGTYP= 5
##$CHEMSTR= <none>
##$CNST= (0..31)
1 1 145 1 1 1 1 1 1 1 1 1 1 1 1 1 1 1 1 1 1 1 1 1 1 1 1 1 1 1 1 1 
##$CPDPRG= <>
##$CPDPRG1= <>
##$CPDPRG2= <>
##$CPDPRG3= <>
##$CPDPRG4= <mlev>
##$CPDPRG5= <mlev>
##$CPDPRG6= <mlev>
##$CPDPRG7= <mlev>
##$CPDPRG8= <mlev>
##$CPDPRGB= <>
##$CPDPRGT= <>
##$D= (0..31)
0 1.2 0 0 0 0 0 0 0 0.06 0 0.03 0 0 0 0 0.0002 0 0 0 0 0 0 0 0 0 0 0 0 
0 0 0 
##$DATE= 1688552094
##$DBL= (0..7)
120 120 120 120 120 120 120 120 
##$DBP= (0..7)
150 150 150 150 150 150 150 150 
##$DBP07= 0
##$DBPNAM0= <>
##$DBPNAM1= <>
##$DBPNAM2= <>
##$DBPNAM3= <>
##$DBPNAM4= <>
$$ [...]
##$SUBNAM3= <"">
##$SUBNAM4= <"">
##$SUBNAM5= <"">
##$SUBNAM6= <"">
##$SUBNAM7= <"">
##$SUBNAM8= <"">
##$SUBNAM9= <"">
##$SW= 18.05172834244
##$SWIBOX= (0..15)
0 0 2 0 0 0 0 0 0 0 0 0 0 0 0 0 
##$SW_h= 3612.71676300578
##$TD= 16384
##$TD0= 1
##$TE= 0
##$TE2= 300
##$TE3= 300
##$TEG= 300
##$TL= (0..7)
0 120 120 120 120 120 120 120 
##$TP= (0..7)
150 150 150 150 150 150 150 150 
##$TP07= 0
##$TPNAME0= <>
##$TPNAME1= <>
##$TPNAME2= <>
##$TPNAME3= <>
##$TPNAME4= <>
##$TPNAME5= <>
##$TPNAME6= <>
##$TPNAME7= <>
##$TPOAL= (0..7)
0.5 0.5 0.5 0.5 0.5 0.5 0.5 0.5 
##$TPOFFS= (0..7)
0 0 0 0 0 0 0 0 
##$TUNHIN= 0
##$TUNHOUT= 0
##$TUNXOUT= 0
##$USERA1= <user>
##$USERA2= <user>
##$USERA3= <user>
##$USERA4= <user>
##$USERA5= <user>
##$V9= 5
##$VALIST= <valist>
##$VCLIST= <CCCCCCCCCCCCCCC>
##$VD= 0
##$VDLIST= <DDDDDDDDDDDDDDD>
##$VPLIST= <PPPPPPPPPPPPPPP>
##$VTLIST= <TTTTTTTTTTTTTTT>
##$WBST= 1024
##$WBSW= 4
##$XGAIN= (0..3)
0 0 0 0 
##$XL= 0
##$YL= 0
##$YMAX_a= 818824
##$YMIN_a= -1039624
##$ZGOPTNS= <>
##$ZL1= 120
##$ZL2= 120
##$ZL3= 120
##$ZL4= 120
##$ABSF1= 15.72044
##$ABSF2= -2.331409
##$ABSG= 5
##$ABSL= 3
##$ALPHA= 0
##$AQORDER= 0
##$ASSFAC= 0
##$ASSFACI= 0
##$ASSFACX= 0
##$ASSWID= 0
##$AUNMP= <proc_1d>
##$AZFE= 0.1
##$AZFW= 0.1
##$BCFW= 0
##$BC_mod= 2
##$BYTORDP= 0
##$COROFFS= 0
##$CY= -3
##$DATMOD= 1
##$DC= 0
##$DFILT= <>
##$DTYPP= 0
##$F1P= 0
##$F2P= 0
##$FCOR= 1
##$FTSIZE= 16384
##$FT_mod= 6
##$GAMMA= 0
##$GB= 0
##$INTBC= 1
##$INTSCL= 3.70164e-10
##$ISEN= 128
##$LB= 0.24
##$LEV0= 0
##$LPBIN= 0
##$MAXI= 10000
##$MC2= 0
##$MEAN= 0
##$ME_mod= 0
##$MI= 1.114404
##$NCOEF= 0
##$NC_proc= -5
##$NLEV= 6
##$NOISF1= 3.799351
##$NOISF2= 2.8
##$NSP= 0
##$NTH_PI= 0
##$NZP= 0
##$OFFSET= 15.71604
##$PC= 1
##$PHC0= -20626.66
##$PHC1= 9.25272
##$PH_mod= 1
##$PKNL= yes
##$PPARMOD= 0
##$PSCAL= 0
##$PSIGN= 0
##$REVERSE= no
##$SF= 200.130011106974
##$SI= 16384
##$SIGF1= 3
##$SIGF2= 2
##$SINO= 5.538805
##$SIOLD= 16384
##$SREGLST= <1H.CDCl3>
##$SSB= 0
##$STSI= 16384
##$STSR= 0
##$SW_p= 3612.71676300578
##$SYMM= 0
##$S_DEV= 0
##$TDeff= 16384
##$TDoff= 0
##$TI= <>
##$TILT= no
##$TM1= 0
##$TM2= 0
##$TOPLEV= 0
##$USERP1= <user>
##$USERP2= <user>
##$USERP3= <user>
##$USERP4= <user>
##$USERP5= <user>
##$WDW= 1
##$XDIM= 16384
##$YMAX_p= 296066107
##$YMIN_p= -278395
$$ End of Bruker specific parameters
$$ ---------------------------------
##NTUPLES= NMR SPECTRUM
##VAR_NAME=  FREQUENCY,     SPECTRUM/REAL,   SPECTRUM/IMAG
##SYMBOL=    X,             R,               I
##VAR_TYPE=  INDEPENDENT,   DEPENDENT,       DEPENDENT
##VAR_FORM=  AFFN,          ASDF,            ASDF
##VAR_DIM=   16384,         16384,           16384
##UNITS=     HZ,            ARBITRARY UNITS, ARBITRARY UNITS
##FACTOR=    0.220516191357247, 1,           1
##FIRST=     3145.25119123169, 0,            0
##LAST=      -467.465571774095, 0,           0
##MIN=       -467.465571774095, -278395,     0
##MAX=       3145.25119123169, 296066107,    0
$$ Real data points
##PAGE= N=1
##DATA TABLE= (X++(R..R)), XYDATA
$$ [...]
$$ plain form
5690 19795229 20273810 20677617 20876600 20899656 20667692 20314169 19907508 19479732 19011773 18520268
5680 18520268 18138366 17865032 17603810 17356981 17243864 17208489 17195238 17276440 17481670 17684893
5670 17684893 17943164 18291590 18688615 19299787 19909006 20515201 21298880 22135430 23112939
5661 23112939 24157517 25167956 26333215 27525689 28640528 29712539 30540550 31066353
5653 31066353 31313157 31333446 31080920 30557741 29883420 29092177 28317833 27529806 26765314 26072078
5643 26072078 25492672 24988747 24577810 24216960 23897752 23750265 23805039 23859906 23965619 24160722
5633 24160722 24451787 24862205 25290811 25823071 26469471 27229328 28038189 28896763 29840487
5624 29840487 30754356 31766742 32829273 33804525 34640192 35342049 35762445 35887025 35740304
$$ packed form
5690A9795229M78581M03807J98983K3056k31964l53523m06661m27776m67959m91505
5680A8520268l81902k73334k61222k46829j13117l5375j3251Q1202K05230K03223
5670A7684893K58271L48426L97025O11172O09219O06195P83679Q36550R77509
5661B3112939J044578J010439J165259J192474J114839J072011Q28011N25803
5653C1066353K46804K0289k52526n23179o74321p91243p74344p88027p64492o93236
5643B6072078n79406n03925m10937l60850l19208j47487N4774N4867J05713J95103
5633B4160722K91065M10418M28606N32260O46400P59857Q08861Q58574R43724
5624B9840487R13869J012386J062531R75252Q35667P01857M20396J24580j46721
$$ plain form
5615 35740304 35329636 34678428 33804040 32834211 31877752 30885369 29906703 29017126 28205813
5606 28205813 27422570 26768678 26193919 25677578 25284854 24912927 24491006 24210451 23865360
5597 23865360 23477678 23152777 22793005 22490779 22217628 21985483 21834765 21778965 21768656 21918171
5587 21918171 22117954 22412603 22832195 23327121 23732840 24242762 24729515 25136768 25501812
5578 25501812 25848148 26081125 26244399 26279935 26241798 26020904 25595965 25026603 24330658 23512067
5568 23512067 22637464 21701838 20697809 19723504 18744593 17800945 16894869 16061922 15248604
5559 15248604 14546712 13960905 13445776 12984261 12547361 12142930 11800138 11489140 11177056
5550 11177056 10916277 10701908 10493102 10285476 10128035 9928159 9744770 9584189 9366304
$$ packed form
5615C5740304m10668o51208q74388r69829r56459r92383r78666q89577q11313
5606B8205813p83243o53892n74759n16341l92724l71927m21921k80555l45091
5597B3865360l87682l24901l59772l02226k73151k32145j50718n5800j0309J49515
5587B1918171J99783K94649M19592M94926M05719N09922M86753M07253L65044
5578B5501812L46336K32977J63274L5536l8137k20894m24939n69362o95945q18591
5568B3512067q74603r35626j004029r74305r78911r43648r06076q32947q13318
5559A5248604p01892n85807n15129m61515m36900m04431l42792l10998l12084
5550A1177056k60779k14369k08806k07626j57441j99876j83389j60581k17885
$$ plain form
5541 9366304 9135812 8981334 8838414 8673560 8491755 8314585 8133046 7933515 7798387 7697096
5531 7697096 7545765 7415888 7229901 7109424 6990922 6898440 6751639 6584582 6484427 6415798
5521 6415798 6374721 6233993 6138559 6098561 6032514 5959131 5951666 5900753 5835529 5740208 5746887 5726183
5509 5726183 5702246 5648631 5600593 5541126 5496513 5509267 5533750 5543534 5514151 5534173 5521988 5476232
5497 5476232 5459075 5446342 5399022 5434766 5438010 5463165 5461810 5444171 5448027 5478159 5519197 5483914
5485 5483914 5488852 5473310 5522540 5587793 5600935 5629591 5675852 5723505 5742704 5710285 5710974 5765002
5473 5765002 5841764 5864705 5913429 5979177 6006176 6043151 6091854 6208493 6212033 6310855 6447698
5462 6447698 6518622 6590712 6671269 6812277 6873856 6942642 6973694 7069716 7191201 7245024 7342630
$$ packed form
5541I366304k30492j54478j42920j64854j81805j77170j81539j99531j35128j01291
5531G697096j51331j29877j85987j20477j18502r2482j46801j67057j00155o8629
5521F415798m1077j40728r5434l9998o6047p3383p465n0913o5224r5321O679k0704
5509E726183k3937n3615m8038n9467m4613J2754K4483R784k9383K0022j2185m5756
5497E476232j7157j2733m7320L5744L244K5155j355j7639L856L0132M1038l5283
5485E483914M938j5542M9230O5253J3142K8656M6261M7653J9199l2419O89N4028
5473E765002P6762K2941M8724O5748K6999L6975M8703J16639L540R8822J36843
5462F447698P0924P2090Q0557J41008O1579O8786L1052R6022J21485N3823R7606
$$ plain form
5451 7342630 7494880 7564604 7728846 7898346 8085712 8292077 8498045 8716029 8941823 9133522
5441 9133522 9392043 9631569 9914126 10249549 10586521 10897758 11339882 11756515 12272540 12779705
5431 12779705 13249542 13809538 14359164 14884601 15377957 15830993 16276403 16522971 16612171 16702672
5421 16702672 16637773 16444171 16235954 15953770 15665387 15411851 15103540 14803685 14510537 14360200
5411 14360200 14203776 14074321 13990672 14010431 14099940 14161212 14158746 14215721 14296364 14320061 14422672
5400 14422672 14588843 14818380 15163575 15506645 15950037 16405346 16889379 17439967 18130974
5391 18130974 18881359 19756509 20649289 21706676 22902925 24253182 25761391 27368597 29083012
5382 29083012 30859298 32643160 34458046 36359664 38323312 40239551 42022094 43603269
$$ packed form
5451G342630J52250O9724J64242J69500J87366K06365K05968K17984K25794J91699
5441I133522K58521K39526K82557L35423L36972L11237M42124M16633N16025N07165
5431A2779705M69837N59996N49626N25437M93356M53036M45410K46568Q9200R0501
5421A6702672o4899j93602k08217k82184k88383k53536l08311k99855k93148j50337
5411A4360200j56424j29455q3649J9759Q9509O1272k466N6975Q0643K3697J02611
5400A4422672J66171K29537L45195L43070M43392M55309M84033N50588O91007
5391A8130974P50385Q75150Q92780J057387J196249J350257J508209J607206J714415
5382B9083012J776286J783862J814886J901618J963648J916239J782543J581175
$$ plain form
5374 43603269 44795383 45545715 45915038 46047219 46043931 45902322 45693121 45385521 45026345 44489485
5364 44489485 43768853 42848286 41815081 40522713 39079022 37509129 35840972 34132943
5356 34132943 32355057 30662286 29051526 27597513 26220523 24931357 23781052 22763961
5348 22763961 21796951 20964694 20307044 19799711 19335932 18901812 18621998 18374198 18211486
5339 18211486 18124383 18043838 18113234 18219492 18446376 18748632 19118549 19545014 20098162 20782365
5329 20782365 21564409 22412459 23300974 24249653 25240588 26256702 27287893 28311014 29226177
5320 29226177 30050271 30633687 31049882 31172262 30971876 30518127 29753357 28769147 27694490
5311 27694490 26529140 25240707 23838473 22552878 21331251 20037659 18917369 17792051
$$ packed form
5374D3603269J192114P50332L69323J32181l288j41609k09201l07600l59176n36860
5364D4489485p20632r20567j033205j292368j443691j569893j668157j708029
5356C4132943j777886j692771j610760j454013j376990j289166j150305j017091
5348B2763961r67010q32257o57650n07333m63779m34120k79814k47800j62712
5339A8211486q7103q0545O9396J06258K26884L02256L69917M26465N53148O84203
5329B0782365P82044Q48050Q88515R48679R90935J016114J031191J023121R15163
5320B9226177Q24094N83416M16195J22380k00386m53749p64770r84210j074657
5311B7694490j165350j288433j402234j285595j221627j293592j120290j125318
$$ plain form
5303 17792051 16753168 15804688 14958207 14212186 13506698 12932278 12384288 11909134 11487583
5294 11487583 11057840 10703867 10407467 10117962 9849215 9601616 9365613 9167429 9053152
5285 9053152 8928477 8725335 8616760 8518075 8445410 8349488 8294519 8259790 8180846 8194814 8229689
5274 8229689 8300099 8405759 8449033 8525958 8671913 8836866 9048320 9294051 9487348 9833309
5264 9833309 10138281 10394173 10704782 11074899 11414652 11676043 11870289 12028972 12104999 11991985
5254 11991985 11797005 11529320 11147187 10745122 10280081 9852859 9422279 8992959 8534181
5245 8534181 8115402 7691835 7399121 7134674 6811980 6601831 6360933 6196837 5975767 5769780
5235 5769780 5588669 5415635 5279785 5172278 5088697 5022306 4882331 4776805 4704996 4598996
$$ packed form
5303A7792051j038883r48480q46481p46021p05488n74420n47990m75154m21551
5294A1487583m29743l53973k96400k89505k68747k47599k36003j98184j14277
5285I053152j24675k03142j08575r8685p2665r5922n4969l4729p8944J3968L4875
5274H229689P0410J05660M3274P6925J45955J64953K11454K45731J93297L45961
5264I833309L04972K55892L10609L70117L39753K61391J94246J58683P6027j13014
5254A1991985j94980k67685l82133m02065m65041m27222m30580m29320m58778
5245H534181m18779m23567k92714k64447l22694k10149k40898j64096k21070k05987
5235E769780j81111j73034j35850j07507q3581o6391j39975j05526p1809j06000
$$ plain form
5225 4598996 4511269 4455998 4378277 4295646 4252913 4163589 4119494 4090501 4046456 3981019 3925958
5214 3925958 3879855 3823408 3832003 3799921 3747406 3703728 3645935 3610245 3577551 3517971 3480867 3479492
5202 3479492 3452447 3413254 3395038 3359934 3375582 3359247 3298591 3301288 3296980 3234986 3222936 3256547
5190 3256547 3224669 3215953 3230584 3248148 3254652 3186709 3189440 3197223 3236270 3232104 3223606 3232954 3199184
5177 3199184 3173054 3210465 3246880 3272313 3268821 3206278 3244437 3283855 3271917 3319271 3293340 3300109
5165 3300109 3284481 3343854 3444020 3461428 3446602 3411935 3428715 3459203 3538466 3608201 3675502
5154 3675502 3703553 3745874 3807604 3816594 3883880 3927563 3975475 4037147 4072196 4224886 4341831
5143 4341831 4287521 4239760 4240653 4256775 4346493 4346357 4328971 4377416 4450104 4566296 4631829 4741950
$$ packed form
5225D598996q7727n5271p7721q2631m2733q9324m4095k8993m4045o5437n5061
5214C925958m6103n6447Q595l2082n2515m3678n7793l5690l2694n9580l7104j375
5202C479492k7045l9193j8216l5104J5648j6335o0656K697m308o1994j2050L3611
5190C256547l1878q716J4631J7564O504o7943K731P783L9047m166q498R348l3770
5177C199184k6130L7411L6415K5433l492o2543L8159L9418j1938M7354k5931O769
5165C300109j5628N9373J00166J7408j4826l4667J6780L0488P9263O9735O7301
5154C675502K8051M2321O1730Q990O7286M3683M7912O1672L5049J52690J16945
5143D341831n4310m7761Q93J6122Q9718j36j7386M8445P2688J16192O5533J10121
$$ plain form
5131 4741950 4839563 4985940 5139501 5277597 5445508 5658543 5822345 5993385 6184585 6416379
5121 6416379 6642723 6746513 6809238 6868738 6863743 6885411 6874062 6824067 6751596 6675879 6573567
5110 6573567 6484156 6456642 6431209 6375571 6319318 6319300 6389775 6440632 6545322 6707259 6836072
5099 6836072 7014113 7210931 7502638 7765358 8085272 8404518 8742854 9039277 9339964 9533214
5089 9533214 9666129 9756088 9795697 9923965 9976457 9978027 9918042 9890017 9817393 9685824 9467921
5078 9467921 9153386 8894543 8574027 8236008 7908207 7678374 7421150 7217247 7076919 7011038
5068 7011038 6905379 6889218 6915246 6905905 6941297 6990122 7023416 7104023 7104313 7159860 7206758 7222619
5056 7222619 7174802 7116909 7103855 7050986 6948678 6806441 6623014 6355134 6048017 5752998
$$ packed form
5131D741950R7613J46377J53561J38096J67911K13035J63802J71040J91200K31794
5121F416379K26344J03790O2725N9500m995K1668j1349m9995p2471p5717j02312
5110F573567q9411k7514k5433n5638n6253j8P0475N0857J04690J61937J28813
5099F836072J78041J96818K91707K62720L19914L19246L38336K96423L00687J93250
5089I533214J32915Q9959L9609J28268N2492J570n9985k8025p2624j31569k17903
5078I467921l14535k58843l20516l38019l27801k29833k57224k03903j40328o5881
5068G011038j05659j6161K6028r341L5392M8825L3294Q0607K90N5547M6898J5861
5056G222619m7817n7893j3054n2869j02308j42237j83427k67880l07117k95019
$$ plain form
5046 5752998 5518714 5252664 4943174 4705001 4551096 4360042 4247459 4076278 3932689 3859459
5036 3859459 3764749 3614480 3518835 3509976 3457607 3349341 3295540 3248122 3201730 3132451 3114527
5025 3114527 3132722 3038353 3027954 3020712 3012830 3005906 2998880 2964375 2954836 2886451 2821645 2805161
5013 2805161 2714436 2701069 2676662 2633658 2619039 2607729 2574040 2557314 2562573 2549774 2482564 2443278
5001 2443278 2460420 2483767 2438459 2437117 2405600 2412193 2413073 2421627 2438353 2442290 2462396 2446170 2451103
4988 2451103 2488589 2410276 2397428 2400818 2341612 2326007 2306570 2340706 2346066 2370174 2374834 2336821
4976 2336821 2338836 2328151 2332700 2334529 2353631 2339762 2374510 2384637 2423496 2487361 2521160 2434587
4964 2434587 2469047 2497718 2482894 2500033 2511053 2532844 2504884 2508432 2501089 2488899 2526878 2575337
$$ packed form
5046E752998k34284k66050l09490k38173j53905j91054j12583j71181j43589p3230
5036C859459r4710j50269r5645q859n2369j08266n3801m7418m6392o9279j7924
5025C114527J8195r4369j0399p242p882o924p026l4505r539o8385o4806j6484
5013B805161r0725j3367k4407m3004j4619j1310l3689j6726N259j2799o7210l9286
5001B443278J7142K3347m5308j342l1517O593Q80Q554J6726L937K0106j6226M933
4988B451103L7486p8313j2848L390n9206j5605j9437L4136N360K4108M660l8013
4976B336821K015j0685M549J829J9102j3869L4748J0127L8859O3865L3799q6573
4964B434587L4460K8671j4824J7139J1020K1791k7960L548p343j2190L7979M8459
$$ plain form
4952 2575337 2584265 2586110 2607579 2615507 2628911 2598221 2584470 2627012 2572716 2609567 2611637 2642888
4940 2642888 2621540 2562507 2574900 2569798 2587743 2587134 2572784 2588458 2590759 2588486 2584916 2621593 2610685
4927 2610685 2619062 2581600 2606364 2629836 2664537 2650133 2705827 2764066 2727096 2749918 2772321 2811938
4915 2811938 2858259 2886410 2884486 2901990 2938624 3014428 3082292 3070066 3026763 3083558 3176400 3254015
4903 3254015 3274300 3297633 3360586 3390231 3451261 3552450 3661390 3757771 3828200 3930339 4082179
4892 4082179 4217935 4366560 4551862 4771332 4998862 5202529 5453405 5683581 5966894 6295089
4882 6295089 6615572 6904620 7106854 7226696 7282947 7362052 7405980 7359637 7313057 7265048 7185722
4871 7185722 7071890 7032685 6979455 6906434 6842167 6776243 6816701 6805533 6850608 6946554 7087885
$$ packed form
4952B575337Q928J845K1469P928J3404l0690j3751M2542n4296L6851K070L1251
4940B642888k1348n9033J2393n102J7945o09j4350J5674K301k273l570L6677j0908
4927B610685Q377l7462K4764K3472L4701j4404N5694N8239l6970K2822K2403L9617
4915B811938M6321K8151j924J7504L6634P5804O7864j2226m3303N6795R2842P7615
4903C254015K0285K3333O2953K9645O1030J01189J08940R6381P0429J02139J51840
4892D082179J35756J48625J85302K19470K27530K03667K50876K30176K83313L28195
4882F295089L20483K89048K02234J19842N6251P9105M3928m6343m6580m8009p9326
4871G185722j13832l9205n3230p3021o4267o5924M0458j1168M5075R5946J41331
$$ plain form
4860 7087885 7213836 7392178 7589173 7843450 8099928 8377471 8715181 8970063 9201822 9334709
4850 9334709 9463383 9481422 9505301 9507510 9503355 9436873 9314500 9234111 9194296 9063721 8877497
4839 8877497 8666607 8444283 8218416 7915353 7680526 7448744 7232055 7032480 6831428 6731705
4829 6731705 6689422 6584658 6520614 6551607 6625373 6640330 6665710 6692343 6783943 6828846 6852972
4818 6852972 6874694 6907251 6943941 6956573 6956212 6966873 6888230 6797871 6560469 6309642 6115404
4807 6115404 5911349 5696932 5507510 5418485 5341921 5250854 5107327 5031576 4930690 4991346
4797 4991346 4931660 4934265 4907764 4849931 4845811 4866959 4904201 4886018 4962439 5015243 5053952 5167470
4785 5167470 5258083 5327795 5330362 5379126 5392060 5488979 5573652 5637156 5814564 5972934 6103885
$$ packed form
4860G087885J25951J78342J96995K54277K56478K77543L37710K54882K31759J32887
4850I334709J28674J8039K3879K209m155o6482j22373q0389l9815j30575j86224
4839H877497k10890k22324k25867l03063k34827k31782k16689j99575k01052r9723
4829F731705m2283j04764o4044L0993P3766J4957K5380K6633R1600M4903K4126
4818F852972K1722L2557L6690J2632l61J0661p8643r0359k37402k50827j94238
4807F115404k04055k14417j89422q9025p6564r1067j43527p5751j00886O0656
4797D991346n9686K605k6501n7833m120K1148L7242j8183P6421N2804L8709J13518
4785E167470R0613O9712K567M8764J2934R6919Q4673O3504J77408J58370J30951
$$ plain form
4774 6103885 6250456 6388786 6504876 6665553 6833942 7051539 7324322 7604616 7996176 8491309
4764 8491309 8964067 9571541 10318836 11139594 12135497 13515454 15433653 17879556 20524172
4755 20524172 22463531 23094171 22280977 20232409 17782895 15546368 13797191 12556334
4747 12556334 11659853 11043874 10597522 10220554 9976363 9725648 9647585 9553195 9479557 9395099
4737 9395099 9323815 9309874 9393400 9429367 9394325 9483845 9670060 9742106 9805830 10037188 10164435
4726 10164435 10333778 10572219 10771248 11011081 11289346 11555697 11848625 12143067 12509591
4717 12509591 12844073 13220354 13676827 14218192 14803060 15434433 16203540 17237889 18652034
4708 18652034 20487701 22784776 24834955 25847027 25961438 25261843 23386203 20971765
$$ packed form
4774F103885J46571J38330J16090J60677J68389K17597K72783K80294L91560M95133
4764H491309M72758O07474P47295Q20758R95903J379957J918199K445903K644616
4755B0524172J939359O30640q13194k048568k449514k236527j749177j240857
4747A2556334q96481o15979m46352l76968k44191k50715p8063r4390p3638q4458
4737I395099p1284j3941Q3526L5967l5042Q9520J86215P2046O3724K31358J27247
4726A0164435J69343K38441J99029K39833K78265K66351K92928K94442L66524
4717A2509591L34482L76281M56473N41365N84868O31373P69107J034349J414145
4708A8652034J835667K297075K050179J012072J14411o99595j875640k414438
$$ plain form
4700 20971765 18809323 17091590 15775668 14804003 14139286 13727017 13428455 13151337 13036518
4691 13036518 12994153 12967051 12928205 12911106 12916949 12886649 12905063 12946214 12966049 13029482 13145991
4680 13145991 13245948 13344490 13428679 13488696 13557301 13612668 13703000 13881878 14009968 14095424 14190675
4669 14190675 14225081 14238161 14287647 14320944 14365818 14408572 14395017 14394426 14441534 14482273 14572261 14676110
4657 14676110 14808253 15020092 15224903 15474751 15807792 16126699 16442328 16789948 17142445
4648 17142445 17539705 17926965 18284275 18551567 18784041 18972140 19103771 19115778 19074522 18968174
4638 18968174 18743772 18482017 18203611 17915663 17617361 17297828 16990214 16713216 16481836
4629 16481836 16310944 16099938 15945868 15931477 15862878 15843566 15840640 15859700 16021436 16151032
$$ packed form
4700B0971765k162442j717733j315922r71665o64717m12269k98562k77118j14819
4691A3036518m2365k7102l8846j7099N843l0300J8414M1151J9835O3433J16509
4680A3145991R9957R8542Q4189O0017O8605N5367R0332J78878J28090Q5456R5251
4669A4190675L4406J3080M9486L3297M4874M2754j3555n91M7108M0739Q9988J03849
4657A4676110J32143K11839K04811K49848L33041L18907L15629L47620L52497
4648A7142445L97260L87260L57310K67292K32474J88099J31631J2007m1256j06348
4638A8968174k24402k61755k78406k87948k98302l19533l07614k76998k31380
4629A6481836j70892k11006j54070j4391o8599j9312k926J9060J61736J29596
$$ plain form
4619 16151032 16257788 16413526 16552774 16689830 16816739 16978195 17108628 17242616 17306336 17362094
4609 17362094 17441588 17488086 17574983 17668667 17717530 17780086 17897933 17979983 18012896 18127204 18251052
4598 18251052 18302903 18383548 18526530 18635381 18819390 19079529 19385645 19654971 19976223 20309270
4588 20309270 20577174 20827752 21087457 21421338 21656824 21906648 22196089 22487481 22832890
4579 22832890 23225670 23597652 24054188 24538891 25146592 25783948 26497625 27352323 28226704
4570 28226704 29231591 30369267 31490294 32540598 33479948 34197867 34583803 34706991 34698317
4561 34698317 34654341 34639533 34717187 34871231 35131269 35430038 35866828 36334774 36810279 37449297
4551 37449297 38010692 38472715 38912236 39226877 39324921 39315298 39144714 38827375 38452845 38001476
$$ packed form
4619A6151032J06756J55738J39248J37056J26909J61456J30433J33988O3720N5758
4609A7362094P9494M6498Q6897R3684M8863O2556J17847Q2050L2913J14308J23848
4598A8251052N1851Q0645J42982J08851J84009K60139L06116K69326L21252L33047
4588B0309270K67904K50578K59705L33881K35486K49824K89441K91392L45409
4579B2832890L92780L71982M56536M84703O07701O37356P13677Q54698Q74381
4570B8226704J004887J137676J121027J050304R39350P17919L85936J23188q674
4561C4698317m3976j4808P7654J54044K60038K98769M36790M67946M75505O39018
4551C7449297N61395M62023M39521L14641R8044r623j70584l17339l74530m51369
$$ plain form
4541 38001476 37560251 37168766 36872759 36683497 36585064 36567415 36695509 36816310 36867389 37015816
4531 37015816 37041827 37014470 36957983 36806446 36612253 36319071 35996644 35604984 35208008 34842352
4521 34842352 34605387 34427133 34251949 34220485 34248604 34340410 34498982 34645755 34916816 35191110
4511 35191110 35369002 35470142 35465156 35320535 35115961 34961858 34796367 34549245 34358223 34238409
4501 34238409 34129506 34106015 34123617 34107611 34168689 34212575 34276220 34348609 34411020 34495631 34537479
4490 34537479 34629461 34722081 34719533 34672987 34631288 34602636 34544465 34478366 34525904 34659588 34758261
4479 34758261 34829591 34984306 35189057 35369798 35585148 35915699 36282874 36777725 37364669 38041361
4469 38041361 38868587 39837744 40912293 42129320 43431195 44770686 46194092 47553863
$$ packed form
4541C8001476m41225l91485k96007j89262r8433j7649J28094J20801N1079J48427
4531C7015816K6011k7357n6487j51537j94193k93182l22427l91660l96976l65656
4521C4842352k36965j78254j75184l1464K8119R1806J58572J46773K71061K74294
4511C5191110J77892J01140m986j44621k04574j54103j65491k47122j91022j19814
4501C4238409j08903k3491J7602j6006O1078M3886O3645P2389O2411Q4611M1848
4490C4537479R1982R2620k548m6546m1699k8652n8171o6099M7538J33684R8673
4479C4758261P1330J54715K04751J80741K15350L30551L67175M94851N86944O76692
4469C8041361Q27226R69157J074549J217027J301875J339491J423406J359771
$$ plain form
4461 47553863 48756584 49769283 50602101 51196654 51532785 51627694 51540823 51266292 50890229
4452 50890229 50599668 50336349 50042127 49749499 49405071 49142980 48913566 48647153 48355712
4443 48355712 48063868 47858352 47782934 47834083 47877001 48111195 48459746 48858470 49313833 49710830
4433 49710830 50074266 50417220 50677528 50878311 50931561 50937666 50784489 50501684 50069191 49597409
4423 49597409 49080275 48549711 47957740 47334716 46826895 46343774 45828746 45402180 45072265
4414 45072265 44824462 44686039 44669537 44754599 44982206 45326996 45785794 46309470 46865621 47458500
4404 47458500 48138023 48848079 49520268 50115225 50633873 51023704 51372710 51649115 51789280
4395 51789280 51860063 51835720 51746464 51522777 51275083 50948396 50561825 50183786 49859101 49618220
$$ packed form
4461D7553863J202721J012699Q32818N94553L36131R4909q6871k74531l76063
4452E0890229k90561k63319k94222k92628l44428k62091k29414k66413k91441
4443D8355712k91844k05516p5418N1149M2918K34194L48551L98724M55363L96997
4433D9710830L63436L42954K60308K00783N3250O105j53177k82805m32493m71782
4423D9597409n17134n30564n91971o23024n07821m83121n15028m26566l29915
4414D5072265k47803j38423j6502Q5062K27607L44790M58798N23676N56151N92879
4404D7458500O79523P10056O72189N94957N18648L89831L49006K76405J40165
4395E1789280P0783k4343q9256k23687k47694l26687l86571l78039l24685k40881
$$ plain form
4385 49618220 49523198 49653210 49973822 50569159 51416180 52485770 53905545 55626220 57718744
4376 57718744 60217568 63305284 67024968 71299865 76057110 80699477 83891079 84500932
4368 84500932 82175219 77872962 72729172 67637820 63002796 59000993 55714039 53087421
4360 53087421 50906756 49166939 47765373 46642908 45807147 45163317 44774201 44508539 44408473
4351 44408473 44440070 44555998 44806315 45180216 45586377 46002462 46445701 46877187 47388891 47853643
4341 47853643 48376510 48977118 49703566 50588771 51558827 52575080 53878670 55374786 57112701
4332 57112701 59190093 61627321 64549114 67829546 71563795 75899892 80836565 86449271
4324 86449271 92934881 100446044 109272175 119548412 131267806 143952759 156350090 167050315
$$ packed form
4385D9618220r5022J30012L20612N95337Q47021J069590J419775J720675K092524
4376E7718744K498824L087716L719684M274897M757245M642367L191602O09853
4368H4500932k325713m302257n143790n091352m635024m001803l286954k626618
4360E3087421k180665j739817j401566j122465q35761o43830l89116k65662j00066
4351D4408473L1597J15928K50317L73901M06161M16085M43239M31486N11704M64752
4341D7853643N22867O00608P26448Q85205R70056J016253J303590J496116J737915
4332E7112701K077392K437228K921793L280432L734249M336097M936673N612706
4324H6449271O485610P511163Q826131J0276237J1719394J2684953J2397331J0700225
$$ plain form
4316 167050315 174742071 178519598 178229540 174408622 168128235 160510108 152714090 145216463
4308 145216463 138096237 131087176 123719274 115743337 107104720 98192388 89413055 81173168
4300 81173168 74029603 68065499 63113519 59039244 55619939 52838777 50546205 48446575
4292 48446575 46542066 44820843 43253351 41874471 40656223 39506560 38466183 37580235
4284 37580235 36868864 36240664 35735069 35237229 34897732 34600887 34423178 34273445 34208984 34222103
4274 34222103 34285204 34449443 34681654 35016402 35405968 35858407 36391894 37054522 37859273 38778994
4264 38778994 39800598 40943964 42252273 43715847 45275365 47144059 49245447 51701880
4256 51701880 54497149 57666749 61297595 65424140 70160768 75504844 81604705 88420197
$$ packed form
4316A67050315P691756L777527k90058l820918o280387p618127p796018p497627
4308A45216463p120226p009061p367902p975937q638617q912332q779333q239887
4300H1173168p143565n964104m951980m074275l419305k781162k292572k099630
4292D8446575j904509j721223j567492j378880j218248j149663j040377q85948
4284C7580235p11371o28200n05595m97840l39497k96845j77709j49733o4461J3119
4274C4222103O3101J64239K32211L34748L89566M52439N33487O62628Q04751R19721
4264C8778994J021604J143366J308309J463574J559518J868694K101388K456433
4256E1701880K795269L169600L630846M126545M736628N344076O099861O815492
$$ plain form
4248 88420197 95961503 103999828 112283899 120004012 125878582 128786231 127989294 123504271
4240 123504271 116224066 107411057 98056555 88990423 80526379 73081244 66578532 60981164
4232 60981164 56049248 51746015 48002747 44802931 41970403 39384075 37058101 34971895
4224 34971895 33078924 31415174 29944482 28659603 27491112 26413538 25437595 24421083
4216 24421083 23459583 22553834 21723883 20888007 20144183 19402955 18705050 18145335 17591679
4207 17591679 17052096 16583790 16132708 15734564 15376969 15065255 14712856 14388896 14114456
4198 14114456 13912566 13664535 13444650 13168652 12917828 12720042 12513697 12287012 12049659
4189 12049659 11837693 11565446 11303591 11028372 10765894 10537522 10291963 10033398 9830998
$$ packed form
4248H8420197P541306Q038325Q284071P720113N874570K907649p96937m485023
4240A23504271p280205q813009r354502r066132q464044p445135o502712n597368
4232F0981164m931916m303233l743268l199816k832528k586328k325974k086206
4224C4971895j892971j663750j470692j284879j168491j077574r75943j016512
4216B4421083r61500r05749q29951q35876p43824p41228o97905n59715n53656
4207A7591679n39583m68306m51082l98144l57595l11714l52399l23960k74440
4198A4114456k01890k48031k19885k75998k50824j97786k06345k26685k37353
4189A2049659k11966k72247k61855k75219k62478k28372k45559k58565k02400
$$ plain form
4180 9830998 9696199 9565615 9396923 9258526 9165386 9069563 8895080 8787340 8624962 8473181
4170 8473181 8380613 8267164 8148235 8064780 7960298 7866224 7791204 7647463 7527685 7464633
4160 7464633 7266117 7169743 7084489 6941414 6833736 6733183 6749459 6707172 6690077 6641800 6550284
4149 6550284 6491441 6448903 6385072 6394962 6372453 6343237 6319870 6297055 6266324 6315792 6303400 6390306
4137 6390306 6455667 6485721 6533509 6524566 6564431 6640274 6752707 6893857 7091529 7223996 7409352
4126 7409352 7682139 8008123 8398921 8882681 9475591 10129107 10806669 11361536 11607722 11325841
4116 11325841 10696343 9927320 9125263 8365282 7836119 7433263 7078897 6802065 6619966
4107 6619966 6472248 6289546 6147107 5989655 5855603 5754787 5639240 5526362 5463223 5391990
$$ packed form
4180I830998j34799j30584j68692j38397r3140r5823j74483j07740j62378j51781
4170H473181r2568j13449j18929q3455j04482r4074p5020j43741j19778o3052
4160G464633j98516r6374q5254j43075j07678j00553J6276m2287j7095m8277r1516
4149F550284n8843m2538o3831R890k2509k9216k3367k2815l0731M9468j2392Q6906
4137F390306O5361L0054M7788q943L9865P5843J12433J41150J97672J32467J85356
4126G409352K72787L25984L90798M83760N92910O53516O77562N54867K46186k81881
4116A1325841o29498p69023q02057p59981n29163m02856l54366k76832j82099
4107F619966j47718j82702j42439j57452j34052j00816j15547j12878o3139p1233
$$ plain form
4097 5391990 5307322 5262943 5220692 5135239 5106476 5107284 5094041 5088642 5136974 5120947 5139001 5108136
4085 5108136 5145458 5187571 5211641 5209651 5228416 5277329 5366782 5456996 5569487 5656987 5725126
4074 5725126 5767901 5872566 5988891 6070815 6174849 6259523 6393015 6534326 6604232 6708467
4064 6708467 6782506 6854021 6901821 6930249 6975293 7039845 7105322 7167175 7222586 7302710 7396023
4053 7396023 7503256 7635156 7808548 7924314 8062200 8241046 8362581 8502205 8695715 8913515
4043 8913515 9116568 9256942 9461104 9749890 9998378 10194143 10461070 10790818 11117092 11417111
4033 11417111 11698892 12009030 12309371 12573792 12783367 13040912 13216583 13462688 13686873
4024 13686873 13904889 14152201 14450544 14781449 15122269 15418280 15679986 16004492 16303099
$$ packed form
4097E391990q4668m4379m2251q5453k8763Q08j3243n399M8332j6027J8054l0865
4085E108136L7322M2113K4070j990J8765M8913Q9453R0214J12491Q7500O8139
4074E725126M2775J04665J16325Q1924J04034Q4674J33492J41311O9906J04235
4064F708467P4039P1515M7800K8428M5044O4552O5477O1853N5411Q0124R3313
4053G396023J07233J31900J73392J15766J37886J78846J21535J39624J93510K17800
4043H913515K03053J40374K04162K88786K48488J95765K66927L29748L26274L00019
4033A1417111K81781L10138L00341K64421K09575K57545J75671K46105K24185
4024A3686873K18016K47312K98343L30905L40820K96011K61706L24506K98607
$$ plain form
4015 16303099 16613595 16914500 17162390 17466132 17765890 18106893 18397280 18715468 19082579
4006 19082579 19396522 19760715 20157195 20571548 20974729 21383040 21846957 22287030 22637234
3997 22637234 22994107 23222313 23357815 23439598 23435695 23558751 23597372 23700282 23843741 24061997
3987 24061997 24256051 24478537 24743678 24827848 24847260 24734648 24420804 24055427 23604232 23097231
3977 23097231 22640914 22229345 21843192 21504831 21161917 20907590 20646101 20290290 19873389
3968 19873389 19374940 18788966 18183397 17481981 16789323 16149082 15477137 14868879 14300387
3959 14300387 13771266 13320119 12903426 12494736 12069525 11616954 11166833 10758373 10346903
3950 10346903 9910709 9479936 9041467 8657763 8279346 8021748 7756058 7496642 7227627
$$ packed form
4015A6303099L10496L00905K47890L03742K99758L41003K90387L18188L67111
4006A9082579L13943L64193L96480M14353M03181M08311M63917M40073L50204
3997B2637234L56873K28206J35502Q1783l903J23056L8621J02910J43459K18256
3987B4061997J94054K22486K65141Q4170J9412j12612l13844l65377m51195n07001
3977B3097231m56317m11569l86153l38361l42914k54327k61489l55811m16901
3968A9873389m98449n85974o05569p01416o92658o40241o71945o08258n68492
3959A4300387n29121m51147m16693m08690m25211m52571m50121m08460m11470
3950A0346903m36194m30773m38469l83704l78417k57598k65690k59416k69015
$$ plain form
3941 7227627 6988057 6791498 6542482 6331878 6137066 5928205 5720635 5511378 5280153 5093540
3931 5093540 4897940 4757344 4617306 4455943 4295380 4155458 4048251 3899160 3782684 3743910
3921 3743910 3671424 3601649 3566379 3481860 3402777 3332419 3263537 3163809 3172877 3129298 3016579
3910 3016579 2911303 2844127 2818388 2742682 2679242 2582263 2536320 2558974 2536807 2551271 2502378
3899 2502378 2414848 2345725 2308798 2178151 2091511 2128499 2104503 2093456 2034322 1973450 1934969
3888 1934969 1858257 1866942 1820871 1767540 1781715 1755885 1738897 1744955 1686054 1605009 1532427 1564111
3876 1564111 1591131 1556129 1512419 1446220 1439919 1467439 1409408 1415130 1419759 1380323 1338358 1325437
3864 1325437 1315849 1314596 1296327 1252098 1243532 1231438 1187290 1214748 1172890 1118620 1177967 1201358
$$ packed form
3941G227627k39570j96559k49016k10604j94812k08861k07570k09257k31225j86613
3931E093540j95600j40596j40038j61363j60563j39922j07207j49091j16476l8774
3921C743910p2486o9775l5270q4519p9083p0358o8882r9728R068m3579j12719
3910C016579j05276o7176k5739p5706o3440r6979m5943K2654k2167J4464m8893
3899B502378q7530o9123l6927j30647q6640L6988k3996j1047n9134o0872l8481
3888A934969p6712Q685m6071n3331J4175k5830j6988O058n8901q1045p2582L1684
3876A564111K7020l5002m3710o6199o301K7520n8031N722M629l9436m1965j2921
3864A325437r588j253j8269m4229q566j2094m4148K7458m1858n4270N9347K3391
$$ plain form
3852 1201358 1162895 1120836 1096772 1127760 1078504 1116511 1119716 1088452 1136964 1080156 1057592 1033255
3840 1033255 976026 996089 973201 933844 924887 885931 955805 974774 986273 1024142 981127 975246
3828 975246 976122 993468 1003720 931120 917097 890939 861566 821059 823277 821074 853281 895107
3816 895107 830252 780930 777237 779687 783721 795888 791142 750454 744650 790374 785498 755537 732259
3803 732259 752828 740019 750990 734670 725249 736234 728155 725874 681444 745818 702856 693671
3791 693671 690534 655608 686133 688206 656538 684041 662804 656221 678999 727387 724509 680649
3779 680649 637864 672071 663897 652195 639653 637205 609107 590868 622119 644597 654733 692523
3767 692523 676401 670379 626161 588047 594610 604343 640016 655209 640924 640396 652453 628040 604268
$$ packed form
3852A201358l8463m2059k4064L0988m9256L8007L205l1264M8512n6808k2564k4337
3840A033255n7229K0063k2888l9357q957l8956O9874J8969J1499L7869m3015n881
3828I75246Q76J7346J0252p2600j4023k6158k9373m0507K218k203L2207M1826
3816H95107o4855m9322l693K450M034J2167m746m0688n804M5724m876k9961k3278
3803G32259K0569j2809J0971j6320r421J0985q079k281m4430O4374m2962r185
3791F93671l137l4926L0525K073l1668K7503k1237o583K2778M8388k878m3860
3779F80649m2785L4207q174j1702j2542k448k8098j8239L1251K2478J0136L7790
3767F92523j6122o022m4218l8114O563R733L5673J5193j4285n28J2057k4413k3772
$$ plain form
3754 604268 570732 573840 593974 594395 622497 609378 574890 581264 550858 563834 560868 580094 543381
3741 543381 597505 622211 563849 574556 554382 553228 578964 584785 571094 557756 485760 489597
3729 489597 539201 570706 591702 573473 556460 487248 488097 534647 510542 528125 572875 545003
3717 545003 558281 590905 537303 521681 541498 508200 537392 506708 479326 522248 581280 599986
3705 599986 584439 593046 567363 523613 590069 621888 573444 602735 595323 585646 595491 634821
3693 634821 643576 575093 616788 641914 613376 554835 623127 633691 618429 641222 629215 633881
3681 633881 612549 602949 606679 622525 608916 582524 580362 601929 605751 571841 594710 617603
3669 617603 603414 589227 624320 569262 551693 576995 605590 632862 650260 579104 521792 518226
$$ packed form
3754F04268l3536L108K0134M21K8102j3119l4488O374l0406J2976k966J9226l6713
3741E43381N4124K4706n8362J0707k0174j154K5736N821j3691j3338p1996L837
3729D89597M9604L1505K0996j8229j7013o9212Q49M6550k4105J7583M4750k7872
3717E45003J3278L2624n3602j5622J9817l3298K9192l0684k7382M2922N9032J8706
3705E99986j5547Q607k5683m3750O6456L1819m8444K9291p412r677R845L9330
3693F34821Q755o8483M1695K5126k8538n8541O8292J0564j5262K2793j2007M666
3681F33881k1332r600L730J5846j3609k6392k162K1567L822l3910K2869K2893
3669F17603j4189j4187L5093n5058j7569K5302K8595K7272J7398p1156n7312l566
$$ plain form
3657 518226 478135 560592 594227 561298 573657 577508 590404 577964 552486 570095 588041 609047
3645 609047 609109 607949 587044 598463 611433 597708 617870 622177 599544 616860 608676 594846 578094
3632 578094 615239 624516 625581 591820 574373 624479 676594 691579 659660 654526 666170 676622
3620 676622 705577 701495 722658 735179 680288 653261 644969 692611 718822 752112 770466 776705
3608 776705 730568 742901 744897 752649 824148 857030 865320 896393 843002 824323 833639 858711
3596 858711 845289 843002 866437 864041 885790 882083 903693 922712 989989 930978 946998 1012077
3584 1012077 1049208 1061963 1082547 1100693 1106956 1083599 1093581 1115392 1132095 1180559 1198376 1179186
3572 1179186 1174811 1193851 1181076 1249984 1286737 1280592 1299355 1333350 1377362 1342564 1329802 1372536
$$ packed form
3657E18226m0091Q2457L3635l2929J2359L851J2896j2440k5478J7609J7946K1006
3645F09047O2j160k0905J1419J2970j3725K0162M307k2633J7316q184j3830j6752
3632E78094L7145R277J065l3761j7447N0106N2115J4985l1919n134J1644J0452
3620F76622K8955m082K1163J2521n4891k7027q292M7642K6211L3290J8354O239
3608G76705m6137J2333J996P752P1499L2882Q290L1073n3391j8679R316K5072
3596H58711j3422k287K3435k396K1749l707K1610J9019O7277n9011J6020O5079
3584A012077L7131J2755K0584J8146O263k3357R982K1811J6703M8464J7817j9190
3572A179186m375J9040j2775O8908L6753o145J8763L3995M4012l4798j2762M2734
$$ plain form
3560 1372536 1385576 1382290 1405065 1418009 1460056 1490974 1499460 1505056 1490467 1491137 1485812 1481005 1491712
3547 1491712 1526658 1531582 1465570 1495009 1509842 1535631 1504657 1504213 1511284 1496200 1538159 1568330
3535 1568330 1580365 1577328 1633681 1697478 1715867 1733037 1756255 1756379 1772139 1822478 1874368 1890424
3523 1890424 1885835 1924551 1924556 1890721 1915331 1939529 1995273 2005358 1953309 1960851 1970256 2016170 2047542
3510 2047542 2071780 2024579 2019766 2069379 2041915 2001818 1996223 2039030 2038667 2018452 2018195 2005419 1986380
3497 1986380 1933586 1942102 1995084 2029992 2078359 2088337 2047350 2060037 2104017 2117732 2071578 2059491
3485 2059491 2073286 2086060 2129267 2159668 2178339 2154097 2138810 2120135 2184567 2214672 2219205 2282072
3473 2282072 2338683 2317217 2375281 2391191 2408629 2444438 2424661 2440013 2474805 2543121 2516860
$$ packed form
3560A372536J3040l286K2775J2944M2047L0918Q486N596j4589O70n325m807J0707
3547A491712L4946M924o6012K9439J4833K5789l0974m44P071j5084M1959L0171
3535A568330J2035l037N6353O3797J8389J7170K3218J24J5760N0339N1890J6056
3523A890424m589L8716Nl3835K4610K4198N5744J0085n2049P542R405M5914L1372
3510B047542K4238m7201m813M9613k7464m0097n595M2807l63k0215k57j2776j9039
3497A986380n2794Q516N2982L4908M8367R978m0987J2687M3980J3715m6154j2087
3485B059491J3795J2774M3207L0401J8671k4242j5287j8675O4432L0105M533O2867
3473B282072N6611k1466N8064J5910J7438L5809j9777J5352L4792O8316k6261
$$ plain form
3462 2516860 2515034 2590038 2636735 2634946 2649498 2740929 2819574 2897849 2896684 2903545 2914503 3003773
3450 3003773 3059996 3159058 3250644 3270792 3306102 3446411 3522534 3543113 3608764 3741337 3812925
3439 3812925 3930167 4072085 4131885 4261609 4393386 4506893 4573025 4714348 4834654 4976494
3429 4976494 5138076 5244460 5291752 5426208 5567239 5676578 5826083 5878591 5969327 6042361
3419 6042361 6055874 6150055 6208552 6228697 6276511 6270731 6269873 6286061 6310729 6327467 6321927 6342577
3407 6342577 6353248 6329370 6268673 6279128 6278700 6305588 6335799 6414967 6357432 6284561 6305552 6353106
3395 6353106 6415360 6369744 6453091 6507552 6542321 6533071 6644028 6746560 6757159 6822179 6902723
3384 6902723 7008059 7119927 7192940 7285050 7356462 7444220 7506089 7619678 7720155 7781959 7883159
$$ packed form
3462B516860j826P5004M6697j789J4552R1431P8645P8275j165O861J0958Q9270
3450C003773N6223R9062R1586K0148L5310J40309P6123K0579O5651J32573P1588
3439C812925J17242J41918N9800J29724J31777J13507O6132J41323J20306J41840
3429D976494J61582J06384M7292J34456J41031J09339J49505N2508R0736P3034
3419F042361J3513R4181N8497K0145M7814n780q58J6188K4668J6738n540K0650
3407F342577J0671k3878o0697J0455m28K6888L0211P9168n7535p2871K0991M7554
3395F353106O2254m5616Q3347N4461L4769r250J10957J02532J0599O5020Q0544
3384F902723J05336J11868P3013R2110P1412Q7758O1869J13589J00477O1804J01200
$$ plain form
3373 7883159 7977456 8018434 8039299 8149532 8245841 8313057 8407196 8522247 8655106 8765489 8878495
3362 8878495 9000995 9099626 9189334 9271753 9456298 9616791 9751540 9814725 9980641 10130844
3352 10130844 10239060 10410517 10599397 10750630 10979291 11212398 11381442 11613778 11876584
3343 11876584 12126733 12360476 12596704 12876437 13151780 13412985 13729710 14000119 14268436
3334 14268436 14580713 14871207 15136138 15338311 15596091 15856689 16145263 16355843 16627130
3325 16627130 16962006 17287284 17549495 17904688 18187859 18486749 18875567 19237935 19552842
3316 19552842 19951043 20409258 20732954 21135568 21585793 22007747 22537683 22964456 23445270
3307 23445270 24037551 24640263 25295795 26008708 26752631 27517031 28289663 29162378 30092739
$$ packed form
3373G883159R4297M0978K0865J10233R6309O7216R4139J15051J32859J10383J13006
3362H878495J22500R8631Q9708Q2419J84545J60493J34749O3185J65916J50203
3352A0130844J08216J71457J88880J51233K28661K33107J69044K32336K62806
3343A1876584K50149K33743K36228K79733K75343K61205L16725K70409K68317
3334A4268436L12277K90494K64931K02173K57780K60598K88574K10580K71287
3325A6627130L34876L25278K62211L55193K83171K98890L88818L62368L14907
3316A9552842L98201M58215L23696M02614M50225M21954N29936M26773M80814
3307B3445270N92281O02712O55532P12913P43923P64400P72632Q72715R30361
$$ plain form
3298 30092739 31042375 32191485 33357649 34625475 35965202 37428543 39014537 40707547
3290 40707547 42552237 44539752 46663288 48989970 51494821 54191556 57103069 60133394
3282 60133394 63277277 66552097 69885614 73265270 76533746 79731722 82702365 85434613
3274 85434613 87953161 90200654 92221191 93985158 95562238 96938404 98133178 99295288
3266 99295288 100364482 101421826 102423366 103328883 104248338 105034125 105675334 106129405 106404589
3257 106404589 106545825 106601164 106598244 106543174 106648957 106942303 107598084 108621287 110114017 112122041
3247 112122041 114687987 117729079 121216950 125100343 129268617 133527833 137618646 141389684
3239 141389684 144651998 147207798 149060979 150148098 150574247 150533617 150127716 149514774 148777003
$$ packed form
3298C0092739R49636J149110J166164J267826J339727J463341J585994J693010
3290D0707547J844690J987515K123536K326682K504851K696735K911513L030325
3282F0133394L143883L274820L333517L379656L268476L197976K970643K732248
3274H5434613K518548K247493K020537J763967J577080J376166J194774J162110
3266I9295288J069194J057344J001540R05517R19455P85787O41209M54071K75184
3257A06404589J41236N5339k920n5070J05783K93346O55781J023203J492730K008024
3247A12122041K565946L041092L487871L883393M168274M259216M090813L771038
3239A41389684L262314K555800J853181J087119M26149m0630m05901o12942p37771
$$ plain form
3230 148777003 148115041 147448844 146584050 145506347 144024467 141931209 139073416 135589486
3222 135589486 131385528 126471204 121046190 115220508 109224491 103198619 97305225 91651100
3214 91651100 86316703 81313635 76706492 72432755 68525756 64977446 61730347 58680104
3206 58680104 55966988 53442850 51135277 49101269 47229637 45513243 43972141 42554101
3198 42554101 41267114 40071597 38947446 37916410 36884639 35942857 35125989 34335106 33584372
3189 33584372 32892042 32266259 31701169 31182894 30758311 30369203 29951094 29629186 29460609
3180 29460609 29303203 29239915 29213578 29195781 29120773 28938147 28760692 28630035 28522835 28493423
3170 28493423 28541835 28656835 28812330 29026738 29234309 29501875 29826462 30186039 30503777 30873964
$$ packed form
3230A48777003o61962o66197q64794j077703j481880k093258k857793l483930
3222A35589486m203958m914324n425014n825682n996017o025872n893394n654125
3214I1651100n334397n003068m607143m273737l906999l548310l247099l050243
3206E8680104k713116k524138k307573k034008j871632j716394j541102j418040
3198D2554101j286987j195517j124151j031036j031771r41782q16868p90883p50734
3189C3584372o92330o25783n65090n18275m24583l89108m18109l21908j68577
3180B9460609j57406o3288k6337j7797p5008j82626j77455j30657j07200k9412
3170B8493423M8412J15000J55495K14408K07571K67566L24587L59577L17738L70187
$$ plain form
3160 30873964 31301271 31646455 32062384 32431791 32739147 33059812 33393162 33665852 33829825
3151 33829825 34016560 34199772 34415723 34604548 34795953 35045870 35296694 35542578 35782840
3142 35782840 36035197 36259564 36573449 36866053 37223540 37616747 38019684 38388277 38738484
3133 38738484 39031239 39289558 39548598 39765262 39976361 40163900 40352831 40578740 40852005
3124 40852005 41072025 41347039 41740763 42196686 42665905 43253731 44001008 44885052 45882414
3115 45882414 47029140 48333890 49764176 51287985 52947365 54778464 56702663 58732600
3107 58732600 60849874 63026699 65253133 67555996 69870546 72155300 74340395 76521421
3099 76521421 78721922 80899720 82973390 85013036 87017753 89056322 91241249 93623949
$$ packed form
3160C0873964M27307L45184M15929L69407L07356L20665L33350K72690J63973
3151C3829825J86735J83212K15951J88825J91405K49917K50824K45884K40262
3142C5782840K52357K24367L13885K92604L57487L93207M02937L68593L50207
3133C8738484K92755K58319K59040K16664K11099J87539J88931K25909K73265
3124D0852005K20020K75014L93724M55923M69219N87826P47277Q84044R97362
3115D5882414J146726J304750J430286J523809J659380J831099J924199K029937
3107E8732600K117274K176825K226434K302863K314550K284754K185095K181026
3099G6521421K200501K177798K073670K039646K004717K038569K184927K382700
$$ plain form
3091 93623949 96065399 98752095 101644007 104753852 108184897 111818992 115621409 119565942
3083 119565942 123562430 127483994 131218471 134614134 137560696 139859229 141557718 142577655
3075 142577655 142850274 142435938 141317641 139546278 137091403 134219096 131068665 127772874
3067 127772874 124507686 121353521 118275830 115429040 112855097 110394649 108028078 105745331
3059 105745331 103521325 101189697 98712437 96001108 93131168 89987070 86691143 83230958
3051 83230958 79657746 76063719 72455737 68936862 65492853 62168794 58977233 55979985
3043 55979985 53190684 50630102 48171556 45911012 43922069 42120699 40427093 38893191
3035 38893191 37514029 36313877 35234661 34280329 33407172 32609114 31884356 31193313 30580443
$$ packed form
3091I3623949K441450K686696K891912L109845L431045L634095L802417L944533
3083A19565942L996488L921564L734477L395663K946562K298533J698489J019937
3075A42577655K72619m14336j118297j771363k454875k872307l150431l295791
3067A27772874l265188l154165l077691k846790k573943k460448k366571k282747
3059A05745331k224006k331628k477260k711329k869940l144098l295927l460185
3051H3230958l573212l594027l607982l518875l444009l324059l191561k997248
3043E5979985k789301k560582k458546k260544j988943j801370j693606j533902
3035C8893191j379162j200152j079216r54332q73157p98058p24758o91043o12870
$$ plain form
3026 30580443 30010109 29495853 29020358 28623264 28193563 27878881 27472577 27125452 26818181
3017 26818181 26478735 26292337 26154511 25966877 25927499 25977970 26052109 26165969 26342133 26567975
3007 26567975 26842267 27054695 27212651 27333167 27414803 27279039 27091258 26808718 26348116 25836990
2997 25836990 25230355 24530967 23795906 23024782 22220022 21418973 20690839 19936925 19259435
2988 19259435 18677672 18070495 17491459 17006638 16512121 16073675 15709750 15314845 14975165
2979 14975165 14606677 14289631 14033247 13812807 13538316 13379742 13216985 13016024 12832598
2970 12832598 12695287 12565085 12392120 12240515 12129257 12045567 11965170 11875766 11796577 11763566
2960 11763566 11750978 11731245 11712871 11628814 11603760 11662405 11727602 11831087 11966897 12029870 12077500
$$ packed form
3026C0580443n70334n14256m75495l97094m29701l14682m06304l47125l07271
3017B6818181l39446j86398j37826j87634l9378N0471P4139J13860J76164K25842
3007B6567975K74292K12428J57956J20516Q1636j35764j87781k82540m60602n11126
2997B5836990o06635o99388p35061p71124q04760q01049p28134p53914o77490
2988A9259435n81763o07177n79036m84821m94517m38446l63925l94905l39680
2979A4975165l68488l17046k56384k20440k74491j58574j62757k00961j83426
2970A2832598j37311j30202j72965j51605j11258q3690q0397q9404p9189l3011
2960A1763566j2588j9733j8374q4057k5054N8645O5197J03485J35810O2973M7630
$$ plain form
2949 12077500 12148872 12271458 12395066 12460234 12536465 12609920 12741808 12893643 12953032 13084261
2939 13084261 13146688 13197222 13328674 13444521 13501953 13676073 13827308 13947595 14064254 14207290
2929 14207290 14438313 14630862 14766755 14970624 15226780 15426169 15629947 15834358 16108835
2920 16108835 16432823 16749124 17084618 17443228 17780862 18066029 18401505 18771140 19028624
2911 19028624 19371117 19744784 20077952 20409311 20803385 21218135 21710112 22214489 22712104
2902 22712104 23291662 23920593 24536330 25203556 25940951 26766475 27619864 28541814 29520164
2893 29520164 30592876 31755123 32988098 34294023 35605497 37030556 38463734 39993615
2885 39993615 41639850 43377970 45195466 47144651 49191715 51413567 53608808 55773600
$$ packed form
2949A2077500P1372J22586J23608O5168P6231P3455J31888J51835N9389J31229
2939A3084261O2427N0534J31452J15847N7432J74120J51235J20287J16659J43036
2929A4207290K31023J92549J35893K03869K56156J99389K03778K04411K74477
2920A6108835L23988L16301L35494L58610L37634K85167L35476L69635K57484
2911A9028624L42493L73667L33168L31359L94074M14750M91977N04377M97615
2902B2712104N79558O28931O15737O67226P37395Q25524Q53389R21950R78350
2893B9520164J072712J162247J232975J305925J311474J425059J433178J529881
2885C9993615J646235J738120J817496J949185K047064K221852K195241K164792
$$ plain form
2877 55773600 58151895 60714001 63483691 66418480 69462617 72658531 76026370 79765683
2869 79765683 83825060 88341697 93461008 99083725 105336981 112041163 119228162 127031258
2861 127031258 135456749 144066043 152068370 158607162 163305297 166615896 169580065 173092691
2853 173092691 178067096 185140872 194660814 206936878 222026479 239629456 258582862
2846 258582862 276633480 290310161 296066107 292030633 278835765 259165178 236415151
2839 236415151 213278213 191462028 171877170 154743340 139957725 127292329 116349215
2832 116349215 106778934 98413962 90983016 84351825 78522518 73218862 68547844 64418478
2824 64418478 60744847 57451551 54543689 51909427 49504617 47225961 45009265 42972635
$$ packed form
2877E5773600K378295K562106K769690K934789L044137L195914L367839L739313
2869G9765683M059377M516637N119311N622717O253256O704182P186999P803096
2861A27031258Q425491Q609294Q002327O538792M698135L310599K964169L512626
2853A73092691M974405P073776R519942J2276064J5089601J7602977J8953406
2846B58582862J8050618J3676681N755946m035474j3194868j9670587k2750027
2839B36415151k3136938k1816185j9584858j7133830j4785615j2665396j0943114
2832A16349215r570281q364972p430946o631191n829307n303656m671018m129366
2824F4418478l673631l293296k907862k634262k404810k278656k216696k036630
$$ plain form
2816 42972635 40970307 39074316 37349036 35723368 34203121 32884405 31597963 30446146
2808 30446146 29392759 28409488 27415540 26498651 25658028 24863811 24105346 23423451 22780310
2799 22780310 22137052 21572418 21027207 20513590 20041361 19545342 19081954 18592448 18021923
2790 18021923 17495571 17040265 16650391 16122495 15691262 15307232 14822529 14356231 14000266
2781 14000266 13612201 13186988 12738621 12324377 12020596 11700931 11359563 11088099 10830507
2772 10830507 10639323 10461312 10391454 10291584 10104982 9957619 9797033 9631456 9455527 9299755
2762 9299755 9109220 8854417 8596936 8365834 8096337 7867142 7599655 7392858 7199753 7076407
2752 7076407 6957777 6823629 6752875 6628186 6480328 6396655 6294549 6239131 6219075 6146261
$$ packed form
2816D2972635k002328j895991j725280j625668j520247j318716j286442j151817
2808C0446146j053387r83271r93948r16889q40623p94217p58465o81895o43141
2799B2780310o43258n64634n45211n13617m72229m96019m63388m89506n70525
2790A8021923n26352m55306l89874n27896m31233l84030m84703m66298l55965
2781A4000266l88065m25213m48367m14244l03781l19665l41368k71464k57592
2772A0830507j91184j78011o9858r9870j86602j47363j60586j65577j75929j55772
2762I299755j90535k54803k57481k31102k69497k29195k67487k06797j93105j23346
2752G076407j18630j34148p0754j24689j47858q3673j02106n5418k0056p2814
$$ plain form
2742 6146261 6003103 5842380 5726769 5602822 5439640 5327301 5186137 5099001 5025412 4901793
2732 4901793 4764970 4683677 4623146 4510473 4373921 4325415 4246656 4146901 4033850 3923414
2722 3923414 3824570 3766625 3705965 3623155 3578463 3491709 3482445 3463581 3423941 3427866 3396158 3319363
2710 3319363 3235717 3232941 3190036 3120923 3106867 3056828 2986366 2984263 2927939 2846379 2771220 2734542
2698 2734542 2720620 2597756 2564369 2613005 2617458 2569745 2534365 2510304 2514740 2550292 2528956 2490725
2686 2490725 2432840 2319606 2310374 2241457 2214399 2221227 2232056 2246813 2212611 2178865 2226480 2177664
2674 2177664 2138123 2130177 2091120 2029102 1959631 1899930 1850440 1762960 1725834 1789940 1736698 1706545
2662 1706545 1662122 1615248 1632692 1612268 1649764 1648575 1632738 1626746 1628967 1640778 1694538 1700335
$$ packed form
2742F146261j43158j60723j15611j23947j63182j12339j41164q7136p3589j23619
2732D901793j36823q1293o0531j12673j36552m8506p8759r9755j13051j10436
2722C923414r8844n7945o0660q2810m4692q6754r264j8864l9640L925l1708p6795
2710C319363q3646k776m2905o9113j4056n0039p0462k103n6324q1560p5159l6678
2698B734542j3922j22864l3387M8636M453m7713l5380k4061M436L5552k1336l8231
2686B490725n7885j13234r232o8917k7058O828J0829J4757l4202l3746M7615m8816
2674B177664l9541p946l9057o2018o9471n9701m9490q7480l7126O4106n3242l0153
2662A706545m4423m6874J7444k0424L7496j189j5837n992K221J1811N3760N797
$$ plain form
2650 1700335 1713261 1721774 1732156 1762460 1780819 1752460 1739581 1775010 1729209 1759862 1771862 1765787
2638 1765787 1802526 1804035 1777569 1788023 1775478 1765271 1711224 1689247 1658301 1683627 1680402 1646375
2626 1646375 1621924 1579315 1644197 1672104 1651461 1666241 1648362 1572011 1562571 1560679 1565054 1552882
2614 1552882 1625102 1598103 1586144 1589454 1520222 1523129 1549403 1565729 1578962 1591699 1579348 1571288
2602 1571288 1552959 1542875 1568364 1533899 1475129 1486940 1477348 1507872 1509122 1476622 1445837 1437199
2590 1437199 1461973 1443159 1428500 1448074 1507394 1509579 1508878 1541533 1557104 1595674 1643882 1673565
2578 1673565 1639234 1680194 1748000 1746506 1741839 1739373 1804309 1862641 1887854 1908275 1964188 2023981
2566 2023981 2060582 2092692 2098307 2144495 2186782 2206262 2159351 2095042 2010815 1955116 1811236
$$ packed form
2650A700335J2926Q513J0382L0304J8359k8359j2879L5429m5801L0653J2000o075
2638A765787L6739J509k6466J0454j2545j0207n4047k1977l0946K5326l225l4027
2626A646375k4451m2609O4882K7907k0643J4780j7879p6351r440j892M375j2172
2614A552882P2220k6999j1959L310o9232K907K6274J6326J3233J2737j2351q060
2602A571288j8329j0084K5489l4465n8770J1811r592L0524J250l2500l0785q638
2590A437199K4774j8814j4659J9574N9320K185p01L2655J5571L8570M8208K9683
2578A673565l4331M0960O7806j494m667k466O4936N8332K5213K0421N5913N9793
2566B023981L6601L2110N615M6188M2287J9480m6911o4309q4227n5699j43880
$$ plain form
2555 1811236 1682458 1631168 1527036 1459797 1444951 1303093 1291493 1288602 1264417 1242846 1218827
2544 1218827 1164449 1100872 1085530 1065628 1050590 988612 993669 986378 965512 947655 921563 912909
2532 912909 876801 860159 814800 783832 790059 745010 754761 719786 681692 669226 616259 602826
2520 602826 627358 654020 628592 601759 580858 537874 550869 548977 510181 484733 471493 494055
2508 494055 540049 524237 529907 544006 482672 473623 489537 524867 476319 439276 444693 465187
2496 465187 502357 436255 420737 439830 485623 438094 420719 459932 403901 419158 440472 436007
2484 436007 493311 491785 463936 472142 465867 462735 474747 485493 525320 499344 482541 474367 439288
2471 439288 487233 476943 453859 417825 442146 448678 391817 394126 359906 380476 425630 417661
$$ packed form
2555A811236j28778n1290j04132o7239j4846j41858j1600k891k4185k1571k4019
2544A218827n4378o3577j5342j9902j5038o1978N057p291k0866j7857k6092q654
2532I12909l6108j6642m5359l0968O227m5049R751l4975l8094j2466n2967j3433
2520F02826K4532K6662k5428k6833k0901m2984J2995j892l8796k5448j3240K2562
2508D94055M5994j5812N670J4099o1334r049J5914L5330m8548l7043N417K0494
2496D65187L7170o6102j5518J9093M5793m7529j7375L9213n6031J5257K1314m465
2484D36007N7304j526k7849Q206o275l132J2012J0746L9827k5976j6803q174l5079
2471D39288M7945j0290k3084l6034K4321O532n6861K309l4220K0570M5154p969
$$ plain form
2459 417661 439145 479906 433638 397012 364406 366912 364966 299354 343601 358013 329326 329159
2447 329159 302218 317625 329575 336438 322399 298222 284914 251614 263372 296855 305690 291576
2435 291576 275831 231960 174613 213637 295631 293863 242360 174479 192956 247057 216936 233644
2423 233644 250758 261403 247423 272153 213210 259546 278677 251800 241550 240098 241657 261705
2411 261705 270816 318973 318298 252049 218399 200823 220643 247767 232736 196005 163740 180429
2399 180429 233591 236585 246220 204882 217333 256792 245353 176253 177916 222035 268573 271135
2387 271135 302359 276179 229506 183272 203095 166333 120327 164219 137200 138860 203011 233523
2375 233523 216601 171228 151557 131704 143331 147815 174926 141170 159528 226334 242993 175492
$$ packed form
2459D17661K1484M0761m6268l6626l2606K506j946o5612M4247J4412k8687j67
2447C29159k6941J5407J1950O863j4039k4177j3308l3300J1758L3483Q835j4114
2435B91576j5745m3871n7347L9024Q1994j768n1503o7881J8477N4101l0121J6708
2423B33644J7114J0645j3980K4730n8943M6336J9131k6877j0250j452J559K0048
2411B61705R111M8157o75o6249l3650j7576J9820K7124j5031l6731l2265J6689
2399A80429N3162K994R635m1338J2451L9459j1439o9100J663M4119M6538K562
2387B71135L1224k6180m6673m6234J9823l6762m6006M3892k7019J660O4151L0512
2375B33523j6922m5373j9671j9853J1627M484K7111l3756J8358O6806J6659o7501
$$ plain form
2363 175492 159245 88972 81776 93915 71155 105369 129479 57010 10148 17756 48861 66690
2351 66690 47310 37703 51378 100105 61675 27431 13716 26146 1364 28420 47489 96109
2339 96109 83722 112555 53375 36285 -17758 -39514 -997 33721 20901 21944 -1840 17049
2327 17049 53134 -8798 -7884 17128 27434 81868 34766 -853 2206 34441 37982 30258 7967
2314 7967 47055 63009 42424 69731 52510 40887 29960 29638 -2674 20012 -4035 4551 37065
2301 37065 -5017 4669 94843 116561 72998 75287 115633 23933 34161 36619 83589 63932
2289 63932 57067 82282 35617 23778 65847 52865 60220 73233 65376 68930 77412 87455 88307
2276 88307 63770 66645 46990 62435 43671 20433 42419 93620 100830 88702 45320 38714
$$ packed form
2363A75492j6247p0273p196J2139k2760L4214K4110p2469m6862P608L1105J7829
2351F6690j9380r607J3675M8727l8430l4244j3715J2430k4782K7056J9069M8620
2339I6109j2387K8833n9180j7090n4043k1756L8517L4718j2820J043k3784J8889
2327A7049L6085o1932R14K5012J0306N4434m7102l5619L059L2235L541p724k2291
2314G967L9088J5954k0585K7307j7221j1623j0927l22l2312K2686k4047Q586L2514
2301C7065m2082R686R0174K1718m3563K289M0346r1700J0228K458M6970j9657
2289F3932o865K5215m6665j1839M2069j2982P355J3013p857L554Q482J0043Q52
2276H8307k4537K875j9655J5445j8764k3238K1986N1201P210j2128m3382o606
$$ plain form
2264 38714 31913 12060 7840 100929 105288 74809 74148 86189 86824 43771 73088 46438 42346
2251 42346 43646 99233 100391 89982 104498 91072 84235 94348 83739 77771 94028 115245 72159
2238 72159 33775 7476 71200 54568 74110 96636 59801 56014 124016 146558 143548 141274
2226 141274 153268 137601 99522 115412 93569 83371 103293 75479 73070 122420 113853 117870
2214 117870 143013 141864 106302 109047 114207 98581 165396 180659 152460 115575 89581 105530
2202 105530 139907 174850 213568 176627 168866 184530 137371 160938 231995 232900 224751 239707
2190 239707 246555 203286 159601 223449 285823 262729 240266 224909 299453 351321 337919 344923
2178 344923 340252 332963 367635 396859 377486 371223 375582 394586 435166 425909 412502 523876
$$ packed form
2264C8714o801j9853m220R3089M359l0479o61J2041O35m3053K9317k6650m092
2251D2346J300N5587J158j0409J4516j3426o837J0113j0609n968J6257K1217m3086
2238G2159l8384k6299O3724j6632J9542K2526l6835l787O8002K2542l010k274
2226A41274J1994j5667l8079J5890k1843j0198J9922k7814k409M9350q567M017
2214A17870K5143j149l5562K745N160j5626O6815J5263k8199l6885k5994J5949
2202A05530L4377L4943L8718l6941p761J5664m7159K3567P1057R05q149J4956
2190B39707O848m3269m3685O3848O2374k3094k2463j5357P4544N1868j3402P004
2178C44923m671p289L4672K9224j9373o263M359J9004M0580r257j3407J11374
$$ plain form
2166 523876 528571 516157 603145 616831 650439 645878 679796 716595 712411 747508 760628 781749
2154 781749 823413 830231 890167 987154 980008 954185 967877 1027439 1042148 1134635 1210455 1310974
2142 1310974 1413693 1448895 1560257 1657583 1780840 1910517 2080453 2272288 2364284 2499194
2132 2499194 2718357 2966498 3202179 3539510 3955996 4553188 5214059 6112475 7349972
2123 7349972 9074988 11444582 14037639 15040452 13317408 10855695 8639588 6877054
2115 6877054 5596315 4597460 3779590 3266281 2895875 2576064 2341864 2186413 2067512
2106 2067512 1967999 1919870 1762702 1566572 1382728 1246773 1180833 1150759 1060693 1020501 975495
2095 975495 905586 846796 792730 775516 742070 688351 641464 561433 514263 490448 530611 507397
$$ packed form
2166E23876M695j2414Q6988J3686L3608m561L3918L6799m184L5097J3120K1121
2154G81749M1664O818N9936R6987p146k5823J3692N9562J4709R2487P5820J00519
2142A310974J02719L5202J11362R7326J23257J29677J69936J91835R1996J34910
2132B499194K19163K48141K35681L37331M16486N97192O60871Q98416J237497
2123G349972J725016K369594K593057J002813j723044k461713k216107j762534
2115F877054j280739r98855q17870n13309l70406l19811k34200j55451j18901
2106B067512r9513m8129j57168j96130j83844j35955o5940l0074r0066m0192m5006
2095I75495o9909n8790n4066j7214l3446n3719m6887q0031m7170k3815M0163k3214
$$ plain form
2083 507397 504002 499720 448314 432474 390388 325433 297493 333272 305738 276347 332131 315691
2071 315691 381872 307208 298827 243350 267644 259113 234644 242118 233813 249407 265976 249698
2059 249698 228607 180023 173422 193928 104814 146992 106661 55680 91312 131636 108917 130922
2047 130922 146286 174495 129297 111228 131862 126800 100964 81821 119440 115852 141042 131909
2035 131909 102012 38924 28529 75546 45160 8535 53347 58093 65600 78343 25546 42487
2023 42487 76910 50521 -11115 -13572 -44778 -19261 -18628 -13117 -9637 -50847 -71639 -51083 -30072
2010 -30072 -20093 5772 -17188 -22336 -23764 -57467 34498 -38946 -93419 -104553 -83538 -84980 -35588
1997 -35588 -26300 -75153 -34373 2309 35932 -21424 -10079 -19884 -57700 -40379 -30799 12239
$$ packed form
2083E07397l395m282n1406j5840m2086o4955k7940L5779k7534k9391N5784j6440
2071C15691O6181p4664q381n5477K4294q531k4469P474q305J5594J6569j6278
2059B49698k1091m8584o601K0506q9114M2178m0331n0981L5632M0324k2719K2005
2047A30922J5364K8209m5198j8069K0634n062k5836j9143L7619l588K5190r133
2035A31909k9897o3088j0395M7017l0386l6625M4812M746P507J2743n2797J6941
2023D2487L4423k6389o1636k457l1206K5517O33N511L480m1210k0792K0556K1011
2010c0072R979K5865k2960n148j428l3703R1965p3444n4473j1134K1015j442M9392
1997c5588R288m8853M0780L6682L3623n7356J1345r805l7816J7321R580M3038
$$ plain form
1985 12239 52021 6289 -58918 -45915 -12555 -41335 -41392 -57097 -81487 -60297 -52480 -79897 -66496
1972 -66496 -118554 -95362 -76144 -49937 -51528 -57598 -66572 -73678 -116277 -68005 -50267 -72921 -27481
1959 -27481 3521 23736 -81651 -70928 -113836 -113735 -79744 -40281 -83555 -113353 -94766 -74426
1947 -74426 -39663 -78416 -98527 -28884 -42001 -99302 -64441 -51634 -110397 -118328 -125625 -144555
1935 -144555 -118964 -67298 -74859 -104179 -51958 -8336 -56972 -74011 -55113 -35835 -17591 -2805
1923 -2805 -11457 -358 -44473 -81087 -65223 -60064 -39755 -66836 -38767 20188 44672 20725
1911 20725 -18017 -34772 -34726 8950 12260 -23562 -31 -20557 -65969 -89395 -89611 -67059 -52717
1898 -52717 -40482 -57892 -46658 -82604 -83408 -48490 -9541 -56719 -77168 -66470 -122991 -117251
$$ packed form
1985A2239L9782m5732o5207J3003L3360k8780n7j5705k4390K1190P817k7417J3401
1972f6496n2058K3192J9218K6207j591o070q974p106m2599M8272J7738k2654M5440
1959b7481L1002K0215j05387J0723m2908J01L3991L9463m3274k9798J8587K0340
1947g4426L4763l8753k0111O9643j3117n7301L4861J2807n8763p931p297j8930
1935a44555K5591N1666p561k9320N2221M3622m8636j7039J8898J9278J8244J4786
1923b805q652J1099m4115l6614J5864N159K0309k7081K8069N8955K4484k3947
1911B0725l8742j6755M6M3676L310l5822K3531k0526m5412k3426k16K2552J4342
1898e2717J2235j7410J1234l5946q04L4918L8949m7178k0449J0698n6521N740
$$ plain form
1886 -117251 -80832 -34586 -3870 -32123 -37871 -3042 -71274 -35832 -75983 -18440 -33850 -56595
1874 -56595 -62680 -33508 -7597 -14424 -60183 -37491 -38599 -18236 -24649 -54590 -11243 -35021 -44101
1861 -44101 -37753 -33815 -7339 28066 -19232 -48497 -15117 -35886 -12404 106 -27808 -7609
1849 -7609 79730 62255 -43870 -22024 -27006 -69213 -40582 -61552 -122119 -96641 -92029 -100210
1837 -100210 -87989 -91942 -73371 -9800 -27766 10054 -2761 -71600 -105433 -89470 -104989 -123075
1825 -123075 -126158 -92166 -61483 -135848 -197481 -143243 -82539 -96410 -81083 -119063 -166931 -136163
1813 -136163 -57163 -76903 -79459 -77148 -74291 -65721 -95044 -83675 -74607 -53792 -74886 -46223 -44271
1800 -44271 -85345 -111180 -87642 -115021 -135835 -140479 -105319 -79976 -101050 -86688 -107596 -55343
$$ packed form
1886a17251L6419M6246L0716k8253n748L4829o8232L5442m0151N7543j5410k2745
1874e6595o085K9172K5911o827m5759K2692j108K0363o413k9941M3347k3778r080
1861d4101O348L938K6476L5405m7298k9265L3380k0769K3482J2510k7914K0199
1849g609Q7339j7475j06125K1846m982m2207K8631k0970o0567K5478M612q181
1837a00210J2221l953J8571O3571j7966L7820j2815o8839l3833J5963j5519j8086
1825a23075l083L3992L0683p4365o1633N4238O0704j3871J5327l7980m7868L0768
1813a36163P9000j9740k556K311K857Q570k9323J1369R068K0815k1094K8663J952
1800d4271m1074k5835K3538k7379k0814m644L5160K5343k1074J4362k0908N2253
$$ plain form
1788 -55343 -62093 -76612 -36136 -60617 -32761 -18472 -88000 -97275 -62452 -105053 -122804 -52988
1776 -52988 -103057 -100577 -50407 -49352 -48830 -38059 -29908 -66884 -72752 -109209 -132212 -91687 -47621
1763 -47621 -48144 -80044 -62731 -72805 -48077 -38851 -69380 -106187 -142271 -122579 -121778 -115347 -89271
1750 -89271 -57476 -82701 -72543 -125519 -70778 -6721 16466 -31090 -55985 -84258 -34492 -29716
1738 -29716 -31694 -41320 -43325 -53091 -113959 -92427 -87734 -127298 -145645 -138405 -87389 -51460 -72464
1725 -72464 -87773 -66461 -44052 -80380 -141605 -150594 -129719 -122138 -124564 -128732 -111996 -78812 -143313
1712 -143313 -134225 -123724 -118722 -96412 -63112 -28083 -33980 -39135 -68492 -65322 -57859 -30363 -50382
1699 -50382 -83227 -109961 -130635 -93808 -70908 -124666 -75352 -80133 -63761 -93452 -19323 -22791
$$ packed form
1788e5343o750j4519M0476k4481K7856J4289o9528r275L4823m2601j7751O9816
1776e2988n0069K480N0170J055N22J0771Q151l6976n868l6457k3003M0525M4066
1763d7621n23l1900J7313j0074K4728R226l0529l6807l6084J9692Q01O431K6076
1750h9271L1795k5225J0158n2976N4741O4057K3187m7556k4895k8273M9766M776
1738b9716j978r626k005r766o0868K1532M693l9564j8347P240N1016L5929k1004
1725g2464j5309K1312K2409l6328o1225q989K0875P581k426m168J6736L3184o4501
1712a43313R088J0501N002K2310L3300L5029n897n155k9357L170P463K7496k0019
1699e0382l2845k6734k0674L6827K2900n3758M9314m781J6372k9691P4129l468
$$ plain form
1687 -22791 -17837 -36547 -36888 -80389 -33151 -15286 -33114 -77489 -67375 -38496 -32845 9836 -18330
1674 -18330 -60592 -96505 -93351 -133896 -67225 -44800 -68859 -123007 -103791 -84397 -56781 -67736
1662 -67736 -67044 -14059 -43597 -100227 -127006 -138349 -93717 -31555 -67970 -7181 -75949 -86028
1650 -86028 -44118 -82199 -93921 -98962 -74743 -91646 -82137 -78623 -85807 -84114 -41648 -49024 -42323
1637 -42323 -58162 -17345 -3431 -7868 -44825 -111066 -40217 -75692 -90500 -62767 -65439 -87002
1625 -87002 -109452 -112587 -94661 -47786 -48737 -76425 -76842 -95334 -126465 -57041 -35991 -58081 -115258
1612 -115258 -117264 -108967 -143286 -115935 -87403 -101783 -133365 -163394 -127364 -117812 -171244 -159429
1600 -159429 -106229 -133868 -140089 -102345 -63971 -58757 -49218 -49153 -44204 -30661 -50191 -5719 -28352
$$ packed form
1687b2791M954j8710l41m3501M7238J7865j7828m4375J0114K8879N651M2681k8166
1674a8330m2262l5913L154m0545O6671K2425k4059n4148J9216J9394K7616j0955
1662f7736O92N2985k9538n6630k6779j1343M4632O2162l6415O0789o8768j0079
1650h6028M1910l8081j1722n041K4219j6903R509L514p184J693M2466p376O701
1637d2323j5839M0817J3914m437l6957o6241P0849l5475j4808K7733k672k1563
1625h7002k2450l135J7926M6875r51k7688m17j8492l1131O9424K1050k2090n7177
1612a15258k006Q297l4319K7351K8532j4380l1582l0029L6030R552n3432J1815
1600a59429N3200k7639o221L7744L8374N214R539O5M949J3543j9530M4472k2633
$$ plain form
1587 -28352 -41305 -77599 -102007 -15002 -58344 -116975 -37376 -43898 -39254 -46689 -15636 -45058
1575 -45058 -62792 -29874 -39620 -49356 -41169 -24556 -14163 -29429 -53430 -82447 -39611 -8572
1563 -8572 -51154 -76163 -65379 -67754 -76644 -19341 6733 -25627 -40599 -32946 -59533 -63168 -55374
1550 -55374 -64733 -81269 -86479 -125690 -88348 -134502 -118845 -85025 -87811 -60176 -45553 -48209 -31021
1537 -31021 -20420 -38265 -80521 -85389 -26192 8512 -20445 -31489 -44316 -21759 -19061 -26853
1525 -26853 -96401 -73713 -44306 -34162 -22991 -32928 -20447 -53677 -70412 -45664 -88688 -101368
1513 -101368 -51201 -81004 -41847 -72665 -82833 -44780 -22569 738 -67946 -97549 -113896 -101196
1501 -101196 -59199 -83420 -70782 -54096 -28644 -35647 -79572 -50209 -49645 -42589 -62416 -53558 -40560
$$ packed form
1587b8352j2953l6294k4408Q7005m3342n8631P9599o522M644p435L1053k9422
1575d5058j7734L2918r746r736Q187J6613J0393j5266k4001k9017M2836L1039
1563h572m2582k5009J0784k375q890N7303K6074l2360j4972P653k6587l635P794
1550e5374r359j6536n210l9211L7342m6154J5657L3820k786K7635J4623k656J7188
1537c1021J0601j7845m2256m868N9197L4704k8957j1044j2827K2557K698p792
1525b6853o9548K2688K9407J0144J1171r937J2481l3230j6735K4748m3024j2680
1513a01368N0167k9803L9157l0818j0168L8053K2211K3307o8684k9603j6347J2700
1501a01196M1997k4221J2638J6686K5452p003m3925K9363N64P056j9827Q858J2998
$$ plain form
1488 -40560 -53080 -70583 -70410 -49638 -57095 -55573 -30882 -37419 -27925 -12081 -61233 -67619 -25193
1475 -25193 -16668 -50265 -40599 -38112 -61913 -78347 -87378 -37588 -42665 -27242 -1248 -31002 9737
1462 9737 -27012 -56574 -29132 -22858 -83927 -106161 -71332 -107168 -87085 -52230 -95067 -83938
1450 -83938 -56796 -59646 -74858 -64151 -121444 -142528 -152369 -73262 -33682 -15088 -38190 -39476
1438 -39476 7773 -23903 -67643 -52401 -72742 -77261 -71229 -59668 -102487 -66239 -61217 -39136
1426 -39136 -62219 -103414 -75714 -18085 -26322 -67755 -79872 -57365 -38530 -39376 -72722 -56847
1414 -56847 549 -22799 -61984 -11658 -40895 -90972 -37310 -59808 -89780 -65254 -70185 -50510
1402 -50510 -71070 -80817 -39259 -83608 -33026 -35743 -19916 -42729 -75644 -45590 -17928 3637
$$ packed form
1488d0560j2520j7503J73K0772p457J522K4691o537R494J5844m9152o386M2426
1475b5193Q525l3597R666K487k3801j6434r031M9790n077J5423K5994k9754M0739
1462I737l6749k9562K7442O274o1069k2234L4829l5836K0083L4855m2837J1129
1450h3938K7142k850j5212J0707n7293k1084r841P9107L9580J8594k3102j286
1438c9476M7249l1676m3740J5242k0341m519O032J1561m2819L6248N022K2081
1426c9136k3083m1195K7700N7629q237m1433j2117K2507J8835q46l3346J5875
1414e6847N7396k3348l9185N0326k9237n0077N3662k2498k9972K4526m931J9675
1402e0510k0560r747M1558m4349N0582k717J5827k2813l2915L0054K7662K1565
$$ plain form
1390 3637 -9199 -50741 -69147 -99322 -83989 -135084 -88765 -99651 -96647 -68333 -62338 -74510
1378 -74510 -69408 -71339 -59312 -45788 -32426 -73434 -80513 -75792 -93340 -56605 -31094 -34964 -27335
1365 -27335 17726 -17139 -60057 -13728 -24291 -89339 -85275 -76190 -57455 -26947 -24468 -26759 -61596
1352 -61596 -56903 -25593 -43247 -121942 -61457 -63183 -81748 -68789 7236 35402 12626 7300
1340 7300 -58279 -55816 -1284 -24371 -70858 -121470 -100232 -42721 -44793 -27477 -61395 -73727
1328 -73727 -55252 -42157 -59264 -58968 -84182 -116729 -83419 -29137 -44820 -25475 -35109 37179
1316 37179 44708 11377 22065 36869 -31448 -96203 -82719 -25383 -51587 -21213 -61277 -91808
1304 -91808 -76630 -73654 -79316 -34432 -70928 -69995 -37246 -35351 15714 181 -5971 -9505 -84129
$$ packed form
1390C637j2836m1542j8406l0175J5333n1095M6319j0886L004K8314N995j2172
1378g4510N102j931J2027J3524J3362m1008p079M721j7548L6735K5511l870P629
1365b7335M5061l4865m2918M6329j0563o5048M064R085J8735L0508K479k291l4837
1352f1596M693L1310j7654p8695O0485j726j8565J2959P6025K8166k2776n326
1340G300o5579K463N4532k3087m6487n0612K1238N7511k072J7316l3918j2332
1328g3727J8475J3095j7107K96k5214l2547L3310N4282j5683J9345r634P2288
1316C7179P529l3331J0688J4804o8317o4755J3484N7336k6204L0374m0064l0531
1304i1808J5178K976n662M4884l6496R33L2749J895N1065j5533o152l534p4624
$$ plain form
1291 -84129 -76119 -71088 -103668 -99139 -91281 -103118 -81592 -44097 -69314 -57769 -82223 -112866 -49663
1278 -49663 -15978 -89719 -59093 -54272 -64963 -112912 -89417 -72693 -53348 -90052 -80774 -41225
1266 -41225 -34246 -45885 -17655 -51223 -44608 -41770 -79763 -66871 -77015 -122247 -99786 -74872
1254 -74872 -93950 -94096 -89959 -116381 -89040 -74961 -87660 -81028 -65041 -78238 -84721 -60892 -44142
1241 -44142 -42785 -51663 -44873 -97380 -97688 -136505 -80052 -31425 -31738 -65841 -128523 -105219 -23927
1228 -23927 -30232 -94572 -71261 -15082 15277 8805 -22215 -37630 -49864 -43424 -8259 -6095 -13330
1215 -13330 -3632 9923 -28689 -66059 -48902 -40179 -71990 -49747 -79916 -71829 -37799 -30186 -14650
1202 -14650 -113963 -112561 -86140 -35427 30915 7871 -26769 14284 -69510 -90839 -60978 -64270
$$ packed form
1291h4129Q010N031l2580M529P858j1837K1526L7495k5217J1545k4454l0643O3203
1278d9663L3685p3741L0626M821j0691m7949K3495J6724J9345l6704R278L9549
1266d1225O979j1639K8230l3568O615K838l7993J2892j0144m5232K2461K4914
1254g4872j9078j46M137k6422K7341J4079j2699O632J5987j3197o483K3829J6750
1241d4142J357q878O790n2507l08l8817N6453M8627l13l4103o2682K3304Q1292
1228b3927o305o4340K3311N6179L0359o472l1020j5415j2234O440L5165K164p235
1215a3330R698J3555l8612l7370J7157Q723l1811K2243l0169Q087L4030P613J5536
1202a4650r9313J402K6421N0713O6342k3044l4640M1053q3794k1329K9861l292
$$ plain form
1190 -64270 -61622 -12514 -43786 -40263 -5998 7965 -62202 -73643 -83787 -58137 -35057 -56327
1178 -56327 -34991 -24915 -36148 -30417 -60538 -72886 -79214 -72420 -34931 -65827 -20249 -1816
1166 -1816 -48284 -64610 -44874 -46324 -73423 -80329 -41335 -97420 -7512 3902 9379 10661 -13026
1153 -13026 8420 2140 -50262 -47167 -51840 -48788 -49890 -45038 -60775 8503 -21951 -31811 -21223
1140 -21223 -16500 -37981 -75817 -64458 -81759 -40948 -56811 -8746 -46159 -22833 -36172 -69787
1128 -69787 -56769 -855 18176 -21770 -7730 -43988 -57746 -10915 -52068 -35464 -30304 -68191
1116 -68191 -53580 -56546 -40373 -64340 -45133 1338 -1390 -54767 -49111 -44393 -59284 -18244 23611
1103 23611 3746 -18447 -54785 -56611 -41322 -58563 -26696 13496 -12147 -25241 -19533 -15985
$$ packed form
1190f4270K648M9108l1272L523L4265J3963p0167j1441j0144K5650K3080k1270
1178e6327K1336J0076j1233N731l0121j2348o328O794L7489l0896M5578J8433
1166a816m6468j6326J9736j450k7099o906L8994n6085Q9908J1414N477J282k3687
1153a3026K1446o280n2402L095m673L052j102M852j5737O9278l0454r860J0588
1140b1223M723k1481l7836J1359j7301M0811j5863M8065l7413K3326j3339l3615
1128f9787J3018N5914J9031l9946J4040l6258j3758M6831m1153J6604N160l7887
1116f8191J4611k966J6173k3967J9207M6471k728n3377N656M718j4891M1040M1855
1103B3611j9865k2193l6338j826J5289j7241L1867M0192k5643j3094N708L548
$$ plain form
1091 -15985 -19429 -22797 -14553 16319 -10964 -10022 -33162 -28505 -16646 -46276 -30104 15714 2130
1078 2130 -16161 -32118 -30942 -13932 -50220 -23460 -5675 -9914 -21996 -44064 -39271 -39785 -46946
1065 -46946 -29485 -36807 -9474 23339 24894 -9249 13781 26231 -9812 -24590 -68574 -64765
1053 -64765 -35032 -238 31407 -22271 15373 48388 23598 8707 -37738 740 24149 11663
1041 11663 -9796 -47089 -36693 -50697 -71705 -51743 31923 32973 5797 13611 40767 49323
1029 49323 45292 40903 -9791 -41708 -10767 -31613 -13672 -13983 48172 45033 28084 21242 28770
1016 28770 36533 44369 -3705 -14429 14550 17249 9590 -61709 -74880 -54089 -30046 -88697 -78324
1003 -78324 13132 42505 68845 72209 71248 21747 -5947 -8288 -21673 63551 23437 45305 12909
$$ packed form
1091a5985l444l368Q244L0872k7283R42k3140M657J1859k9630J6172M5818j3584
1078B130j8291j5957J176J7010l6288K6760J7785m239j2082k2068M793n14p161
1065d6946J7461p322K7333L2813J555l4143K3030J2450l6043j4778m3984L809
1053f4765K9733L4794L1645n3678L7644L3015k4790j4891m6445L8478K3409j2486
1041A1663k1459l7293J0396j4004k1008J9962Q3666J050k7176P814K7156Q556
1029D9323m031m389n0694l1917L0941k0846J7941l11O2155l139j6949o842P528
1016B8770P763P836m8074j0724K8979K699p659p1299j3171K0791K4043n8651J0373
1003g8324R1456K9373K6340L364r61m9501k7694k341j3385Q5224m0114K1868l2396
$$ plain form
990 12909 -8947 22914 13278 -35036 -28498 2008 -7464 -21798 -7882 -4928 -30174 10333 18345
977 18345 -22837 -3706 22936 -3528 -70111 -42117 -5062 -39296 -36077 -33267 5906 59353
965 59353 64838 36512 -11915 -34352 20218 1407 -33025 -46098 129 31581 13193 17778
953 17778 11169 -13059 -28771 -46282 -36559 -31140 -53407 -40025 -16691 -4130 -59653 -41880 -22887
940 -22887 20056 -6759 26043 18036 -18062 -28444 -66828 -37965 -21939 -31033 -10552 48635
928 48635 23019 22286 11569 13794 68368 39301 -22232 -13203 29412 -634 -1927 4171 -13306
915 -13306 4044 40306 6745 -33153 19226 22852 7687 40218 28739 29630 43216 -8853 13957
902 13957 42513 2825 3026 42896 44084 43141 13677 -20680 -49675 -36940 -16591 -28736 585
$$ packed form
990A2909k1856L1861r636m8314O538L0506r472j4334J3916K954k5246M0507Q012
977A8345m1182J9131K6642k6464o6583K7994L7055l4234L219K810L9173N3447
965E9353N485k8326m8427k2437N4570j8811l4432j3073M6227L1452j8388M585
953A7778o609k4228j5712j7511R723N419k2267J3382K3334J2561n5523J7773J8993
940b2887M2943k6815L2802q007l6098j0382l8384K8863J6026r094K0481N9187
928D8635k5616p33j0717K225N4574k9067o1533R029M2615l0046j293O098j7477
915a3306J7350L6262l3561l9898N2379L626j5165L2531j1479Q91J3586n2069K2810
902A3957K8556l9688K01L9870J188r43k9464l4357k8995J2735K0349j2145K9321
$$ plain form
889 585 41122 32472 36057 59623 47946 65845 37554 -5093 -7954 -26560 -49831 -46643 11930
876 11930 -46082 -45508 -15949 3177 37520 66646 92321 -2732 -43088 -41233 -50609 14427 17910
863 17910 59600 17664 -10242 -48339 32693 21895 -55971 -64727 -16462 21245 -19574 -5696
851 -5696 15044 39300 68049 105269 89693 81697 42335 57762 36327 11342 11778 10055 34906
838 34906 98062 14477 11998 53146 73681 66835 90942 58326 4707 37301 17667 -21489
826 -21489 39970 63489 14137 19460 50186 34510 21740 80282 49283 23910 -29509 33075
814 33075 81970 7688 15082 25190 37431 78405 59834 -26811 -19482 3737 32680 49134
802 49134 57427 97788 39433 -14877 -3115 90879 86536 60262 39868 34443 61 -12488 30381
$$ packed form
889E85M0537q650L585K3566j1677J7899k8291m2647k861j8606k3271L188N8573
876A1930n8012N74K9559J9126L4343K9126K5675r5053m0356J855r376O5036L483
863A7910M1690m1936k7906l8097Q1032j0798p7866q756M8265L7707m0819J3878
851e696K0740K4256K8749L7220j5576p996l9362J5427k1435k4985M36j723K4851
838C4906O3156q3585k479M1148K0535o846K4107l2616n3619L2594j9634l9156
826b1489O1459K3519m9352N323L0726j5676j2770N8542l0999k5373n3419O2584
814C3075M8895p4282P394J0108J2241M0974j8571q6645P329K3219K8943J6454
802D9134Q293M0361n8355n4310J1762R3994m343k6274k0394n425l4382j2549M2869
$$ plain form
789 30381 45745 65265 13341 -8044 591 54092 37304 10981 12215 -17631 -15515 -3015 -11128
776 -11128 -7582 -8106 5392 9016 52375 50186 30589 25743 41141 94764 81735 58509 20208
763 20208 8767 43051 21893 47834 -9530 5101 49561 48191 22064 39041 89282 64169
751 64169 -193 8461 13986 24228 35191 99306 64777 31196 73362 25655 6115 10932 -28859
738 -28859 -21588 -26617 -24631 20089 16864 41532 99157 86524 47051 101025 9693 -35836 -16043
725 -16043 14794 -16877 4513 -4363 62754 61818 38999 45890 37739 20040 16614 76103 107295
712 107295 47056 45595 40553 37991 62592 90230 75402 75172 81859 61419 51370 26429 -26609
699 -26609 -9211 43779 54033 55839 22268 35260 -11498 20832 35250 3279 15135 -3420
$$ packed form
789C0381J5364J9520n1924k1385Q635N3501j6788k6323J234k9846K116J2500q113
776a1128L546n24J3498L624M3359k189j9597m846J5398N3623j3029k3226l8301
763B0208j1441L4284k1158K5941n7364J4631M4460j370k6127J6977N0241k5113
751F4169o4362Q654N525J0242J0963O4115l4529l3581M2166m7707j9540M817l9791
738b8859P271n029J986M4720l225K4668N7625j2633l9473N3974r1332m5529J9793
725a6043L0837l1671K1390q876O7117r36k2819O891q151j7699l426N9489L1192
712A07295o0239j461n042k562K4601K7638j4828k30O687k0440j0049k4941n3038
699b6609J7398N2990J0254J806l3571J2992m6758L2330J4418l1971J1856j8555
$$ plain form
687 -3420 -4396 15768 21004 2683 -1461 55508 77660 29863 -3888 2608 38322 -4302 32682
674 32682 26679 33138 23397 30892 10221 9851 72601 80404 83085 46412 68745 111385 73302 -18591
660 -18591 -377 25815 20535 87199 107627 78395 59693 44372 66893 72118 55524 89
648 89 6734 39931 97537 83023 71108 69841 34199 39384 29939 43335 58187 33747 9948
635 9948 7388 59506 62967 57642 31449 31368 -53261 2269 84472 82550 75059 2866 30760 79244
621 79244 105996 127367 101607 123948 136872 70067 33610 62670 77620 71750 4133 -11890
609 -11890 41521 27005 24213 47388 48181 66772 41495 60828 78630 98135 94232 94725 85399
596 85399 32065 60650 52144 50671 32280 -6464 48696 93431 57603 35459 -10822 -11930 -13728
$$ packed form
687c420r76K0164N236j8321m144N6969K2152m7797l3751O496L5714m2624L6984
674C2682o003O459r741P495k0671l70O2750P803K681l6673K2333M2640l8083r1893
660a8591J8214K6192n280O6664K0428k9232j8702j5321K2521N225j6594n5435
648H9O645L3197N7606j4514j1915j267l5642N185r445J3396J4852k4440k3799
635I948k560N2118L461n325k6193q1q4629N5530Q2203j922p491p2193K7894M8484
621G9244K6752K1371k5760K2341J2924o6805l6457K9060J4950n870o7617j6023
609a1890N3411j4516k792K3175P93J8591k5277J9333J7802J9505l903M93r326
596H5399n3334K8585q506j473j8391l8744N5160M4735l5828k2144m6281j108j798
$$ plain form
583 -13728 -1950 60370 70604 82802 58222 55578 49164 68124 77057 86786 54932 3506 22563
570 22563 36229 28788 72767 53498 59428 53505 71750 48811 -17336 -46861 3080 39268 49446
557 49446 58985 16604 30621 22846 54740 77842 76785 58761 45200 28758 33975 32190 22662
544 22662 47156 50573 42585 77098 2130 23207 30529 25001 66628 51858 71287 79507 63771
531 63771 36311 3597 54155 48639 70810 83555 86037 87764 136435 70606 109802 102602 116193
518 116193 108537 81166 92917 79718 85156 66963 37971 38019 53576 79538 33798 12255 57692
505 57692 116056 119817 76756 37828 38807 50864 54414 131235 96609 77005 105654 147873 145341
492 145341 91136 93914 114956 76400 104151 180432 120733 74088 70962 72811 75409 74177 85149
$$ packed form
583a3728J1778O2320J0234J2198k4580k644o414J8960Q933R729l1854n1426J9057
570B2563J3666p441M3979j9269N930n923J8245k2939o6147k9525M9941L6188J0178
557D9446R539m2381J4017p775L1894K3102j057j8024j3561j6442N217j785r528
544B2662K4494L417p988L4513p4968K1077P322n528M1627j4770J9429Q220j5736
531F3771k7460l2714N0558n516K2171J2745K482J727M8671o5829L9196p200J3591
518A16193p656k7371J1751j3199N438j8193k8992M8J5557K5962m5740k1543M5437
505E7692N8364L761m3061l8928R79J2057L550P6821l4626j9604K8649M2219k532
492A45341n4205K778K1042l8556K7751P6281n9699m6645l126J849K598j232J0972
$$ plain form
479 85149 64311 68395 64790 87506 59033 40616 76005 92222 119834 92623 49331 101366
467 101366 33120 23040 53399 93833 89884 71964 35246 21887 41967 42009 21234 43970 72014
454 72014 60407 41346 42224 41394 31190 17701 61374 80243 79762 9858 22309 65798 100667
441 100667 66837 29134 29510 55948 102503 109368 90391 57810 45673 39243 34500 38387 44788
428 44788 68666 87478 92729 89335 89912 91038 91317 115336 92158 41348 88448 136255 108601
415 108601 126812 96095 28594 43832 24041 16637 39363 6540 64644 61586 30527 75186
403 75186 93231 89957 63805 78684 114160 66505 66370 83730 117708 104364 71644 56849 40231
390 40231 79404 112414 93234 89226 72904 126248 107880 49740 65170 55500 43343 66000
$$ packed form
479H5149k0838M084l605K2716k8473j8417L5389J6217K7612k7211m3292N2035
467A01366o8246j0080L0359M0434l949j7920l6718j3359K0080M2k0775K2736K8044
454G2014j1607j9061Q78q30j0204j3489M3673J8869m81o9904J2451M3489L4869
441A00667l3830l7703L76K6438M6555O865j8977l2581j2137o430m743L887O401
428D4788K3878J8812N251l394N77J126K79K4019k3178n0810M7100M7807k7654
415A08601J8211l0717o7501J5238j9791p404K2726l2823N8104l058l1059M4659
403G5186J8045l274k6152J4879L5476m7655j35J7360L3978j3344l2720j4795j6618
390D0231L9173L3010j9180m008j6322N3344j8368n8140J5430r670j2157K2657
$$ plain form
378 66000 101941 111021 59980 67107 65357 82483 80634 97864 68631 91047 132578 55301 48034
365 48034 70764 52578 63599 60851 38088 66543 96849 54146 29834 61822 20799 56822
353 56822 119674 126639 90773 76932 96976 87364 123136 89951 88999 106452 116053 100950 38925
340 38925 62618 44645 52801 92862 54895 51469 104604 47602 24439 37595 70424 41961
328 41961 44205 80225 7693 -9279 19820 97343 99284 104235 99727 43277 71430 89526 105033
315 105033 109051 86995 42399 65080 102330 90707 71980 45568 87375 106809 62504 40709
303 40709 101271 111911 45823 51070 48286 36761 42401 45552 65215 47982 52300 118814 110144
290 110144 82842 61519 89987 113608 81409 29478 116295 78138 97908 146075 91469 107442
$$ packed form
378F6000L5941R080n1041P127j750J7126j849J7230k9233K2416M1531p7277p267
365D8034K2730j8186J1021k748k2763K8455L0306m2703k4312L1988m1023L6023
353E6822O2852O965l5866j3841K0044r612L5772l3185r52J7453R601j5103o2025
340C8925K3693j7973Q156M0061l7967l426N3135n7002k3163J3156L2829k8463
328D1961K244L6020p2532j6972K9099P7523J941M951m508n6450K8153J8096J5507
315A05033M018k2056m4596K2681L7250j1623j8727k6412M1807J9434m4305k1795
303D0709O0562J0640o6088N247k784j1525N640L151J9663j7233M318O6514q670
290A10144k7302k1323K8468K3621l2199n1931Q6817l8157J9770M8167n4606J5973
$$ plain form
278 107442 79864 73689 74095 50378 47461 111461 76049 101884 117237 122908 83544 91842 121288
265 121288 125247 115274 105297 111189 79387 112550 113548 76084 47882 59577 80235 66151 69984
252 69984 93444 137268 103022 135601 77935 72723 69820 50532 34998 62870 75964 74756 100816
239 100816 90595 59785 15450 20073 42789 101646 101032 76455 38351 107296 65824 58240 59942
226 59942 27093 52192 79915 83712 69534 17412 51404 58330 105005 86782 69001 107649
214 107649 94830 32818 6916 88363 58168 36546 98238 102504 49749 -3290 15019 72482
202 72482 97989 96924 42007 76173 74665 86865 113515 82017 126758 111383 93284 84009 95795
189 95795 89717 112949 72478 54584 53652 67759 118941 132422 101150 22804 15419 71541 59243
$$ packed form
278A07442k7578o175M06k3717k917O4000l5412K5835J5353N671l9364Q298K9446
265A21288L959r973r977N892l1802L3163R98l7464k8202J1695K0658j4084L833
252F9984K3460M3824l4246L2579n7666n212k903j9288j5534K7872J3094j208K6060
239A00816j0221l0810m4335M623K2716N8857o14k4577l8104O8945m1472p584J702
226E9942l2849K5099K7723L797j4178n2122L3992O926M6675j8223j7781L8648
214A07649j2819o2012k5902Q1447l0195k1622O1692M266n2755n3039J8309N7463
202G2482K5507j065n4917L4166j508J2200K6650l1498M4741j5375j8099r275J1786
189I5795o078K3232m0471j7894r32J4107N1182J3481l1272p8346p385N6122j2298
$$ plain form
176 59243 46608 87235 103995 56439 65249 117709 94142 88615 80887 73837 77073 109059 72615
163 72615 126087 108644 83971 117149 92096 103315 69173 31513 52101 96875 85720 58069
151 58069 61824 48126 64535 68851 103971 90488 125619 115403 58560 46391 76946 69398 68933
138 68933 79221 108649 125265 138911 121111 86374 77076 80793 75398 33052 34806 44517 80670
125 80670 100741 99493 127476 122004 70553 61359 90841 78634 41330 103723 121394 104265 135040
112 135040 122230 93708 75671 75352 60979 55221 114588 116465 135439 72961 57929 56576 65803
99 65803 58813 46401 56053 94362 125817 93386 82988 31356 26185 81434 97498 88540 61429
86 61429 84166 78780 71410 105392 93042 68213 67578 65642 67472 50481 45207 80716 90713 86028
$$ packed form
176E9243j2635M0627J6760m7556Q810N2460k3567n527p728p050L236L1986l6444
163G2615N3472j7443k4673L3178k5053J1219l4142l7660K0588M4774j1155k7651
151E8069L755j3698J6409M316L5120j3483L5131j0216n6843j2169L0555p548m65
138F8933J0288K9428J6616J3646j7800l4737r298L717n395m2346J754R711L6153
125H0670K0071j248K7983n472n1451r194K9482j2207l7304O2393J7671j7129L0775
112A35040j2810k8522j8037l19j4373n758N9367J877J8974o2478j5032j353R227
99F5803o990j2412R652L8309L1455l2431j0398n1632n171N5249J6064q958k7111
86F1429K2737n386p370L3982j2350k4829o35j936J830j6991n274L5509R997m685
$$ plain form
72 86028 93605 110359 101082 136393 115185 119770 140999 128890 85345 49150 73364 91244 97804
59 97804 134081 120932 83855 43625 58530 72778 110122 100748 101263 114314 103125 86099 86707
46 86707 86436 60084 48734 44377 63987 73817 98646 95184 67149 32419 65743 92083 94404
33 94404 21777 24227 51958 81372 87644 89044 58129 26127 49701 94177 91966 80783 77906
20 77906 55000 110217 93800 105509 96162 103326 69351 76930 81120 99574 91133 92260 121612
7 121612 142966 105690 99351 80373 61412 90808 109376
0 109376
$$ packed form
72H6028P577J6754r277L5311k1208M585K1229j2109m3545l6195K4214J7880O560
59I7804L6277j3149l7077m0230J4905J4248L7344r374N15J3051j1189j7026O08
46H6707k71k6352j1350m357J9610R830K4829l462k8035l4730L3324K6340K321
33I4404p2627K450K7731K9414O272J400l0915l2002K3574M4476k211j1183k877
20G7906k2906N5217j6417J1709r347P164l3975P579M190J8454q441J127K9352
7A21612K1354l7276o339j8978j8961K9396J8568
0A09376
$$ Imaginary data points
##PAGE= N=2
##DATA TABLE= (X++(I..I)), XYDATA
$$ plain form
16383 -1960788 -1925124 -1876036 -1858620 -1857938 -1803914 -1807415 -1773748 -1739456 -1685843 -1642802 -1621689 -1593805
16371 -1593805 -1568731 -1533700 -1505366 -1505291 -1501622 -1469965 -1420509 -1407368 -1384084 -1390039 -1359218 -1296729
16359 -1296729 -1243220 -1202974 -1208064 -1169418 -1158608 -1106603 -1073940 -1058503 -1014088 -1002398 -1031881
16348 -1031881 -980413 -937346 -861090 -869049 -850734 -874577 -850814 -782956 -715543 -718025 -695703 -660010
16336 -660010 -659728 -634150 -596695 -568945 -555320 -560124 -538598 -474396 -483142 -458142 -428446 -385872
16324 -385872 -388984 -367138 -297529 -263836 -253990 -227057 -208273 -186582 -178832 -159935 -128698 -77127
16312 -77127 -64126 -80394 -69376 -22600 34230 51635 78949 100829 94462 78116 93559 110899
16300 110899 176687 222907 215761 249056 277694 273554 311330 356302 362261 375507 407292 439458
$$ packed form
16383a960788L5664M9088J7416O82N4024l501L3667L4292N3613M3041K1113K7884
16371a593805K5074L5031K8334P5L669L1657M9456J3141K3284n955L0821O2489
16359a296729N3509M0246n090L8646J0810N2005L2663J5437M4415J1690k9483
16348a031881N1468M3067P6256p959J8315k3843K3763O7858O7413k482K2322L5693
16336f60010K82K5578L7455K7750J3625m804K1526O4202q746K5000K9696M2574
16324c85872l112K1846O9609L3693R846K6933J8784K1691P750J8897L1237N1571
16312g7127J3001j6268J1018M6776N6830J7405K7314K1880o367j6346J5443J7340
16300A10899O5788M6220p146L3295K8638m140L7776M4972N959J3246L1785L2166
$$ plain form
16288 439458 443077 463800 487176 529526 566029 601193 625637 608430 606943 626640 615516 676071
16276 676071 714939 689695 722752 772198 784702 798711 808884 812952 831711 815975 863363 878431
16264 878431 920268 934017 953384 940440 990847 1011519 1053494 1058621 1026858 1077863 1083564 1053567
16252 1053567 1051479 1101065 1081734 1140674 1222985 1238390 1209767 1219470 1261865 1255254 1283212 1301788
16240 1301788 1261084 1276457 1334111 1343359 1314665 1348230 1411651 1447886 1451807 1457237 1485436 1459247
16228 1459247 1469247 1481324 1460813 1501876 1550157 1562809 1542316 1551582 1528071 1546119 1595030
16217 1595030 1639937 1644413 1655424 1646420 1668819 1637574 1622627 1662155 1668047 1723900 1719213 1760253
16205 1760253 1794063 1721509 1726404 1747445 1733543 1801372 1819295 1846277 1877444 1849937 1852955 1831371
$$ packed form
16288D39458L619K0723K3376M2350L6503L5164K4444j7207j487J9697j1124O0555
16276F76071L8868k5244L3057M9446J2504J4009J0173M068J8759j5736M7388J5068
16264H78431M1837J3749J9367j2944N0407K0672M1975N127l1763N1005N701k9997
16252A053567k088M9586j9331N8940Q2311J5405k8623R703M2395o611K7958J8576
16240A301788m0704J5373N7654R248k8694L3565O3421L6235L921N430K8199k6189
16228A459247J0000J2077k0511M1063M8281J2652k0493R266k3511J8048M8911
16217A595030M4907M476J1011r004K2399l1245j4947L9528N892N5853m687M1040
16205A760253L3810p2554M895K1041j3902O7829J7923K6982L1167k7507L018k1584
$$ plain form
16193 1831371 1816893 1869299 1883434 1883844 1930385 1913730 1898661 1864327 1896662 1904711 1944393 1986882
16181 1986882 1962677 1970354 1998791 2008570 1973207 1959649 1967614 2013390 2034406 2033297 2066146 2062668
16169 2062668 2020792 2027353 2047608 2070221 2094017 2062996 2065128 2124594 2110275 2077868 2087030 2143608
16157 2143608 2184416 2164897 2181259 2160804 2228386 2195003 2138038 2173879 2187966 2195483 2190250 2168769
16145 2168769 2166269 2199091 2245340 2227544 2241019 2217481 2177702 2172151 2220750 2252649 2181719 2185309
16133 2185309 2227680 2240984 2233576 2267130 2230366 2250405 2209521 2200635 2220031 2252448 2237913 2246814
16121 2246814 2267114 2262546 2265048 2336176 2298057 2293227 2288275 2295630 2273255 2285897 2308918 2312466
16109 2312466 2308618 2280226 2296463 2262736 2271340 2247374 2312571 2320331 2329890 2400577 2375924 2310374
$$ packed form
16193A831371j4478N2406J4135M10M6541j6655j5069l4334L2335Q049L9682M2489
16181A986882k4205P677K8437R779l5363j3558P965M5776K1016j109L2849l478
16169B062668m1876O561K0255K2613K3796l1021K132N9466j4319l2407R162N6578
16157B143608M0808j9519J6362k0455O7582l3383n6965L5841J4087P517n233k1481
16145B168769k500L2822M6249j7796J3475k3538l9779n551M8599L1899p0930L590
16133B185309M2371J3304p408L3554l6764K0039m0884q886J9396L2417j4535Q901
16121B246814K0300m568K502P1128l8119m830m952P355k2375J2642K3021L548
16109B312466l848k8392J6237l3727Q604k3966O5197P760R559P0687k4653o5550
$$ plain form
16097 2310374 2321058 2350707 2370194 2346082 2343121 2351511 2340786 2321596 2279300 2310488 2341993 2324625
16085 2324625 2354585 2359133 2344238 2330961 2341341 2292925 2285672 2317285 2333095 2320232 2314115 2331770
16073 2331770 2377713 2358102 2382785 2409434 2368237 2335301 2388628 2407043 2384144 2412509 2357994
16062 2357994 2356817 2404685 2424232 2375117 2396812 2361320 2406734 2465476 2476946 2430710 2407360
16051 2407360 2373937 2374957 2412014 2367982 2348745 2381657 2381532 2427440 2395723 2393489 2388339 2420066
16039 2420066 2460670 2381964 2411560 2373112 2374641 2361258 2381104 2367843 2394390 2407644 2384448
16028 2384448 2373530 2429294 2414874 2381191 2384725 2361889 2406971 2422911 2472361 2465848 2357574
16017 2357574 2337267 2386441 2450944 2467241 2458156 2441034 2419486 2431933 2395308 2390592 2413074 2426783
$$ packed form
16097B310374J0684K9649J9487k4112k961Q390j0725j9190m2296L1188L1505j7368
16085B324625K9960M548j4895j3277J0380m8416p253L1613J5810j2863o117J7655
16073B331770M5943j9611K4683K6649m1197l2936N3327J8415k2899K8365n4515
16062B357994j177M7868J9547m9115K1695l5492M5414N8742J1470m6236k3350
16051B407360l3423J020L7057m4032j9237L2912j25M5908l1717k234n150L1727
16039B420066M0604p8706K9596l8448J529j3383J9846j3261K6547J3254k3196
16028B384448j0918N5764j4420l3683L534k2836M5082J5940M9450o513j08274
16017B357574k0307M9174O4503J6297r085j7122k1548J2447l6625m716K2482J3709
$$ plain form
16005 2426783 2439805 2404625 2414803 2394327 2402635 2435377 2401454 2374394 2403083 2448834 2414374
15994 2414374 2411997 2368145 2346733 2386932 2466207 2446308 2406788 2402578 2452061 2458612 2431585 2421400
15982 2421400 2398096 2389974 2354968 2408648 2418675 2417936 2447472 2452421 2459834 2433068 2386184 2380722
15970 2380722 2335603 2375618 2436661 2482898 2461125 2437422 2450268 2477438 2472185 2467644 2463464 2455560
15958 2455560 2429439 2429764 2462797 2426107 2393140 2356768 2432315 2444410 2408134 2384138 2369707 2396486
15946 2396486 2447461 2450138 2437239 2383886 2384853 2399163 2409994 2380674 2387724 2398307 2364831 2409325
15934 2409325 2393364 2416339 2415898 2418849 2393264 2371123 2378198 2404115 2436647 2464281 2472758 2434369
15922 2434369 2451137 2421753 2403059 2412389 2408741 2408862 2393358 2440475 2400230 2391929 2401327 2425652
$$ packed form
16005B426783J3022l5180J0178k0476Q308L2742l3923k7060K8689M5751l4460
15994B414374k377m3852k1412M0199P9275j9899l9520m210M9483O551k7027j0185
15982B421400k3304q122l5006N3680J0027p39K9536M949P413k6766m6884n462
15970B380722m5119M0015O1043M6237k1773k3703J2846K7170n253m541m180p904
15958B455560k6121L25L3033l6690l2967l6372P5547J2095l6276k3996j4431K6779
15946B396486N0975K677j2899n3353R67J4310J0831k9320P050J0583l3476M4494
15934B409325j5961K2975m41K951k5585k2141P075K5917L2532K7634Q477l8389
15922B434369J6768k9384j8694R330l648J21j5504M7117m0245q301R398K4325
$$ plain form
15910 2425652 2413153 2411506 2493796 2484156 2435175 2469254 2480010 2479300 2459671 2420634 2411544 2432494
15898 2432494 2431719 2371565 2367055 2417171 2427952 2421126 2425636 2423746 2418567 2402037 2401086 2432561 2393194
15885 2393194 2400246 2417252 2390870 2433682 2454525 2452804 2411356 2412586 2405331 2428703 2393440 2427630
15873 2427630 2439174 2421432 2419483 2458776 2444643 2422084 2447085 2426948 2449513 2467488 2460086 2479543
15861 2479543 2498920 2475289 2442828 2438274 2400084 2375295 2429707 2441631 2462417 2513508 2559595
15850 2559595 2486996 2447112 2437323 2417012 2420038 2432740 2436303 2436567 2461733 2461373 2461760 2450784 2464122
15837 2464122 2446059 2483869 2491934 2503550 2499077 2475005 2481320 2502495 2470348 2438994 2428401 2450478
$$ packed form
15910B425652j2499j647Q2290r640m8981L4079J0756p10j9629l9037r090K0950
15898B432494p75o0154m510N0116J0781o826M510j890n179j6530r51L1475l9367
15885B393194P052J7006k6382M2812K0843j721m1448J230p255K3372l5263L4190
15873B427630J1544j7742j949L9293j4133k2559K5001k0137K2565J7975p402J9457
15861B479543J9377k3631l2461m554l8190k4789N4412J1924K0786N1091M6087
15850B559595p2599l9884r789k0311L026J2702L563K64K5166l60L87j0976J3338
15837B464122j8063L7810Q065J1616m473k4072O315K1175l2147l1354j0593K2077
$$ [...]
##END NTUPLES=NMR SPECTRUM
##END=
