##TITLE=1H_CA-9169-1
 CDCl3
 8 sc, 
 5.7.2023
##JCAMPDX= 6.0         $$ Bruker NMR JCAMP-DX V2.0
##DATA TYPE= NMR SPECTRUM
##DATA CLASS= NTUPLES
##ORIGIN= UXNMR, Bruker Analytische Messtechnik GmbH
##OWNER= root
$$ XWIN-NMR		Version 3.5
$$ Wed Jul  5 14:08:56 2023 Russian Standard Time (UT+4h)  she@DPX200
##.OBSERVE FREQUENCY= 200.13135
##.OBSERVE NUCLEUS= ^1H
##.ACQUISITION MODE= SIMULTANEOUS
##.ACQUISITION SCHEME= undefined
##.AVERAGES= 8
##.DIGITISER RES= 18
##SPECTROMETER/DATA SYSTEM= spect
##.PULSE SEQUENCE= zg30
##.SOLVENT NAME= CDCl3
##.SHIFT REFERENCE= (INTERNAL, CDCl3, 0, 15.7205)
##AUDIT TRAIL= $$ (NUMBER, WHEN, WHO, WHERE, WHAT)
$$ ##TITLE= Audit trail, XWIN-NMR		Version 3.5
$$ ##JCAMPDX= 5.01
$$ ##ORIGIN= Bruker BioSpin GmbH
$$ ##OWNER= she
$$ F:/spectra/data/she/nmr/H-F/1/pdata/1/auditp.txt
$$ ##AUDIT TRAIL=  $$ (NUMBER, WHEN, WHO, WHERE, WHAT)
(   1,<2023-07-05 14:07:47.03 +0400>,<she>,<DPX200>,
      <created by zg, POWCHK disabled, PULCHK disabled
       configuration hash MD5:
       00 E9 B6 7A A2 85 ED C7 34 08 36 98 17 FE 4E 26
       data hash MD5: 16K
       CB DF E9 98 E9 02 37 5B 74 C3 AF BC 51 25 7A B6>)
(   2,<2023-07-05 14:07:49.54 +0400>,<she>,<DPX200>,
      <Start of raw data processing
       efp BC_mod = 2 LB = 0.24 FT_mod = 6 PKNL = 1 PHC0 = -20628.46 PHC1 = 9.85272 SI = 16K 
       data hash MD5: 16K
       36 B3 0B 0A 2C EE D5 7D BF 8C DD A1 73 9B B8 D4>)
(   3,<2023-07-05 14:08:11.96 +0400>,<she>,<DPX200>,
      <pk PHC0 = 1.463439 PHC1 = -0.6 
       data hash MD5: 16K
       DA C4 12 0B 48 FA 4C F1 E5 AD 21 66 4F 59 E0 43>)
(   4,<2023-07-05 14:08:15.21 +0400>,<she>,<DPX200>,
      <abs ABSG = 5 
       data hash MD5: 16K
       4A E8 E9 D6 EF 0B 26 8D FF 80 82 B9 47 69 0E F5>)
$$ ##END=
$$ 
$$ hash MD5
$$ BE 95 8C 2B 23 98 FD 1B 9B FF 11 09 DF 2D BC 65
##$RELAX= 
##$RELAX= 
##$RELAX= 
##$RELAX= 
##$RELAX= 
##$RELAX= 
$$ Bruker specific parameters
$$ --------------------------
##$DU= <F:/spectra>
##$EXPNO= 1
##$NAME= <H-F>
##$PROCNO= 1
##$TYPE= <nmr>
##$USER= <she>
##$AMP= (0..31)
100 100 100 100 100 100 100 100 100 100 100 100 100 100 100 100 100 100 
100 100 100 100 100 100 100 100 100 100 100 100 100 100 
##$AQSEQ= 0
##$AQ_mod= 1
##$AUNM= <au_zg>
##$AUTOPOS= <>
##$BF1= 200.13
##$BF2= 200.13
##$BF3= 200.13
##$BF4= 200.13
##$BF5= 200.13
##$BF6= 200.13
##$BF7= 200.13
##$BF8= 200.13
##$BYTORDA= 1
##$CFDGTYP= 0
##$CFRGTYP= 5
##$CHEMSTR= <none>
##$CNST= (0..31)
1 1 145 1 1 1 1 1 1 1 1 1 1 1 1 1 1 1 1 1 1 1 1 1 1 1 1 1 1 1 1 1 
##$CPDPRG= <>
##$CPDPRG1= <>
##$CPDPRG2= <>
##$CPDPRG3= <>
##$CPDPRG4= <mlev>
##$CPDPRG5= <mlev>
##$CPDPRG6= <mlev>
##$CPDPRG7= <mlev>
##$CPDPRG8= <mlev>
##$CPDPRGB= <>
##$CPDPRGT= <>
##$D= (0..31)
0 1.2 0 0 0 0 0 0 0 0.06 0 0.03 0 0 0 0 0.0002 0 0 0 0 0 0 0 0 0 0 0 0 
0 0 0 
##$DATE= 1688551666
##$DBL= (0..7)
120 120 120 120 120 120 120 120 
##$DBP= (0..7)
150 150 150 150 150 150 150 150 
##$DBP07= 0
##$DBPNAM0= <>
##$DBPNAM1= <>
##$DBPNAM2= <>
##$DBPNAM3= <>
##$DBPNAM4= <>
$$ [...]
##$SUBNAM3= <"">
##$SUBNAM4= <"">
##$SUBNAM5= <"">
##$SUBNAM6= <"">
##$SUBNAM7= <"">
##$SUBNAM8= <"">
##$SUBNAM9= <"">
##$SW= 18.05172834244
##$SWIBOX= (0..15)
0 0 2 0 0 0 0 0 0 0 0 0 0 0 0 0 
##$SW_h= 3612.71676300578
##$TD= 16384
##$TD0= 1
##$TE= 0
##$TE2= 300
##$TE3= 300
##$TEG= 300
##$TL= (0..7)
0 120 120 120 120 120 120 120 
##$TP= (0..7)
150 150 150 150 150 150 150 150 
##$TP07= 0
##$TPNAME0= <>
##$TPNAME1= <>
##$TPNAME2= <>
##$TPNAME3= <>
##$TPNAME4= <>
##$TPNAME5= <>
##$TPNAME6= <>
##$TPNAME7= <>
##$TPOAL= (0..7)
0.5 0.5 0.5 0.5 0.5 0.5 0.5 0.5 
##$TPOFFS= (0..7)
0 0 0 0 0 0 0 0 
##$TUNHIN= 0
##$TUNHOUT= 0
##$TUNXOUT= 0
##$USERA1= <user>
##$USERA2= <user>
##$USERA3= <user>
##$USERA4= <user>
##$USERA5= <user>
##$V9= 5
##$VALIST= <valist>
##$VCLIST= <CCCCCCCCCCCCCCC>
##$VD= 0
##$VDLIST= <DDDDDDDDDDDDDDD>
##$VPLIST= <PPPPPPPPPPPPPPP>
##$VTLIST= <TTTTTTTTTTTTTTT>
##$WBST= 1024
##$WBSW= 4
##$XGAIN= (0..3)
0 0 0 0 
##$XL= 0
##$YL= 0
##$YMAX_a= 716813
##$YMIN_a= -927974
##$ZGOPTNS= <>
##$ZL1= 120
##$ZL2= 120
##$ZL3= 120
##$ZL4= 120
##$ABSF1= 15.73808
##$ABSF2= -2.313769
##$ABSG= 5
##$ABSL= 3
##$ALPHA= 0
##$AQORDER= 0
##$ASSFAC= 0
##$ASSFACI= 0
##$ASSFACX= 0
##$ASSWID= 0
##$AUNMP= <proc_1d>
##$AZFE= 0.1
##$AZFW= 0.1
##$BCFW= 0
##$BC_mod= 2
##$BYTORDP= 0
##$COROFFS= 0
##$CY= -3
##$DATMOD= 1
##$DC= 0
##$DFILT= <>
##$DTYPP= 0
##$F1P= 0
##$F2P= 0
##$FCOR= 1
##$FTSIZE= 16384
##$FT_mod= 6
##$GAMMA= 0
##$GB= 0
##$INTBC= 1
##$INTSCL= 3.70164e-10
##$ISEN= 128
##$LB= 0.24
##$LEV0= 0
##$LPBIN= 0
##$MAXI= 10000
##$MC2= 0
##$MEAN= 0
##$ME_mod= 0
##$MI= 1.114404
##$NCOEF= 0
##$NC_proc= -5
##$NLEV= 6
##$NOISF1= 3.799351
##$NOISF2= 2.8
##$NSP= 0
##$NTH_PI= 0
##$NZP= 0
##$OFFSET= 15.72045
##$PC= 1
##$PHC0= -20627
##$PHC1= 9.25272
##$PH_mod= 1
##$PKNL= yes
##$PPARMOD= 0
##$PSCAL= 0
##$PSIGN= 0
##$REVERSE= no
##$SF= 200.130010226145
##$SI= 16384
##$SIGF1= 3
##$SIGF2= 2
##$SINO= 5.538805
##$SIOLD= 16384
##$SREGLST= <1H.CDCl3>
##$SSB= 0
##$STSI= 16384
##$STSR= 0
##$SW_p= 3612.71676300578
##$SYMM= 0
##$S_DEV= 0
##$TDeff= 16384
##$TDoff= 0
##$TI= <>
##$TILT= no
##$TM1= 0
##$TM2= 0
##$TOPLEV= 0
##$USERP1= <user>
##$USERP2= <user>
##$USERP3= <user>
##$USERP4= <user>
##$USERP5= <user>
##$WDW= 1
##$XDIM= 16384
##$YMAX_p= 273980170
##$YMIN_p= -157392
$$ End of Bruker specific parameters
$$ ---------------------------------
##NTUPLES= NMR SPECTRUM
##VAR_NAME=  FREQUENCY,     SPECTRUM/REAL,   SPECTRUM/IMAG
##SYMBOL=    X,             R,               I
##VAR_TYPE=  INDEPENDENT,   DEPENDENT,       DEPENDENT
##VAR_FORM=  AFFN,          ASDF,            ASDF
##VAR_DIM=   16384,         16384,           16384
##UNITS=     HZ,            ARBITRARY UNITS, ARBITRARY UNITS
##FACTOR=    0.220516191357247, 1,           1
##FIRST=     3146.13389957301, 0,            0
##LAST=      -466.582863432775, 0,           0
##MIN=       -466.582863432775, -157392,     0
##MAX=       3146.13389957301, 273980170,    0
$$ Real data points
##PAGE= N=1
##DATA TABLE= (X++(R..R)), XYDATA
$$ [...]
8009 89413 69897 28057 -15999 5075 71056 38458 -24992 -43741 -15453 -21986 -42202 -656
7997 -656 64173 61796 2457 54336 33820 -466 32015 104907 129828 98399 57750 18602
7985 18602 5589 17178 17806 30308 7637 -18041 10219 35776 33893 10351 30128 58203
7973 58203 44812 1722 -12562 9179 25731 23010 -8095 2300 -28052 -47377 -38546 -57113
7961 -57113 7015 5006 5881 -38959 -28636 9819 20043 9971 -8839 9555 44002 17518
7949 17518 66497 31293 -12889 -50522 -2549 57026 32002 -2052 -47013 -1821 -216 -45687
7937 -45687 -11543 -43740 -71329 -83357 -39652 7779 -19953 -50990 -28539 -35955 29249 7602
7925 7602 -25764 18218 33788 37094 -9704 3864 -10138 -64892 -33720 -36236 -77363 -62001
7913 -62001 -95587 -85510 -96567 -73964 -31320 -94959 -52449 -37585 -49897 -71081 -48434 -21670
7901 -21670 -36624 -25838 -29518 -64160 -34157 -22008 -42184 -38208 -12949 54938 41784 8230
7889 8230 -4222 5978 -11053 15983 11804 4035 -3994 39365 -14299 -36793 -42473 -53708 -41005
7876 -41005 -10695 -8523 -34804 -42638 -35106 -40683 -20203 -62555 5150 -14418 -7026 21838 23266
7863 23266 48722 12618 -40048 -28650 12887 10919 -8640 -10296 5964 -2493 -338 -6182 -37560
7850 -37560 -11081 24465 27941 6227 18999 -20562 -6069 38714 25336 -8541 -19662 28944
7838 28944 82251 49313 -1430 38583 39469 5258 -31478 4193 14500 29811 32629 24884 17645
7825 17645 13668 21939 2579 -21322 16626 13844 52167 94400 18223 -8216 -19385 -8174
7813 -8174 -46727 -44577 -130430 -108680 -45577 -43557 18719 41403 17854 -54481 -24636 -4253
7801 -4253 23652 -32191 17955 35186 -37276 -36359 22063 68638 57194 8606 20117 11633 14333
7788 14333 11070 26711 26650 5210 25864 11002 24410 12436 1964 39693 -24649 1665 55897
7775 55897 6372 -14609 19924 5333 -42365 -36936 -5873 -16021 35912 36770 2955 10405 -5126
7762 -5126 28854 69641 46193 25255 35348 72086 51443 51660 55637 78909 85938 45725 77167
7749 77167 72906 44423 48751 50390 57232 61976 63227 86350 88990 56907 47040 8878 35653
7736 35653 24217 -10141 3982 23577 35722 50524 47724 75754 58539 3237 -16299 -40331
7724 -40331 30781 54548 38153 32125 8845 -14303 6065 19759 -22177 -12139 39643 -18396
7712 -18396 -7220 7540 -13675 19156 -21190 11901 19143 -4121 -33855 -45338 -36206 -30657
7700 -30657 -17108 -11251 -21922 21682 84250 42164 19736 19176 14771 -36110 6146 2618 31628
7687 31628 -43238 12379 40257 -24815 3070 58869 68410 36571 36377 16521 -20312 12275
7675 12275 33779 53636 23461 -5527 -10914 -21918 -32323 -20750 18244 73528 70960 53034
7663 53034 48162 49844 86909 38764 49397 65925 -6516 -24803 40859 110364 94658 64628
7651 64628 46180 98086 87159 79147 79070 73622 59707 41621 52429 43889 108946 81831 39015
7638 39015 53407 68961 43271 76526 83610 24354 110410 101252 92902 103812 77632 83781 64029
7625 64029 72792 837 32794 95501 125710 104684 133229 138779 117578 113933 105731 159359 140389
7612 140389 118096 86591 43387 54372 44419 49236 88238 110434 83033 72616 61457 95790
7600 95790 145002 111414 102438 101012 38993 78695 108352 125664 139951 135429 116156 123208 102174
7587 102174 156695 156636 159602 184910 133205 144530 194896 202419 166924 148748 111110 113478 104631
7574 104631 118912 127713 107229 99541 115074 168253 171166 130288 111756 107444 135027 179764
7562 179764 142272 125185 60169 101903 110124 100576 104865 98171 99730 122092 100417 82634 102281
7549 102281 119491 86141 79021 134430 163532 171733 138254 98929 105424 130737 84285 79088
7537 79088 116425 145269 128708 93796 63780 41751 73789 89419 86428 74604 49154 97052
7525 97052 98738 61478 92572 99842 84052 128263 111760 98290 115024 78171 80292 134547
7513 134547 154481 127863 99789 131421 122472 139864 149573 126439 98405 89814 81602 132612
7501 132612 172983 106330 109924 204107 188070 152363 87256 71237 80156 140748 148833 156909
7489 156909 136211 170262 148359 179339 157352 169082 118911 114056 158715 163730 153538 132824
7477 132824 137264 92740 71628 111063 162599 140056 160995 159682 163273 119727 114751 149215
7465 149215 184508 169137 142801 157927 174359 169674 215034 172584 118101 179347 243117 240047
7453 240047 194071 184462 228825 186883 168701 226835 235553 208796 179273 184522 230036 227637
7441 227637 230077 205626 255260 227685 174458 206760 196832 192509 191640 177509 193353 220111 248277
7428 248277 224861 184840 168721 169367 188112 179324 224518 270096 226121 189685 184847 184383 152863
7415 152863 163330 186489 187747 156280 149693 176696 134234 148642 174194 181514 140211 124228
7403 124228 161904 109876 133035 182856 145259 162709 156990 118279 134967 150840 113738 116816
7391 116816 84674 113080 154488 122303 148081 131914 133510 134582 134946 147269 126965 139557
7379 139557 163059 158609 173376 178550 167746 150415 238140 198581 154542 191706 198779 226294
7367 226294 236779 238164 256507 239504 194319 123902 152496 193185 206981 221198 257386 255288
7355 255288 228805 206491 223675 227582 234711 275435 249412 223602 223812 232954 214145 192080 159747
7342 159747 150993 183210 172620 134125 72302 129501 184302 143819 127934 138121 109209 129609
7330 129609 154950 143828 152379 176553 157768 110157 116122 135449 85031 93652 152057 111070
7318 111070 126267 160568 163698 145311 182146 189989 159361 124817 140032 155798 131684 91290
7306 91290 139055 119878 124989 110262 139988 143113 122305 125606 145072 82496 47538 104691
7294 104691 74566 90054 119879 121381 117965 93793 122499 135280 159918 117722 114755 99179
7282 99179 105496 114941 55267 48551 89782 96911 120053 155202 165819 158676 151285 87073 103772
7269 103772 123129 94771 99700 97493 80286 114679 156406 119842 118445 70803 70531 78643 75065
7256 75065 142522 155558 139208 103424 106348 86493 137166 176716 145920 153837 149602 144100 97468
7243 97468 80043 121477 119143 108877 153060 123023 148192 158268 173112 175738 159328 149678
7231 149678 150023 155933 175762 127590 155995 109622 134259 163980 202644 187547 160173 134860
7219 134860 111511 117811 146876 221474 191712 184934 170007 175989 130845 114174 151729 193028
7207 193028 182057 187844 162666 158831 175553 155533 211205 201369 165891 121382 135642 197160
7195 197160 171708 192066 150657 126729 144712 213320 216122 166610 281944 299517 282337 280281
7183 280281 279588 297181 280872 274769 260022 251329 339138 336706 285078 352362 432123 406357 391796
7170 391796 381366 412746 410699 387392 393627 398829 349028 329034 329063 361768 309767 257041 283807
7157 283807 239808 175738 180166 198362 261239 232183 214070 218661 165116 209071 241123 274822
7145 274822 259372 225919 248981 264444 253949 263098 237566 245239 269248 297991 300645 244864
7133 244864 231536 240329 248032 279731 276932 298892 313090 342193 330001 314649 361912 406018
7121 406018 409431 399015 371752 371971 341315 373483 391412 435660 410249 343175 382119 334498
7109 334498 331877 285595 286311 272697 266006 255118 255688 261579 219212 245893 200883 215597 195281
7096 195281 234749 232406 208229 202815 229620 177200 181917 202219 197713 191843 205256 227807 194927
7083 194927 207993 243596 196216 240997 281959 215364 212236 184307 150153 192935 230595 188327
7071 188327 145917 128739 163152 196605 172899 195438 242705 220736 243405 215578 200519 190102
7059 190102 230588 230763 195780 166719 130013 155207 216143 185189 157937 209341 190162 169427
7047 169427 187368 219327 215655 177714 169131 207086 216497 164177 123835 141352 144321 175315
7035 175315 218149 229466 183355 228572 264655 217467 218738 193865 195548 231851 227874 227323 200118
7022 200118 216918 221297 214660 218825 226766 224096 240158 220695 187407 196401 203771 265625 241628
7009 241628 252244 271653 260398 268269 273100 267141 253999 183926 187677 226159 232553 233497 249894
6996 249894 261132 222168 183175 196369 215449 268834 206817 222142 249689 221080 260000 263741
6984 263741 253509 256429 287084 252450 228276 195646 207064 204686 209041 238207 234897 219837
6972 219837 168242 234920 213681 234384 255915 244246 266015 270626 262903 219291 186507 216214
6960 216214 253375 295298 270868 211538 232827 292783 281081 261384 271317 244131 243620 270673
6948 270673 266517 234061 212749 246223 288169 289335 240187 210360 263628 274422 240049 309151
6936 309151 327157 298976 250448 237219 200147 209624 259804 260690 269884 256075 249170 283763 280296
6923 280296 269757 200373 204594 214889 235507 197145 186171 232177 234663 292143 277405 269811
6911 269811 189502 207876 257326 338302 272863 242289 279837 267389 189065 250466 375185
6900 375185 399789 343760 352835 341780 335982 279555 314770 287783 295749 306846 301548 277500
6888 277500 274852 256351 259062 253285 282065 277580 249989 252112 265693 279239 239784 276177 311546
6875 311546 326442 252932 246218 255458 232382 242535 288157 295376 247240 229131 269912 247617
6863 247617 284092 285127 227689 229665 262611 282554 234041 192665 214721 233135 249972 237233
6851 237233 198294 202998 274361 236544 215618 236428 251861 248552 209449 245583 289038 295660
6839 295660 252071 280794 275731 236577 264609 284994 270464 247269 275362 243261 189828 225385
6827 225385 211013 188679 190893 193071 193879 229964 251304 219825 221014 224945 237972 167883 241590
6814 241590 259705 267900 239422 205826 193415 227605 215825 216687 275451 296230 230451 210866
6802 210866 200576 176514 202027 241799 279286 294335 230672 209029 281901 217440 177329 237289
6790 237289 242834 279264 255878 226882 230935 267838 279913 292507 300677 261898 275626 263888
6778 263888 270667 259756 253821 209939 198875 212922 220781 212734 234800 295110 297315 323389 340405
6765 340405 356731 339629 302724 272206 244870 274060 291513 247753 250384 275262 277324 245289
6753 245289 281735 316099 287015 271679 254011 288299 279143 270804 252812 249810 249206 233469 220693
6740 220693 245756 228570 236532 244430 230115 181399 232694 246295 209357 223219 278242 264880
6728 264880 284289 264730 227251 273455 290290 253284 251736 257686 316063 310709 280028 256412
6716 256412 264230 245959 225493 250669 243537 232170 295028 288894 283688 263405 240701 254519
6704 254519 208426 239194 270569 265520 238116 205934 179909 213743 219257 221332 192859 166660
6692 166660 173675 167367 198088 237277 192899 229095 204382 213378 249787 245719 263782 254245 276964
6679 276964 295771 318565 299935 302498 308728 241774 220874 263132 305970 298744 265815 240635
6667 240635 241342 203783 224792 232845 241390 258687 313574 279854 282623 243413 195015 216037 259611
6654 259611 276486 249662 249459 241707 207830 235679 227163 211827 223936 209920 215657 164300 190720
6641 190720 198114 221033 253602 261962 255200 271521 273453 241218 234098 227317 229956 239481 271529
6628 271529 217477 178577 196057 177382 213181 224372 253656 258837 210960 195102 203579 229329
6616 229329 215836 183390 209431 151618 204100 232156 221540 270964 212013 251103 297136 237651
6604 237651 225105 242173 286045 303665 313814 292395 244809 229709 231685 244033 275699 266496
6592 266496 263137 250758 237319 254102 279681 257272 232842 256085 234891 229882 224976 209316
6580 209316 268345 301340 297905 304614 280523 220806 214631 224294 228240 234302 244108 231568 234858
6567 234858 204722 221961 252539 214270 189056 175931 215180 238682 232709 219954 252786 250336
6555 250336 282527 289043 272560 240313 244755 241943 254553 226319 190748 208665 236967 223259
6543 223259 252874 290739 244309 211914 255953 237522 242315 214765 247441 234482 248940 268676
6531 268676 251172 298467 301056 297502 276434 291478 322510 308866 309941 316308 246908 240502 244608
6518 244608 236145 291683 305520 239512 289805 323031 286441 232727 231526 293583 233637 139619
6506 139619 185206 261434 257517 246869 249167 197441 171738 194031 263229 247685 250862 278520
6494 278520 260677 247856 283706 267622 247410 226617 212108 257353 254252 262903 319459 257361
6482 257361 253202 263946 296829 245680 233217 276963 294162 244548 238584 241693 197026 221662
6470 221662 207139 289513 338138 310732 253026 285719 317256 297985 306810 310579 264014 259530
6458 259530 257559 262048 229065 234063 263081 302686 279750 266593 276383 263600 171563 242040
6446 242040 349146 342871 322761 311158 294069 279408 254881 240594 276754 265408 257608 287919
6434 287919 253764 245340 260211 236646 290335 269672 281688 264460 262572 318469 326867 311124
6422 311124 265098 318947 320876 250732 225443 265014 296642 278242 293191 229460 225779 248402
6410 248402 263126 234210 293803 286225 251396 248385 303361 288833 324563 283044 265073 304576
6398 304576 318456 301578 333017 371891 321081 323034 333297 354872 342990 310063 264098 297483
6386 297483 336140 313663 359983 358671 321790 347915 324239 329324 324901 313189 322628 346512
6374 346512 307193 300084 299492 250086 222464 259161 273271 303161 311506 267783 249834 271628
6362 271628 291725 320602 307811 346665 290679 327263 316935 300877 295446 289462 319163 328020
6350 328020 336314 322866 257633 279939 322031 311457 310380 322570 355690 346820 365393 359314
6338 359314 282257 321382 380480 389401 356578 319082 328844 338558 365723 360376 322733 311410
6326 311410 304965 319988 331375 346055 340331 266691 287914 296481 345137 341365 340675 348632 275264
6313 275264 280767 304027 311037 337517 308199 282205 320405 332180 323738 308011 342488 309163
6301 309163 302079 308988 250500 268801 253269 267182 337912 335243 365507 370763 307293 324421
6289 324421 310005 327656 321570 354364 328901 331034 333153 348554 323252 304746 262320 306815
6277 306815 299445 267559 267669 283576 293101 281613 277771 259374 230750 239959 262334 308256 324075
6264 324075 289179 288113 319407 334245 286840 299460 330492 273517 277973 323751 343827 363294
6252 363294 307353 331381 324860 362485 345150 360182 341465 348743 325232 279663 254417 221194
6240 221194 236056 293643 294356 303256 327952 292659 284366 290620 286350 243939 268877 254670 274143
6227 274143 312626 360987 312416 325856 350530 352142 359206 356626 331354 280330 331306 337840
6215 337840 369499 350169 323246 372407 420996 409667 337176 303917 312389 310820 310335 317162 364699
6202 364699 328867 316950 286855 288302 334123 315258 343004 351050 331222 355480 328150 318262
6190 318262 348146 439551 402714 323990 347019 361866 384769 466974 436459 372112 385307 382500
6178 382500 418492 438139 382574 393962 385608 420358 468844 426104 415928 411833 462724 420082
6166 420082 440320 396072 341641 379324 407365 354527 350403 417261 372764 439205 531652 517130
6154 517130 525107 553034 618285 582218 558268 563541 617626 647899 684859 766721 822592 912879
6142 912879 931953 954071 923968 894937 863721 841697 754304 666160 625281 577018 555939 589191
6130 589191 572209 537046 490265 504451 452783 474811 462654 443683 459118 402004 404744 453792
6118 453792 475661 396107 408866 463685 485248 488554 414015 380453 417911 415969 468909 487733
6106 487733 470174 458460 485660 466002 469646 435883 439765 430677 394337 369520 394410 392159
6094 392159 433167 428893 415171 397618 416327 473992 431135 437373 425791 427175 401431 440680
6082 440680 456519 451058 447862 433561 475853 424867 363828 409961 382939 308817 372214 402356
6070 402356 454121 483580 481647 433078 400991 483253 503917 457497 463271 520816 524190 479298
6058 479298 464707 491234 523292 499615 497783 547918 538155 492813 515969 486887 513503 540551
6046 540551 525110 556592 546102 504407 465976 487369 503001 536886 566879 610611 588645 568887
6034 568887 612415 645429 587022 588728 574200 564066 558495 590701 595765 580098 631860 675006
6022 675006 624732 635576 669758 671927 690142 669565 663388 668059 646207 669149 745009 676777
6010 676777 686169 711322 686478 764334 799726 789272 727535 727201 750617 732136 769583 775384
5998 775384 757206 815277 825979 830921 850404 843905 810384 814938 843407 890256 921086 882764
5986 882764 847939 858301 928895 953879 983847 979487 1011710 1056678 1069022 1044195 1074328 1039256
5974 1039256 1033539 978514 1009270 1022654 1017311 1101049 1109121 1113376 1126095 1152429 1160248 1202114
5962 1202114 1234314 1310090 1391941 1386717 1391317 1340336 1314109 1297014 1258765 1264495 1207720 1215023
5950 1215023 1234494 1180812 1145155 1156943 1117530 1145742 1139760 1105430 1089720 1086673 1072892 1039339
5938 1039339 1092042 1113778 1092504 1064346 1062995 1065877 987379 991197 1034775 1098906 1088168 1094650
5926 1094650 1126024 1150181 1141158 1137848 1144012 1066405 1084708 1127749 1149637 1173367 1164835 1160767
5914 1160767 1167643 1154484 1173298 1188031 1184512 1199465 1181745 1139681 1157636 1138743 1189401 1266449
5902 1266449 1221359 1207379 1266765 1324934 1446716 1506787 1516669 1548744 1618482 1652078 1672202
5891 1672202 1684506 1604876 1543161 1466825 1448885 1416393 1353216 1305108 1317609 1307352 1287624
5880 1287624 1301171 1270569 1305341 1265982 1278482 1317123 1291495 1300153 1341869 1305617 1333786 1353655
5868 1353655 1354665 1342620 1387218 1404149 1363518 1395228 1372211 1397927 1423654 1421544 1381671 1405736
5856 1405736 1397197 1461500 1475159 1446208 1442844 1417109 1401056 1435423 1485455 1501429 1547100 1622235
5844 1622235 1621577 1677555 1604710 1587850 1608439 1643143 1723277 1783571 1822532 1831361 1898003 1925020
5832 1925020 1938068 1955504 2005878 2051471 2100404 2182029 2210000 2198068 2261782 2246295 2221592
5821 2221592 2291924 2304424 2299387 2331788 2351741 2349039 2313212 2345702 2373115 2353161 2404781 2447907
5809 2447907 2463530 2515196 2467674 2629425 2684092 2693831 2734882 2787580 2868523 2875589 2896588 2924833
5797 2924833 2939855 2983833 3004792 3031386 3068848 3130084 3126983 3195649 3190096 3198850 3223474 3242143
5785 3242143 3285331 3351949 3401075 3361051 3429839 3513192 3516740 3588793 3687702 3768342 3835856 3910965
5773 3910965 4036759 4116605 4227597 4359220 4547800 4659735 4716899 4791760 4946810 5064552
5763 5064552 5084772 5082906 5107885 5101304 5160828 5223172 5219861 5265420 5276906 5256068 5390136 5459104
5751 5459104 5494830 5621315 5805821 5876528 5975998 6127954 6308198 6526529 6734538 6982269
5741 6982269 7197052 7443368 7802714 8201082 8629714 9067183 9523215 10007716 10513388 10909502
5731 10909502 11313922 11621992 11721567 11734709 11570031 11364430 11173577 10986491 10810836 10683968
5721 10683968 10578603 10498966 10488878 10462212 10429684 10409771 10438331 10473809 10497018 10534568 10589357
5710 10589357 10712973 10838908 10966747 11100309 11309997 11551817 11738114 11981980 12216862
5701 12216862 12520427 12879005 13194781 13550750 13969871 14419441 14932479 15407642 15912229
5692 15912229 16517301 17101763 17681875 18238660 18698068 19009128 19180149 19088047 18873244 18544186
5682 18544186 18075957 17684481 17199983 16786604 16471638 16183448 15945758 15770890 15705124 15724881
5672 15724881 15773834 15830355 15980311 16243156 16530963 16817489 17231014 17686075 18206458 18895629
5662 18895629 19597619 20388886 21341798 22336644 23474000 24648601 25885423 27117665 28261493
5653 28261493 29233932 30078865 30623222 30779675 30644077 30268324 29708997 28926254 28083708
5644 28083708 27231042 26385271 25607943 24951606 24394614 23851185 23474942 23233145 23058609
5635 23058609 22864677 22800045 22865908 23010624 23216620 23447955 23850786 24360127 24932941 25600084
5625 25600084 26382754 27235559 28219319 29278346 30439677 31626763 32614980 33591574 34363706
5616 34363706 34845235 35148345 35129083 34765838 34122989 33293132 32315425 31320554 30382510 29406688
5606 29406688 28503984 27651025 26948329 26278936 25637836 25009412 24428654 23916386 23354786
5597 23354786 22757531 22205721 21699053 21279781 20917104 20597678 20402778 20265151 20256185 20297885
5587 20297885 20398521 20544847 20705027 20973314 21213071 21461791 21691557 21839086 22026032
5578 22026032 22187788 22390733 22683600 22971730 23265972 23566925 23672075 23567462 23281113
5569 23281113 22738867 21932727 21000253 19967898 18862588 17772646 16716863 15798000 14954333
5560 14954333 14099643 13358893 12736774 12158735 11595506 11141353 10755235 10399441 10062729
5551 10062729 9711748 9376392 9159338 8925939 8739683 8557481 8337134 8233858 8104962
5542 8104962 7967371 7870593 7707690 7575059 7405179 7280151 7116408 6972702 6789709 6607145
5532 6607145 6443162 6293593 6122516 5928356 5748118 5589184 5473482 5313726 5204383 5061994
5522 5061994 4935901 4877583 4773360 4622900 4561352 4502262 4416906 4363273 4295868 4226312 4162170
5511 4162170 4123826 4061210 4045244 3973762 3973711 3988054 3950509 3950721 3900814 3830148 3836737 3873430 3862202
5498 3862202 3871377 3834675 3826577 3872550 3905934 3871432 3857394 3857278 3789238 3812601 3871645 3868252
5486 3868252 3867374 3922373 3927775 3907607 3878198 3858516 3884415 3942349 4011749 4016774 4053747 4046709
5474 4046709 4040495 4065540 4099212 4124013 4143583 4158248 4160070 4194421 4201405 4201686 4248178 4230977
5462 4230977 4244211 4242543 4276164 4323660 4355019 4365491 4392943 4444607 4460702 4484057 4526661 4577918
5450 4577918 4670464 4753787 4817305 4851629 4948914 5008972 5077067 5190567 5334902 5430339 5536127
5439 5536127 5665188 5769304 5880515 6029364 6211873 6358153 6515298 6701210 6911015 7169558
5429 7169558 7377565 7601977 7875376 8218581 8597368 9041395 9544086 10043711 10580520 11125079
5419 11125079 11702855 12284723 12928213 13449313 13834024 14223471 14497380 14631228 14608175 14467795
5409 14467795 14207984 13828778 13478290 13063575 12611813 12147524 11758201 11384749 11006443
5400 11006443 10631579 10350090 10135415 9954965 9816709 9658254 9576056 9574115 9546670 9551475
5390 9551475 9605017 9619690 9685568 9801973 10048941 10183159 10335592 10555834 10867522 11168320
5380 11168320 11521345 11876263 12272201 12775863 13252046 13794028 14297475 14877632 15488042
5371 15488042 16162382 16921768 17707790 18401673 19147349 19884945 20613867 21314372 22021414
5362 22021414 22777892 23641102 24574216 25531524 26551491 27598852 28568664 29441283 30148366
5353 30148366 30632873 30789174 30678727 30261748 29546952 28574404 27477334 26238612 24910895
5344 24910895 23631061 22370392 21114064 19917879 18810268 17816480 16908146 16144556 15418032
5335 15418032 14785387 14286946 13764664 13284627 12968351 12713038 12462864 12231706 12062020
5326 12062020 12047833 12005266 11907441 11922982 11981193 12030975 12188107 12373544 12546774 12776019
5316 12776019 13137453 13535220 13962009 14407071 15031021 15677061 16349043 17164087 18098077
5307 18098077 19016948 20042172 21095633 22167502 23220124 24229858 25172164 25987217 26651234
5298 26651234 27072250 27220210 27100619 26679952 26001353 25212849 24169252 23113432 21953905
5289 21953905 20717550 19536649 18385672 17306526 16249288 15251546 14333731 13471388 12721684
5280 12721684 12031613 11373162 10803833 10296380 9853875 9506529 9208184 8905134 8661584
5271 8661584 8351028 8094766 7877218 7725742 7621563 7474276 7353093 7254470 7186828 7087786
5261 7087786 6999286 7004454 6962602 6916777 6914417 6890723 6878069 6911976 7008296 7117193 7234171
5250 7234171 7408232 7587200 7817231 8043018 8376287 8675446 9043106 9439446 9820270 10154864
5240 10154864 10464170 10753256 10912438 11017518 10994280 10919621 10719933 10445965 10106693 9743786
5230 9743786 9282011 8836754 8330200 7860057 7483378 7067155 6664560 6323641 6065046 5807397
5220 5807397 5468145 5189742 4972960 4792785 4624232 4446787 4251957 4092546 3970399 3856307
5210 3856307 3723669 3579063 3477485 3379553 3324585 3229329 3190712 3106560 3052798 3031733 2933602
5199 2933602 2831273 2774180 2762307 2739384 2634109 2561813 2547970 2515816 2458267 2441312 2441235 2379457
5187 2379457 2348776 2322002 2315223 2294185 2224462 2146397 2137358 2151258 2143799 2119827 2135657 2163111
5175 2163111 2162154 2178397 2110939 2138334 2143971 2113383 2088309 2030655 2103841 2096102 2092118 2111402
5163 2111402 2084118 2041505 2096390 2180266 2230527 2193737 2216050 2264486 2257038 2264919 2274970 2291270
5151 2291270 2311399 2305671 2285010 2261977 2299922 2330167 2347946 2261362 2240318 2203443 2232921 2193694
5139 2193694 2187261 2231470 2230155 2274296 2324246 2398189 2357547 2328702 2262737 2249058 2227765 2132246
5127 2132246 2054952 2042539 2020067 1971566 1936837 1866475 1840694 1855292 1846157 1841384 1831303 1857847
5115 1857847 1813491 1785457 1793442 1788703 1763366 1782626 1726359 1698495 1709775 1765442 1770884 1794559
5103 1794559 1808478 1809154 1795098 1806099 1789555 1808529 1796987 1796478 1794001 1771096 1759678 1758664 1779320
5090 1779320 1809541 1787519 1817404 1799211 1847873 1831255 1777743 1762690 1736951 1834628 1816575
5079 1816575 1808466 1806851 1823457 1745577 1677664 1708363 1742898 1739217 1720857 1702380 1635325 1655945
5067 1655945 1679849 1605551 1599342 1627958 1645898 1651792 1644035 1693315 1691589 1672194 1706740 1684159
5055 1684159 1688056 1654501 1661871 1631118 1618054 1638145 1659249 1701925 1724963 1714899 1732367 1698519
5043 1698519 1673789 1708131 1711986 1635684 1601169 1573889 1598526 1573927 1553305 1588741 1574732 1552788
5031 1552788 1593883 1558922 1554682 1555464 1534343 1565116 1554655 1516919 1520690 1565795 1577958 1587536
5019 1587536 1589406 1571958 1568891 1592620 1550746 1493274 1459289 1466710 1393835 1412754 1429749 1416268
5007 1416268 1363229 1357703 1381637 1338330 1402043 1413029 1364082 1328537 1329607 1338524 1358239 1384062
4995 1384062 1397777 1388618 1410948 1413670 1386681 1368701 1352718 1367961 1345526 1338877 1363268 1366282
4983 1366282 1354812 1361961 1409026 1480135 1423141 1359113 1396047 1427209 1442750 1445739 1467996 1508681
4971 1508681 1496802 1467613 1501476 1532842 1459469 1466581 1481662 1425899 1453455 1427680 1441338 1491748
4959 1491748 1480969 1460332 1493422 1526035 1511759 1492430 1539157 1558300 1598816 1549532 1543853 1527004
4947 1527004 1502730 1540774 1571259 1571054 1530405 1522002 1539786 1593185 1581657 1600625 1566291 1578687
4935 1578687 1602827 1608337 1532478 1626528 1672242 1610364 1626088 1598226 1590259 1617345 1584506 1581876
4923 1581876 1568466 1593323 1589687 1546295 1559667 1547816 1540436 1521550 1575842 1596804 1578204 1635840
4911 1635840 1646134 1649740 1696603 1743224 1751694 1737873 1719429 1714226 1688481 1651238 1640765 1636518
4899 1636518 1665932 1639876 1615844 1598106 1593377 1591758 1629574 1607599 1579266 1586339 1589731 1583704
4887 1583704 1620423 1624726 1596953 1622198 1638959 1639486 1627883 1672488 1707759 1706761 1709273 1721321 1756990
4874 1756990 1813687 1828870 1867419 1872755 1851458 1844816 1937431 1936092 1915902 1941351 1970371 1968520
4862 1968520 1940383 1986441 2067256 2075339 2072256 2091410 2118655 2139582 2188050 2235797 2309639 2340398
4850 2340398 2332614 2413967 2411877 2429900 2489465 2509851 2543998 2582868 2624872 2648368 2616245 2646419
4838 2646419 2724176 2773978 2734884 2758064 2767578 2771702 2798369 2894080 2934869 2947451 2962865 2975155
4826 2975155 3008400 3040756 3114023 3162096 3181741 3252257 3295973 3299461 3335489 3446181 3478497
4815 3478497 3475783 3524544 3564005 3621853 3682965 3742665 3818945 3845911 3857252 3861965 3939462 3984317
4803 3984317 4039832 4094447 4161421 4193534 4272462 4327052 4443789 4532808 4614805 4787505 4957445
4792 4957445 5073504 5171113 5335812 5418782 5538696 5716635 5788973 5900107 6086153 6258457
4782 6258457 6456347 6625434 6850880 6971205 7143143 7389660 7659026 7955316 8362170 8818303
4772 8818303 9314165 9879552 10583748 11471913 12474416 13769974 15387854 17417092 20031756
4763 20031756 23378480 27183908 30712626 32553265 31983517 29334540 25282769 21318507
4755 21318507 18208659 16017485 14446082 13317899 12498941 11850213 11356129 10960641 10604357
4746 10604357 10362923 10132786 9997548 9848721 9775928 9750183 9789298 9798680 9928479 10023517
4736 10023517 10101596 10135849 10170327 10209162 10299909 10417523 10513458 10673633 10818214 11021825
4726 11021825 11168211 11363613 11506534 11805599 12066673 12348633 12812469 13333228 13871296
4717 13871296 14545179 15405185 16443363 17650405 19127823 20938402 23126959 25893760
4709 25893760 29306520 32743462 35322983 35905661 35026297 33057246 29615142 25760745
4701 25760745 22662219 20467022 18798093 17575262 16642345 15845768 15179254 14602078 14153126
4692 14153126 13767870 13420703 13174250 12956437 12770862 12642679 12574048 12541583 12557163 12626235
4682 12626235 12673642 12703359 12765171 12802022 12881347 12975390 12993466 13003747 13120578 13237866 13292205
4671 13292205 13350621 13426361 13484017 13570660 13688996 13771004 13792170 13882114 13949524 14041886 14045470
4660 14045470 14059314 14121921 14146917 14107640 14056863 14093190 14038381 14013905 14049896 14125087 14197697
4649 14197697 14299734 14452286 14672860 14871540 15168717 15475251 15721984 16025046 16389848
4640 16389848 16726786 17085676 17447015 17749862 17981382 18147673 18370137 18483410 18431394 18344092
4630 18344092 18246031 18112093 17941171 17729943 17476472 17165442 16896093 16625507 16367746 16132667
4620 16132667 15949286 15791979 15662384 15507602 15386188 15256702 15147481 15048570 14907212 14825531
4610 14825531 14766488 14787075 14799408 14776134 14858215 14955600 14988692 15048399 15115447 15202020 15263224
4599 15263224 15308102 15282438 15233539 15176114 15078045 14966446 14831143 14694507 14602665 14487476
4589 14487476 14391244 14393914 14416918 14415989 14501083 14606580 14670972 14766322 14933404 15084747 15260423
4578 15260423 15504331 15669478 15780908 16054494 16318117 16559307 16790947 17008654 17271359
4569 17271359 17509925 17831565 18169724 18467582 18831304 19262832 19698596 20112844 20520699
4560 20520699 20884081 21187321 21432813 21720910 22063162 22383687 22796001 23107046 23385968
4551 23385968 23748271 24066049 24336140 24536621 24717315 24775268 24738793 24638863 24492198 24237829
4541 24237829 23989314 23739750 23446697 23163587 22982919 22862986 22797419 22787340 22766060 22795827
4531 22795827 22784249 22798693 22792346 22720012 22723300 22654167 22517607 22317639 22108530 21973558 21800984
4520 21800984 21573497 21272952 21078428 20808978 20616408 20488869 20379968 20341877 20301086 20261724
4510 20261724 20311594 20419637 20619650 20766557 20947193 21130386 21333159 21504494 21584247 21661733
4500 21661733 21783626 21875420 21932919 22000532 22110109 22319398 22603939 22888628 23139437 23424366
4490 23424366 23649054 23809098 23934845 23995488 24030601 24103172 24152060 24283947 24436840 24642220
4480 24642220 24865162 25203697 25536866 25893788 26251155 26665768 27126765 27563657 28015184
4471 28015184 28453948 28913393 29351494 29826380 30322368 30870526 31393229 31921533 32503710
4462 32503710 33056094 33601645 34172190 34736371 35430515 36221106 37036765 37886963 38746030
4453 38746030 39572660 40274945 40829227 41309459 41659326 41926548 42075227 42179663 42188671 42181172
4443 42181172 42207320 42281738 42401654 42452105 42426320 42357567 42228005 42137523 42080496 42034298 42054763
4432 42054763 42112632 42226865 42392798 42544171 42658330 42727149 42834215 42887239 42857114 42827592
4422 42827592 42674013 42475863 42164264 41843039 41447646 41011916 40621511 40289775 40050439
4413 40050439 39920486 39890273 40010664 40149456 40421057 40793997 41133026 41574023 41965211 42416538
4403 42416538 42794672 43128546 43468254 43832062 44188416 44485835 44695160 44813447 44966019
4394 44966019 45110038 45128973 45210054 45283550 45280155 45235154 45119544 44977286 44730718 44413364
4384 44413364 44063347 43774466 43491227 43254764 43068434 43070749 43101780 43229088 43450688 43784453
4374 43784453 44202604 44823922 45542788 46454673 47397829 48301369 48907322 48899913 48235851 47167330
4364 47167330 46073849 45185905 44522664 44069685 43796473 43765791 43816458 43886343 44008420 44057892
4354 44057892 44048233 43904632 43726403 43528014 43341871 43234715 43230001 43274102 43546261 43796682
4344 43796682 44083032 44494509 44877890 45272710 45660416 46137377 46719174 47286211 48044872
4335 48044872 48886703 49792771 50820527 52017630 53323145 54736364 56362625 58112469
4327 58112469 60033185 62253952 64718662 67493065 70739232 74607702 79169850 84614545
4319 84614545 91023267 98736058 107838165 118153619 129409689 140624029 150343278 157151752
4311 157151752 160060071 158890540 153656926 145105864 134464480 122787370 111360644 100943109
4303 100943109 91806088 83850030 76937686 70905655 65752858 61281821 57352045 53921220
4295 53921220 51020979 48423817 46121245 44146767 42407174 40819436 39359349 38033617
4287 38033617 36784554 35587561 34429194 33399962 32365676 31543774 30785898 30089798 29528018
4278 29528018 29014930 28468744 27983080 27596731 27203060 26850395 26499795 26176504 25879520
4269 25879520 25546776 25239859 24974336 24767044 24565568 24298738 24133033 24083023 24021275 23988707
4259 23988707 24020024 24137527 24290238 24486425 24670722 24910294 25212905 25623030 25957622 26349807
4249 26349807 26827779 27311721 27864986 28428748 29034216 29642245 30388024 31212723 32077844
4240 32077844 33085052 34154029 35359844 36697925 38163345 39859186 41774099 43985868
4232 43985868 46519293 49388015 52627099 56397484 60745970 65728834 71470971 77915851
4224 77915851 85135847 93072212 101459663 109786817 117147399 122429009 124391784 122461939
4216 122461939 116862468 108862497 99848478 90840174 82527890 75060775 68554071 62874769
4208 62874769 58018712 53766452 50027030 46830518 43977163 41416052 39081950 37032806
4200 37032806 35208472 33502528 31882555 30378702 29040388 27740005 26495860 25379076
4192 25379076 24316293 23306317 22399669 21556068 20742020 20066371 19409429 18842348 18304746
4183 18304746 17836822 17360233 16942894 16507743 16065062 15694234 15350693 14982394 14612728
4174 14612728 14253138 13983624 13635603 13241344 12938771 12612914 12261223 11925948 11648924
4165 11648924 11402037 11162099 10945697 10727887 10445502 10195096 9976552 9725821 9480257
4156 9480257 9345113 9289315 9080530 8887798 8726366 8532592 8401839 8215313 8106687 7954000
4146 7954000 7861484 7706356 7578663 7558562 7438884 7301699 7170638 7121093 7085654 7077076 6974645
4135 6974645 6901490 6756422 6625396 6527115 6417291 6330232 6261659 6221319 6163056 6083815 6025131
4124 6025131 6047742 5957802 5877335 5829833 5772603 5719930 5626637 5492159 5410733 5364582 5313061
4113 5313061 5258034 5228408 5158651 5143645 5146251 5133027 5078728 5013102 4963054 4939271 4993648 4945510
4101 4945510 4928292 4904424 4863178 4871884 4938706 4923954 4927194 5021459 5031472 4975140 4976546 5003332
4089 5003332 4991624 5005924 5021307 5051115 5047046 5074376 5101415 5062792 5087704 5150714 5153101 5222059
4077 5222059 5247479 5313090 5341365 5369505 5375019 5423637 5437600 5394721 5409026 5494775 5525732 5552686
4065 5552686 5689157 5749723 5811356 5863516 5896760 5910036 5929477 5993600 6000391 6070334 6192183
4054 6192183 6231574 6254744 6353495 6429039 6499087 6566687 6666489 6796640 6913551 7015712 7113592
4043 7113592 7134014 7279344 7392593 7539586 7694777 7864128 7980320 8096227 8225618 8355902
4033 8355902 8552570 8665688 8837775 8975326 9079898 9277474 9468361 9632734 9785377 9932181
4023 9932181 10105378 10205678 10354382 10485088 10627847 10853181 11060239 11252351 11530294 11816297
4013 11816297 12073148 12353173 12669062 12970156 13345922 13687309 14090441 14416582 14786782
4004 14786782 15163469 15504717 15902526 16324815 16744181 17158525 17655328 18150216 18676063
3995 18676063 19211598 19740438 20199907 20633649 20927451 21193371 21403122 21564575 21706130
3986 21706130 21925726 22130453 22372149 22727942 23043826 23347379 23558666 23729769 23734306 23690381
3976 23690381 23465011 23092471 22594021 22178216 21766176 21389932 21100136 20885193 20696456
3967 20696456 20554368 20308125 19982050 19651137 19212502 18645864 18028571 17389157 16759882
3958 16759882 16158562 15570228 14995956 14524161 13990174 13552451 13140294 12730358 12369109
3949 12369109 11924856 11512416 11055217 10595119 10156911 9712054 9292727 8871003 8523366
3940 8523366 8261098 7924817 7641669 7419564 7154360 6939894 6689632 6442109 6242504 6055306
3930 6055306 5878752 5756338 5610349 5383499 5251832 5124000 5020042 4881218 4750928 4663238
3920 4663238 4618295 4582760 4557857 4476710 4409368 4303889 4248528 4128826 4065432 3954751 3846647
3909 3846647 3688747 3619892 3589478 3427487 3356890 3361431 3283272 3166743 3070184 3041175 3000415
3898 3000415 2949828 2941033 2885920 2739377 2707219 2715627 2697080 2654215 2602229 2505271 2461501 2461654
3886 2461654 2397621 2364708 2300777 2287286 2230197 2191279 2157776 2187478 2136369 2056147 2079654
3875 2079654 2043854 2023421 2028972 2022115 1979661 2000621 2007930 1948402 1957934 1922194 1901321 1852689
3863 1852689 1846304 1801711 1799081 1857207 1828219 1814659 1806198 1817080 1837882 1855308 1820333 1787826
3851 1787826 1760638 1755449 1661589 1644279 1684935 1676044 1693413 1675511 1684007 1627309 1671513 1732889
3839 1732889 1756298 1669488 1674265 1652832 1661689 1701946 1642036 1592901 1573119 1591647 1593766 1654024
3827 1654024 1679870 1670990 1637846 1610974 1590942 1596471 1609585 1602153 1589850 1626584 1577715 1542565
3815 1542565 1540331 1542908 1547699 1589923 1543615 1543331 1600700 1594520 1585810 1593814 1562148 1523399 1520085
3802 1520085 1513911 1548847 1559265 1546238 1525189 1512292 1509933 1553774 1586445 1574732 1544540 1559212
3790 1559212 1507885 1473904 1472724 1492242 1459462 1421743 1486123 1517634 1503330 1495124 1507673 1424179
3778 1424179 1398233 1380755 1359111 1376215 1367794 1427028 1369789 1326430 1368466 1391074 1396960 1394769
3766 1394769 1385548 1330226 1405893 1442286 1455105 1466407 1457948 1433168 1392866 1414719 1416113 1396624
3754 1396624 1410080 1416039 1375664 1420329 1413062 1441118 1408937 1386224 1333472 1367941 1393966 1397155
3742 1397155 1388401 1372700 1415978 1356576 1362182 1384944 1364033 1360872 1387105 1418532 1388702 1347127
3730 1347127 1363215 1346982 1319649 1325922 1323754 1344203 1407218 1393094 1349997 1335254 1352383 1387741
3718 1387741 1375987 1342299 1317956 1328245 1423595 1419651 1406514 1410482 1377310 1382478 1405794 1346451
3706 1346451 1380663 1422594 1418737 1456979 1393444 1456563 1428413 1449959 1434218 1466937 1516676 1508699
3694 1508699 1488636 1433044 1493468 1505267 1491978 1520441 1517024 1452680 1452153 1402281 1411643 1475466
3682 1475466 1542250 1511695 1476896 1497873 1484006 1514075 1562855 1592999 1585321 1545982 1558052 1591296
3670 1591296 1582920 1570706 1566468 1580362 1540904 1564124 1573088 1573498 1607431 1559132 1517120 1510285 1549233
3657 1549233 1562069 1554429 1532033 1572661 1541669 1591178 1627343 1593885 1576163 1535720 1549613 1620754
3645 1620754 1635293 1637967 1609539 1608579 1668477 1696820 1613007 1637719 1694953 1723377 1723642 1715814 1703799
3632 1703799 1694532 1691790 1685536 1712079 1699617 1738272 1760755 1802080 1804671 1768465 1758855 1781265
3620 1781265 1778875 1765032 1746122 1758193 1783772 1783952 1742415 1793229 1806290 1814952 1853958 1900991
3608 1900991 1907969 1843237 1841475 1872964 1893832 1891321 1930247 1910700 1906388 1915224 1936341 1908714
3596 1908714 1897761 1921649 1947867 2014960 2051008 2066740 2033597 2022581 2054463 2090757 2124636
3585 2124636 2117714 2132246 2184029 2151976 2138526 2124632 2188385 2227734 2226120 2209750 2229552 2176267
3573 2176267 2156785 2204656 2250522 2231584 2206138 2210910 2163410 2172946 2222777 2225193 2228803 2216314
3561 2216314 2230069 2260825 2262482 2240784 2276072 2281000 2243124 2313784 2386702 2346274 2355840 2382271
3549 2382271 2365892 2390029 2427603 2484877 2425398 2427317 2493997 2484314 2481848 2473316 2519549 2577802
3537 2577802 2583617 2606189 2684081 2730391 2730670 2769142 2708993 2753337 2787735 2788265 2841051 2865760
3525 2865760 2885125 2942581 2961582 2945829 2995497 3026777 3039084 3019483 3015687 3028275 3026048 3050050
3513 3050050 3037799 3038235 3040064 3013037 3036934 3055611 3078828 3110463 3085806 3108672 3141170 3112721
3501 3112721 3120018 3110132 3086162 3106888 3103670 3099883 3065925 3103338 3058876 3083740 3139163 3145913
3489 3145913 3127874 3158398 3192123 3193506 3233193 3211733 3240258 3261030 3273771 3310428 3287715 3309496
3477 3309496 3336527 3346281 3441353 3457988 3475337 3501266 3526040 3550901 3584276 3567913 3576461 3587519
3465 3587519 3645700 3654692 3648486 3657074 3672595 3759197 3774266 3806603 3822343 3889604 3948875 3968423
3453 3968423 3953810 4005438 4010689 4044139 4125686 4120547 4138854 4177270 4194876 4262803 4316962 4290874
3441 4290874 4367179 4458961 4529534 4546201 4630933 4675687 4760071 4790184 4883548 4941431 5013492
3430 5013492 5098230 5109232 5176753 5193935 5282648 5393101 5475350 5553268 5569411 5623273 5694910
3419 5694910 5738510 5769380 5845786 5975697 6043729 6100291 6162153 6177557 6187029 6230645 6257329
3408 6257329 6279865 6312468 6334893 6319020 6365876 6406829 6374932 6363771 6391324 6413533 6472470
3397 6472470 6512414 6547629 6573044 6590905 6654677 6660340 6636882 6697376 6696201 6742955 6800384 6868806
3385 6868806 6963267 7081809 7128798 7227892 7273969 7318849 7468916 7566189 7650924 7786208 7844094
3374 7844094 7917750 8050259 8158617 8282889 8362238 8465989 8541626 8622145 8762682 8896126
3364 8896126 8954004 9060040 9171802 9348477 9420293 9508882 9706465 9824571 9934430 10056576
3354 10056576 10199369 10327553 10431155 10599901 10757180 10922231 11068139 11216519 11372738
3345 11372738 11581794 11790117 11961244 12170019 12367213 12600200 12817126 13108274 13357918
3336 13357918 13660037 13918229 14185255 14429118 14685324 14966418 15178253 15457367 15689695
3327 15689695 15937987 16133941 16328519 16493857 16712031 16929894 17107778 17393222 17677701
3318 17677701 17939474 18161879 18425893 18690806 18956360 19171000 19419948 19669257 19837621
3309 19837621 20021224 20246083 20513378 20826075 21105047 21368552 21710273 22061259 22434512
3300 22434512 22839905 23250169 23663865 24159021 24651038 25156822 25679447 26222274 26794735
3291 26794735 27435447 28063938 28771255 29498044 30209628 30941460 31807071 32705245 33625024
3282 33625024 34577873 35532279 36580905 37668768 38808192 40040444 41246910 42634899
3274 42634899 44120411 45753639 47577908 49386089 51430599 53695906 56036606 58536902
3266 58536902 61239196 64112187 67106939 70237305 73484269 76696076 79889372 83099826
3258 83099826 86285731 89357268 92255949 94969253 97510585 99783184 101936237 103992916
3250 103992916 106073067 108297134 110757960 113361081 116158726 119234153 122436033 125782701
3242 125782701 129188480 132608384 135963442 139032552 141773349 144024846 145630742 146614959
3234 146614959 146898668 146460308 145392246 143768615 141861935 139789963 137740407 135784130
3226 135784130 133986813 132290039 130579194 128697664 126508271 123810728 120587603 116746138
3218 116746138 112227902 107207757 101859298 96396377 90964140 85661886 80613194 75871807
3210 75871807 71476772 67558016 64025194 60830794 57939656 55319837 52966701 50800753
3202 50800753 48858856 47091713 45486286 44061124 42755671 41520564 40359245 39305884
3194 39305884 38316174 37439454 36646087 35909658 35168692 34578605 34009141 33461425 32965947
3185 32965947 32466623 31936103 31423333 30946527 30448672 29930091 29454855 28985821 28581068
3176 28581068 28220838 27895227 27606492 27273923 26992243 26672674 26415584 26228144 26047611
3167 26047611 25948596 25824582 25763756 25697415 25648167 25579912 25590874 25523464 25517309 25605256 25669592
3156 25669592 25733660 25867509 25997909 26122639 26344365 26585519 26858778 27181768 27590361 28048034
3146 28048034 28581551 29116858 29705135 30434196 31186265 31879190 32660403 33457928 34299804
3137 34299804 35042463 35665613 36252565 36744938 37015422 37227901 37293657 37198323 37001830 36768103
3127 36768103 36478520 36169270 35888309 35579634 35420710 35323688 35201242 35117318 35110623 35116326
3117 35116326 35132132 35238163 35407966 35548170 35606305 35801264 36037605 36279014 36591596 36897862
3107 36897862 37233879 37608782 38013919 38565527 39115758 39782125 40556533 41343380 42260778
3098 42260778 43275876 44446722 45616706 47025800 48650010 50424363 52386451 54443858
3090 54443858 56648076 59026932 61653823 64399294 67287578 70289557 73301192 76329482
3082 76329482 79298847 82146677 84782398 87244728 89395761 91252880 92782997 94028316
3074 94028316 95125538 96027221 96848350 97595078 98406737 99285451 100306618 101555610 102981623
3065 102981623 104512958 106093525 107747351 109451551 111064513 112586690 113839543 114748867
3057 114748867 115287236 115263601 114588696 113298176 111329352 108819413 105832510 102418107 98799149
3048 98799149 95117202 91457354 87891799 84537901 81284663 78317199 75595303 72988655
3040 72988655 70519970 68257124 66045255 63800967 61607593 59441760 57278264 55037910
3032 55037910 52815259 50638974 48606309 46632481 44704915 42884304 41173872 39626079
3024 39626079 38145176 36845666 35650223 34602082 33674802 32853494 32119823 31490179 30916151
3015 30916151 30368389 29876124 29453287 29012812 28593288 28298731 28084704 27832024 27646413
3006 27646413 27524004 27428798 27374957 27264249 27198932 27198222 27131669 27052380 26976823 26897706 26734645
2995 26734645 26539965 26382137 26240853 26149518 26028331 25935884 25813544 25737225 25803169 25734049
2985 25734049 25734229 25733668 25731482 25686184 25552208 25393654 25150771 24764921 24291751 23736453 23030751
2974 23030751 22272262 21534167 20893150 20311973 19856778 19421169 18914015 18405486 17982114
2965 17982114 17471689 17019793 16757256 16476810 16217041 16096462 15911923 15807649 15756715 15703150
2955 15703150 15698239 15721353 15813605 15915334 16015327 16072120 16169370 16292950 16447391 16630139 16730349
2944 16730349 16869156 16982404 17060283 17040632 17022129 16983598 16900467 16919170 16870606 16829045 16870706
2933 16870706 16869029 16849762 16807054 16779291 16704834 16641070 16639572 16682890 16752589 16852091 16934754 17075564
2921 17075564 17275564 17439062 17623464 17842819 18017189 18218856 18492342 18751289 18977021
2912 18977021 19170575 19391977 19616601 19831674 20132270 20407041 20722666 21025156 21367239
2903 21367239 21728764 22169346 22664326 23135914 23594772 24166138 24752625 25389337 26112078
2894 26112078 26814578 27563981 28375973 29195523 29908741 30703610 31477659 32265109 33160831
2885 33160831 34117458 35174092 36322828 37536631 38886237 40366045 41899173 43461432
2877 43461432 45048677 46651460 48328646 49985187 51666940 53339430 54991963 56573662
2869 56573662 58089139 59555003 61099916 62810535 64674476 66734866 69131672 71845091
2861 71845091 74793657 78190093 81931242 85904509 90287214 95118886 100428156 106434352
2853 106434352 113329451 121266328 130300685 140335893 151135936 162874140 176109556
2846 176109556 191399260 208813490 227721152 246622909 262714908 272828469 273980170
2839 273980170 265074549 247978185 226487914 204023735 182937453 164217885 148045201
2832 148045201 134200896 122409221 112198295 103205819 95247435 88260590 81946074 76341950
2824 76341950 71365305 66843365 62785784 59195648 56007289 53095795 50529415 48158554
2816 48158554 46063147 44085847 42226321 40484156 38838284 37295798 35822777 34431366
2808 34431366 33200683 32099731 31021363 30021845 29053374 28118542 27249487 26399370 25585439
2799 25585439 24758466 23934506 23106165 22328501 21599886 20869035 20140954 19516020 18903771
2790 18903771 18359303 17782824 17244333 16804849 16380972 15959219 15551000 15157726 14721573
2781 14721573 14342017 13964231 13618813 13318923 12986275 12747913 12483395 12216054 11968740
2772 11968740 11764801 11587017 11392034 11274905 11165555 11127659 11096820 11070613 10986378 10923521
2762 10923521 10843089 10637459 10305539 9966499 9599192 9225565 8953555 8717017 8502644 8267327
2752 8267327 8150146 8023006 7905332 7818492 7760630 7706996 7713727 7691897 7755194 7877913 7832184
2741 7832184 7711558 7498724 7136761 6805864 6556579 6302205 6025938 5851017 5618563 5491505
2731 5491505 5385487 5242169 5110630 5041305 5005898 4898461 4827369 4725348 4629085 4598361
2721 4598361 4543863 4540664 4468297 4395438 4347136 4286639 4321811 4311490 4279952 4216466 4184284 4113949
2709 4113949 4110213 4098078 4001378 3927995 3977505 3914861 3846081 3771814 3810856 3799162 3734073 3663217
2697 3663217 3665744 3701658 3646392 3618013 3569546 3541576 3531614 3477677 3421908 3386535 3321885 3362940
2685 3362940 3345579 3302836 3277104 3248341 3201576 3190904 3183942 3099975 3097060 3109785 3052352 3039235
2673 3039235 3062913 3006089 2977443 3033765 3083554 3090631 3143520 3115369 3139479 3227832 3280292 3224600
2661 3224600 3228640 3241533 3254667 3263420 3243841 3236822 3198966 3232397 3211266 3275632 3269980 3242705
2649 3242705 3195510 3169348 3166500 3166454 3209768 3257862 3257975 3266084 3332885 3367842 3390699 3416332 3478228
2636 3478228 3446559 3457388 3482671 3483644 3510763 3408190 3354287 3335083 3393751 3435707 3433863 3455527
2624 3455527 3506335 3508528 3430179 3397789 3411158 3413914 3346986 3345454 3351226 3355251 3345732 3344129 3367958
2611 3367958 3382940 3375914 3420498 3482622 3550368 3594488 3640431 3673588 3724858 3818884 3881934 3851422
2599 3851422 3828446 3798063 3677754 3624766 3594690 3528707 3495142 3438013 3382930 3388730 3375135
2588 3375135 3315488 3236012 3229435 3212395 3177262 3138292 3192128 3189708 3152454 3156621 3064430 3077445
2576 3077445 3156683 3148474 3149765 3154592 3247500 3312177 3338648 3371032 3436898 3497709 3620936 3795690
2564 3795690 3838419 3809433 3852200 3865812 3855212 3797281 3725135 3639717 3488399 3385918 3231759
2553 3231759 3103299 2893145 2734568 2663685 2570393 2475851 2446684 2386518 2325801 2252587 2167367
2542 2167367 2078784 1995037 1929713 1873320 1798805 1701629 1695049 1717799 1721698 1692564 1710991 1736549
2530 1736549 1776493 1675426 1541789 1552906 1554488 1501949 1448810 1442296 1395773 1306116 1288927
2519 1288927 1228270 1186766 1203208 1204326 1195565 1166353 1121118 1145265 1084477 1059938 1065967 1043456
2507 1043456 1028797 1061883 1084187 1015638 967143 929838 925069 871447 877074 891217 904593 886924
2495 886924 836935 808599 800896 817842 761852 768889 782379 790691 759771 717232 767383 772281
2483 772281 798804 718803 672634 654844 640607 698688 764963 758569 696092 655291 654027 648642
2471 648642 600222 569702 631455 617568 557284 548381 590116 622561 611688 649516 563445 528815
2459 528815 537405 490259 572873 591923 573826 549105 493671 537003 571290 536672 549894 586045
2447 586045 561946 532131 556729 539310 561075 542354 571782 601095 556846 556807 552427 504999
2435 504999 500866 524114 486290 474122 497546 510495 517814 531180 476965 500755 495280 505500
2423 505500 553864 537129 548553 522722 555709 538116 476994 463662 426746 399985 426592 451647
2411 451647 467770 490592 519641 517061 484145 493591 444390 458085 452411 450200 454578 419980 441410
2398 441410 512314 504422 426386 380491 366695 386826 423416 418011 489278 496579 434299 444363
2386 444363 505057 549041 518025 525210 542506 500533 513163 481591 467672 443870 427412 363032
2374 363032 380198 439166 459478 415493 399582 455077 440291 454253 507639 482149 432538 409349
2362 409349 431519 384813 387390 413772 439642 486644 482066 431702 437815 446044 405616 386221
2350 386221 387798 414817 402801 433710 385742 436339 422783 396626 404976 426006 379746 416236
2338 416236 473480 439467 403235 378220 416581 438227 399242 381543 388012 429433 394346 352835
2326 352835 370845 376495 335925 331915 347073 367931 399927 421337 434750 387739 343327 360938
2314 360938 380634 412819 422440 422630 401148 398323 428039 412255 358033 365551 356255 281495 261361
2301 261361 328412 318503 270640 240528 269084 286541 274475 253727 229432 290325 309718 268510
2289 268510 286493 302412 247048 248445 239158 288344 364166 315538 297494 327303 343128 371379
2277 371379 378586 338595 338598 347695 343724 340823 298963 270432 254756 246444 261818 303023 333844
2264 333844 357181 331116 299990 297362 291813 272219 282742 267871 248212 278684 322542 321855
2252 321855 286407 286502 305775 304452 262898 262491 294572 226355 291131 277753 256437 230417 310446
2239 310446 325103 353753 377474 334433 282568 322248 378664 356453 364785 344148 345820 356571
2227 356571 381816 335709 341151 330233 350967 360160 394010 397527 399966 397288 395969 392024 377706
2214 377706 393360 424373 402591 410401 387542 411627 446512 433617 474018 470986 437832 420785
2202 420785 465446 440952 409894 363285 370442 444951 478927 423937 458663 477255 559538 575743
2190 575743 524548 561240 567485 603464 567919 583003 637131 656606 618503 591409 569355 534436
2178 534436 558364 588135 593206 610425 604656 612382 680112 633341 663732 679568 671511 727477
2166 727477 721233 755243 771638 784512 775528 771895 802581 816428 787152 832324 863844 876860
2154 876860 907593 943632 968556 1032500 1123313 1178412 1209484 1235717 1221617 1280465 1334757 1379130
2142 1379130 1459033 1517980 1536583 1669340 1736206 1809351 1908795 1975989 2111426 2280835 2449035
2131 2449035 2512627 2634894 2859743 2980925 3172075 3580577 4076107 4552107 5280628 6190751
2121 6190751 7321230 8835743 10864079 12931319 14523853 14181137 11523308 8930465
2113 8930465 7168464 5894867 4980030 4350451 3823596 3436797 3099028 2851229 2609636
2104 2609636 2449337 2414008 2312475 2119061 1915595 1696244 1584627 1463218 1395895 1328433
2094 1328433 1199671 1156061 1165075 1099124 1028758 1019027 936007 850187 907606 885657 783896
2083 783896 769793 799975 785659 790199 759375 718146 696572 626214 617683 657947 649353 565599
2071 565599 556270 516281 489773 455647 448101 474037 404834 350753 339214 308040 301484 324039
2059 324039 331033 336153 336231 349224 339017 335719 365756 340346 312437 289851 279089 249855 269530
2046 269530 290666 237087 238464 236850 268948 262676 261826 262477 227734 194621 159175 181510 148368
2033 148368 180572 200782 213466 212937 223252 183689 181725 123532 144867 228611 197085 182870
2021 182870 174108 162386 146045 151096 152529 155995 131285 135757 126296 140177 134555 142746 104922
2008 104922 81318 66667 91405 133903 156008 168668 133889 153864 194115 219536 225839 165926
1996 165926 177163 134360 114841 113287 133225 123226 140295 123282 102822 165308 154797 173926
1984 173926 163238 179924 172299 164136 138983 142607 151743 199620 122219 85592 65005 75091
1972 75091 62308 14718 57357 110081 151318 190994 167007 136258 128001 139939 172909 166937
1960 166937 150496 131356 143544 146275 151634 125925 114856 79189 65784 112648 95391 97374
1948 97374 155535 112741 109375 110013 139991 103887 114608 65561 71186 76602 107359 127069 92586
1935 92586 79674 66885 61829 52833 56922 67701 53670 35276 34182 42026 57541 94177 100846
1922 100846 47812 68346 77518 69614 52065 54830 51573 72250 61232 62681 84532 107900 75060
1909 75060 99567 114716 130806 65227 53610 63939 130023 145213 120466 111229 120931 67410
1897 67410 86977 76368 74756 115954 107213 83209 68791 63641 40625 67048 76540 101116 52284
1884 52284 132723 93960 23023 46479 117915 114283 66635 52033 -17218 27271 67616 78465
1872 78465 124158 125851 116721 96591 57411 30796 37224 17145 44541 57166 51754 41003 52554
1859 52554 59114 61006 92503 100056 104408 108650 73861 138730 149400 104968 98797 124784 138260
1846 138260 150374 132745 114199 110554 82099 106757 82408 28038 20724 52360 67563 49741
1834 49741 50693 43361 39976 54662 11624 58227 90367 105890 60162 31862 10767 34393 73258
1821 73258 93368 104508 104154 58463 46617 -8076 15069 20802 -51770 -17395 -17701 11949 56137
1808 56137 -24035 -38118 -21261 5826 40599 61113 103659 64987 56402 8862 4590 -33045
1796 -33045 18723 45298 30290 1899 14921 883 15961 -1504 2974 3687 -1866 -16853 14341
1783 14341 13280 29279 94821 76080 95543 112260 86472 27199 24393 75415 91710 81989
1771 81989 82100 58790 49080 812 -8438 -656 35669 94897 90728 47469 82463 41008 1601
1758 1601 32437 25515 12059 5424 627 68228 43780 -9784 28384 47811 48790 20865 -226
1745 -226 49144 115864 104809 91148 51494 -12639 -9654 36888 50128 13454 -34273 -20704
1733 -20704 -6229 24194 38898 47414 67243 87518 54414 -4314 16404 61225 82368 77333
1721 77333 48221 19695 29108 14128 7761 -18718 -11631 28153 -1576 22481 -18484 -54451
1709 -54451 -39823 7718 47323 40053 70141 17001 16378 68192 119847 96002 20481 4389
1697 4389 31031 18464 12639 19115 16221 17016 3589 20974 40106 21763 19296 40619 42116
1684 42116 -24820 4463 43118 29583 8024 38547 65525 46209 70286 80098 36607 -1222
1672 -1222 25537 47229 -3817 25273 6668 -22803 -56374 -89512 -48837 -9850 -18241 -32376
1660 -32376 -14990 -29887 -25002 13471 14637 13166 19326 42824 -10174 -58690 -10650 5922 17553
1647 17553 40446 42821 94148 44062 -1583 -14731 -8631 -1656 22116 17639 -47535 -11656 -8167
1634 -8167 21224 21843 16933 -18681 -48374 -77540 -29266 11658 -10711 -35616 -616 86747 51789
1621 51789 -4152 23004 33439 26687 -47146 -38274 -57089 -27459 -20742 29566 45531 56111
1609 56111 52196 8924 5639 18227 6705 75703 34904 26627 55591 1994 13026 47082
1597 47082 20579 -3836 -11932 -30368 -52049 -55820 -37166 43532 17091 -43662 37548 -11107
1585 -11107 -12691 7951 12129 6049 32700 24252 13328 32486 -1962 -43194 -29481 -13215 37263
1572 37263 17845 -6165 30007 13541 -67646 -30562 26587 -46654 -42916 17018 49709 -23120
1560 -23120 -28904 -3028 -20137 15923 706 -31070 -52439 3018 5636 -2618 21050 14575 -3546
1547 -3546 13608 -4405 -874 9394 16516 11402 21718 46400 29915 43466 35383 51433 69329
1534 69329 60194 81821 67896 68154 38439 44166 5258 3951 -7894 -13534 22357 49133 57845
1521 57845 26604 -2178 5331 29822 29149 -13998 -877 -41115 -13218 129 26505 45500
1509 45500 13889 17501 -6588 -22393 11476 13896 -35474 36571 22723 -14062 -13405 -43152 -15319
1496 -15319 -7949 -67444 -31708 41704 127247 70462 52700 49883 -44489 -32818 16379 -47499
1484 -47499 -43991 -30302 28940 30428 22958 76330 61723 24055 -13559 -2933 3208 -53937 -53698
1471 -53698 -16544 16960 8469 -26125 20367 -24606 -15364 -5079 24076 15247 22882 26391 10977
1458 10977 -7140 -82177 -36765 7217 -37621 -31114 15919 12214 16503 -43286 -31429 -33542 -44976
1445 -44976 -50578 -7036 3984 -53230 -35555 -26840 -9600 -9858 -22371 535 26896 49259 -16639
1432 -16639 -32662 -31721 -31544 -10251 -7923 16965 1399 -36528 -23319 -39745 -7282 -1235 9016
1419 9016 30399 -39870 -20582 -35225 -24724 52423 7391 -52530 -59356 -82422 -96817 -51860
1407 -51860 5547 3787 1162 32643 47660 28471 2221 10385 17782 -23186 -55695 -13121 -38201
1394 -38201 -44151 -20756 23810 42558 4597 12618 17030 8653 -42186 12824 -20325 -43037 -18581
1381 -18581 17029 19784 -25843 42066 53974 -4717 -24454 22676 3416 -6390 72291 62733
1369 62733 3172 -265 73415 44176 -322 30963 77562 16886 10515 15739 8152 -27979 -87929
1356 -87929 -69880 -21795 -39217 -15271 -18298 21430 64651 71078 95076 28341 7279 -13328
1344 -13328 12696 9320 -30924 -49805 -26102 -10830 14422 5045 15116 -8138 12006 -18724
1332 -18724 3916 9572 17130 14913 4234 32378 -22629 -50837 -26489 -27781 -21388 5474 -49657
1319 -49657 -3029 46193 12938 -40154 -30931 -19463 14610 -6175 29937 -19852 -17230 -7581
1307 -7581 8598 23268 -76672 -95543 -67314 -50879 -19085 -30489 -58503 -33103 -15321 36679
1295 36679 46994 14714 13485 40450 19529 133 -13796 36759 41266 6687 7715 16779 14155
1282 14155 -825 -13997 16401 -16599 -3107 -6905 -29565 -24533 -39970 -33382 1718 43591
1270 43591 54546 37462 -13273 -34655 -21478 36454 31603 -16473 -50668 -10721 53924 59273
1258 59273 28632 -24353 -31022 -80408 -51712 -35368 -24702 -26218 8736 18588 13406 9306 -21583
1245 -21583 -46628 -3083 -8176 -17401 20246 -7357 62527 49333 -16426 -14799 18578 12720 36531
1232 36531 36428 -12972 -39486 -16030 -67037 -45427 23279 -931 896 -15919 -11755 -25222 -76545
1219 -76545 -48602 -43702 -28046 -13459 -4712 -30684 -12124 -8600 -15956 -18507 10476 -21175 -12782
1206 -12782 -22878 -74881 -82171 -9872 -23301 -78127 -48413 -50134 -23463 -45818 -11328 2296
1194 2296 -4262 -8911 -36454 -49237 -66866 -51212 -39773 -6063 -28166 -64559 -4074 -14318
1182 -14318 -31281 6120 -16436 -1173 12741 -25683 -75257 -26281 40525 -29151 -33941 -46796
1170 -46796 -17556 20380 -46007 -99633 -83660 -92150 -32668 -31932 -83116 -48230 -8011 -33513
1158 -33513 -35903 -48212 -51892 -86595 13578 11064 -73871 -53802 -3612 5043 72762 47385
1146 47385 4720 -18923 22511 28167 -4286 -15011 -42755 -36996 -51927 -8213 -18379 -29468
1134 -29468 -6993 12500 -34927 -49597 -32690 -36930 -75076 -26004 -31320 -50068 -60587 -2995
1122 -2995 -13571 -48102 -35150 -3096 -19204 -42689 -3618 1743 24685 6030 -3275 19421
1110 19421 -10063 -41498 -33817 14231 30589 324 -27014 50949 10550 5826 18500 7
1098 7 50926 41424 29094 3844 -12943 -2760 22353 1207 -39413 -35563 -65810 -47250 17769
1085 17769 28868 8727 31506 30200 47150 33707 4600 -2253 36368 44219 -13369 -43850
1073 -43850 -27331 -14322 -30392 4683 8977 7064 -4453 -41548 -67180 -56253 -46884 -13331
1061 -13331 -10227 -36206 -34690 3775 23263 -3076 -12215 12575 21405 37765 18743 21348 -50663
1048 -50663 -14300 -4712 -37896 -60587 -69978 -83762 -40379 -26670 -25499 -5974 -2937 -52025 -78637
1035 -78637 -20933 -22054 -10243 -61097 -50148 -5227 14752 33747 36848 -2146 -39291 -12644
1023 -12644 10621 2619 10999 -6447 -1945 -27255 -19194 -86241 -8520 33510 -24233 -2093 17202
1010 17202 -38002 -15805 42280 9778 -51422 -55663 -16225 -11523 13319 -13962 -57321 -60269
998 -60269 -49165 -38346 -48872 -37905 -29092 -21959 -31703 -82742 -39867 23724 39320 29368 -1277
985 -1277 -22291 -64212 -10876 -3067 -3879 -3227 -24050 -3686 -63236 -42220 -10352 -11538 49383
972 49383 64582 29946 -14157 11842 43565 -1184 3807 -24690 -46360 -69237 -86467 -102341
960 -102341 -48735 24712 25070 26965 24767 24536 7549 -21704 -24800 -44631 -6660 -37842 1656
947 1656 32007 -21895 -39467 -37468 -21823 -15114 -13135 -14749 -56070 -13461 56128 72808 4214
934 4214 -11231 21107 -1363 -45779 -56484 -15620 -25013 -65183 3929 14683 38225 -15561
922 -15561 -18629 50240 64465 42895 -30310 -35282 -37325 -79974 -72253 -72697 -51241 7169 17972
909 17972 14469 -17394 -10482 -33472 -29135 12824 40370 -7573 -35220 -57741 -7515 36660 23581
896 23581 24001 12885 7734 -22383 -64724 -12991 21825 -38170 -29309 12519 18754 36673 -3081
883 -3081 -13444 5043 -35842 -65911 -81577 -4038 25095 3339 16951 -25037 -19595 -48700
871 -48700 -61057 -49321 -42813 -45871 -14451 -81638 -64809 -56771 -85093 -52258 -26912 -27054 -20980
858 -20980 17339 42239 36635 40521 40554 -8418 -27159 -35281 -31672 8321 27216 54320 32605
845 32605 55248 62915 70003 86870 34168 -12835 27864 -22758 -49062 -52611 -52235 -18926 -9652
832 -9652 -3498 5359 43829 39933 -9094 8529 9344 -6643 -41349 -30044 14496 24856 15593
819 15593 57529 21738 -2079 -9580 630 -1794 -63662 -70161 -65869 15863 -33821 -47112 -40076
806 -40076 24796 39141 32849 64961 -35257 -47563 13266 -7264 -11281 -19913 9516 -2170
794 -2170 -43817 -60053 12628 16129 33098 18091 15422 -35376 -18280 5319 2312 14204 4997
781 4997 -18005 -14036 27358 28063 63679 29104 -41469 25500 34268 50785 39415 -20763 27117
768 27117 35833 -21940 -12979 13783 38777 48214 31773 31876 51942 57765 33116 -35430 17252
755 17252 75986 70470 28923 -55706 -49014 -25019 -38529 -30908 -30370 -5096 -28214 -41685 -40244
742 -40244 -27525 -41195 12438 86174 6438 -18551 -52642 -42904 -36708 -68625 -40392 -19419
730 -19419 -20411 36136 19510 11936 3416 -49811 -42982 -30827 -24162 -17010 40786 13008 -23983
717 -23983 -19563 -3713 7862 16308 -25452 -76272 -16705 38334 37754 32990 38462 23549 3934
704 3934 -52565 -50886 -58324 -25436 15465 73123 -7754 -14402 -12860 34851 17605 45363 -25213
691 -25213 -64344 -74826 -81092 -51669 -27237 38395 33542 -2633 -14265 -24499 -50521 -55566 -69526
678 -69526 -17813 30187 45504 3283 -4271 -20490 -16085 -303 50400 32207 33495 12383 18280
665 18280 10822 -28842 -28469 -12116 56393 75326 34934 -48465 -63759 -28163 7246 59953 45882
652 45882 19937 24991 15388 8899 -36425 -11957 18791 -49590 -30508 -15811 -33262 -22000 21398
639 21398 65550 73884 48248 -652 36101 17962 15472 25912 46707 17971 -7454 1612 -24599
626 -24599 -762 -42552 -10470 45741 20660 29921 16018 -12534 -17105 19182 39600 18746
614 18746 33718 67756 75376 36962 3435 -22769 -30320 -26614 8809 39516 58109 -25603 9109
601 9109 25842 -13356 -31934 -6901 18541 -2827 -16136 -9366 -10965 8247 27650 -24823 -11423
588 -11423 -17778 706 4229 -20703 34707 55527 -2147 28644 56101 3420 5262 20726 -37673
575 -37673 -36001 20509 -11260 -22337 -12574 -4391 27036 10735 1746 -10632 34209 62242 8862
562 8862 15699 42597 56076 10293 4192 6571 -401 23049 22767 -29919 -22674 -17656 -27142 -21311
548 -21311 -21013 -22467 -44192 -43613 -29887 22399 -10923 -19334 -13975 4106 -36824 -36994 34106 9067
534 9067 741 29268 433 -6812 52562 27565 -19836 18046 5349 -15012 44836 51166 45616
521 45616 5099 5065 18054 33437 21767 2397 -10984 19725 39895 29590 2943 8658 -20923
508 -20923 -44309 -4726 -6997 -10607 22427 -19482 2975 39671 20478 -23823 -34011 75993
496 75993 40079 60168 87271 22392 32654 -8485 -10515 26898 4340 34528 52099 20854
484 20854 58420 66062 26743 36355 49694 61980 55055 52964 51317 41756 16078 -17322 8713
471 8713 24475 35254 67925 44338 63646 23243 -11475 -6897 -5256 -6296 53408 7597 -17897
458 -17897 -22379 -15664 36131 5197 -15679 31011 24758 -17544 486 32575 1928 8853 27017
445 27017 49287 10677 3320 51247 31443 -22467 -7573 14272 34711 41108 40030 -6617 27248
432 27248 89791 34656 11952 26247 42909 7544 20204 56385 33360 12721 53041 13552
420 13552 19281 31727 -20075 -19082 47583 1031 -19517 -23081 -4479 -5353 -22233 16568 -146
407 -146 -31313 10752 16169 34073 18871 41696 11208 -46860 -25196 -7870 6615 4242 -3986
394 -3986 -26974 -39032 -54264 25300 62004 64923 5886 -5450 4760 -30221 -6068 18001
382 18001 26803 -25147 -55120 -59216 -48881 27805 -9488 -69934 4105 49895 66909 52113
370 52113 39106 48438 27324 32190 8064 -7495 -38760 -29177 5068 -993 -4006 -21298 -76838
357 -76838 -32836 -18684 27515 48555 36467 24765 49305 18101 -11630 -762 36656 62280
345 62280 14035 -3707 14161 35886 10927 36131 47864 21639 -11324 77416 37670 54744
333 54744 2321 42173 84808 24321 -11415 18667 21529 32428 42351 -122 56850 43717
321 43717 34033 33662 -35203 -15050 -40474 -34231 68823 74742 4481 23468 21531 -20389 -3050
308 -3050 31128 35176 18413 3666 9585 -6552 17336 78076 51659 32731 -14257 -57840 -35881
295 -35881 -24210 -20747 -48524 -27237 7212 1583 33004 27261 -8758 -33108 22932 23773 -20902
282 -20902 6771 35652 -13191 -30272 -13818 14389 1846 29799 30364 46020 -1274 1639 10449
269 10449 -72701 -95626 -73573 -64926 -34596 -45530 -10708 37105 28633 -5445 -37337 5088
257 5088 -30918 -41851 -46416 -27148 51776 66030 59986 -5706 8017 19317 15334 49359 66029
244 66029 51050 -30371 -46378 -6363 -7805 -28029 -20353 -3267 -12475 29749 46082 19031 26000
231 26000 27968 31362 54024 6892 29910 75123 22241 -13931 33961 11636 -12884 12992
219 12992 8576 40933 43548 12191 16147 78338 44367 14803 16414 9260 -39554 -18452 -14442
206 -14442 61799 71364 30301 17928 -21105 30244 72375 117605 78744 53949 61361 41855
194 41855 22197 40258 33508 35085 91278 49193 24973 38301 -19525 -65247 -49483 -22030
182 -22030 6326 11021 60764 39648 -15805 -19151 32067 21095 7332 -4979 -19582 -3651
170 -3651 27164 62336 6503 1509 17635 16281 -15674 -12674 -47482 -31796 10605 18219 19318
157 19318 39698 34464 -5673 12065 -14404 38563 22552 -14252 35395 84236 38615 28951
145 28951 47921 79810 125397 40865 19809 43594 31378 49209 79467 45667 25738 25619
133 25619 22974 9567 29658 43208 35204 10335 66038 62710 45106 15987 -18851 -11748 -24405
120 -24405 -14993 1220 45026 17741 21291 42807 852 -21669 -5875 16275 -8916 -11910 11313
107 11313 18136 10791 57075 18640 26187 35545 46091 58975 43840 32287 32433 30633 58797
94 58797 65596 62958 25338 -20782 -2644 11381 10283 -33045 21442 42979 24720 15646 39538
81 39538 23639 22847 23567 45695 40095 45049 9709 2779 -14307 31627 30174 -11275 16505 39294
67 39294 15779 -22720 -4223 41237 13448 18982 35387 85931 41790 16470 335 5402 46885
54 46885 27377 10187 32475 23226 37130 18684 6421 50881 7916 -6596 4936 47927
42 47927 50448 408 25401 8077 -1429 14300 3306 10652 15933 43463 -5399 7606 27889
29 27889 47664 24789 13906 -14151 -3139 17253 31454 -6379 23294 29138 41817 42370 84698
16 84698 80853 59516 71618 16612 29597 28997 22711 35442 12858 40237 45530 52562 57992 37338
2 37338 24024 -540
0e40
$$ Imaginary data points
##PAGE= N=2
##DATA TABLE= (X++(I..I)), XYDATA
16383 -1921340 -1881060 -1847846 -1864906 -1837525 -1753139 -1724544 -1704401 -1690537 -1684758 -1672270 -1625493
16372 -1625493 -1579147 -1562635 -1525757 -1502162 -1460138 -1430582 -1418920 -1433517 -1404750 -1362518 -1322192
16361 -1322192 -1313947 -1306946 -1273424 -1232227 -1218399 -1196996 -1149475 -1141868 -1096385 -1083611 -1079094 -1056866
16349 -1056866 -1038217 -1022998 -1005306 -967822 -929574 -868468 -840533 -820543 -809896 -807458 -794612
16338 -794612 -798239 -781953 -730363 -710569 -660093 -624548 -609538 -592348 -558859 -532315 -550416 -515584
16326 -515584 -530613 -514772 -441246 -443257 -422044 -381886 -385714 -330719 -291737 -299150 -258352 -243088
16314 -243088 -238424 -212049 -177579 -148396 -146177 -122625 -99661 -27798 -21436 4578 -12585 11327
16302 11327 -13775 -23911 16736 66914 96656 129012 154470 141007 133963 147062 174163 217704
16290 217704 262317 295035 315274 287435 345227 379078 353695 410455 415480 356819 397598 466920
16278 466920 480972 427365 478747 551377 579380 588379 521640 554775 575534 627698 609734 631907
16266 631907 701114 695931 732022 726147 772197 796192 822512 839534 824765 836037 812998 830306
16254 830306 889856 887248 891884 916569 927414 977506 987805 964665 974647 998785 1000741 1052325
16242 1052325 1076006 1018568 1065443 1089609 1069160 1072990 1106011 1160628 1188538 1193338 1188409 1202114
16230 1202114 1203610 1195323 1211826 1245012 1248113 1227430 1295433 1276251 1277400 1271999 1296918 1302592
16218 1302592 1313746 1342790 1382141 1375790 1403636 1402189 1410512 1391620 1404777 1446058 1442217 1448225
16206 1448225 1436845 1463622 1474712 1501842 1527780 1529488 1518218 1554005 1561823 1548300 1543984 1567908
16194 1567908 1560155 1540178 1539717 1570568 1583913 1607923 1640192 1654518 1621451 1639664 1672620 1651311
16182 1651311 1626064 1622006 1643849 1635616 1647398 1674018 1680748 1687748 1697944 1663392 1705138 1790044
16170 1790044 1779144 1700625 1730716 1727653 1699120 1694114 1765127 1762330 1778315 1768369 1759044 1815936
16158 1815936 1813018 1833336 1817925 1791348 1816252 1869730 1819536 1805318 1827584 1826899 1838993 1830308
16146 1830308 1826794 1879159 1874168 1872352 1886024 1923156 1884874 1882176 1872694 1890291 1917277 1931199
16134 1931199 1936658 1904736 1905019 1875663 1883481 1899226 1936329 1936174 1939120 1933462 1916827 1934415 1977793
16121 1977793 1947714 1923188 1903804 1919067 1978184 1994105 1993542 2044789 1986954 1961480 2021617 1995854
16109 1995854 2008145 1986973 1980906 1936015 1990394 2033233 2046482 2039667 2064593 2047109 2013643 2010021
16097 2010021 2054576 2093027 2042235 2022823 2047882 2033066 2048075 2034111 2063336 2052228 2039479
16086 2039479 2019380 1958994 1986669 2007603 2005374 2054656 2050256 2052963 2058136 2034037 2021302 2003746
16074 2003746 2014537 2003781 2023059 2047108 2070462 2072938 2011529 2017723 2050288 2030231 1993216 2006831
16062 2006831 2034673 2073764 2105230 2053407 2047162 2037168 2067480 2052888 2044906 2046527 2067024 2090984
16050 2090984 2095961 2090131 2109367 2110404 2060547 2111645 2082083 2067309 2129625 2111916 2065241 2000440
16038 2000440 2044310 2078524 2075528 2015015 2056014 2118604 2098451 2101344 2079764 2058946 2100311 2120264
16026 2120264 2092159 2090375 2076349 2060857 2098108 2081461 2066402 2090875 2042917 2061359 2046947
16015 2046947 2054632 2073953 2121497 2137748 2165074 2114044 2063829 2082010 2068867 2082258 2083525 2097415
16003 2097415 2080612 2084969 2078113 2086779 2077051 2078955 2097788 2080379 2064183 2093350 2042148 2083013
15991 2083013 2057927 2065664 2050772 2027138 2017327 2045766 2071332 2076522 2081965 2084128 2069304 2088381
15979 2088381 2126984 2076913 2091363 2121099 2105341 2073196 2053238 2037298 2039721 2044134 2091057 2095405
15967 2095405 2084106 2070623 2061338 2085648 2075185 2013540 2052943 2112108 2138854 2105449 2061205
15956 2061205 2100024 2128720 2120387 2102788 2093026 2102338 2107516 2152683 2151493 2115513 2074401 2065990
15944 2065990 2095141 2102764 2037153 2004879 2085903 2118101 2087274 2119793 2148228 2079555 2082958 2081806
15932 2081806 2084284 2081201 2089247 2134867 2099082 2040158 2026718 2092553 2104711 2143936 2158071 2099136
15920 2099136 2070130 2052405 2084334 2091892 2092756 2127074 2100459 2140952 2144762 2048152 2033847 2053703
15908 2053703 2067915 2065410 2089366 2104572 2114267 2084443 2076541 2126335 2138901 2130277 2090571 2086941
15896 2086941 2124825 2139901 2083891 2059752 2043714 2081229 2077817 2080910 2101345 2113907 2079003 2070543
15884 2070543 2061838 2089695 2127225 2176255 2167032 2095386 2100040 2117764 2125818 2076873 2102266 2085746
15872 2085746 2113478 2106513 2076936 2069270 2090672 2130644 2082383 2116922 2133104 2113859 2109953 2124991
15860 2124991 2115420 2074918 2103191 2108663 2093962 2131347 2125855 2108955 2094298 2102703 2126026 2114005
15848 2114005 2093155 2092095 2137889 2100328 2102563 2108777 2135785 2161363 2133207 2126516 2126205 2107329
15836 2107329 2103717 2093538 2119426 2126416 2145072 2160927 2150652 2142098 2106481 2092279 2106421 2125058
15824 2125058 2149196 2123791 2107068 2082113 2051472 2048947 2105792 2133112 2083741 2096102 2101882 2120319
15812 2120319 2163770 2196419 2203133 2155552 2083445 2124232 2079730 2052905 2099265 2153396 2154371 2149863
15800 2149863 2082538 2086098 2088364 2089154 2118467 2155430 2162307 2116053 2107685 2105507 2132170 2111616 2126349
15787 2126349 2108803 2132722 2128299 2113412 2137258 2126404 2150656 2157565 2105626 2143219 2151797 2153082
15775 2153082 2161624 2091900 2082104 2083719 2038715 2099437 2142438 2112973 2137131 2135184 2142281 2128609
15763 2128609 2109073 2097541 2069154 2106925 2173291 2153722 2158683 2164169 2132869 2144369 2126107 2174281
15751 2174281 2155335 2114187 2065116 2059021 2126725 2119532 2075974 2110823 2148588 2129599 2127574 2166953
15739 2166953 2166448 2155288 2129631 2102791 2188117 2198612 2163972 2176538 2233420 2204197 2104248 2131366
15727 2131366 2128098 2092939 2122793 2136430 2173466 2137216 2102906 2125237 2146464 2192433 2115109
15716 2115109 2091935 2119872 2116109 2078040 2126947 2190328 2162311 2170417 2135813 2104536 2096175 2095506
15704 2095506 2133009 2125496 2144849 2155657 2199577 2216420 2163537 2134277 2087204 2063001 2105165
15693 2105165 2132643 2122844 2141691 2184049 2206489 2225917 2223560 2199232 2141221 2121572 2136627 2143161
15681 2143161 2156664 2180772 2210236 2176990 2139332 2104649 2127335 2117079 2141776 2167266 2133213
15670 2133213 2168719 2144394 2142094 2155696 2154406 2151086 2167465 2162324 2165398 2173285 2177310 2155843 2116289
15657 2116289 2144370 2166037 2155303 2180744 2183475 2140017 2201627 2163205 2151067 2174533 2158735
15646 2158735 2150094 2134214 2134028 2160138 2141602 2158671 2090724 2085249 2113805 2138579 2133724 2148330
15634 2148330 2167261 2165079 2158323 2160439 2159205 2166734 2176082 2151799 2134848 2173862 2170205 2150684 2152580
15621 2152580 2179247 2171901 2176042 2117020 2082613 2130821 2106372 2090756 2141972 2166375 2196943 2196800
15609 2196800 2193613 2112995 2085298 2155516 2175875 2159339 2163729 2171291 2156926 2180258 2172913 2162455
15597 2162455 2142677 2123927 2162711 2185852 2165119 2144207 2123026 2149044 2145150 2170308 2109584
15586 2109584 2094953 2090096 2136133 2085075 2134267 2155040 2141291 2190341 2244851 2199375 2171026
15575 2171026 2220277 2142845 2205375 2211090 2157723 2200389 2203373 2151742 2128161 2141049 2164461 2191979
15563 2191979 2142293 2196739 2195979 2215111 2164656 2180219 2214397 2177939 2189620 2172659 2130810 2093975
15551 2093975 2092163 2105999 2118773 2157324 2152265 2188355 2198573 2189301 2158310 2140705 2156071 2166010
15539 2166010 2151864 2130945 2188675 2150781 2135121 2124140 2144251 2148339 2163874 2174220 2159003
15528 2159003 2182590 2131766 2154620 2181354 2132130 2097695 2123980 2201581 2205610 2171871 2194881
15517 2194881 2201347 2218014 2217691 2228345 2237803 2208062 2211779 2179774 2152517 2189359 2162521 2147535
15505 2147535 2173851 2164683 2189858 2229316 2241363 2240080 2241078 2207001 2180341 2166061 2188987 2111568
15493 2111568 2083447 2122941 2182760 2173044 2186807 2180167 2147258 2190694 2225493 2186657 2225533 2226621
15481 2226621 2163953 2133970 2154839 2143610 2165175 2192019 2172539 2141880 2163581 2212314 2253314
15470 2253314 2231242 2198219 2167289 2170003 2168497 2182910 2152755 2173009 2178543 2173140 2169270 2183499
15458 2183499 2163123 2199241 2207108 2165504 2176042 2158211 2171656 2127148 2097801 2128013 2195358
15447 2195358 2219658 2241063 2237124 2240092 2236361 2183889 2164931 2182726 2207146 2222750 2216241 2228714
15435 2228714 2186482 2242881 2272855 2251468 2185000 2132904 2152044 2175805 2184387 2247653 2232954
15424 2232954 2232120 2207666 2183130 2204006 2198850 2197021 2200743 2206553 2190555 2166479 2154007 2169860
15412 2169860 2163291 2160394 2182837 2185704 2185621 2205042 2239323 2262777 2277442 2249617 2233757 2201062
15400 2201062 2208700 2252878 2265350 2245540 2242131 2202527 2176993 2153039 2136864 2152318 2193220 2192289
15388 2192289 2213429 2191329 2188888 2160919 2172617 2218382 2205821 2188000 2157211 2143759 2160397
15377 2160397 2159828 2143944 2150867 2205333 2234575 2211098 2221046 2254483 2189181 2211103 2249725 2216414
15365 2216414 2237227 2213460 2278999 2245078 2206890 2206989 2173672 2195762 2147618 2187897 2156834 2196690
15353 2196690 2226545 2185818 2235462 2208819 2266423 2230935 2188794 2203829 2224778 2207529 2278888
15342 2278888 2274712 2275031 2208727 2210851 2230234 2254453 2226484 2257718 2269425 2267665 2284725 2247465
15330 2247465 2202362 2188672 2171733 2191249 2247823 2238609 2238970 2260304 2242647 2254320 2268409 2257440
15318 2257440 2232726 2232347 2226152 2228467 2241710 2242073 2244935 2226615 2217284 2281910 2292641 2225903 2231765
15305 2231765 2220849 2157954 2155808 2184103 2232853 2211344 2240880 2228664 2207375 2213141 2181061 2244365
15293 2244365 2229880 2244934 2221325 2292429 2312263 2256647 2202302 2228409 2226623 2231658 2198969 2240162
15281 2240162 2209222 2149122 2184700 2206119 2252585 2239246 2229300 2241572 2218986 2242911 2170525
15270 2170525 2170407 2160305 2154471 2158926 2139875 2223232 2213785 2221749 2232177 2199856 2231073 2260018
15258 2260018 2271949 2253493 2251205 2249980 2244201 2187235 2183204 2167504 2209275 2213198 2185505 2243488
15246 2243488 2217903 2251470 2259556 2282032 2260078 2231699 2198927 2191902 2210739 2272120 2307839 2285537
15234 2285537 2271734 2260620 2273207 2253561 2265007 2262043 2263879 2278091 2249610 2224977 2241381 2258371
15222 2258371 2320693 2253947 2268949 2334113 2340461 2255035 2222521 2257636 2273360 2255129 2199285
15211 2199285 2191425 2182732 2228049 2259534 2237099 2243716 2233957 2270653 2298698 2277971 2286047 2263538
15199 2263538 2221282 2222347 2249226 2311721 2317941 2269029 2292566 2233303 2275554 2286441 2262604 2298377
15187 2298377 2245719 2231934 2277701 2266433 2302102 2266895 2282674 2249800 2263844 2220826 2223114
15176 2223114 2197105 2225173 2251845 2234240 2217583 2268009 2255124 2236020 2254735 2275113 2234115
15165 2234115 2235541 2254589 2292853 2275663 2212024 2224170 2201711 2239472 2216115 2252060 2293494
15154 2293494 2256546 2226993 2247958 2260923 2265996 2269076 2267921 2262815 2314425 2303765 2310346 2289699
15142 2289699 2285669 2274605 2265267 2249068 2233085 2296736 2295836 2269891 2272505 2300489 2307242 2245153
15130 2245153 2252410 2284808 2275614 2251506 2253644 2288696 2275782 2241866 2285212 2268738 2248526 2268171
15118 2268171 2290116 2288576 2310746 2317290 2264956 2300034 2359101 2320400 2316394 2282246 2210474 2214593
15106 2214593 2273832 2273698 2292413 2266644 2271154 2298596 2301409 2276465 2260463 2280856 2301810 2209717
15094 2209717 2211834 2283017 2303634 2334216 2325940 2288858 2291198 2233003 2218003 2237098 2246943 2298270
15082 2298270 2256142 2290569 2295090 2254559 2259502 2311476 2336113 2307612 2303600 2318516 2296813 2291738
15070 2291738 2282937 2300728 2295550 2291347 2274736 2256557 2250915 2322308 2290751 2302287 2286423 2251611
15058 2251611 2273959 2236181 2308302 2309615 2289593 2310747 2325270 2330409 2283499 2279890 2296264 2275446
15046 2275446 2275100 2352845 2370478 2336484 2274541 2235561 2258917 2298713 2334242 2313064 2317670 2303279
15034 2303279 2296505 2259793 2269611 2324716 2273943 2287414 2307236 2300920 2292873 2258411 2268517 2236137
15022 2236137 2267105 2287178 2299900 2248523 2244763 2306633 2305325 2293324 2255718 2252966 2319430 2299424
15010 2299424 2290110 2274605 2324194 2386155 2314328 2287161 2292882 2299661 2285148 2309464 2317018 2296185
14998 2296185 2303761 2336135 2344719 2356632 2326670 2345876 2350246 2318310 2291985 2307880 2299475 2272831
14986 2272831 2315736 2311433 2289214 2321122 2297523 2255254 2256495 2254729 2231855 2250732 2301207 2352538
14974 2352538 2357520 2297237 2287345 2307768 2360789 2302769 2331819 2349523 2344723 2375572 2326801 2276482
14962 2276482 2284648 2313488 2280530 2295300 2337532 2304719 2279943 2333778 2360603 2355610 2256366 2217598
14950 2217598 2274872 2311635 2330916 2355147 2333434 2336271 2325725 2346880 2368994 2356758 2300065
14939 2300065 2286206 2316896 2296583 2289458 2298623 2337150 2323048 2307965 2358767 2361187 2306847 2297226
14927 2297226 2299939 2286524 2325518 2329374 2344651 2372623 2346265 2319140 2302001 2277879 2264381 2362481
14915 2362481 2376208 2353202 2332415 2315836 2302466 2308906 2309722 2340656 2365413 2321051 2314935 2320581
14903 2320581 2312366 2321146 2331371 2266729 2243464 2270138 2287459 2294425 2321583 2305170 2259776 2254589
14891 2254589 2266349 2288807 2324408 2313364 2289358 2242843 2236642 2334415 2307234 2322502 2352715
14880 2352715 2309172 2373188 2395810 2419513 2378384 2341049 2347933 2380797 2340004 2339390 2332599 2343874
14868 2343874 2363421 2326468 2372217 2367839 2358847 2343024 2306425 2347353 2409942 2419405 2444148 2356335
14856 2356335 2342630 2343674 2365446 2311419 2289588 2293110 2333826 2367189 2312393 2308780 2353854 2352873
14844 2352873 2287131 2258295 2299324 2340653 2342214 2355650 2320087 2357961 2343462 2296997 2267931
14833 2267931 2299701 2341698 2323556 2309026 2341073 2381028 2344750 2303371 2302164 2307719 2313638 2352253
14821 2352253 2336557 2297483 2331554 2310840 2304457 2336788 2338554 2338572 2311970 2318893 2324158 2305731 2307776
14808 2307776 2278496 2265145 2294045 2305900 2304872 2315481 2348816 2348846 2339545 2350552 2358009 2354617 2376426
14795 2376426 2322736 2304751 2371986 2389917 2362737 2359285 2345641 2379842 2377029 2327074 2298021 2305235
14783 2305235 2299994 2309541 2337306 2363345 2385422 2361770 2353961 2339121 2351750 2361880 2372476 2357671
14771 2357671 2368009 2364121 2341569 2322504 2305915 2314850 2304456 2289272 2314091 2323645 2271630 2312588
14759 2312588 2363719 2410614 2401220 2418371 2418094 2362820 2425577 2421417 2355417 2328264 2376489 2332190
14747 2332190 2334324 2372048 2356956 2349575 2338997 2368945 2374986 2344197 2355194 2362059 2345204 2365601
14735 2365601 2356278 2368970 2346049 2321322 2351780 2370277 2356609 2358802 2406275 2361409 2381055 2401497
14723 2401497 2378395 2357716 2309136 2363470 2376545 2379242 2402419 2398072 2397478 2333142 2346644 2386944
14711 2386944 2420067 2438985 2422826 2388419 2378656 2374969 2392179 2407966 2423471 2407354 2390067 2407530
14699 2407530 2368318 2352804 2389996 2398943 2346574 2356864 2388187 2359339 2309447 2273709 2297442
14688 2297442 2333523 2352718 2343319 2361729 2352745 2365122 2400315 2405274 2399465 2373512 2394740 2398391
14676 2398391 2351849 2295564 2262938 2291503 2341550 2411123 2416371 2341329 2328918 2343033 2376106
14665 2376106 2385301 2349193 2414884 2430016 2411301 2434474 2408406 2377001 2389198 2408399 2400334 2376110
14653 2376110 2370014 2398179 2405051 2389403 2404717 2430583 2423358 2408643 2360364 2354824 2406532 2378829
14641 2378829 2316490 2393331 2422996 2415043 2450206 2412710 2405268 2351801 2319442 2400988 2385900 2320056
14629 2320056 2326736 2363766 2330516 2322314 2348293 2374845 2368719 2427519 2416229 2382276 2341737 2380574
14617 2380574 2403718 2351672 2341861 2369082 2367642 2395709 2425308 2393817 2381149 2376905 2393898 2358618
14605 2358618 2392886 2407895 2361437 2317408 2331435 2371547 2344884 2344623 2396828 2363483 2341162 2360746
14593 2360746 2390519 2419359 2426928 2419994 2429563 2454383 2444324 2424531 2405388 2374943 2385871 2375383
14581 2375383 2347582 2356817 2410401 2447084 2439718 2404380 2371746 2405034 2404611 2448673 2477328 2411358
14569 2411358 2430891 2450594 2441149 2377370 2363758 2391717 2386302 2397243 2402951 2369620 2385056 2412320
14557 2412320 2394329 2427536 2400350 2410004 2416747 2442779 2414176 2433559 2484552 2440428 2430616 2469823
14545 2469823 2438524 2381176 2409544 2434488 2409342 2370777 2371994 2388322 2428330 2405489 2423600
14534 2423600 2456352 2418973 2409682 2392641 2432132 2401657 2428421 2419860 2373888 2380296 2383721 2376463
14522 2376463 2386595 2416066 2390474 2381365 2414898 2459609 2398878 2370388 2397945 2386267 2398979
14511 2398979 2358415 2355804 2390180 2392814 2403175 2427847 2351139 2320596 2338790 2373035 2426456 2453706
14499 2453706 2467081 2458226 2431654 2388348 2427001 2425421 2509705 2467644 2406439 2385515 2423881 2408123
14487 2408123 2383226 2426068 2420989 2403964 2444633 2439003 2428386 2449171 2449397 2420226 2406334 2402955
14475 2402955 2436255 2440053 2462484 2457957 2456748 2408865 2381550 2376660 2369695 2419525 2425469 2445584
14463 2445584 2447292 2424548 2392129 2381320 2397299 2464185 2415998 2398935 2419002 2485310 2479137 2436905
14451 2436905 2465363 2435423 2432442 2418488 2419140 2392034 2439503 2436572 2445416 2448396 2419187 2414719 2427231
14438 2427231 2495113 2468582 2427740 2443048 2481296 2464524 2413248 2367865 2353144 2383629 2435856
14427 2435856 2453749 2405162 2401747 2366042 2383481 2407454 2449883 2479058 2477417 2455798 2415202 2437149
14415 2437149 2405081 2448696 2441194 2473079 2479988 2491006 2455582 2440277 2403464 2410354 2450797 2441476
14403 2441476 2391846 2368408 2430760 2450087 2457862 2474217 2420162 2406970 2405354 2385688 2405770 2408762
14391 2408762 2422738 2461157 2477128 2494469 2453052 2412368 2440358 2428215 2457765 2510781 2498074
14380 2498074 2516619 2461570 2406249 2411808 2418285 2457025 2477822 2491486 2478717 2425906 2414560 2381006
14368 2381006 2423645 2446100 2449997 2488007 2488773 2449021 2451554 2438634 2395273 2485081 2520908 2488099
14356 2488099 2455589 2437677 2466842 2444226 2420741 2422909 2419527 2395076 2420496 2474971 2460139 2423546
14344 2423546 2428813 2453331 2467345 2465578 2446500 2485078 2498984 2462579 2425876 2446973 2487706 2466908
14332 2466908 2431824 2468123 2470075 2432223 2434996 2496260 2504270 2477365 2524145 2495840 2412888 2462725
14320 2462725 2425430 2468589 2485744 2484141 2472752 2463845 2481065 2487458 2453837 2455973 2554029 2555842
14308 2555842 2474851 2511911 2518247 2460520 2446199 2410928 2457375 2477933 2524188 2517075 2466988 2491999
14296 2491999 2452099 2447034 2466825 2484795 2484915 2448428 2476731 2414375 2428669 2433841 2460253 2497561
14284 2497561 2425610 2471658 2511388 2482701 2490294 2471401 2509764 2533816 2492710 2451497 2457204 2474778
14272 2474778 2454776 2452847 2471625 2458510 2439613 2465512 2480715 2500928 2487575 2476168 2501791
14261 2501791 2502940 2505926 2518349 2454169 2536822 2471187 2431688 2480582 2508972 2549925 2546708 2509892
14249 2509892 2510728 2475350 2457985 2472391 2446549 2454727 2453263 2464002 2461743 2504804 2528246 2562020
14237 2562020 2541639 2498082 2496890 2509471 2527925 2499922 2478490 2502738 2492837 2501589 2485911 2450479
14225 2450479 2468232 2474100 2485003 2509378 2523389 2499025 2470115 2547026 2572223 2537329 2564475
14214 2564475 2632827 2564675 2557268 2510510 2520865 2522418 2459779 2479603 2518630 2578851 2522135 2470706
14202 2470706 2482266 2478214 2500898 2505118 2476752 2521478 2492137 2477168 2491202 2486123 2484781 2491542
14190 2491542 2492177 2503593 2506367 2507815 2537293 2544393 2546131 2500185 2569374 2541210 2565714 2537744
14178 2537744 2506758 2519818 2498988 2538078 2503548 2423301 2400223 2472306 2470057 2466688 2504173 2498737
14166 2498737 2474525 2475364 2515803 2553478 2483618 2441222 2431404 2438211 2419120 2458766 2450168 2463764
14154 2463764 2508558 2520707 2508784 2567377 2569891 2527851 2532073 2513331 2509585 2475885 2461359 2473258
14142 2473258 2494983 2548672 2572340 2526263 2451671 2450308 2485945 2490421 2463402 2472073 2508329 2496972
14130 2496972 2539223 2538074 2557401 2511833 2535699 2529732 2503675 2434371 2463681 2524597 2539830 2567375
14118 2567375 2614387 2618550 2610683 2587802 2554024 2606958 2565061 2586539 2573770 2536071 2568565 2527790
14106 2527790 2540353 2538260 2513082 2538428 2520073 2498391 2494772 2507785 2507504 2537214 2560351 2561273
14094 2561273 2568567 2554027 2531094 2548465 2578273 2549265 2532512 2560971 2548965 2550769 2522485 2569707
14082 2569707 2556382 2554874 2556184 2552023 2602061 2610974 2586805 2544644 2545638 2569875 2554861 2460083
14070 2460083 2494635 2528802 2540503 2545376 2505081 2541088 2562405 2581461 2550316 2548666 2580808 2563870
14058 2563870 2509236 2528007 2529870 2567997 2557783 2549428 2573704 2553846 2559435 2554996 2568722 2572864
14046 2572864 2530402 2527944 2537956 2551690 2552873 2506752 2486951 2525199 2516825 2550435 2524735 2509108
14034 2509108 2532601 2548759 2530679 2552798 2568515 2545576 2553228 2515784 2558161 2546439 2560041
14023 2560041 2558571 2555313 2532477 2503449 2495507 2552785 2524808 2510134 2574453 2577762 2574487 2537502
14011 2537502 2525038 2544125 2517482 2514822 2487803 2461363 2479042 2558815 2525208 2542533 2656725
14000 2656725 2657360 2602321 2591460 2589809 2576282 2579941 2531066 2529365 2530776 2522188 2546564 2570027 2574103
13987 2574103 2523618 2483674 2474779 2493667 2568764 2531370 2520502 2538543 2555938 2535156 2515404
13976 2515404 2525974 2601785 2656059 2625552 2593448 2603569 2558147 2538695 2565471 2587814 2596476
13965 2596476 2637309 2646498 2593769 2577415 2543221 2549866 2570183 2567594 2579554 2594909 2567335 2588571
13953 2588571 2577478 2599302 2556256 2524264 2511407 2563443 2544374 2532887 2538537 2559585 2571086
13942 2571086 2538268 2556312 2627387 2602729 2605137 2601101 2538340 2578485 2587490 2586739 2558813 2553767
13930 2553767 2563468 2543435 2541379 2591044 2591125 2574669 2545563 2535139 2548951 2603296 2587468 2591050
13918 2591050 2581125 2561027 2533813 2584075 2615172 2563511 2528742 2517945 2596524 2585788 2561035
13907 2561035 2542028 2569487 2564301 2557555 2545859 2596797 2586756 2620177 2605475 2621734 2601532 2605030
13895 2605030 2622155 2583964 2596047 2608164 2629168 2570742 2582187 2633411 2662293 2601561 2594467
13884 2594467 2601563 2625138 2559588 2557975 2582650 2601552 2623535 2627676 2615473 2641407 2602554 2602297
13872 2602297 2646165 2654776 2604569 2584627 2576309 2617362 2602762 2612237 2626010 2586481 2596103 2548411
13860 2548411 2552075 2537200 2543477 2598714 2608190 2524334 2538409 2557711 2588178 2612595 2631229 2587657
13848 2587657 2581439 2552236 2512247 2595336 2604521 2580404 2575571 2588547 2615296 2588393 2613787 2689777
13836 2689777 2611551 2548263 2549804 2565258 2608667 2620677 2644995 2650297 2609178 2594116 2560473 2581768
13824 2581768 2652751 2603218 2584733 2634485 2608272 2601650 2581878 2547535 2593797 2594866 2605383 2643211
13812 2643211 2585198 2592742 2588294 2621629 2609808 2605558 2619893 2596090 2658975 2637040 2614897 2631539
13800 2631539 2587071 2597230 2613682 2606572 2628251 2598496 2609581 2636116 2646286 2631506 2599508
13789 2599508 2649263 2658662 2626743 2626123 2598201 2618185 2582229 2612341 2642499 2641766 2637203 2580264
13777 2580264 2624720 2639419 2619889 2631323 2675818 2716211 2681486 2672096 2669284 2654763 2620564 2600530
13765 2600530 2604334 2612392 2633854 2630145 2634032 2620597 2582375 2609125 2651704 2632097 2625407 2633946
13753 2633946 2696967 2669514 2639138 2634930 2629703 2671315 2624055 2664749 2658084 2649952 2600663 2605778
13741 2605778 2662819 2632584 2647393 2652794 2629398 2608967 2623854 2634580 2653168 2661771 2670184 2677685
13729 2677685 2648336 2607396 2599249 2599477 2607092 2648922 2601005 2574667 2604808 2664999 2662265 2611071
13717 2611071 2613819 2579113 2625664 2609827 2642834 2674956 2684559 2702439 2663454 2639596 2623869 2625588
13705 2625588 2610229 2608203 2660404 2652436 2642726 2624663 2597046 2664993 2651186 2660246 2679059 2672180
13693 2672180 2653257 2651281 2629600 2631024 2622525 2580991 2619063 2624767 2624171 2616718 2676515 2697641 2678375
13680 2678375 2676298 2654441 2682886 2647124 2639717 2651424 2626057 2678602 2636034 2558388 2619525 2626638
13668 2626638 2651588 2661066 2643997 2675805 2670406 2644704 2646100 2661426 2700528 2683340 2630403 2660155
13656 2660155 2659192 2643102 2658730 2700545 2706927 2648583 2656496 2673954 2662631 2649614 2644759 2615466
13644 2615466 2622844 2659746 2653247 2647444 2671301 2726247 2708159 2673174 2675744 2715286 2670999 2705210
13632 2705210 2722531 2692355 2711922 2698812 2723846 2717503 2682369 2687122 2690021 2652685 2643834 2649092
13620 2649092 2671254 2676563 2697062 2680987 2646875 2671845 2644669 2650312 2693730 2650523 2647991 2733108
13608 2733108 2702605 2651462 2654779 2705435 2660146 2659347 2688369 2699236 2659637 2634632 2658894 2668530
13596 2668530 2643006 2600672 2599546 2615498 2595597 2584515 2586871 2611738 2671120 2639429 2650996 2649546
13584 2649546 2668989 2659630 2670010 2681067 2632775 2665664 2684553 2717659 2702008 2639539 2651366
$$ [...]
##END NTUPLES=NMR SPECTRUM
##END=
